##TITLE=1H_UK-10''
 pyr+MeClorid,108 sc, 
 2.02.2021
##JCAMPDX= 6.0         $$ Bruker NMR JCAMP-DX V2.0
##DATA TYPE= NMR FID
##DATA CLASS= NTUPLES
##ORIGIN= UXNMR, Bruker Analytische Messtechnik GmbH
##OWNER= root
$$ XWIN-NMR		Version 3.5
$$ Tue Feb  2 12:08:03 2021 Russian Standard Time (UT+4h)  she@DPX200
##.OBSERVE FREQUENCY= 200.1315066352
##.OBSERVE NUCLEUS= ^1H
##.DELAY= (6, 6)
##.ACQUISITION MODE= SIMULTANEOUS
##.ACQUISITION SCHEME= undefined
##.AVERAGES= 108
##.DIGITISER RES= 18
##SPECTROMETER/DATA SYSTEM= spect
##.PULSE SEQUENCE= zg30
##.SOLVENT NAME= CD2Cl2
##.SHIFT REFERENCE= (INTERNAL, CD2Cl2, 0, 15.7039)
##AUDIT TRAIL= $$ (NUMBER, WHEN, WHO, WHERE, WHAT)
$$ ##TITLE= Audit trail, XWIN-NMR		Version 3.5
$$ ##JCAMPDX= 5.01
$$ ##ORIGIN= Bruker BioSpin GmbH
$$ ##OWNER= she
$$ F:/spectra/data/she/nmr/H-F/1/audita.txt
$$ ##AUDIT TRAIL=  $$ (NUMBER, WHEN, WHO, WHERE, WHAT)
(   1,<2021-02-02 12:00:47.45 +0400>,<she>,<DPX200>,
      <continue with go, POWCHK disabled, PULCHK disabled
       configuration hash MD5:
       00 E9 B6 7A A2 85 ED C7 34 08 36 98 17 FE 4E 26
       data hash MD5: 16K
       94 7B AF 32 73 4F C4 D6 58 57 CC 41 F8 F7 C5 26>)
$$ ##END=
$$ 
$$ hash MD5
$$ 08 61 A1 4E D2 FA A3 9D B5 AE 6D 61 8C F3 E1 AA
##$RELAX= 
##$RELAX= 
##$RELAX= 
##$RELAX= 
##$RELAX= 
##$RELAX= 
$$ Bruker specific parameters
$$ --------------------------
##$DU= <F:/spectra>
##$EXPNO= 1
##$NAME= <H-F>
##$PROCNO= 1
##$TYPE= <nmr>
##$USER= <she>
##$AMP= (0..31)
100 100 100 100 100 100 100 100 100 100 100 100 100 100 100 100 100 100 
100 100 100 100 100 100 100 100 100 100 100 100 100 100 
##$AQSEQ= 0
##$AQ_mod= 1
##$AUNM= <au_zg>
##$AUTOPOS= <>
##$BF1= 200.13
##$BF2= 200.13
##$BF3= 200.13
##$BF4= 200.13
##$BF5= 200.13
##$BF6= 200.13
##$BF7= 200.13
##$BF8= 200.13
##$BYTORDA= 1
##$CFDGTYP= 0
##$CFRGTYP= 5
##$CHEMSTR= <none>
##$CNST= (0..31)
1 1 145 1 1 1 1 1 1 1 1 1 1 1 1 1 1 1 1 1 1 1 1 1 1 1 1 1 1 1 1 1 
##$CPDPRG= <>
##$CPDPRG1= <>
##$CPDPRG2= <>
##$CPDPRG3= <>
##$CPDPRG4= <mlev>
##$CPDPRG5= <mlev>
##$CPDPRG6= <mlev>
##$CPDPRG7= <mlev>
##$CPDPRG8= <mlev>
##$CPDPRGB= <>
##$CPDPRGT= <>
##$D= (0..31)
0 1.2 0 0 0 0 0 0 0 0.06 0 0.03 0 0 0 0 0.0002 0 0 0 0 0 0 0 0 0 0 0 0 
0 0 0 
##$DATE= 1612252426
##$DBL= (0..7)
120 120 120 120 120 120 120 120 
##$DBP= (0..7)
150 150 150 150 150 150 150 150 
##$DBP07= 0
##$DBPNAM0= <>
##$DBPNAM1= <>
##$DBPNAM2= <>
##$DBPNAM3= <>
##$DBPNAM4= <>
##$DBPNAM5= <>
##$DBPNAM6= <>
##$DBPNAM7= <>
##$DBPOAL= (0..7)
0.5 0.5 0.5 0.5 0.5 0.5 0.5 0.5 
##$DBPOFFS= (0..7)
0 0 0 0 0 0 0 0 
##$DE= 6
##$DECBNUC= <off>
##$DECIM= 32
##$DECNUC= <off>
##$DECSTAT= 4
##$DIGMOD= 1
##$DIGTYP= 9
##$DL= (0..7)
0 120 120 120 120 120 120 120 
##$DP= (0..7)
150 150 150 150 150 150 150 150 
##$DP07= 0
##$DPNAME0= <>
##$DPNAME1= <>
##$DPNAME2= <>
##$DPNAME3= <>
##$DPNAME4= <>
##$DPNAME5= <>
##$DPNAME6= <>
##$DPNAME7= <>
##$DPOAL= (0..7)
0.5 0.5 0.5 0.5 0.5 0.5 0.5 0.5 
##$DPOFFS= (0..7)
0 0 0 0 0 0 0 0 
##$DQDMODE= 0
##$DR= 18
##$DS= 0
$$ [...]
##$SUBNAM2= <"">
##$SUBNAM3= <"">
##$SUBNAM4= <"">
##$SUBNAM5= <"">
##$SUBNAM6= <"">
##$SUBNAM7= <"">
##$SUBNAM8= <"">
##$SUBNAM9= <"">
##$SW= 16.9725356469052
##$SWIBOX= (0..15)
0 0 2 0 0 0 0 0 0 0 0 0 0 0 0 0 
##$SW_h= 3396.73913043478
##$TD= 16384
##$TD0= 1
##$TE= 0
##$TE2= 300
##$TE3= 300
##$TEG= 300
##$TL= (0..7)
0 120 120 120 120 120 120 120 
##$TP= (0..7)
150 150 150 150 150 150 150 150 
##$TP07= 0
##$TPNAME0= <>
##$TPNAME1= <>
##$TPNAME2= <>
##$TPNAME3= <>
##$TPNAME4= <>
##$TPNAME5= <>
##$TPNAME6= <>
##$TPNAME7= <>
##$TPOAL= (0..7)
0.5 0.5 0.5 0.5 0.5 0.5 0.5 0.5 
##$TPOFFS= (0..7)
0 0 0 0 0 0 0 0 
##$TUNHIN= 0
##$TUNHOUT= 0
##$TUNXOUT= 0
##$USERA1= <user>
##$USERA2= <user>
##$USERA3= <user>
##$USERA4= <user>
##$USERA5= <user>
##$V9= 5
##$VALIST= <valist>
##$VCLIST= <CCCCCCCCCCCCCCC>
##$VD= 0
##$VDLIST= <DDDDDDDDDDDDDDD>
##$VPLIST= <PPPPPPPPPPPPPPP>
##$VTLIST= <TTTTTTTTTTTTTTT>
##$WBST= 1024
##$WBSW= 4
##$XGAIN= (0..3)
0 0 0 0 
##$XL= 0
##$YL= 0
##$YMAX_a= 1229223
##$YMIN_a= -1345086
##$ZGOPTNS= <>
##$ZL1= 120
##$ZL2= 120
##$ZL3= 120
##$ZL4= 120
##$ABSF1= 10
##$ABSF2= 0
##$ABSG= 5
##$ABSL= 3
##$ALPHA= 0
##$AQORDER= 0
##$ASSFAC= 0
##$ASSFACI= 0
##$ASSFACX= 0
##$ASSWID= 0
##$AUNMP= <proc_1d>
##$AZFE= 0.1
##$AZFW= 0.1
##$BCFW= 1
##$BC_mod= 2
##$BYTORDP= 1
##$COROFFS= 0
##$CY= 11.3945322036743
##$DATMOD= 1
##$DC= 2
##$DFILT= <>
##$DTYPP= 0
##$F1P= 15.9154993809931
##$F2P= -4.1035820241983
##$FCOR= 0.5
##$FTSIZE= 0
##$FT_mod= 4
##$GAMMA= 1
##$GB= 0.15
##$INTBC= 1
##$INTSCL= 1
##$ISEN= 128
##$LB= 0.24
##$LEV0= 0
##$LPBIN= 0
##$MAXI= 10000
##$MC2= 0
##$MEAN= 0
##$ME_mod= 0
##$MI= 1.114404
##$NCOEF= 0
##$NC_proc= 0
##$NLEV= 6
##$NOISF1= 3.799351
##$NOISF2= 2.8
##$NSP= 1
##$NTH_PI= 0
##$NZP= 0
##$OFFSET= 15.70392
##$PC= 1
##$PHC0= -10755.69
##$PHC1= 4.000954
##$PH_mod= 1
##$PKNL= yes
##$PPARMOD= 0
##$PSCAL= 0
##$PSIGN= 0
##$REVERSE= no
##$SF= 200.130013532006
##$SI= 16384
##$SIGF1= 3
##$SIGF2= 2
##$SINO= 400
##$SIOLD= 16384
##$SREGLST= <1H.CDCl3>
##$SSB= 0
##$STSI= 0
##$STSR= 0
##$SW_p= 3612.71676300578
##$SYMM= 0
##$S_DEV= 0
##$TDeff= 0
##$TDoff= 0
##$TI= <>
##$TILT= no
##$TM1= 0
##$TM2= 0
##$TOPLEV= 0
##$USERP1= <user>
##$USERP2= <user>
##$USERP3= <user>
##$USERP4= <user>
##$USERP5= <user>
##$WDW= 1
##$XDIM= 8192
##$YMAX_p= 0
##$YMIN_p= 0
$$ End of Bruker specific parameters
$$ ---------------------------------
##NTUPLES= NMR FID
##VAR_NAME=  TIME,          FID/REAL,        FID/IMAG
##SYMBOL=    X,             R,               I
##VAR_TYPE=  INDEPENDENT,   DEPENDENT,       DEPENDENT
##VAR_FORM=  AFFN,          ASDF,            ASDF
##VAR_DIM=   8192,          8192,            8192
##UNITS=     SECONDS,       ARBITRARY UNITS, ARBITRARY UNITS
##FACTOR=    0.0002944,     1,               1
##FIRST=     0,             0,               0
##LAST=      2.4114304,     0,               0
##MIN=       0,             -1345086,        0
##MAX=       2.4114304,     1229223,         0
$$ Real data points
##PAGE= N=1
##DATA TABLE= (X++(R..R)), XYDATA
0 0 0 0 0 0 0 0 0 0 0 0 0 0 0 108 -108 108 -108 108 -216 216 -216 324 -324 432 -506 540 -648 756 -864
29 -864 975 -1156 1296 -1483 1652 -1861 2100 -2366 2634 -2941 3274 -3644 4042 -4475 4954 -5471
45 -5471 6038 -6662 7342 -8081 8893 -9801 10797 -11909 13145 -14537 16109 -17914
57 -17914 19993 -22426 25324 -28827 33168 -38694 46010 -56135 71072 -95268 140622
68 140622 -253378 1076089 1229223 -1345086 741086 17549 -475676 272508 -472964 368177
78 368177 538596 -452627 368181 29121 -466084 30889 88414 91407 165800 136316 70642
89 70642 -223018 -184912 -59405 59887 59823 139590 220970 -58567 -189457 -123999 -69380 47865
101 47865 30587 238703 122395 -203681 -48612 -189475 -152287 149126 -19927 235159
111 235159 135657 -261448 54128 -183925 -205328 245406 1440 128806 154176 -231390
121 -231390 -53389 -148251 -161673 202618 50181 84829 144957 -156903 -105521 -100720 -105996
132 -105996 136914 105188 73702 80057 -137547 -152889 -72037 -88162 115023 165658 42668
143 42668 81334 -81675 -170784 -27585 -61038 90031 201940 13729 45197 -64408 -217269
154 -217269 -617 -9320 48504 225958 32363 6780 -23288 -194512 -23228 33575 34621
165 34621 193959 50651 -55216 -30170 -168771 -60094 80489 47227 162312 91270 -74902
176 -74902 -37340 -123338 -87145 95007 55333 114993 92856 -114716 -59500 -105030 -108280 122776
188 122776 69781 83175 108216 -114144 -79237 -74238 -111672 103876 80333 45200 90924 -116690
200 -116690 -110606 -52217 -90325 96083 106809 40337 71078 -89280 -126481 -41923 -67538 63132
212 63132 127978 24177 30714 -69202 -148701 -37545 -24300 54704 147146 35134 8465 -43292
224 -43292 -154290 -39661 6460 27510 153508 35340 -28859 -24270 -148622 -37957 48090
235 48090 31294 147982 57494 -47752 -21664 -127292 -54969 62382 29367 122851 62716
246 62716 -68508 -32628 -104043 -58647 82955 54053 99407 78423 -71623 -55457 -78185
257 -78185 -71866 76950 68211 69321 70594 -74461 -73994 -55337 -63835 78774 92697 46908 66916
270 66916 -67569 -101606 -39722 -65480 53937 101909 27438 42999 -57608 -113991 -29412
281 -29412 -36122 46679 116938 25483 21513 -45118 -129021 -34822 -21330 28960 116322 26920
293 26920 -7045 -34750 -121573 -39409 16053 30891 112820 38393 -27773 -34682 -115461 -48985
305 -48985 27319 28598 101897 47248 -42910 -30675 -89580 -50351 55313 41852 85845 58452
317 58452 -53112 -42875 -73530 -57329 54988 52365 68720 62741 -50263 -52263 -48535 -51827
329 -51827 64223 73101 51020 59197 -50520 -74088 -40924 -47189 50237 85396 42556 47561
341 47561 -39695 -80543 -25203 -30780 48398 92101 30899 30823 -38104 -92557 -30299 -19970 32304
354 32304 95622 32218 10583 -27592 -92269 -27990 836 29542 91908 29890 -11574 -32868
366 -32868 -96140 -40264 14175 23159 85334 38802 -29293 -27577 -81073 -44551 31367 27557 70208
379 70208 40424 -42705 -42103 -73244 -52143 36398 33277 59658 48421 -44975 -40080 -54837 -50593
392 -50593 44433 44122 44109 44731 -45800 -58122 -44369 -46361 40549 59782 38665 44817 -39030 -62205
406 -62205 -28808 -35860 38873 70930 27802 29514 -33503 -76761 -25221 -21991 30160 82409 28890
419 28890 21580 -23633 -74190 -21689 -6895 28053 78198 26177 3445 -21848 -78397 -24510
431 -24510 7884 21616 80463 33413 -10071 -19319 -69148 -31851 18179 23303 65428 32595
443 32595 -26315 -25503 -63928 -39869 29479 25356 58810 42646 -35404 -30397 -49085 -44798 33708
456 33708 33735 38973 37749 -40725 -40233 -41981 -46086 36435 41523 35151 39275 -37482 -48745 -31902
470 -31902 -39350 31504 48503 21830 32240 -33957 -57980 -24067 -27208 27841 59118 27591
482 27591 20519 -26032 -59619 -24737 -14201 19514 63055 22450 4169 -16494 -65156 -25841
494 -25841 4991 18897 64957 33704 -5896 -14275 -59523 -27919 14652 17075 60028 29243
506 29243 -14434 -13225 -55328 -28617 24858 19272 56671 36720 -21511 -19638 -49625 -30687 26764
519 26764 20725 44646 30140 -28690 -25058 -40281 -30055 27950 32996 38094 31477 -26976 -36793
532 -36793 -33813 -32458 25068 37539 24545 24644 -24711 -44632 -25092 -24102 20754 46740 21604
545 21604 21744 -20633 -53426 -21671 -19905 14783 49572 14095 9918 -15963 -53433 -18439 -6606
558 -6606 13368 54550 19077 950 -16257 -57150 -17969 -1595 12649 54555 16173 -5659
570 -5659 -12289 -49541 -19536 11269 13470 51190 25324 -14007 -14593 -44544 -24943 16399 18766
583 18766 39979 26587 -16648 -19333 -32398 -24037 23868 23590 33266 31564 -22256 -25264 -26662 -27736
597 -27736 22790 31715 24132 27232 -20122 -29931 -17586 -24232 23875 35741 18920 25423 -19580
610 -19580 -38176 -16100 -22600 17990 42282 14032 16891 -15896 -40957 -11970 -11245 14627 42099
623 42099 12663 9412 -15144 -45116 -16666 -5903 9020 44013 14589 -2574 -9076 -44168
635 -44168 -16727 5159 8459 40124 16759 -11335 -12084 -40547 -22532 10573 9111 37004 21012
648 21012 -16358 -11150 -34503 -21878 19011 11540 29200 23493 -19636 -18891 -27619 -25635 16761
661 16761 18520 23886 24195 -19457 -19731 -19529 -21900 19496 24991 15810 20160 -16324 -29134 -13783
675 -13783 -19381 14597 33323 12705 18389 -12397 -32633 -9697 -11758 13668 34721 9763 10866
688 10866 -9116 -37531 -9310 -7190 7217 38042 10848 4103 -6119 -34607 -11284 607
700 607 7185 32963 12327 -3155 -7199 -33146 -14505 6119 6552 31017 15283 -8469 -8735 -28143
714 -28143 -17896 11417 10298 21118 19540 -14311 -13949 -22653 -20085 13707 13932 20225 21215 -14901
728 -14901 -14651 -16012 -21188 15653 17706 13030 18533 -15030 -20151 -11261 -18057 15510 22340 12148
742 12148 17516 -11155 -21882 -9654 -12837 11368 23888 8502 11510 -10377 -26808 -7352 -8033
755 -8033 9528 27687 11283 6406 -5244 -26605 -8927 -919 4529 27057 8457 608 -4090
768 -4090 -26318 -8504 3643 4921 28625 11802 -4941 -2394 -22184 -13155 8496 3869 22145
781 22145 13446 -9682 -5179 -20468 -12691 10599 7615 18468 15662 -12624 -9474 -15052 -16717 12710
795 12710 8301 12429 14233 -12545 -14102 -10756 -13527 10897 15195 9289 14520 -11253 -16103 -8164
809 -8164 -15279 7789 17562 4044 11508 -7540 -19202 -4394 -8784 5266 21427 5267 6800
822 6800 -5580 -22047 -4616 -7166 4609 21045 3421 3241 -3118 -21795 -4913 447 1801
835 1801 20901 6629 -2643 -1940 -20547 -8220 4003 2224 17638 7934 -5853 -2101 -15925
848 -15925 -9588 8143 2895 16225 12042 -9008 -3109 -12538 -11914 9255 5646 9896 13386 -7938
862 -7938 -7231 -7640 -11463 10134 9305 7628 13678 -9672 -10533 -5586 -12205 7292 11883 3739 9708
877 9708 -5748 -14644 -2399 -8342 5552 14722 3003 7614 -4559 -15705 -3335 -6545 1950
890 1950 15384 2065 4044 -712 -17216 -3538 -174 1316 15378 2531 -1145 -1842 -16796 -6285
904 -6285 1060 -72 13854 6069 -2464 -260 -14412 -5711 5329 -787 12712 7653 -5623 -2939
918 -2939 -9616 -9141 4998 2918 8427 7244 -5047 -1577 -6208 -7099 6639 4542 3974 8851 -6159
933 -6159 -6512 -3691 -9634 4667 8464 2113 8883 -5574 -7650 -1700 -7453 5512 9205 -769 7893
948 7893 -3170 -10749 147 -6604 1284 11131 -474 4259 -1258 -11455 1374 -3967 1317 12107
962 12107 1762 2481 -995 -10139 -844 -1088 1910 9469 1553 1105 667 -10991 -2255 477 590 7949
978 7949 4027 -4575 -487 -7780 -4611 2621 205 6964 5007 -3726 647 -5408 -8043 5066 1214
993 1214 2915 7696 -6635 -2031 -2652 -7356 6346 2195 2269 7529 -4516 -2681 199 -5592 4255
1008 4255 3376 45 7240 -5738 -5278 1071 -6175 3893 6445 -583 5290 -872 -5536 194 -2795
1023 -2795 887 5123 131 2403 -862 -7496 954 -831 304 7622 368 291 3393 -6183 -868
1038 -868 1393 -1851 5209 2290 -3189 2192 -6277 -1579 1789 -1708 5799 2914 -3548 2832 -3325
1053 -3325 -3763 3539 -2251 3684 3733 -4067 1201 -1597 -3458 3720 -668 727 2907 -3163 333 -410
1069 -410 -5554 3137 265 -1352 4833 -3783 -1474 1637 -3601 801 3486 -2449 3121 -1266 -3453
1084 -3453 2014 -4453 214 2264 -2654 3103 124 -4901 4306 -429 -1322 4659 -3414 -1020 1853
1099 1853 -3783 661 47 -158 3489 -1773 -800 2034 -2856 -176 2099 -3952 3404 199 -2822 3202
1115 3202 -798 -2 3606 -3882 2213 2328 -2758 2083 524 -1537 3541 -2085 -1304 2341 -4853 4078
1131 4078 -508 -3541 3845 -2035 -1938 2688 -2741 1410 2330 -3800 2615 407 -1046 1690 -1284 1522
1147 1522 3263 -1623 1751 -236 -3887 2448 -220 -2005 4431 -620 -1023 724 -3336 767 1912
1162 1912 -979 2927 64 -2638 1572 -4059 -371 3111 -2006 3688 -9 -2598 2574 -3134 -2373
1177 -2373 3404 -820 2052 1413 -3900 261 -1036 -3569 3181 -85 2468 2062 -4571 959 -294
1192 -294 -3072 2972 1444 -804 1695 -2322 -2773 844 -1952 3109 2761 -1683 906 -2121 -3367 1110
1208 1110 -2807 1796 4186 -2722 -227 -1842 -4572 1656 -398 -1028 5306 -1173 -699 -601 -5353 785
1224 785 118 -690 4817 -1811 -2529 -102 -6171 888 2470 -1157 4872 254 -4168 96 -2260 -978
1240 -978 2721 454 2641 1534 -4782 -755 -3440 -186 4681 1592 2583 1949 -4348 -2436 -2361 -4344
1256 -4344 5306 2536 -865 3503 -4336 -2133 90 -2064 3510 2688 666 2928 -3189 -3950 2059
1271 2059 -1949 3933 5106 -832 -38 -2692 -3514 736 -86 1748 4110 436 618 -1430 -5451 -465
1287 -465 182 1956 6171 -1463 -1633 -635 -6867 1250 2623 928 6482 1786 -2362 -696 -3513 -2221
1303 -2221 3396 1993 4196 701 -3415 -1694 -4623 -1586 4117 285 2845 4387 -5081 -3535 -2367
1318 -2367 -2324 5846 2254 2398 2209 -4371 -1499 -2519 -2372 3984 4919 193 707 -4677 -2710 -91 -2553
1335 -2553 4435 3822 -536 482 -2789 -5491 -683 440 3131 5768 -1400 746 -2372 -5888 283
1350 283 -1194 3650 6113 -554 -1323 -1389 -6844 -884 2272 1548 5841 -1155 -2189 -2145 -5317 -634 2969
1367 2969 2344 4351 -167 -3790 -2115 -5096 -867 2885 2201 3594 3191 -5087 -2543 -4205 -2169 4565
1383 4565 3038 3351 2553 -5424 -2822 -3009 -2820 7267 3411 2472 1773 -5652 -2291 -1198 -1887 5107
1399 5107 5036 2054 1781 -4701 -4192 16 -2116 4833 4734 1400 1434 -3845 -7286 -826 101 5651 6392
1416 6392 -433 -90 -4140 -7020 102 904 2664 6395 478 -2172 -3285 -6164 -306 1940 2909 5302
1432 5302 1155 -3516 -2375 -5173 -2211 4445 1893 4394 3011 -3220 -3219 -5400 -964 6205 3009 5545
1448 5545 2258 -4839 -2670 -2898 -2644 4151 4187 3309 2801 -4885 -5129 -1271 -1501 4981 5670 3666 2067
1465 2067 -2613 -3882 -1808 -653 6052 4943 2952 1288 -3470 -6042 415 -264 4330 6292 1299
1480 1299 -1088 -4877 -6633 -1128 -332 3022 5516 1603 -1526 -3664 -6870 -1270 1367 2747 6596
1495 6596 503 -3120 -3024 -5742 -1215 3535 2616 5301 1733 -4025 -3789 -5313 -551 4466 5026 5071 1425
1512 1425 -3039 -4275 -3140 -2660 3388 4701 3054 2323 -4587 -4774 -3158 -1296 2956 5751 2802 770
1528 770 -4151 -5085 -2457 -901 4911 4319 2368 1961 -4231 -5686 -902 73 5118 6906 1304 -468
1544 -468 -4730 -5618 -2352 1317 3709 6114 1871 -1377 -2710 -5611 -1550 692 1716 5100 767
1559 767 -1841 -3249 -5376 -1532 2650 3511 4138 916 -2568 -2952 -5070 -1735 3433 3098 6232 1726
1575 1726 -3317 -3602 -4050 -727 4261 3781 4803 1222 -3409 -3887 -4126 -1137 3794 5096 2595 1924
1591 1924 -4049 -4897 -3457 -1224 3577 4248 1953 403 -4301 -4035 -2831 -868 4550 5291 1967 637
1607 637 -4289 -6151 -1796 -428 4865 6065 1836 344 -3215 -5988 -801 382 3496 5815 1139
1622 1139 -893 -3598 -5724 -1154 1008 3597 5416 1944 -1370 -3799 -5506 -341 1658 2961 5243
1637 5243 596 -2284 -3291 -5417 -2594 2969 4752 3458 681 -4292 -4016 -3000 -1123 4259 3273
1652 3273 2891 1495 -2776 -3013 -3215 -1688 3995 3400 3159 1565 -4406 -4886 -2908 -56 3713 5715
1668 5715 2733 498 -4359 -4049 -2530 -386 4049 5394 2014 1329 -3207 -5532 -1994 407 3722
1683 3722 3960 2872 -231 -2777 -4495 -2282 -199 3635 6192 2128 -443 -2813 -4994 -1094 1485
1698 1485 3198 6098 2580 -2247 -3830 -4513 -1688 1972 3619 3803 1260 -2654 -3221 -5666 -916 2809
1714 2809 2709 4242 378 -3084 -3678 -3089 -1908 2286 3439 3449 1806 -2991 -3376 -4050 -155 2640 3416
1731 3416 2740 179 -2728 -4219 -1214 -1608 4085 2921 1708 452 -2535 -4101 -2954 82 3915
1746 3915 4512 1019 -112 -2912 -4688 -635 -317 2702 4643 940 1039 -3616 -4919 -1023 1209 2755
1762 2755 5006 1634 -1359 -2212 -3989 -1905 1614 3120 2845 108 -1307 -3094 -2900 -1871 1736 3081
1778 3081 3326 2111 -2653 -3032 -3448 -719 2335 2965 3364 474 -2931 -2818 -3500 -1163 2379 1211 1799
1795 1799 2960 -4255 -2948 -2897 -1885 3439 3137 2209 748 -2736 -2995 -2560 360 3937 2882 912
1811 912 615 -2756 -4080 -432 1077 2923 3284 372 -782 -2442 -4008 -862 536 3009 3461 1870
1827 1870 -577 -2346 -2843 -965 760 3790 3152 2461 -1602 -2401 -3358 -1371 1646 1567 3598 1396 -845
1844 -845 -2682 -2926 -387 1721 2952 3424 894 -2805 -2961 -4174 -1096 2909 1818 2677 146 -2916
1860 -2916 -3673 -1984 16 1265 2729 1839 1025 -2307 -2307 -2371 -975 1617 1851 1978 1415 -2466 -3136 -367
1878 -367 -1215 2258 3118 714 -385 -1816 -3608 -1095 936 1580 1391 869 397 -2885 -2592 -1109 284
1895 284 2233 3212 -365 -729 -2017 -2321 -614 1136 2077 2414 756 -1514 -1469 -2343 -351 97 2224
1912 2224 2724 598 -1349 -2776 -2846 -431 1639 1292 2325 223 -1718 -2367 -2672 -1159 1605 2077 1317
1929 1317 135 -946 -2144 -2729 -1038 964 809 694 1240 -2836 -1664 -718 156 1843 1777 470 75
1946 75 -1653 -2054 -928 -604 964 1999 925 -535 -1633 -3415 -360 793 1244 1812 -870 -230 -1148
1963 -1148 -1697 -852 582 2593 2164 620 101 -1496 -3084 623 1077 763 3305 191 -586 -1213 -771
1980 -771 -1113 476 -499 905 411 -20 -293 -2437 -978 366 1486 1704 1896 -1791 -360 -1883 -1218
1997 -1218 1263 586 702 1001 -688 -1485 369 123 1218 1355 205 1367 -855 -623 -533 -1585 646
2014 646 1657 58 417 -1655 -2409 -2061 -648 847 2227 905 -38 -802 -2038 449 -777 1727
2030 1727 1559 879 -147 -143 -1921 -430 962 984 2733 584 500 -1097 22 -574 437 225 889 -1614
2048 -1614 -780 372 -772 -100 1717 1134 506 414 -945 -59 -674 138 716 -489 71 438 91 -502
2066 -502 -1082 -1516 84 894 440 308 -605 -534 -1463 -2198 1315 103 345 -131 -364 -1842 736 864 905
2085 905 461 -900 -221 -672 -1945 237 537 650 50 749 1800 79 -772 -1194 -1288 -988 113 32 821
2104 821 391 -873 592 606 591 -749 -1083 -1166 315 638 -3 709 -531 482 -300 -274 275 17 -282
2123 -282 -1322 -1716 -944 -120 -1134 206 -511 -56 484 -1642 665 704 169 605 1141 -709 1215 114
2141 114 -668 1026 -1648 -1042 571 -838 79 -97 1482 1820 1136 -442 -8 -206 1182 668 155 1246
2159 1246 372 -1455 226 -157 -1102 265 -1427 843 1478 1069 -1021 -964 -31 773 -135 1778 1773 -1455
2177 -1455 672 -657 1369 -202 -2232 1204 -7 224 -480 -747 -217 -358 656 -75 532 413 -571
2194 -571 1778 -1404 -942 185 84 1065 1018 237 -409 193 -977 971 823 925 1295 -1182 -729 864
2212 864 -191 481 652 376 1141 83 -1314 -278 -1683 1348 1295 -2 2569 -461 -27 -1603 -614
2229 -614 73 1090 1138 2138 1824 -1312 -1617 -1175 -1048 2564 -827 910 -62 -2125 82 -444 145 1857
2247 1857 1441 1522 1000 -2282 808 575 808 1629 1107 864 499 -348 -1040 1306 1795 1409 885 -58 -84
2266 -84 28 -1920 -964 -569 3094 2426 -994 -595 -1596 -1766 117 1050 715 1336 -581 -884 -1732 37
2284 37 -2109 2455 884 983 615 558 -1509 -1154 840 632 1254 685 -700 -968 -313 -896 -571 1820 1204
2303 1204 777 373 -686 -2999 -1692 687 1572 1924 372 -284 -1217 -839 -1063 782 2683 1474 334
2320 334 -801 -1041 -248 -96 808 1592 2217 1558 118 -2173 -1662 -69 1641 3141 364 -238 -898 -2725
2338 -2725 -1902 178 1388 1473 1905 408 -2515 -2268 -1329 2300 3294 1226 -435 -66 -959 -2446 -1857
2355 -1857 -286 927 1376 1771 -1140 -1388 -1230 -1058 1345 985 1593 1397 -200 -1019 -1752 -1529 -127 3081
2373 3081 1424 2154 -475 -1446 -1820 -1219 647 2565 1602 38 -461 -2220 -1100 -1206 267 2818 2447
2390 2447 593 -1317 -2926 -405 -464 727 3478 1745 691 -748 -2880 -1953 -1233 1676 1894 2414
2406 2414 570 -1554 -3568 -2409 744 1284 2976 1499 -1512 -2019 -2028 -2300 625 1952 2253 2382 -614
2423 -614 -2434 -2007 -2126 11 3029 2248 1866 -707 -1576 -2495 -1299 640 2199 2648 863 -772 -3006
2440 -3006 -2224 -1439 908 3370 2604 1049 -311 -2274 -2463 -1546 991 1890 3226 1213 -481 -2562
2456 -2562 -2415 -1275 958 3230 2568 715 -1078 -2943 -2733 -128 1400 2987 2832 942 -2290 -3196
2472 -3196 -1655 428 1792 2079 3099 -319 -3141 -3212 -2680 671 1408 2702 3181 -135 -1593 -3764
2488 -3764 -1628 777 2787 3824 1801 -811 -3429 -3000 -2392 853 2280 3273 2502 -912 -3467 -3112
2504 -3112 -335 1059 3417 2756 2349 -211 -2352 -3887 -1552 751 3160 2706 1670 -923 -3994 -3902
2520 -3902 -1759 1188 2645 3866 1100 -1555 -3528 -2316 -917 2072 2739 1917 846 -1550 -2795
2535 -2795 -1655 -340 2279 2697 3026 212 -1771 -2738 -2136 -287 2100 3554 3006 858 -935 -4055
2551 -4055 -2747 432 1771 3495 3142 261 -2656 -3499 -2742 -560 3187 3149 1856 -128 -2198 -2962
2567 -2962 -3041 1197 2265 3244 2142 -775 -3440 -2604 -1536 701 3951 2423 1585 -1233 -3505 -3682
2583 -3682 -1387 1963 3643 3979 1118 -1346 -2273 -4177 -518 2610 4260 2361 338 -1526 -4489
2598 -4489 -2642 -1459 2448 3478 3916 975 -1298 -3435 -3546 103 2227 4217 3351 701 -2195 -3511
2614 -3511 -2643 -455 3127 3497 3688 345 -1904 -3707 -2927 892 1970 3488 2269 1288 -3120 -4538
2630 -4538 -1405 1700 3953 3410 2004 -807 -3312 -3766 -2978 884 3041 3346 1996 -1379 -4186 -3038
2646 -3038 -1348 1041 4362 4616 2417 -1041 -4110 -3739 -2094 1182 4462 3181 987 -1208 -5028
2661 -5028 -4064 112 1546 4056 2064 984 -1087 -3583 -2520 -775 2042 4045 2434 1192 -1848
2676 -1848 -4257 -2729 -1368 2069 3546 4005 635 -3345 -4104 -3216 -375 3214 4108 2708 471 -2768
2692 -2768 -3855 -3730 1732 3438 4145 2704 -623 -2511 -4264 -3537 303 3997 3661 2432 -1544 -3609
2708 -3609 -4205 -2234 560 4139 3477 1942 -935 -3833 -3648 -3049 1620 4825 5144 1184 -575 -4849
2724 -4849 -4308 -1549 3242 4872 3229 1399 -2024 -4286 -2829 -1108 2749 4895 3711 445 -2530
2739 -2530 -4360 -3987 -1603 2447 3589 3152 645 -2133 -3288 -3326 -751 2016 4883 4015 -209 -2321
2755 -2321 -5187 -3245 -233 2973 4368 3499 -82 -3098 -4310 -1939 375 2781 4846 2657 -550
2770 -550 -2564 -3377 -2935 1015 4462 4464 2629 -79 -4242 -4044 -2576 167 4389 3524 1216 -2018 -3724
2787 -3724 -5897 -3037 547 4297 3599 588 -1083 -3846 -4049 -1659 1470 5153 4173 2307 -2285 -5274
2803 -5274 -3284 -2698 1689 4586 4277 1016 -2228 -2859 -2599 -1299 3228 4417 4411 1360 -3024 -4972 -4341
2820 -4341 102 2693 5066 3277 886 -3795 -4681 -3259 410 2643 4547 3718 -956 -4120 -4539 -3726
2836 -3726 158 3131 3963 2805 37 -2928 -3904 -1648 1373 4232 3553 3002 -1949 -4382 -3711 -2628
2852 -2628 1620 4274 3833 2075 -1960 -4060 -3672 -2306 2433 3249 4292 2361 -2046 -4619 -4147 -1038
2868 -1038 2258 5001 3285 1087 -2527 -4959 -3313 -1519 2563 4464 3623 334 -2351 -4098 -3134
2883 -3134 -1153 3168 3808 4055 500 -2712 -3994 -2980 -346 2428 4668 3549 371 -2547 -3610
2898 -3610 -2622 231 2131 4171 4194 -513 -3464 -4585 -2327 946 3195 4840 2947 -237 -3999 -3470
2914 -3470 -1016 2322 3751 4515 2426 -2190 -2851 -4127 -1567 11 4087 3988 1345 -1427 -4079 -4255
2930 -4255 -1793 1372 5526 3616 1967 -2285 -4718 -2889 -841 2413 4050 3966 1759 -2318 -5263
2945 -5263 -3940 -1523 2688 3933 4587 604 -2336 -4171 -3569 -611 2665 4011 3483 -191 -3556 -5114
2961 -5114 -3659 -695 3111 4081 2754 746 -3498 -3764 -1954 227 2893 4058 2923 -1878 -3286
2976 -3286 -4259 -1972 1140 3405 3899 3206 -1566 -4536 -4117 -3154 1465 3960 3755 2458 -1899 -3866
2992 -3866 -4317 -1924 1939 4510 3573 1888 -1255 -4727 -3432 -2210 1877 4457 5105 594 -1584 -4067
3008 -4067 -3748 -762 2360 4672 4444 1094 -1910 -4431 -4699 -1453 2112 3834 4086 -487 -2542 -3918
3024 -3918 -4407 -156 3262 5006 4971 88 -2387 -3526 -2887 -692 2447 4444 2829 -1840 -4008 -3860
3040 -3860 -2792 153 3323 3347 2006 -979 -3074 -4709 -2965 824 3725 5270 2167 -421 -3714
3055 -3714 -3109 -2905 584 4470 4248 1123 -2051 -4742 -5130 -1056 2022 3601 2998 493 -3241 -4484
3071 -4484 -3971 -762 2630 3345 3115 455 -1285 -5249 -2899 -1090 2007 4437 3955 1358 -3177 -4452
3087 -4452 -3581 -1050 2887 4918 2373 509 -2198 -4546 -3011 -190 2774 4692 3660 -397 -3166
3102 -3166 -3579 -2941 -161 2760 4247 1977 205 -2980 -4131 -2080 -474 3076 2835 3548 31 -2658
3118 -2658 -3825 -1745 883 3917 4680 3454 854 -2693 -2196 -2108 1131 3948 3901 1376 -1788 -3945
3134 -3945 -3564 -1874 1747 3842 3799 1325 -2056 -3612 -4373 -1280 2412 3790 3443 629 -3112 -3574
3150 -3574 -3463 -932 1986 3673 3286 285 -2778 -4689 -3043 -529 3130 3909 2839 278 -2569 -3034
3166 -3034 -2493 -215 2383 3176 3085 -168 -2665 -3205 -1844 1143 2432 4586 2589 -911 -3737 -4627
3182 -4627 -2031 1316 2956 4452 2600 60 -2778 -4153 -1591 780 3700 3746 2456 -1231 -3470
3197 -3470 -2973 -2201 779 2987 3496 1114 -1731 -3260 -2787 -783 869 2956 3153 2217 -1799 -3041
3213 -3041 -2939 -831 1419 3484 3281 398 -2579 -3719 -3523 -70 1847 3649 3023 1384 -2225 -3062
3229 -3062 -1577 -677 2664 3929 2574 -659 -2374 -3578 -3265 -533 2580 3513 1964 574 -3263 -3986
3245 -3986 -2655 293 2696 3562 1341 -538 -2711 -4083 -2661 724 2591 3793 2263 -722 -3932
3260 -3932 -3979 -1701 551 3594 2827 2046 -300 -3341 -3678 -1520 1968 2898 3721 760 -1142 -3822 -3268
3277 -3268 -1111 1020 3690 2826 942 -1676 -3221 -3097 -1263 609 3235 1802 679 -1347 -4107
3292 -4107 -2190 -778 2129 3445 3508 410 -2057 -1870 -3093 415 2737 4093 4127 -129 -3377 -3136
3308 -3136 -1164 502 1949 2836 2235 -942 -2946 -3638 -3008 -532 3032 3369 1924 -1250 -3620 -3844
3324 -3844 -2197 -476 3064 3611 1351 -484 -2668 -3137 -2139 1475 3221 2801 1340 -1275 -3298 -4233
3340 -4233 -1303 714 3389 3135 1300 -995 -2908 -2452 -1410 230 3287 2701 303 -922 -3781 -2029
3356 -2029 -929 1434 3290 2857 599 -2073 -2913 -2528 198 2175 3214 1922 -198 -1297 -3400 -2089
3372 -2089 -33 3198 3395 2595 222 -1986 -2601 -2524 1027 2556 2451 2484 365 -2513 -3296 -2310 789
3389 789 3347 3512 1826 -453 -2102 -2780 -2460 534 2552 3033 1828 -647 -2057 -3451 -2016 782
3405 782 2849 3056 76 -1238 -4088 -2029 -862 504 3061 2483 1201 -802 -2348 -2366 -1076 928
3421 928 2562 2918 748 -2018 -2739 -2739 -1246 1230 3134 2350 319 -2145 -2267 -2467 -491 980 2750
3438 2750 2643 -642 -1353 -2119 -1769 -671 2077 2459 1622 547 -2366 -2568 -1365 -102 1174 2035 1848
3455 1848 -474 -2831 -2240 -1880 619 1694 2082 1773 -798 -2351 -2102 -1041 -335 2785 3212 270 -1568
3472 -1568 -2055 -2633 -2132 741 3183 2499 1223 -1299 -2754 -3126 -333 1217 3228 2644 714 -498
3488 -498 -2826 -2641 -587 1195 3088 2139 535 -702 -2901 -2140 -1104 2322 2102 2080 667 -2307 -2113
3505 -2113 -1338 137 2393 2770 1554 264 -2444 -1930 -1777 802 1616 3330 1255 -850 -2394 -2431 -1157
3522 -1157 974 1679 2245 2012 -295 -1940 -1451 -1943 1373 1953 2893 1085 -1496 -3373 -2489 -677 223
3539 223 2925 2998 1257 -1610 -1734 -1492 -998 64 3143 2043 -196 -448 -1697 -3063 -689 1378 2427
3556 2427 2049 1330 -1423 -1111 -1583 1123 1200 1771 2420 736 -2330 -2586 -2591 -115 1904 1857 1627 790 -1992
3575 -1992 -2214 -716 155 1514 2486 2253 -212 -1809 -1839 -1310 646 1274 2205 766 117 -1803 -2090 -949
3593 -949 -206 1195 1929 1472 -479 -391 -2104 -1370 123 2051 1614 356 51 -1820 -2235 -849 877
3610 877 1909 2150 900 -139 -2561 -2218 -697 784 2025 2481 978 -461 -1625 -2230 -444 1914
3626 1914 2296 1227 693 -1742 -1482 -1748 -841 242 2108 1561 -772 -823 -1478 -826 -7 1982 3457 2471
3644 2471 1327 -1678 -579 -2131 364 1590 2717 2028 -969 -799 -1790 -2265 -474 2051 1751 1171
3660 1171 -718 -1806 -2153 -1767 192 885 1837 929 -745 -1873 -2296 -143 1575 1833 701 728 -773
3677 -773 -1389 -1738 -1486 437 1992 1398 1266 -504 -1274 -749 -1546 1174 1216 919 963 -793 -1306 -1988 -368
3696 -368 266 695 1021 51 -1048 -2240 -2736 -390 173 1433 1362 1276 -798 -1629 -914 -452 1191 1257 1520
3715 1520 -573 -766 -2029 -1324 427 941 2349 1248 560 -519 -1443 -388 216 934 2581 476 271
3732 271 -731 -1921 -311 -164 1717 1465 886 -44 -783 -1405 -685 996 1332 1359 496 -1243 -900 -1697
3750 -1697 -1372 875 1500 1207 834 -167 -1448 -598 -1107 46 1997 1008 -9 -769 -533 -2108 -510
3767 -510 363 1860 1509 858 -691 -1503 -1613 -216 582 1447 1149 -2 -1666 -1773 -1299 -1031 937 1448
3785 1448 747 1168 -840 -2299 -586 41 1457 1399 1754 -1106 -1550 -1829 -236 -576 294 930 1378 -600
3803 -600 -1493 -1486 -454 1240 575 1083 383 124 -2086 -1414 -978 -40 199 408 31 129 -330 -1401 -1019 647
3823 647 804 1206 -131 -255 -664 -109 -2 792 1136 374 595 -378 -983 -1055 -203 611 745 1114 1191 -436
3843 -436 -1421 -1210 -681 506 792 1482 346 -1339 -1619 -1396 -190 1057 1144 986 -556 -319 -2324 49
3861 49 46 1115 -69 1075 589 -1347 -343 -271 1110 96 341 832 -179 -829 -1196 -139 84 2158
3879 2158 1270 102 -74 -997 -1149 -1164 -631 66 466 310 -71 -553 -1327 -1654 37 798 1441 -798 -444
3898 -444 -1663 -1214 -474 -15 677 1282 661 -723 -1531 -715 -62 1567 1596 -493 90 -438 -1041 7 871
3917 871 494 772 -625 806 -349 -723 -1301 -565 1242 189 1071 -177 -805 -1245 160 -588 -328 727
3935 727 326 78 -692 -1715 -1718 108 90 654 498 323 -756 -1029 -393 -381 1362 1413 793 -808 -46 -931
3955 -931 -1172 597 817 1075 250 -324 -255 243 -124 -286 746 782 207 -188 -838 -385 -22 -116 319 17
3975 17 -753 -176 -768 513 17 575 908 16 -337 -817 -828 -573 -365 -412 177 159 242 778 -1282 -589 597
3996 597 1191 -167 553 294 -211 -270 -369 637 929 1492 -656 -57 -582 348 -468 -667 506 288 799
4015 799 458 -8 -752 -878 868 -98 -699 1296 362 505 -926 -188 680 -124 -234 -777 -495 88 -1267
4034 -1267 -633 -831 171 -1257 1282 -1322 172 -155 911 1031 -627 99 -27 -1553 -1021 -588 -192
4051 -192 -417 1345 1331 -717 246 -297 151 -1312 -91 523 842 -25 -153 -744 -610 32 -290 308 -295
4070 -295 -391 -1240 -874 -631 -4 829 -554 165 351 238 -94 -447 489 -178 1170 816 -975 -605 188
4089 188 74 786 -205 280 41 648 -20 -450 -607 -82 620 -36 -23 453 270 187 534 -168 154 164 691
4110 691 279 1138 -816 95 1016 225 82 -584 528 -721 -725 85 576 142 -75 131 295 295 527 -99
4130 -99 35 -546 -345 -944 -303 438 -842 -175 418 -342 262 -345 -117 -159 -370 -365 -766 -60 729 -102 -187
4151 -187 274 -703 -496 -704 159 -315 -440 -41 58 -628 -126 378 660 571 -892 -626 6 105 -92 -140 -216
4172 -216 385 -340 -264 315 421 -17 1474 76 17 -717 -1043 -659 455 -575 -184 -683 757 -187 1040
4191 1040 315 547 202 173 -197 -663 -213 -720 32 -16 -653 139 910 326 1165 -61 -243 765 -620
4210 -620 596 881 -750 502 -416 -284 251 334 1252 825 304 -680 7 -380 594 -72 251 -298 -396 225
4230 225 -414 73 -673 689 1102 721 600 -273 291 -6 70 579 -290 1057 -552 81 710 -28 978
4249 978 -359 -385 179 -299 273 -137 -934 -48 1044 64 -775 151 -739 -144 19 -109 -1023 -751 24 685
4269 685 48 -661 51 -167 604 84 -762 152 501 639 152 -80 -415 1934 462 -309 862 -226 854
4288 854 -980 1252 1085 142 -904 -174 468 -707 -271 -520 410 -533 205 98 149 -439 643 -110 -66
4307 -66 -700 -206 1101 -567 435 297 364 556 538 79 1008 -62 -93 352 319 216 78 613 894 466
4327 466 58 71 -917 -819 373 -268 782 249 -1260 740 -211 -394 -1293 726 26 474 -185 -231 -626
4346 -626 156 -162 558 -119 343 -350 -969 -437 94 -388 436 -775 -366 -221 -1216 49 -662 1208 308
4365 308 268 -455 175 -1321 -210 409 -447 754 1140 -974 -440 -1139 83 -192 -367 -109 239 1075 520
4384 520 465 -46 -220 1041 1196 604 801 21 -1789 -507 -103 -262 -19 -486 1080 770 -945 -357 -1867
4403 -1867 371 -576 247 -550 -1500 -482 119 1334 1035 1677 -718 -831 -1567 -248 -564 484 579 -917
4421 -917 -598 -403 -8 1062 -137 -475 66 127 -1472 -959 285 -450 306 1157 415 613 107 -1183 -304
4440 -304 -21 -601 314 1244 15 -829 436 -695 -136 -23 -417 939 230 -232 -102 79 1032 -642
4458 -642 -109 9 368 -401 -285 -568 412 17 -142 102 223 -503 -809 -394 -358 296 120 505 -424 276
4478 276 180 -70 -291 -557 1476 -161 330 309 -1057 -816 1116 66 859 -120 -88 -498 -619 -12 776
4497 776 -869 536 300 -168 -92 -473 -428 151 164 -788 -342 -703 -536 -1200 -1188 896 -1121 315 164 35
4517 35 -363 -684 -397 -606 449 -658 -258 511 -830 -247 -99 -82 1536 187 -748 -85 -441 -286 720
4536 720 -116 -964 -468 -479 290 -562 -6 -104 123 -67 155 396 -415 -1242 148 -89 1148 704 208 506
4556 506 -864 222 -793 39 723 617 608 183 -948 -1021 109 482 777 280 615 -683 -514 -490 2
4575 2 -552 242 -39 53 -76 -763 211 443 362 207 615 -47 -1088 -784 -528 -251 414 1517 522 313 165
4596 165 -660 -262 -440 55 -463 723 139 313 -636 -981 813 -73 517 1337 200 -189 86 -850 35
4615 35 -75 297 440 1333 168 -533 -257 87 -95 1016 186 342 -319 -677 71 45 -467 -69 -54 -144 -618
4636 -618 -1 -584 707 570 1002 -884 -229 -319 62 -29 169 132 -606 -785 -178 -53 -156 681 385 -279
4656 -279 -192 -203 -707 -703 -555 -1038 164 -134 555 395 -187 -963 -1721 -492 -467 462 710 -279 -1397 -1297 -857
4677 -857 -452 -50 974 1306 531 -182 -568 517 70 107 210 456 327 -347 -569 -290 251 688 -898
4696 -898 -1036 -398 -522 -1082 -267 -345 957 140 266 -132 -468 268 -634 -96 1207 520 620 -575 -684
4715 -684 149 31 -503 551 863 -209 -79 -1433 -998 914 189 -850 -386 579 -205 390 231 -143
4733 -143 724 -372 -977 -1158 -862 589 334 -34 520 1200 1595 160 -1477 -422 685 -67 32 -214
4751 -214 371 506 -984 -449 -893 504 1428 519 -743 686 -193 -631 -791 -175 110 933 -482 -1293
4769 -1293 286 -859 -228 2156 1278 -595 -898 -143 -426 492 -1401 744 -116 288 296 -879 -869 138
4787 138 -99 -82 -522 -122 -755 -535 -697 -376 -446 242 399 26 -326 -1346 -322 -303 -238 -112 437 818 161
4808 161 26 -56 427 -94 985 264 415 178 359 -167 -976 391 490 989 356 -242 -340 3 -619 108
4828 108 -972 511 243 -451 -138 -910 -548 -264 332 -252 399 239 -502 45 -263 72 1022 -268 636
4847 636 -413 -136 -543 -950 195 428 -562 821 -77 686 -598 -944 -197 1583 430 110 -511 -378
4865 -378 -699 482 -426 -247 723 53 -106 24 596 -271 -226 992 531 -359 264 85 605 -243 -495 352
4885 352 546 131 464 -395 -1059 684 280 1107 1596 114 922 -232 -1183 -60 324 916 484 338 937
4904 937 -276 -498 182 1545 -683 654 -47 -27 -249 402 -267 1169 -549 833 -171 -1492 -381
4921 -381 310 55 40 29 -763 425 836 -1213 -234 -410 596 146 -482 -776 105 214 55 129 -828 842
4941 842 174 401 386 321 70 668 467 761 -1095 -1107 -740 -994 839 312 1030 140 -365 -191 -555 -447
4961 -447 -141 1062 1021 -457 283 -71 -1156 -438 235 60 603 607 573 107 -481 657 -395 653 -375
4980 -375 802 295 255 -176 -284 11 -260 420 204 279 -326 -1 -600 -487 -498 267 296 -477 -601 -636 -1360
5001 -1360 23 638 312 -36 112 -968 -287 1013 2 559 -296 -92 -571 -270 711 34 -49 406 6
5020 6 -404 -713 101 -131 351 733 975 -68 -632 104 -627 -319 -626 -273 736 898 -418 135 365 -749
5040 -749 -396 708 -494 336 264 -257 -274 551 -92 373 323 236 243 -522 -212 -157 794 -287 -415 722 84
5061 84 -237 351 -84 450 -299 626 -273 162 -224 433 704 -306 -144 184 5 -659 -374 -1065 -359 592
5081 592 -560 -125 753 -201 -334 -523 72 325 427 462 -1185 249 109 -385 -398 658 -12 507 241
5100 241 7 -894 41 -1191 -400 253 -170 -257 510 448 -589 29 -86 199 763 -224 -10 -78 423 235
5120 235 -48 341 -514 -153 -188 -371 -159 253 349 75 -1234 -881 115 -588 108 961 -536 -638 -386 -258
5140 -258 -1664 -84 86 -763 -311 -407 66 -637 1126 61 -1533 -609 1418 -77 89 878 -620 1561
5158 1561 -458 -2322 372 -40 -459 -1914 -168 178 -290 555 86 402 1385 -1088 119 528 -476
5175 -476 -467 1453 1130 1174 -891 -729 -154 -957 750 1456 342 780 -80 -1031 -713 -102 -8 -92 -1578 -478
5195 -478 -342 14 -537 -292 159 563 -771 1207 524 59 -524 -129 844 -444 -602 1664 -790 470
5213 470 23 45 -1041 207 885 -805 1215 -435 276 -1161 369 -35 -932 201 130 -732 544 116
5231 116 554 20 -71 241 669 -989 -149 -272 -650 147 -241 -263 -83 -265 -51 -1064 -401 281 -375 689
5251 689 202 922 -438 673 -11 -334 -74 755 87 -153 1461 815 697 -131 -50 961 104 -507 232
5270 232 -856 696 64 -648 193 346 633 21 402 -511 -505 -721 -740 986 501 -23 -856 -365 527 507
5290 507 11 650 419 834 180 453 780 353 -813 683 -337 -792 342 56 702 146 -109 331 -33
5309 -33 541 -41 -213 -1523 162 -656 286 -672 1083 -549 -580 -256 1017 -978 127 -637 258 -1071
5327 -1071 -534 210 38 426 108 1054 617 524 5 -867 1515 151 -479 863 152 -374 878 1075 -484
5346 -484 -108 -53 -720 265 -1179 445 -9 -112 -445 1296 -188 -83 263 -876 548 792 -250 138
5364 138 -61 -43 309 805 602 613 428 311 412 -371 684 -389 -383 70 1251 308 -446 -523 -390 -881 199
5385 199 196 447 -174 -404 -212 296 -76 -103 1055 188 27 -403 -67 -146 -761 602 785 -394 1125 -130
5405 -130 254 -274 457 -98 528 528 -1266 166 -54 -189 561 695 218 -745 -1066 -57 114 -464 -360 1418
5425 1418 -179 411 -63 27 -309 254 -1101 702 448 208 -1356 -294 -513 312 217 521 140 -1256
5443 -1256 -299 141 804 -64 -30 1098 455 -227 -296 -133 530 390 264 65 307 379 -262 -1267 515 -839
5463 -839 1220 1096 110 335 271 28 542 179 397 507 62 218 72 465 -202 347 339 49 505 26 -297
5484 -297 -573 -252 -153 -107 -612 -75 -504 660 -97 522 682 159 244 -789 -436 -252 -828 -89 498 826
5504 826 668 885 418 63 -215 62 454 677 35 -1070 -903 -656 157 -18 797 634 -186 -304 467 -1023
5524 -1023 -766 -359 1098 616 441 498 -277 -862 154 -536 440 -595 643 -28 -436 311 -938 -309
5542 -309 273 549 397 95 -623 411 116 -587 489 -535 -62 228 -383 -128 -859 91 280 119 -690
5561 -690 -317 82 -522 -410 -352 226 -86 -72 205 538 -300 -285 -420 54 403 220 260 -586 -150 -229 32 1117
5583 1117 479 -46 -184 301 -644 -319 269 1026 9 -753 -352 -66 -500 825 510 731 604 383 393
5602 393 -386 135 1061 1056 751 469 325 179 -171 -677 -134 664 289 -401 1009 -309 -829 848 202 1457
5622 1457 1922 573 -464 640 -1085 91 76 361 1165 159 -1104 -407 388 -698 493 316 -498
5639 -498 -238 202 -1008 -292 -447 -339 427 104 -529 -789 320 -324 77 205 105 721 192 -167 -179 44
5659 44 254 -55 822 533 -480 -30 136 -1228 -323 14 1378 225 -179 754 -1236 -594 -32 -66 -256
5678 -256 -116 144 -1149 -896 -35 910 -17 109 -761 128 -863 -862 -572 -80 1239 128 -156 -635 -469 62
5698 62 -340 97 806 -383 -559 275 214 -302 566 56 -394 -302 -135 -125 176 253 -29 731 -74 317 224 -652
5720 -652 -522 -366 -549 410 673 193 523 -94 -727 -224 60 679 62 -675 643 -70 -1441 -437 -174
5739 -174 -613 414 -394 -120 -1302 682 -520 -132 -337 888 364 -320 -309 -1109 -943 -874 -167 597 -105
5758 -105 475 -375 -1032 -274 1268 742 -83 591 -587 -38 -946 334 -147 1477 -80 -775 -396 -1094
5776 -1094 -729 723 111 338 439 190 -691 314 -453 -973 -37 429 917 -504 -489 -58 -849 949 819
5795 819 401 728 340 -927 -1308 73 -17 -677 -336 242 339 -578 -709 -379 -773 817 309 456 -120 -240
5815 -240 -817 156 -197 815 313 228 147 -1073 109 -513 -487 -129 -11 385 -157 -852 -855 -743 1446 154
5835 154 151 400 1251 -351 -1214 -540 1017 161 447 -1228 -163 -614 -284 -41 466 268 -264 746 -542
5854 -542 -536 -835 12 1050 -563 190 -54 -1119 -131 -136 630 790 501 240 -208 -787 -365 -667 180 -179
5874 -179 214 648 185 -587 -958 61 -636 365 366 251 1036 -621 -505 308 -15 -365 603 868 -586
5893 -586 -964 -567 -262 201 700 1582 205 -263 -671 -47 -1540 -354 497 -701 80 -948 -160 -1816
5911 -1816 -307 382 184 767 736 658 421 -31 -23 -77 1092 527 -640 -573 -408 147 405 784 501 -196 172
5932 172 185 -578 -1385 -275 -86 -234 234 -367 294 546 951 -62 193 488 130 76 -581 277 -884 -215
5952 -215 268 2499 755 511 -780 -368 -365 -728 879 88 276 -16 -1094 -940 -154 44 86 -1058 -20
5971 -20 638 -403 -586 -776 -278 892 284 386 -385 475 -482 -433 435 299 271 852 -199 349 -317 -369
5991 -369 395 1741 1104 -91 364 -1164 -705 356 1532 1252 -292 433 -1109 -674 -57 264 946 445
6009 445 595 731 -287 12 -411 -155 632 125 -91 -486 15 -1067 214 -89 278 431 1276 593 122
6028 122 -1468 -684 479 3 657 -818 -122 -309 -804 -205 -1493 408 149 181 480 -663 -579 -34 875
6047 875 -967 -43 -291 108 -708 -460 247 880 1266 2155 1927 -770 -461 -245 -1286 -502 180 172 -213 362
6067 362 570 -294 -36 -274 163 459 704 939 -1337 497 383 1622 580 972 -73 -230 -133 814 -611
6086 -611 -1241 -946 367 457 88 -370 -576 77 -67 124 135 -101 3 -142 -196 -12 -902 862 -79 -106 -532
6107 -532 -716 458 33 -274 983 57 196 403 -2044 -281 369 25 376 -255 -633 -628 -1277 194 -454
6126 -454 -76 363 152 348 49 -715 187 99 202 657 215 -1559 -966 -437 -739 -454 -470 -1013 615 -559
6146 -559 -259 -742 -413 -911 449 -330 -467 589 -698 131 266 1465 -1110 368 -1567 245 706
6163 706 -585 -883 556 -51 507 -231 -999 -28 -331 -415 -156 -68 -117 657 -530 -690 342 419 239 67
6183 67 131 -538 -1159 -1264 245 -495 1853 1029 -396 907 -296 -688 -688 970 513 1244 570 211 -1118
6202 -1118 -336 929 -1076 591 218 -1328 -1024 -137 -1483 -356 111 1129 1374 196 98 -1330 -1246
6219 -1246 -173 -784 109 492 -663 -191 -309 321 330 -791 1081 214 -6 -1397 15 -1006 570 -66
6237 -66 345 -521 -1206 226 -839 544 -921 216 1295 -24 -58 9 -729 -143 417 -99 -1011 278
6255 278 -700 169 -260 -324 -285 36 96 58 -1024 -134 -711 -814 405 1680 -387 642 -658 1072 45
6274 45 -144 -589 572 142 -407 244 -699 -208 119 -146 1453 1235 436 -1083 -303 -654 74 -278 859
6293 859 1440 -431 980 -1784 -578 231 279 848 521 -1044 -549 -747 327 197 246 -289 862 -507
6311 -507 -43 -327 -223 907 622 489 -619 -33 -418 -559 -735 1330 381 109 1632 -374 164 -463
6329 -463 33 53 -465 1275 879 395 -623 397 -367 -408 320 312 506 -811 750 -302 393 37 -100
6348 -100 531 -1030 292 -547 -620 -403 667 131 -297 318 -196 -723 -309 -96 84 1155 887 -227 -641
6367 -641 -1526 -141 820 511 696 -364 -792 -44 163 -761 798 -1155 523 -460 -271 1146 -1225 -485
6385 -485 323 666 181 -99 -1506 -356 -317 -220 -95 816 -121 344 -413 -487 -1727 162 105 156 145 860 578
6406 578 -298 -844 -1237 919 16 305 857 -52 530 -837 -715 436 132 -980 -237 -974 -1309 -116
6424 -116 -264 -1230 132 691 -319 178 -1324 490 -503 -56 -9 -666 -272 -427 361 -633 753 741 -86
6443 -86 140 101 -205 56 88 717 166 -32 -690 -178 73 68 188 -232 755 -235 -103 372 -684 -475 321
6464 321 -12 -143 -391 -88 -513 -664 298 -462 25 818 -347 -74 743 -85 -676 -107 -640 166 271 -579
6484 -579 1179 -1077 -1399 -1195 -103 1212 1099 428 -678 -574 -77 817 691 -413 -28 213 -183 -1901
6502 -1901 -293 669 -967 -19 -1303 -1041 -451 -805 -269 240 233 -267 199 -736 -485 83 -723 -429 827
6521 827 551 -918 224 -415 137 542 552 52 -276 -248 -365 -85 447 -224 786 284 148 207 -727 779
6541 779 -52 16 174 -431 228 243 -1275 -1279 336 1588 692 87 823 -67 -572 -91 -5 -1201 157 -526
6561 -526 224 -145 -1777 -517 -1240 473 -72 104 97 -86 -549 205 86 341 103 -569 211 212 -17 595
6581 595 158 510 466 -733 -943 756 960 -704 -535 -244 1055 -180 420 467 -36 -94 303 391 142 347
6601 347 -569 -1151 -464 282 1527 1137 -241 -58 482 -131 -525 -939 700 332 704 1465 957 -288 -515
6620 -515 -63 736 192 -817 714 131 -462 -439 -408 165 1085 -252 1005 -1129 -675 -162 -147 508 -755
6639 -755 193 -645 -448 690 163 7 37 -1060 165 -154 -155 359 -581 -759 -978 266 -248 828 -861
6658 -861 751 447 144 -185 370 -331 315 494 -840 -1182 427 -98 479 310 50 23 337 39 -189
6677 -189 33 5 849 105 219 1531 -805 -202 327 830 936 -19 -395 -921 51 -698 227 -266 -97 130
6697 130 -88 -330 -819 -1532 34 -552 308 239 564 126 348 597 -500 -236 293 -174 530 542 -536 53
6717 53 515 706 415 226 -380 -313 80 -634 -498 349 -285 377 -132 1087 435 -618 427 268 427 -423
6737 -423 701 103 929 -168 756 -4 756 463 -693 465 84 -282 511 765 199 -883 -243 132
6755 132 -472 1011 -250 694 -255 -206 -901 244 1087 -390 760 -167 85 -934 -48 887 -200 166
6773 166 168 656 673 -475 -522 306 -214 -299 73 -385 66 160 -721 -102 8 102 161 -508 -195 -368 -792 74
6795 74 552 1060 18 1145 105 -893 584 -680 -66 673 500 423 -579 -617 -508 94 -711 723 667
6814 667 -46 371 347 -367 649 418 908 156 532 358 -463 739 381 -427 256 -194 305 683 -444
6833 -444 -250 691 281 261 417 -118 156 -299 -111 752 -93 1260 150 -86 360 -406 -559 353 -74 -55
6853 -55 117 5 133 522 247 -270 388 712 -140 -374 -340 -43 -65 327 834 -81 480 39 -430 -887 205
6874 205 131 100 546 568 30 110 -306 749 -980 -245 -453 39 126 359 173 -843 61 -452 -37 -943 242
6895 242 -824 352 145 -324 340 -31 -161 -536 195 259 -143 561 834 398 -86 -82 435 184 21 377
6915 377 473 398 797 33 469 -85 -610 -70 651 -22 844 -379 -113 -1559 -541 319 -842 -545 -73
6934 -73 630 -1967 -113 -259 -1144 -778 -487 951 -496 739 107 -1318 -795 -381 762 457 194 -694
6952 -694 211 -717 -311 416 -695 -407 8 -279 -518 -1263 403 530 -782 -542 -334 -769 1108 446 -75
6971 -75 -815 88 145 -447 -248 483 -697 -548 -58 -66 -162 293 -869 14 -8 62 -150 -30 -17 34 1166 -345
6993 -345 877 -408 -111 175 -166 -635 -50 -753 -255 1051 954 449 323 273 141 -1072 -382 362 282 -630
7013 -630 -101 82 -234 -200 985 429 -756 206 154 12 95 -288 -524 -382 463 -244 -238 -797 -647 373 167
7034 167 305 540 603 -499 75 -806 -16 828 -647 -21 -1096 627 605 215 -188 -371 216 -314 -40
7053 -40 -439 277 238 1511 -246 624 504 -335 -1169 476 485 -556 -511 328 -207 343 -388 -568 -513 -849 9
7074 9 220 674 -788 -751 -241 -485 15 728 -360 22 489 -329 -473 -21 942 -14 -909 -383 -827 -374
7094 -374 -546 239 -34 -171 795 336 -53 -648 -986 -1183 1242 700 -1445 611 -902 -12 237 -377 -476
7113 -476 270 171 -468 64 86 920 -482 448 -329 -1253 1078 61 -333 -51 -1047 1137 -537 -1115 605
7132 605 17 -285 -216 667 246 787 773 -365 -76 114 -206 -307 -727 -320 610 406 -137 -819 -165 -249 425
7153 425 351 50 -523 -1 -267 27 -247 867 -459 -440 464 145 773 703 199 -325 240 56 360 192
7173 192 -212 348 145 -265 1548 -604 -75 439 361 131 -196 233 11 471 -386 168 474 626 -138 851
7193 851 -45 -366 449 64 -318 432 -417 -162 -47 247 -316 563 -716 -162 -448 -736 370 627 110
7212 110 41 65 -655 82 804 623 668 -184 -201 -475 -1002 431 -438 97 252 1543 -396 332 -285 -218 201
7233 201 -184 -536 269 264 -186 414 -182 1517 541 -276 -97 461 -174 -1513 -942 -491 -109 -60 464 -22
7253 -22 521 -546 -435 153 329 619 -360 -358 880 -397 554 -41 387 424 1515 288 493 -654 -159
7272 -159 -120 1435 -1481 385 -3 128 -350 -1184 -1125 893 -830 -671 -542 178 -472 -682 -101 10 -412
7291 -412 -1237 320 -6 -293 -55 791 -401 394 -325 -154 1305 -799 619 1597 434 678 71 149
7309 149 -35 -213 -38 -1121 -475 -175 -34 822 269 -1255 -1164 559 -282 -672 -889 76 -439 191 -397
7328 -397 -530 7 74 -615 -291 -640 -459 51 -317 -1100 1320 579 -230 -727 888 -493 149 524 904
7347 904 1182 -888 143 -1080 1002 -566 1458 125 1142 -1414 45 56 -90 441 -356 -752 -875
7364 -875 -217 207 385 -371 581 205 869 -398 1294 309 -228 -1217 -106 852 -13 351 265 534 -514
7383 -514 19 615 -701 -1090 -216 -374 -1144 82 178 -675 -778 260 -843 -189 265 -179 506 -793 495
7402 495 -88 54 368 -147 -711 -130 27 -528 -242 414 -966 -349 -214 118 247 242 -78 493 -330 602
7422 602 -38 335 697 -229 748 -166 -587 -288 26 1045 -1305 -141 1376 -366 543 -1 2 -126 -110
7441 -110 -493 203 1117 -287 88 -503 -102 308 553 -515 -927 -320 451 -673 5 -817 -579 834 -322
7460 -322 -119 240 -366 764 -598 -295 516 402 135 -27 -631 -12 -195 -863 -1024 594 -864 100 234
7479 234 950 -1356 -367 1207 -1319 -255 37 459 -98 321 -175 144 -1451 648 -166 -538 -794 -1461
7497 -1461 -727 -1139 -500 -249 -778 416 -183 160 -264 82 483 -214 -842 -32 -255 54 -175 -666 -115
7516 -115 -307 -92 -526 1066 -143 -485 -190 253 295 33 362 35 -1385 41 -337 731 -1177 55
7534 55 -564 45 1934 601 909 150 363 -646 -1184 -398 -628 231 504 -777 -573 -665 -153 129 -714
7553 -714 -1520 -563 -114 -902 -310 1023 -1322 -1555 -951 -616 780 846 898 636 -1190 248 625 315 -847
7572 -847 634 598 420 -360 59 -1409 -951 -176 209 -659 340 314 -302 -776 610 883 -25 445 320 428
7592 428 4 -625 -596 580 534 628 19 697 312 15 -622 -368 280 -471 38 18 -1053 -135 -144 -77 161 -229
7614 -229 -504 -224 -589 -733 -169 -291 -628 -373 116 910 810 332 774 -858 -531 773 -522 -43 804
7633 804 -248 31 564 281 242 201 980 -471 -200 41 -649 -944 -487 -155 1271 -470 180 -367 -999
7652 -999 494 59 897 703 1113 374 104 1368 263 61 1708 766 -1620 395 -394 -601 -462 189
7670 189 119 1122 409 893 -399 750 220 -748 -1846 -653 102 -119 -986 -109 -697 49 765 429 714
7689 714 446 -20 -34 1013 489 311 -92 -510 22 434 213 659 -329 711 35 -597 182 62 -353 122
7709 122 -227 37 38 -112 -350 803 -867 -469 1410 -433 -1077 114 868 370 22 -69 -390 -252 721
7728 721 -108 -505 -90 49 -1316 297 -545 343 -785 -1025 -124 -397 -702 -247 1153 250 -289 550 681
7747 681 -347 623 127 -440 -594 -179 174 482 94 -556 157 -190 325 -219 260 747 337 318 1308 -810
7767 -810 -810 -447 -593 564 -399 -222 -46 -756 757 -620 585 623 666 -165 -694 -711 102 -643 580 796
7787 796 -23 307 615 -492 -518 -624 1150 51 600 286 -480 -946 -905 273 1070 -632 -1322 -853 174
7806 174 722 17 456 -787 -503 495 -604 -89 -46 -429 -305 -138 768 -399 165 -1391 137 -541 238
7825 238 373 53 -220 -750 -117 -1797 -637 362 -951 -1399 316 -158 -782 1 545 -431 78 173 92
7844 92 -1320 1341 108 -1104 269 558 180 -1411 -255 761 -864 398 218 141 532 -322 -1043
7861 -1043 -745 -901 138 639 -454 -514 -1396 257 183 -581 -570 -551 -432 767 608 261 437 1031 449 384
7881 384 -614 -499 -203 728 261 -89 -825 590 726 387 -790 -253 -49 -414 -205 2 -110 7 -312
7900 -312 -74 84 -130 168 -30 -376 832 -6 445 -203 213 -396 198 -41 -741 -464 967 754 -126
7919 -126 -367 407 -375 455 -695 624 -747 16 534 1227 564 85 172 -434 888 -711 802 913
7937 913 231 766 287 -973 385 -665 795 707 136 -116 286 -286 791 356 -807 137 -957 637
7955 637 642 465 19 580 -583 -94 -100 -391 37 -461 -746 -631 -1139 14 -72 57 -369 309 -1088 -260 575
7976 575 -494 -51 -96 -180 -243 606 170 168 366 489 500 650 -18 251 -794 -683 -579 -254 142 552 -223
7997 -223 717 -814 870 495 1090 485 278 -418 -169 -211 -748 556 145 -207 572 34 -363 627 -236
8016 -236 -898 139 -10 -151 -537 -388 223 700 -71 -317 895 867 -340 -327 -1 -304 -201 50 -473 22
8036 22 800 -273 26 566 64 317 -495 -345 517 599 -248 -43 -121 356 -330 146 -153 824 -412 -237
8056 -237 -407 460 -60 118 -109 349 124 -546 -305 367 465 181 -616 -74 -633 682 283 415 182 -687
8076 -687 6 69 -426 535 834 -20 223 -674 -275 190 -329 -241 -5 -113 108 -432 -623 646 38 -860
8096 -860 -885 1044 216 -346 -333 -242 192 -1392 1209 -355 -48 217 328 -368 -1 298 -569 -4 569 -323
8116 -323 -142 -410 -1394 -593 -177 -906 -518 -1135 1727 85 -297 711 -994 945 68 -13 62 635 164
8135 164 343 146 243 44 -1586 -739 -512 -309 -1043 307 516 136 -415 -575 -355 331 -125 425 515 -122
8155 -122 -843 -47 392 106 606 -67 -122 -282 -791 532 30 -1171 -56 -297 661 23 589 -840 -251
8174 -251 -506 -592 -971 -377 390 1264 503 -305 249 199 -417 -660 1266 448 -255 440 243
8191B43
$$ Imaginary data points
##PAGE= N=2
##DATA TABLE= (X++(I..I)), XYDATA
0 0 0 0 0 0 0 0 0 0 0 0 0 0 0 19 -108 108 -108 108 -216 216 -216 324 -324 432 -540 569 -654 767 -932
29 -932 1080 -1195 1403 -1596 1807 -2041 2284 -2583 2897 -3241 3621 -4036 4494 -4985 5529
44 5529 -6125 6768 -7477 8242 -9091 10014 -11029 12143 -13384 14753 -16278 17990
56 17990 -19928 22131 -24673 27625 -31121 35335 -40513 47075 -55714 67612 -85272 114518
68 114518 -175531 637551 -1135969 -124879 904793 -861691 444324 -59450 95735
77 95735 661442 -485890 -98922 271088 -551293 97790 290550 93208 104054 25009
87 25009 -67241 -212632 -165774 99212 134897 117509 31747 73011 -158401 -269012 -51747
98 -51747 55081 135615 108165 107974 70349 -287941 -124158 -4367 -90201 226874 80325
109 80325 15717 93324 -356002 -86393 36119 -175216 297447 134230 -71833 109204
119 109204 -260826 -145165 43916 -89562 229795 130259 -85369 49998 -186140 -166843
129 -166843 40037 2421 179192 156030 -28407 -10370 -142449 -156926 38212 43741 122792
140 122792 167950 -47721 -63018 -85922 -165442 48497 94656 99598 197257 -31598 -97136
151 -97136 -46596 -172736 42132 143083 39198 164506 -10869 -144345 -33228 -128058
161 -128058 15845 169786 59018 122909 16798 -163856 -60540 -84765 -26314 161389
171 161389 66370 48615 21076 -165754 -91335 -33931 -28163 154599 104731 13987 23202 -164728
183 -164728 -120088 -6109 -47830 140205 109123 -36146 16187 -145983 -134723 22838 -22294
194 -22294 124398 130134 -45666 -2695 -125770 -151918 27231 -2329 92329 124717 -44074
205 -44074 -30753 -94676 -134130 35307 46959 79569 137693 -23595 -66478 -70782 -130554 14909
217 14909 79947 63508 118127 -8223 -91189 -48023 -98709 12728 122944 57642 109836
228 109836 11225 -121112 -41070 -82867 -7639 135941 56235 77005 28461 -121544 -43414
239 -43414 -40091 -6634 144443 70961 49859 27588 -129052 -65871 -27385 -15809 128729 81255
251 81255 18054 20091 -110849 -85512 2180 -4199 112826 98587 -4900 -2611 -107147 -109047
263 -109047 3338 2762 86938 104493 -19435 -19475 -80171 -114370 18305 24515 63543 108078
275 108078 -27635 -50891 -73711 -120072 5407 44504 46794 98562 -17848 -68432 -51813
286 -51813 -105205 5119 72640 41064 87868 -8731 -92897 -55182 -87795 -9550 90162 47940
298 47940 68613 8054 -94021 -47614 -57271 -6249 100543 54788 50194 10104 -101353 -57926
310 -57926 -35237 -12157 102352 70870 29593 22245 -84922 -62522 -7290 -315 93900 80993
322 80993 12269 6294 -80571 -79574 4055 8424 84385 94463 1511 -652 -61440 -82736 10136
335 10136 22993 65523 89113 -4930 -30578 -60484 -88110 7263 34741 55181 89584 -6984
347 -6984 -39474 -46442 -82796 4555 47247 40442 71525 -6555 -64154 -48374 -77039 -5314 61249
360 61249 40293 62380 1562 -72014 -45826 -60343 -11046 68571 38899 42316 3639 -85520
372 -85520 -52608 -42624 -14400 78286 52688 29328 10160 -76901 -55697 -24063 -9825 72268
384 72268 55422 12395 6086 -74660 -62381 -6950 -5224 73818 69673 6401 3370 -57663 -66521
397 -66521 3110 10827 59419 72536 -1557 -10398 -50608 -70695 11558 25279 54702 80679
409 80679 738 -23832 -39313 -69979 7619 37854 39408 71846 -3472 -42521 -35357 -64910
421 -64910 4682 50923 40302 63877 1924 -48379 -34303 -58146 -4950 56302 30578 46474
433 46474 3325 -64367 -38123 -42397 -7379 61711 40327 31741 5107 -66132 -45475 -31576
445 -31576 -16543 58598 38979 15801 5560 -68994 -52307 -13113 -10346 56498 53690 4507
457 4507 2684 -58821 -59717 -6083 -7340 50380 55325 -3876 -3105 -51653 -60608 4004 8841 47000
471 47000 61873 -4353 -11753 -40689 -63308 4414 21112 37986 61079 1675 -23587 -34046
483 -34046 -50477 6163 38782 38286 59682 5534 -37522 -25813 -46034 -4186 48464 33763
495 33763 43698 11863 -44094 -29304 -32475 -3543 56577 36242 34859 11945 -50437 -28014 -27456
508 -27456 -11220 55492 34343 23671 12418 -50795 -36168 -16821 -3976 55432 37888 14397
520 14397 4540 -53085 -41327 -12587 -7569 43056 41711 7539 -3245 -46139 -47871 -4191 3487
533 3487 39037 46361 -2461 -13899 -39170 -50908 -6009 10742 28317 45877 -97 -19916
545 -19916 -28783 -50799 -373 23142 24181 46871 -2548 -31749 -24759 -47923 -3521 30915 20538
558 20538 42773 4141 -35285 -21798 -38950 -1530 40020 23942 38424 1142 -41997 -22120
570 -22120 -31946 -4779 45361 26126 29723 9633 -40908 -23505 -18936 -3509 44807 33367 18618
583 18618 5070 -40154 -33450 -11445 -2160 39929 35553 10534 6869 -34837 -37127 -2531 -221
596 -221 35792 40552 -858 -4530 -32849 -42237 -975 4724 28771 43845 -3619 -7257 -26252
609 -26252 -44146 2210 9604 22080 42044 -5867 -21180 -23481 -42079 -626 18762 17594 37634
622 37634 -1521 -23011 -19367 -36784 -2339 24995 16916 31265 1042 -34368 -21087 -30070 -6779
635 -6779 33309 19070 24933 6974 -34212 -20660 -20801 -5640 33927 22821 17509 7459 -37065
648 -37065 -23032 -12210 -6145 38062 26101 11144 11174 -29211 -25859 -4043 -3489 30169 30284 3489
662 3489 3120 -28967 -29337 736 1492 29186 34663 1857 -553 -20153 -34403 2697 7942 19376
676 19376 36012 -980 -12046 -17653 -33666 2896 15271 17512 34804 242 -16642 -13331 -33589
689 -33589 -1282 18194 10285 29578 -1398 -25408 -13408 -27334 -3251 23627 13334 22768
701 22768 3208 -25632 -15375 -21165 -7524 24508 13221 15662 3535 -30090 -19696 -15103 -6642
714 -6642 26098 20460 7945 4715 -25293 -24003 -7654 -6928 22923 21758 3040 4859 -24219 -23586
728 -23586 -460 -2492 23736 27719 -495 2659 -18864 -27003 1939 1012 18272 26498 -1468
741 -1468 -2573 -16197 -24841 2212 7064 17459 28115 -164 -7845 -11947 -24994 1928 12833
754 12833 12466 24264 2093 -13438 -9719 -20727 -1115 19310 11440 21593 3335 -18620 -10219
767 -10219 -17819 -3887 19322 9842 15631 5248 -22218 -9754 -12982 -6500 23393 12334 9399
780 9399 6260 -21990 -13349 -9743 -6436 20175 12430 5578 4397 -21248 -16610 -2643 -5114 18374
794 18374 17004 463 2038 -17924 -20427 -2040 -2627 14423 19283 -1163 -462 -13432 -19936 1574
808 1574 1448 10987 22428 -2677 -2936 -9839 -22598 408 6123 6884 20508 -1219 -9154 -5937
822 -5937 -19456 1265 11614 6394 19617 -655 -12864 -6875 -17411 -1471 15169 5877 14373
835 14373 4785 -16135 -4713 -11889 -2336 16601 7356 10957 3453 -15296 -9841 -8046 -5380 16207
849 16207 8430 5041 7210 -16987 -9437 -1076 -7393 15157 12224 -80 4093 -13622 -14638 302
863 302 -2970 12252 14335 -808 3380 -10842 -15252 2861 -1853 8406 15594 -3397 -3018 -7890
877 -7890 -18088 1032 3584 6432 16659 -1068 -4960 -5438 -14269 510 5758 3769 14706 291
891 291 -8441 -3437 -14262 -1491 10748 3098 12723 2827 -10833 -3186 -9008 -2883 11787 5092
905 5092 10015 3121 -11621 -3684 -6310 -3015 13476 5712 5898 5718 -11089 -4911 -1697 -4305 10898
920 10898 8859 1080 3612 -9025 -6980 -1805 -3239 10928 9481 -624 3015 -8105 -10202 2480
934 2480 -1162 4623 12764 -2829 2386 -4734 -13200 1482 1412 5133 10740 -2120 198 -1841 -13340
949 -13340 1362 2441 1358 12921 -2581 -4901 -1920 -10960 -430 5228 1951 8045 176 -7408
963 -7408 -418 -9460 -787 5733 984 7474 145 -6859 -28 -6472 -1920 8344 923 4839 3345
978 3345 -8668 -3806 -1571 -3672 7254 3081 1081 2478 -9356 -4910 -1672 -4199 7489 4398
992 4398 -1377 4816 -6395 -6264 3634 -3755 5405 6700 -3738 3112 -4667 -6719 2888 -2570 5456
1007 5456 8288 -2823 1500 -2978 -7865 3675 -1677 1248 7044 -2709 -1262 -518 -6748 336 1124
1022 1124 1051 6315 -1309 -3240 -965 -5829 300 2832 -1774 5126 101 -4574 1096 -5051 -3530
1037 -3530 6114 -1503 3095 2021 -7129 -188 -2587 -3532 4331 -626 722 3349 -5394 660 -545
1052 -545 -4588 5357 764 -337 3087 -4966 -2312 1397 -2882 4009 2446 -2407 2621 -3111 -2511
1067 -2511 3217 -3163 1710 4282 -3857 2867 -1188 -4317 3576 -847 798 4872 -2885 -474 1708
1082 1708 -4119 2759 821 -1837 4970 -1838 310 2065 -4820 1084 1377 -2384 3834 -1337 -2507
1097 -2507 3132 -3223 331 3195 -2431 2452 472 -3392 1781 -1448 -828 3565 -1724 1033 2549
1112 2549 -4020 1727 848 -3837 3805 -1575 -2020 4154 -2528 644 780 -3044 3120 352 -3001 4282
1128 4282 -3062 403 2196 -3865 2038 909 -3352 4087 215 -1768 3603 -1467 93 2873 -3251
1143 -3251 1628 302 -1256 2049 -2522 -1497 1861 -3214 798 2038 -2102 2805 1204 -3462 1962
1158 1962 -2004 -638 3794 -1298 1221 1266 -4163 1633 -544 -1474 3659 -1311 -747 1991 -4502 1486
1174 1486 903 -2279 4799 -698 -1794 3047 -3698 -272 962 -2605 3791 788 -1508 1791 -3713
1189 -3713 -1337 2359 -1683 3182 3369 -2990 888 -2064 -2592 3655 415 1564 3947 -2897 -1518
1204 -1518 -1046 -2005 2571 352 -148 4422 -2180 -2216 994 -5470 2475 2576 -2473 2394 -455 -3661
1220 -3661 195 -2450 1794 3529 -340 2896 -1552 -4405 885 -1905 -183 5397 -772 1156 -287
1235 -287 -6247 -89 -680 -1042 4957 1400 223 923 -5260 -1577 96 539 4103 342 -2475 265
1251 265 -4792 -2559 2949 -1140 3868 3759 -4087 904 -3698 -5116 2586 -792 3379 3223 -2386 -646
1267 -646 -3223 -3884 2965 1270 2599 5010 -3088 -1746 -1311 -4139 3120 3112 2250 3200 -1662 -4099 -2259
1284 -2259 -2352 2666 4354 -63 3305 -1113 -3943 -1601 -2975 1535 6124 1218 253 1145 -5626 -2850
1300 -2850 579 -176 4862 3062 1438 328 -5209 -1843 137 360 7095 1290 -336 20 -5996 -2307
1316 -2307 731 -496 5328 3364 -2106 411 -5803 -3505 2264 1694 4831 4133 -3320 -1061 -3669
1331 -3669 -4065 3191 1826 3921 3927 -2057 -2111 -3442 -4366 2215 3552 2775 5809 -2236 -3532 -2098 -4965
1348 -4965 1729 2862 2872 4676 -3384 -3984 -1701 -3427 2283 5499 770 2665 -225 -6427 -1223 -1753
1364 -1753 1208 5495 2530 2347 -1794 -6247 -1667 -637 497 6191 2127 1885 -871 -5310 -3341
1379 -3341 528 812 5987 2878 -499 -1139 -5087 -3600 1350 581 6297 4608 -2637 -586 -6075 -5377
1395 -5377 2041 918 4624 5837 -2813 -2522 -4794 -5335 1844 1859 4461 2329 -2542 -2993 -4580 -4060
1411 -4060 2691 4361 1303 4811 -2386 -5453 -2407 -3376 1359 5208 1391 2039 -1894 -5253 -2491
1426 -2491 -2068 990 5666 2684 1334 -2641 -6889 -1831 -1216 1624 7221 2759 1685 758 -6873 -3169
1442 -3169 854 645 6959 4057 -509 -1663 -4305 -1872 712 1045 5985 4722 64 -1215 -7550
1457 -7550 -3970 2023 2958 4349 3686 -2824 -3619 -4188 -4194 1116 2963 3539 4970 -1779 -3192 -3153 -5145
1474 -5145 2896 3519 2767 4842 -1351 -5444 -3582 -4338 2772 4524 3215 4097 254 -4765 -3749 -3834
1490 -3834 844 7099 1501 3330 -609 -6916 -2604 -2781 1309 7597 3626 1295 -511 -6311 -3018
1505 -3018 -1570 1608 5772 3937 610 -609 -5904 -2498 134 1585 5129 3627 -2053 -1766 -5060
1520 -5060 -2154 611 3073 7230 3672 -68 -3289 -5437 -4994 580 2502 4405 5372 -2368 -2216 -5017
1536 -5017 -3531 1089 2075 4519 4624 -2532 -4932 -3872 -3719 2041 2929 5366 3328 -2278 -4444 -4423
1552 -4423 -3980 2329 4758 2648 3054 -1593 -5454 -3146 -1782 1279 6882 2994 2328 -1281 -5615 -3367
1568 -3367 -2522 1178 6204 2896 1572 -1308 -6424 -3220 -604 1412 5307 4134 891 -1780 -4359
1583 -4359 -4559 -141 1925 5725 3888 13 -2291 -6009 -3862 771 2045 5225 5031 -789 -2308
1598 -2308 -5004 -3501 1093 3557 4343 4170 -474 -2934 -4117 -4880 1719 2537 3945 4443 -1055 -3537
1614 -3537 -2569 -4443 1364 4141 2735 3649 -1698 -4661 -4086 -3890 949 4171 3203 3127 -2177 -5186 -3466
1631 -3466 -2760 879 5814 1564 1940 -154 -4799 -3205 -2175 701 4766 3838 34 -2272 -4420 -2726
1647 -2726 300 1537 4821 3689 -493 -2019 -5009 -4322 436 1790 5498 5004 -1180 -2025 -4960 -3756
1663 -3756 2063 2526 4733 4504 -1237 -2644 -3470 -4036 1052 2622 4463 4609 -104 -4022 -5273 -2764
1679 -2764 743 3515 3777 2872 -167 -3520 -3783 -2073 1689 4214 3978 2066 -1389 -3622 -2800 -2241
1695 -2241 1550 3596 1708 2325 -1403 -4098 -3663 -1488 38 3846 2255 1507 -1818 -4943 -2836 -1775
1711 -1775 2287 4329 2053 1858 -2342 -5077 -3071 -397 1225 5916 3632 538 -2933 -3752 -3353 666
1727 666 2243 3762 3153 -220 -2159 -4778 -3420 125 1990 4092 3758 -35 -1741 -3824 -3543 727
1743 727 3435 3481 2274 -1627 -2433 -3999 -3786 846 3277 3395 3476 -850 -4255 -3450 -3401 389 3735 3613
1761 3613 2289 -1986 -5073 -2599 -1941 2099 4345 3823 2912 -1784 -3497 -1237 -2208 1439 4660 3109
1777 3109 -392 -583 -4346 -2830 -621 2252 3894 2677 -95 -1936 -3661 -1549 -253 1592 3993
1792 3993 2517 -263 -1319 -3288 -3694 445 605 4931 3173 611 -1477 -4209 -4105 2 1764 3949
1808 3949 2853 -2105 -2445 -3033 -2731 2046 1053 2544 1701 -530 -2473 -3127 -2521 710 3445 2312 2691
1825 2691 -976 -3291 -1992 -1589 2427 2197 1101 2063 -872 -3687 -2390 -1521 1017 3557 2964 1377
1841 1377 -213 -3037 -1963 -1944 696 4103 1295 792 -428 -3940 -2066 -715 252 3356 1799 -456
1857 -456 -801 -4044 -1595 187 1380 3910 2194 13 -2033 -2384 -2867 -85 1344 3163 1668 -233
1873 -233 -2312 -1731 -2278 921 1788 1860 1035 -1445 -1162 -2148 -2131 221 2641 3122 2519 -501 -2150 -1337
1891 -1337 -2259 1335 2844 1848 1361 -1146 -3059 -2210 -3473 1234 2351 2001 1036 -1728 -2403 -2379 -492
1908 -492 310 3424 1250 1832 -519 -1940 -1157 -1099 1444 2741 1928 774 -206 -2429 -1684 -518 1734
1925 1734 1861 1164 835 -1530 -2951 -395 918 533 3464 1567 -374 -1894 -1572 -2030 1167 1449 2261
1942 2261 1301 -224 -1567 -1679 -1582 429 1788 1642 1654 -1641 -1075 -985 -1510 1665 2002 330 2441 58
1960 58 -1257 -1714 -493 1107 1496 1393 1168 -933 -2035 -1161 -2018 1407 1953 423 962 -774 -1576 -1329
1978 -1329 -520 -577 1368 1765 -134 -250 -2550 -1031 -825 333 1892 41 756 -910 -1500 -1996 226
1995 226 1071 1913 2214 -1159 -358 -2570 -1796 -35 -806 1773 700 -1207 -1639 -1798 -1012 1578 -2513
2012 -2513 1014 2396 -982 -1006 -1242 -2099 -748 1311 1634 545 -765 -2223 -793 463 96 1348
2028 1348 473 1372 -416 -2431 -1784 -1513 854 959 67 -247 1299 -2309 -244 -383 -358 165 -402 -819
2046 -819 -336 -2518 -415 95 102 1473 1108 540 -1143 -1093 305 599 -1345 3717 250 -6 198 429
2064 429 653 -110 -391 1269 163 -414 -637 -2076 -1900 401 78 851 1510 -893 -411 -1341 -181 -6
2082 -6 865 139 1947 -763 -926 -707 -119 617 -299 968 2215 -852 -1261 611 -1858 -247 1141 -1134
2100 -1134 343 -549 -2671 -882 -156 -523 -1042 1042 -1281 -785 -2163 13 -838 1053 710 -452 764
2117 764 -1282 -25 183 -794 1094 765 605 -28 -807 -384 497 -1392 -1034 1159 -319 -1574 -636 -839
2135 -839 -85 1378 -844 -273 1393 -1185 933 1290 -467 -801 45 -257 -500 -172 -744 -1015 -1642 287
2153 287 -588 -1079 -811 -51 -490 48 -46 1215 -197 64 -135 -478 670 -19 63 -1801 30 634 8
2172 8 156 -617 1746 -634 -1234 1122 -1614 -775 -138 -923 -208 365 -955 534 -1447 -948 -85 -193
2190 -193 34 926 -742 120 -1405 736 209 -354 1091 853 380 -750 -62 -357 228 754 1873 -373
2208 -373 -1467 64 646 -1532 523 1409 -361 829 -2258 -2656 221 624 1143 1024 -98 -212 164
2225 164 -1261 -1397 82 275 1513 1659 12 -73 -123 -868 -276 351 1413 -45 -447 -120 -1348 791
2243 791 779 1685 376 222 969 -878 -355 -1058 37 1262 985 1480 -2228 -945 -1195 -1894 1073 1028
2261 1028 965 1347 -312 -1897 -231 1536 1279 1170 2774 -298 482 -340 343 -875 2789 2141 1711
2278 1711 1149 141 -823 -2056 -272 -261 1065 796 27 -903 -1464 -2317 -856 2511 -122 1205 287
2295 287 -2826 -1180 662 -148 881 2356 190 -1036 -2849 -3328 -1690 650 1111 842 353 1053 -674
2312 -674 -1902 -583 1467 1517 2642 949 -815 -1572 -1832 -805 519 1103 1353 442 -1225 -2618 -1312
2329 -1312 -204 1699 2896 2016 1872 -1684 -1677 -2951 -1382 2347 3011 2057 -314 -751 -2439 -1182 -958
2346 -958 1190 -427 700 1540 -1242 -2929 -476 -904 1727 1522 979 -801 -932 -2802 470 690 706
2363 706 1694 1463 20 -1951 -2091 412 1163 1781 2246 709 44 -1580 -3562 31 -122 1142 2163
2380 2163 1398 -456 -2379 -2790 -977 431 3248 1567 175 -1752 -2372 -1218 -2147 231 1569 2780
2396 2780 1023 -1998 -1820 -1324 -1325 371 1364 1845 -35 -1458 -2572 -2149 -861 1611 2368 2531 -575
2413 -575 -1435 -2873 -1680 -460 2158 2975 1296 -74 -1114 -2971 -1386 757 1662 1954 2278 429
2429 429 -1961 -2742 -1673 556 2433 3171 1451 389 -2251 -3433 -1064 285 2357 3071 1527 -809
2445 -809 -2570 -2978 -672 1090 2328 2612 1018 -1037 -1810 -1897 -1173 1365 1995 3047 920 -1080 -2188
2462 -2188 -2374 -1140 1450 2408 3175 331 -1208 -2937 -3029 545 2584 1922 2390 444 -1872 -2528 -1604
2479 -1604 -476 3113 3346 2121 -210 -1950 -3208 -1685 358 2161 2717 2065 351 -3036 -4077 -1684
2495 -1684 -114 2886 4610 1818 143 -1703 -2591 -2369 -563 3070 4350 1427 -1448 -2788 -3153 -1275
2511 -1275 956 3836 3053 1120 -823 -2657 -4233 -914 1662 2493 2809 886 -948 -4080 -3081 -701
2527 -701 2208 2621 2521 1020 -1787 -3551 -2501 -1246 2309 4121 3746 1235 -2408 -3466 -3141 -683
2543 -683 2706 4572 2873 -210 -2930 -3391 -2780 -423 3321 3643 2874 457 -2609 -3880 -3344 93
2559 93 3356 4378 1973 -993 -2504 -3585 -2260 1728 3620 2813 1476 -399 -3512 -3140 -1978 1533
2575 1533 3907 3466 971 -625 -4241 -3717 -2356 1772 2453 3936 1021 -1350 -3378 -3089 -1088 2381
2591 2381 3316 3141 959 -977 -3429 -3026 -787 1510 4537 2955 1863 -1845 -4085 -2952 -251 2102
2607 2102 4716 3100 297 -2219 -3206 -2356 313 1818 3550 2812 738 -2065 -4557 -2387 -108 2318
2623 2318 4616 2158 -1132 -3067 -4195 -2572 1248 2154 4160 2087 -252 -2659 -3486 -1827 550
2638 550 2935 3445 2357 -955 -2857 -3866 -3020 1288 3975 4176 439 -2012 -3668 -2757 -1554 1917
2654 1917 3414 3269 1530 -2113 -2202 -3713 -2412 1866 3421 2824 1305 -1746 -3870 -4467 -854 2078
2670 2078 2920 2827 1362 -2425 -4351 -2908 -1044 2651 4317 3662 366 -3279 -5162 -3907 -302 1800
2686 1800 3893 3811 1014 -4027 -3916 -1762 -25 3617 5059 2611 43 -3248 -3992 -2178 178 3049
2702 3049 3409 2308 -832 -2774 -3137 -3296 914 3059 4521 1946 -1410 -3609 -3403 -2332 1946 4279
2718 4279 3875 1614 -974 -3773 -3838 -1971 1927 3643 3808 1018 -2603 -3583 -3871 -181 1881 3990
2734 3990 3096 1362 -2979 -2959 -3568 -963 2576 3350 2405 562 -2628 -4912 -3358 -947 2987 3914 3511
2751 3511 1354 -3632 -4829 -2831 -848 2906 4281 2769 777 -2477 -3572 -2746 193 3925 4603
2766 4603 2662 -656 -3711 -5490 -2302 330 3665 4199 2754 -3 -3639 -4333 -1959 485 3958
2781 3958 4691 1849 -578 -3984 -3254 -2851 856 3084 3963 1526 -1161 -4446 -3579 -1083 1318 3085
2797 3085 4299 1564 -1765 -3373 -4235 -1199 2520 3670 3687 90 -2518 -5518 -3606 -1582 2004 4160
2813 4160 4626 171 -2519 -2997 -3299 -1126 2536 5271 2361 -206 -2879 -4935 -2993 201 3313 4913
2829 4913 2318 -706 -3090 -3143 -3387 776 3580 4206 4268 -178 -4074 -5458 -1826 949 4008 4024 1987
2846 1987 231 -2956 -4253 -1759 1777 3945 3353 1897 -829 -4022 -3957 -2162 1467 3595 4182 1778
2862 1778 -1792 -4061 -4126 -1500 1417 5217 4114 1689 -1709 -3785 -2437 -2229 1887 4430 3765 1464
2878 1464 -3118 -3311 -4408 -712 2833 4536 4288 1379 -2578 -4138 -3209 -43 2644 4288 4064 -512
2894 -512 -3479 -4516 -2668 -124 3365 4615 3889 -590 -2912 -3754 -2769 1166 2966 4279 1811 -1272
2910 -1272 -3805 -4444 -1998 1095 4572 4460 3107 -1746 -4310 -3360 -1353 1309 4106 3184 1592 -1579
2926 -1579 -4040 -3188 -522 1872 4287 3613 1700 -1614 -3203 -3918 -2037 2124 4732 4492 -86 -3227
2942 -3227 -4268 -4487 -1962 2022 4725 3722 1172 -3283 -5999 -2463 1702 3570 4140 4102 742 -2022
2958 -2022 -4273 -3215 -462 3615 5398 3028 936 -2293 -4143 -2697 229 3530 4119 2588 -891
2973 -891 -3862 -3948 -1457 65 3633 4877 2912 -302 -3958 -3608 -2632 678 3359 3502 2084 -1245
2989 -1245 -4416 -5062 -1998 1993 4062 4422 2222 -2291 -3724 -5242 -1061 2051 3694 4530 325 -1649
3005 -1649 -4933 -4066 -367 2296 4036 3148 756 -2724 -3410 -4132 166 2774 4530 3423 782 -2738
3021 -2738 -4151 -3975 601 2272 4905 3647 851 -3885 -4953 -3117 -1054 3211 4087 3539 700 -3411
3037 -3411 -3260 -1739 -520 3902 3482 2762 275 -2759 -3775 -2283 1632 4439 4119 2343 -1061 -3453
3053 -3453 -4128 -2089 975 4343 4684 2073 -1219 -4397 -4322 -2923 1288 3892 2636 1926 -2592 -3550
3069 -3550 -4669 -1428 2732 3371 2620 1614 -2481 -3713 -3756 -1478 2578 3778 3983 564 -995 -4189
3085 -4189 -3420 261 1968 4338 4468 987 -3023 -4277 -3276 356 2270 3849 3393 -1034 -4081 -4670
3101 -4670 -2420 1006 2999 3860 3352 -838 -3386 -3272 -2521 1618 2137 4081 1414 -644 -2926 -4210
3117 -4210 -885 1928 2734 4119 2739 -1436 -2421 -3068 -1357 1672 3034 3599 2274 -1594 -4227 -4098
3133 -4098 -1453 608 3935 4396 1702 -2707 -2671 -4351 -1705 1964 4269 3174 302 -1778 -3804 -3551
3149 -3551 -1522 2037 4561 2331 1071 -1495 -3695 -3140 -1161 2739 4081 3635 622 -1545 -3713
3164 -3713 -2250 -804 3025 3189 2344 1558 -3381 -3371 -3219 668 2840 3353 2788 -744 -2167 -3717 -3063
3181 -3063 -318 2810 3809 1281 -681 -3050 -3380 -1948 1148 3673 3969 921 -640 -4309 -4122 -1008
3197 -1008 1373 3848 3407 2399 -991 -3285 -3208 -712 1579 3326 3998 887 -941 -3778 -3734 -1045
3213 -1045 1635 3772 4022 861 -1952 -2624 -2428 -1900 2048 3739 2824 -499 -2191 -3949 -1652 -556
3229 -556 2023 3643 2340 -353 -2793 -3076 -2980 -661 2084 3633 1707 63 -2884 -3753 -2412 763
3245 763 2311 3451 1531 198 -3361 -3525 -1667 1489 2827 3743 2636 242 -2741 -5347 -2399 1449
3261 1449 2606 3871 1957 -749 -3368 -3147 -1200 1660 2940 2358 590 -1611 -2805 -3893 -1345
3276 -1345 1394 3471 2689 1543 -1065 -2939 -2220 -1403 1390 3139 3272 1002 -2044 -3472 -3373 -513
3292 -513 2660 3091 3210 891 -1570 -3513 -3289 -680 2402 4239 2492 490 -2606 -2634 -2296 329 2451
3309 2451 3669 2612 18 -2371 -3518 -2316 370 1753 2670 1821 -157 -2247 -3475 -2262 592
3324 592 3552 3481 637 -937 -2806 -3697 -1814 496 2988 2515 1508 -8 -2579 -3322 -2247 1063
3340 1063 3246 3005 1602 -1505 -3393 -3067 -1725 2191 3215 2681 1090 -1914 -3924 -3286 -429 1649
3356 1649 2490 2425 626 -2678 -2791 -2246 -910 2256 2879 3681 229 -1522 -3529 -2150 -427 1534 3216
3373 3216 2776 -26 -2877 -2862 -1874 -450 2222 3388 2394 -303 -2053 -2775 -1608 799 2435 3270 1964
3390 1964 -517 -2333 -2739 -1590 1261 2124 2525 1440 -910 -2417 -2437 -1950 1423 3208 2490 771 -663
3407 -663 -3188 -2929 -1094 971 2720 3600 1281 -973 -2236 -2437 -1501 1476 2943 2153 1434 -1465 -2995
3424 -2995 -2647 -727 2492 2647 2435 567 -1370 -3450 -2593 -613 1966 3054 2886 17 -2064 -3611
3440 -3611 -2004 -836 1107 3152 2959 -513 -2153 -3623 -2732 681 2191 2463 1169 -665 -1879 -2786
3456 -2786 -1296 217 2001 2881 718 -1663 -2981 -3060 -2796 1108 1519 2908 998 -1078 -2084 -2373
3472 -2373 -1392 1155 1734 2166 693 -146 -4101 -2730 -332 1573 2819 2229 140 -2383 -2451 -1040 -1243
3489 -1243 1210 3609 1980 256 -955 -3484 -2656 -1330 183 1884 1576 190 -1203 -2230 -2541 -343
3505 -343 1040 3787 896 464 -1225 -2958 -1464 -560 2357 1411 2408 289 -1960 -2488 -1101 1095
3521 1095 2045 3506 1255 -653 -1898 -3291 -958 639 1189 1435 1433 -1140 -1838 -2217 -1574 657 2508
3538 2508 3077 1052 -1347 -2014 -1428 -1965 1163 2999 2302 923 -1205 -2695 -3191 -1249 844 2380
3554 2380 2842 762 -1434 -2795 -1880 -389 2334 496 1849 -351 -1477 -2316 -3035 -278 1185 3499
3570 3499 2210 -321 -1271 -1573 -1637 -1317 1306 1573 1194 -289 -2017 -3203 -1898 -378 1777 2769 1379
3587 1379 -1322 -1367 -2285 -3371 1118 2193 1985 1705 276 -1658 -1623 -1364 611 1734 1243 770 -436
3604 -436 -1140 -2154 -1443 755 2384 1888 1495 -12 -2497 -2253 -333 470 1460 1403 613 -1241 -1840 -844
3622 -844 -1020 164 3045 2129 472 -1172 -2853 -1879 -227 1743 1939 1867 1256 -851 -1839 -829 -798 566
3640 566 1961 832 140 -1576 -2027 -2053 -144 1553 1171 679 -435 -1130 -2215 -2088 -462 1629 1620 1045
3658 1045 -75 -1481 -1217 -351 -155 522 1999 1613 372 -1243 -1833 -1856 590 745 2306 1697 109
3675 109 -1637 -1466 -1006 1030 1370 1482 1052 -797 -1473 -2063 -535 562 1049 2626 910 -23 -1692
3692 -1692 -1830 -1093 904 1102 1287 356 -807 -2144 -788 -617 729 2220 1302 301 -1023 -1288 -1885
3709 -1885 49 946 2084 2276 714 -628 -2524 -1088 356 1320 1105 2283 -274 -893 -1341 -630 6
3726 6 1554 2466 1118 234 -466 -1183 -1183 852 830 1309 1256 -25 -1759 -2123 -1077 845 1432 1554 799 98
3746 98 -1495 -535 -596 326 1599 1226 555 -144 -2091 -2648 88 584 1947 1737 16 -396 -929 -1313 -539
3765 -539 -291 811 641 155 -635 -2162 -1390 143 1036 1077 1825 169 -936 -866 -863 -36 1239 1761 289
3784 289 -30 -1603 -1548 -859 61 614 814 751 -163 -26 -1949 -1034 188 1203 1041 485 412 -1451 -1798
3803 -1798 -1336 288 1700 1949 -195 -249 -1065 -668 -526 -173 1340 1324 772 -570 -1638 -717 -918 599
3821 599 334 528 -323 -965 -1142 -158 -480 11 636 1786 830 -578 -785 -893 126 179 1334 1494 954
3840 954 -955 -1324 261 -136 1277 1238 908 232 -792 -859 -198 732 989 1546 1749 369 -1245 -736 -679
3859 -679 -944 715 2508 1075 -675 -631 -1113 -1011 -435 -452 457 -142 595 -810 -544 454 -314 980 1355
3878 1355 606 66 -310 -1149 -1255 -121 271 604 258 -684 -1117 144 -330 175 1220 1989 348 -168
3896 -168 -758 -356 -421 181 -215 664 1926 -895 -920 -1023 -797 1710 1180 985 606 -1366 -1474 -1868 -525
3915 -525 -564 258 -93 843 -941 -947 -1015 -343 405 1428 1611 722 214 -918 -858 213 577 2130 1482 -805
3935 -805 -1038 -515 -367 -70 1016 805 779 -1844 -657 -1397 -310 53 852 636 214 352 -901 -1102 -384
3954 -384 760 1137 1072 -165 -257 -130 -589 -11 188 -47 865 277 296 -1332 -569 -310 -291 -150 388 337 -684
3975 -684 -1054 -180 75 -207 2015 890 94 -937 -802 454 -239 888 1421 106 -93 -636 -1403 -118
3993 -118 -612 869 1283 224 155 140 -407 -612 93 820 1021 -119 151 -373 -1219 -888 220 185 1266
4012 1266 -483 -538 -169 -1133 455 -77 1760 982 581 -162 882 -1481 135 576 934 95 974 -296
4030 -296 -815 -1336 -1343 398 423 -682 -115 -1057 -368 -1447 -1444 1495 20 -533 -824 62 35 674 -395 710
4050 710 608 -581 -318 222 -887 -99 159 340 984 274 -231 269 -553 258 871 1060 591 50 1162
4069 1162 -210 -126 -1086 131 174 882 -116 143 -496 -508 -328 -853 -954 490 65 -1606 74 18 107 -802
4089 -802 241 -632 601 80 -391 -895 -603 283 441 668 -571 152 -190 -369 -864 203 -265 -525 145
4108 145 757 141 125 1185 -340 -153 387 -401 -544 -145 -757 799 200 -307 -18 446 786 376 91
4127 91 738 -119 172 722 581 -477 -953 -1049 114 272 209 -205 680 -766 1082 685 287 322 71 678
4147 678 121 999 499 152 -246 237 1411 224 -793 -323 146 787 1237 -851 321 -592 232 -248
4165 -248 -492 -192 -541 91 355 -1022 -619 218 -51 -63 -691 -350 1086 186 -227 -135 -29 -1383 -441 512
4185 512 612 346 746 47 -225 -628 942 -594 -303 380 -1208 404 -692 -464 -783 -229 1958 445
4203 445 237 168 -857 437 -823 -50 643 -423 -1084 -164 126 -176 -141 -255 271 -685 -216 107 93 -164
4223 -164 -369 739 -169 273 167 709 949 177 -51 -298 332 131 -1646 -41 -867 -896 242 1260 149
4242 149 125 767 -322 -446 -121 197 120 -620 -494 171 510 1129 703 -235 296 -256 589 293 202 -1067
4262 -1067 100 996 -311 72 -6 337 244 -231 -580 -818 -628 116 -623 -134 287 520 67 242 -513 -1059
4282 -1059 -688 300 338 -1198 -244 -236 495 101 597 322 941 416 -1006 -19 -416 -422 -311 -702 -444 705
4302 705 319 13 885 -88 332 384 -71 -359 -744 211 422 -94 660 392 448 -67 42 650 201 265 907
4323 907 376 -408 1155 259 742 550 557 541 -603 -864 -1351 92 -543 -792 -530 958 -167 -505 -307
4342 -307 -402 -1120 817 963 509 -248 68 -104 -874 652 155 951 822 40 -911 -2487 2 -604 139
4361 139 735 726 921 -113 73 -336 -445 788 -1254 1370 736 -1469 792 500 -331 1088 2329 -100
4379 -100 586 303 -1305 -665 -517 -324 -41 406 386 -41 -222 75 876 1361 998 -359 -98 443 -38 -74
4399 -74 771 -475 304 491 -441 114 -821 -522 509 630 630 -158 208 395 602 -292 -236 -942 1528 851
4419 851 168 -122 82 -797 -1127 322 902 946 -450 219 321 814 1608 -873 -595 475 -85 322 -1192
4438 -1192 957 413 79 1556 83 562 -307 562 -113 264 -845 400 216 132 -558 -1133 471 62
4456 62 -417 768 847 -717 440 -81 890 28 250 162 147 -691 174 -152 229 558 -266 -205 533 -694
4476 -694 -237 -579 395 124 361 865 -20 30 -585 -389 57 -701 274 632 -207 -387 56 -356 207 597
4496 597 51 353 -1140 105 -171 -855 723 476 -127 -70 -735 519 -639 -597 532 593 63 456 -519
4515 -519 -756 -941 -130 959 1137 1246 1604 47 -1630 -1603 558 1203 890 -256 338 309 -1504 -943 -496
4534 -496 307 -29 -881 300 69 -282 569 1047 1652 249 107 -575 -1317 511 -520 17 110 510 784
4553 784 -645 -349 -1114 -592 257 -127 -95 324 -971 64 -712 -1305 7 -588 -63 -199 331 481 -92
4572 -92 132 1283 473 585 284 -552 -416 -1003 -1224 693 915 -25 -422 582 258 -566 -1040 283 575
4591 575 178 447 21 -607 794 370 347 -35 -30 220 -804 -1036 -320 264 213 759 982 -209 -17 -1362
4611 -1362 -764 -98 -123 425 720 -172 -951 145 480 -100 38 87 988 134 -988 537 -94 11 -383
4630 -383 667 -348 89 -428 -494 372 -227 147 -695 -478 23 -536 -1375 138 -105 135 701 372 -232
4649 -232 -793 -621 -628 148 389 854 50 -515 321 -871 592 12 76 479 -634 -118 -829 -199 106 423
4669 423 854 50 41 -258 -1014 -113 -376 -265 667 -266 -106 -200 -172 -625 -296 169 -180 -153 239 -463 -731 1093
4691 1093 45 99 133 -44 -1111 -72 -558 -687 475 119 481 747 0 -565 -501 -687 -302 1 555
4710 555 685 -504 -457 -198 -91 350 774 -30 1044 -942 38 -357 301 -552 -38 -189 738 -652 1274
4729 1274 416 91 -468 755 -608 -58 855 52 -105 653 586 -64 919 619 412 786 227 -1384 -248
4748 -248 163 -400 128 -704 139 -23 -140 54 -400 449 -129 -55 721 396 -664 12 754 -506 375 -1519
4768 -1519 -1163 800 272 -136 829 -898 -1338 -810 -737 875 -1174 -43 758 41 -795 -33 -482 -771
4786 -771 838 356 723 -276 -265 -1018 936 261 -57 1024 1436 552 77 -165 -596 -330 587 301 1197
4805 1197 617 -794 -37 -939 203 -525 521 542 400 -111 -549 -1554 70 151 326 1023 -529 -221
4823 -221 37 -973 -79 707 16 360 -697 -372 1061 -418 -223 881 806 329 408 -457 194 114 -937
4842 -937 524 -79 11 -313 -551 -238 -17 1341 720 258 -256 -411 -438 350 324 -109 418 771 52 -1356
4862 -1356 35 -528 187 -773 -298 933 254 -701 -154 -146 1291 215 334 -162 -11 600 -819 -208 -212
4881 -212 -57 511 230 183 -529 366 -208 750 138 -936 -655 -193 28 -1069 -1071 45 190 -678 -356 -265
4901 -265 -56 -383 -26 -279 -255 88 208 68 671 -916 60 -340 8 19 1173 -1326 -418 -856 -365 69
4921 69 184 588 -156 385 -756 -515 76 520 1769 1637 1368 -123 -841 401 116 877 631 1203 -278
4940 -278 443 -380 -1398 285 10 992 467 533 -332 -359 820 21 -1211 704 -25 -232 -229 -74 369 -1083
4960 -1083 -30 806 -87 672 182 154 188 -492 -232 471 -1310 146 174 -542 -424 96 1039 -89 582
4979 582 428 175 -268 -1426 74 -498 153 399 -851 268 -1059 358 -761 -335 -207 923 -962
4996 -962 208 -146 -436 -75 -543 6 638 -314 -268 -183 -291 -214 -206 309 -146 -731 -348 290 82 248 -474
5017 -474 -275 -177 -583 -184 691 408 222 526 -167 825 395 613 -257 -1161 892 -217 516 425 -614 -195
5037 -195 -479 289 226 438 65 290 480 315 163 -489 254 -85 -232 929 -362 -95 707 -343 -239
5056 -239 354 -349 332 -376 225 -26 93 -667 -100 -326 -136 -271 404 -72 -311 6 145 1 90 120 -10
5077 -10 735 -177 1036 147 -17 -737 371 316 -267 -272 419 927 459 386 -438 -963 -149 -582 206 575 -728
5098 -728 308 -704 -520 -891 988 -399 -500 357 229 -379 323 880 -1283 -366 838 -397 -632 -411
5116 -411 298 67 652 129 182 748 150 -24 -821 908 296 16 371 -241 -691 1347 -516 -153 992
5135 992 -1157 -236 -294 553 -1078 656 -885 1468 190 -569 303 -203 -9 1199 -638 763 999
5152 999 -738 646 -52 -478 270 586 -833 -438 -494 -774 -405 461 401 -424 497 1408 -931 -528 -1523
5171 -1523 -330 -938 -209 71 152 -658 264 -1913 647 1061 -714 -695 -24 -332 -948 -556 387 -1428 158
5190 158 758 -539 2 -1270 -475 -1100 1132 758 53 -19 626 -841 384 -1256 268 -2 49 1986
5208 1986 -6 399 -652 37 -180 -430 -934 2 353 313 842 924 -121 -450 -1202 644 270 322 784
5227 784 -248 221 212 -95 512 845 537 163 151 -1486 -642 -406 629 801 -332 506 -793 570 -76
5246 -76 -306 -1787 -357 -1144 -441 -839 -1250 727 -489 -153 246 -51 1091 446 127 503 309 810 1040
5265 1040 351 462 131 -421 -1069 353 -662 338 -1160 -65 1429 311 -360 -212 -613 17 -46 641
5283 641 686 -27 -637 363 650 -425 -332 -1127 515 1162 833 -600 -1471 -23 -1011 781 -1088 219
5301 219 -115 10 -52 760 461 5 -949 -460 -902 -270 99 327 297 -665 -140 -928 -377 -482 -217 -122 327
5322 327 111 455 -6 246 -1180 77 -61 -679 -120 511 409 243 412 -52 -239 286 -106 -56 -1158
5341 -1158 -183 -140 -492 388 129 786 -117 338 211 -219 194 -326 277 -285 609 -295 -115 18 669 -677
5361 -677 -1063 1210 315 -1163 -253 -82 81 -692 -695 -1276 237 -45 573 404 -886 581 196 -653 -112
5380 -112 -1019 665 163 119 243 -242 -300 4 -471 93 -126 -1397 601 445 -109 -224 -236 -288 242 362
5400 362 175 -248 510 -1588 -1038 -470 672 -43 -918 -227 764 293 437 -409 578 595 -553 -716 -20
5419 -20 169 324 -103 269 345 -422 690 -757 291 60 424 571 -226 381 -378 31 22 -643 -176 950
5439 950 255 -631 187 -46 -1103 701 340 -358 -33 -262 -169 514 -1495 279 -300 268 444 -316 -170
5458 -170 -743 -695 809 1019 60 928 -60 327 429 -610 1001 -141 870 519 428 381 -392 -303 51 587
5478 587 -502 491 -1191 -98 433 -1139 991 -630 824 44 -329 266 670 885 -237 -132 647
5495 647 611 -301 601 -227 -43 -79 277 -498 -233 459 -155 -42 346 349 228 84 -570 79 -253 -516 40
5516 40 259 418 1001 231 -428 -132 -393 127 124 92 151 353 -1187 -293 1 -439 -666 97 212 -263 718
5537 718 -232 -387 808 -219 330 490 371 -140 -289 -54 309 -435 -207 -168 217 -840 -871 758 184
5556 184 364 -250 351 129 -21 -91 675 -374 -365 -572 753 1052 493 -268 434 747 50 303 735 -742
5576 -742 -167 -490 -185 17 -642 54 -104 -987 -95 325 329 -494 255 -201 10 -598 -101 -192 -821 -359 868
5597 868 546 182 283 -517 365 820 873 -318 -429 -29 -286 -185 -467 950 -61 -734 -170 -119 -103 -583
5617 -583 53 -362 919 1146 -612 -1021 -886 -1160 -446 -432 38 -280 171 1183 -201 -658 -754 372 536
5636 536 863 -355 -120 363 -1079 372 -334 -231 1075 1075 -1562 -853 54 -177 565 564 94 -389 -728 -652
5656 -652 -83 -143 -212 213 172 -333 -488 -790 -922 411 737 367 -60 114 -189 -467 -200 184 480 654 223
5677 223 -442 -91 -590 -26 -543 580 -688 1178 82 -1103 115 -117 -20 333 282 377 66 -92 -1008
5696 -1008 -1122 -15 226 245 -709 -497 -382 291 -754 319 1609 130 -283 -1098 179 148 -170 -424
5714 -424 375 677 609 -219 -1430 -833 866 989 1188 494 454 721 -549 -51 -19 -924 192 151 -108 -227
5734 -227 -508 -115 -36 -313 346 -48 34 -6 -805 -687 -391 -151 217 17 -68 461 -174 -669 295 360 644 -1132
5756 -1132 284 -376 -125 -323 365 -39 -1222 173 256 -991 -599 180 -453 1378 -27 307 428 120
5774 120 -459 -459 334 -137 -570 545 -90 -133 -40 -481 78 229 -142 -394 -1302 -713 -391 1578 725 825 104
5795 104 872 237 276 -1318 -238 -12 971 121 -151 198 55 -179 184 -127 1277 710 593 -142 267
5814 267 234 -229 -628 1136 994 853 178 39 -455 -870 1229 837 -248 -139 384 269 -570 -1403 601
5833 601 123 102 502 -894 -251 388 -1050 355 -23 655 218 -502 -500 -571 507 95 1107 390 264 -273
5853 -273 -1208 665 141 580 607 -141 216 9 -523 -594 391 39 -264 -1276 -883 149 44 59 285 1538
5873 1538 503 -175 148 -400 -1014 -429 730 1202 -196 -351 -288 -1062 -270 619 -144 29 -290 1022 -1949
5892 -1949 -172 412 -102 -27 226 18 -24 -158 -568 -478 -169 437 1932 -167 -418 -79 -709 -538 -737 398
5912 398 -767 679 407 -342 -329 842 979 -31 343 977 -758 -87 -802 -941 465 387 575 686 71
5931 71 -506 -116 464 -396 540 1033 -402 -443 -1178 -605 -689 1686 -73 1367 -575 -1378 -282 -672 -74
5950 -74 331 896 250 887 -665 -699 -1034 383 -343 1386 537 -1038 -512 -354 -328 -63 -99 -58 377 -83
5970 -83 -519 264 -472 247 1239 460 221 2 -825 61 -686 1104 1003 80 190 -111 569 -967 718
5989 718 -848 370 925 705 -475 -18 -79 26 646 1491 731 -126 245 177 -651 -326 550 640 108 -565
6009 -565 -539 -166 -515 -424 846 -307 538 -345 -307 282 -428 18 1102 736 530 127 -531 -413 -182 -597
6029 -597 882 1283 248 594 -587 -1002 205 -195 -205 -976 1160 -800 -76 -787 -395 1402 -436 595
6047 595 1384 -837 -1200 -1472 -811 -638 1005 714 -9 -581 749 79 -1152 1682 -55 905 707 1030
6065 1030 -1250 -153 -455 277 902 840 -208 -446 -18 1523 -1310 115 1424 604 -551 -1278 -689
6082 -689 57 -875 307 1266 -11 -872 1695 187 -1542 -648 426 794 133 555 -609 -348 80 506
6100 506 37 1310 -1263 -945 -56 -210 -52 95 40 -40 -294 1130 -1382 -256 538 910 1015 394 148
6119 148 772 -108 -1413 -811 576 692 563 345 -730 439 -973 -426 -15 -579 202 178 -735 689
6137 689 -811 -1 796 1153 -15 611 -448 -735 520 946 115 540 76 755 1021 -1056 394 -876
6155 -876 1116 939 1825 -489 -206 38 -402 -143 1044 430 1002 -292 -642 -605 299 -1234 -352 1350
6173 1350 -315 928 -603 455 -896 -374 1287 164 1173 -520 24 -530 -61 500 90 410 143
6190 143 -23 -642 -633 517 -269 568 706 1311 933 -465 -749 320 397 1351 70 -685 -551 1025 240
6209 240 -858 1166 96 -417 1115 -1094 -772 -149 1 1156 275 332 -193 -159 -624 105 580 -67 1602
6228 1602 456 -507 -369 -403 779 264 1567 1235 82 -988 -660 -354 -373 -56 27 498 -33 15 -410
6247 -410 -619 131 133 1122 2241 764 -72 -264 570 -155 -14 -27 5 -332 -593 -454 515 413 1007 1256 77
6268 77 627 184 133 -1917 563 941 1109 406 -477 -508 -1878 -503 -613 1401 -96 860 1067 114 492
6287 492 -1886 743 558 1431 215 -165 -901 452 -950 -790 950 318 282 -716 -234 -1257 634 248
6305 248 -274 -96 839 617 -1140 -443 -214 1395 505 572 606 -745 160 31 -381 672 1475 614 -164
6324 -164 -79 -438 -824 251 -551 953 346 186 -147 -479 -160 -452 -1007 797 417 -681 693 -317
6342 -317 -221 688 505 560 1310 145 819 -706 303 -226 -71 869 164 1104 50 -117 -76 270 4 285
6362 285 -200 -488 -807 216 -650 -307 516 66 261 282 -226 170 -278 -326 737 -12 -173 122 -250 -463
6382 -463 324 452 -473 1145 479 161 -445 -153 339 95 -950 -4 448 148 -15 177 132 -420 946
6401 946 630 130 387 -162 473 86 1273 1506 -281 595 9 -515 -578 61 44 84 -109 -558 448 -339
6421 -339 -371 -130 -720 -9 236 -1444 254 -746 550 -708 -98 -74 -404 50 -257 344 -821 -157 -148
6440 -148 -797 212 566 -391 -1554 74 581 435 989 585 -1464 -649 65 -187 -775 11 905 -181
6458 -181 322 -466 -1127 -215 143 1336 157 48 142 -110 342 161 -541 90 497 516 679 -592 85 527
6478 527 4 770 716 639 -1686 -643 -891 -1484 -172 303 223 -948 445 541 759 202 507 119 -218 407
6498 407 -434 -433 475 556 891 -302 -89 -408 451 -1277 53 -625 651 -40 624 -1349 464 909 663
6517 663 -261 -11 499 745 -591 -967 -254 -174 -668 -217 18 185 -1016 -448 345 981 437 -70 671 571
6537 571 -807 51 -100 746 884 -453 -92 -1137 987 421 -454 769 981 88 495 796 111 1333
6555 1333 225 362 743 -30 -181 -907 43 380 42 -227 19 351 546 1713 241 282 -369 -1403 -421
6574 -421 497 957 -483 -260 -300 -260 -808 913 -624 -71 350 727 -942 195 -637 325 482 -877 629
6593 629 122 -399 139 -617 -106 -812 -1200 -79 -174 532 -770 -436 478 242 -737 129 -245 -1474 -445
6612 -445 375 900 570 -265 -281 -474 -283 454 164 -295 25 1083 462 43 -551 581 -60 -692 -34 154
6632 154 777 -324 815 -559 -34 -540 152 49 92 118 -674 -646 279 1333 559 -214 821 399 700
6651 700 -115 924 286 -748 -101 -16 -188 -131 659 -431 448 720 614 278 351 -1885 1315 493 -201
6670 -201 66 223 -318 32 458 615 -215 -571 -856 693 42 993 -474 -794 -276 630 287 -476 -339
6689 -339 151 86 54 710 159 879 -809 -114 516 -55 60 -435 231 -407 76 672 -341 125 251 -933
6709 -933 174 -916 151 -350 354 -484 -295 -18 166 430 -1103 -366 -349 221 149 480 207 112 -277 -941
6729 -941 499 347 130 -142 25 -394 -776 -393 -520 -571 645 -212 865 -203 -21 -427 -261 151 284
6748 284 1659 -682 -693 656 824 639 979 269 299 784 -139 215 505 992 565 568 87 657 -264 1407
6768 1407 -550 -402 556 -596 -268 775 11 215 -841 147 -219 131 643 352 600 799 -240 243
6786 243 109 155 25 -34 677 -560 -482 -260 -656 -120 162 595 322 298 77 -198 383 147 435 608 -639
6807 -639 97 -759 274 665 -260 99 -109 526 -502 -973 572 -171 80 2 -597 730 -933 141
6825 141 413 -280 -196 254 92 -1150 207 -314 -483 801 -447 282 -517 412 -202 -458 89 343 -124
6844 -124 237 -317 -486 -45 -165 2 -260 -316 -547 -954 -308 375 -398 247 -303 619 -623 -294 -718 316
6864 316 312 -32 183 143 217 -582 -386 -105 668 -425 231 124 141 -18 -117 -66 -169 -28 148 190 -596 -544 -189
6887 -189 -850 882 -225 -318 -439 -1162 -629 -446 -15 277 126 899 462 31 -249 -662 741 -282 -164
6906 -164 467 131 716 188 -15 -506 -109 519 373 394 382 -268 2 -196 424 -202 -1210 -35 950 -213
6926 -213 -350 755 826 262 -646 244 -367 -239 -57 161 2112 -183 244 -193 363 527 1305 -51 -157
6945 -157 -1378 564 1703 -975 -170 -646 337 -199 -234 1670 324 335 -525 -835 -522 -922 -153 882
6963 882 1715 -631 -1161 -517 -204 -564 1198 420 71 20 -419 -63 805 337 274 -188 145 -494 496 -370
6983 -370 351 267 -386 957 187 213 288 -389 40 138 1738 -42 -584 -85 314 -264 -528 261 134 -9
7003 -9 -278 -190 -32 212 -358 683 215 -240 655 225 342 -93 -52 -320 -278 39 331 -141 185 -660 -61
7024 -61 592 -837 -850 -792 -797 -461 1207 21 390 180 179 560 -172 -547 104 -347 556 495 -966 362 431
7045 431 -347 405 658 384 -890 276 -268 317 -653 -405 66 1017 -325 376 1415 -746 -363 327
7063 327 -158 148 -349 -748 -533 -956 158 -607 -137 -696 711 -207 -311 337 372 85 -709 71 -359 851
7083 851 -676 -142 335 873 523 -226 39 -189 659 -1154 -276 10 114 60 -309 -758 276 -1244 -37
7102 -37 1129 272 145 362 -327 -146 453 -500 -323 -1002 -655 -66 703 -5 1480 512 1444 393 608
7121 608 1053 -1 -851 -189 825 -851 650 562 -167 -62 203 877 -391 -310 -684 -52 -175 -279 98
7140 98 135 387 294 1424 567 -349 -400 586 -157 -256 201 113 595 665 280 286 397 -482 726 781 -390 297
7162 297 -1079 1262 1251 -247 -435 552 108 199 643 -79 -814 898 8 182 90 393 285 -334 484 -89
7182 -89 2 491 305 100 -293 -334 172 -274 -975 -290 -34 318 246 -587 570 -110 447 152 931 129 175
7203 175 93 -810 -84 847 418 528 -265 186 -1023 664 252 -206 858 -504 -869 169 406 -27 -540
7222 -540 -689 -35 -1009 1309 -38 -88 255 437 -885 113 674 162 377 -344 1680 220 279 399 170
7241 170 56 -661 1055 242 -1041 -34 -868 411 327 243 55 -140 465 -402 379 255 -331 502 -484
7260 -484 436 -296 -474 226 616 1 518 -94 -433 511 344 0 200 -179 185 -137 754 -402 1502
7279 1502 292 -250 779 566 164 -1460 485 584 -1007 24 966 631 -341 488 1017 581 -612 473
7297 473 -2058 -178 -132 423 946 -821 485 -100 601 -805 177 294 -234 -1431 -341 289 172 -395
7315 -395 139 427 152 509 235 584 -787 1073 137 -68 1434 463 546 515 11 13 -997 -870 -117 -205
7335 -205 -624 -50 1216 620 -1281 328 -372 891 173 971 260 49 367 -229 1108 -1263 994 -421
7353 -421 475 -105 373 -80 535 135 636 -407 278 -187 1331 385 230 578 -649 26 -661 -572 -151
7372 -151 328 523 304 -874 -403 -579 135 466 133 -972 777 958 52 -260 553 -189 -348 410 -40
7391 -40 129 -688 -501 206 -145 244 765 -479 -155 101 671 -541 296 98 352 560 -879 -348 -73
7410 -73 -198 245 84 325 -719 868 -535 881 -60 279 -187 150 -257 -789 -894 -352 40 383 662
7429 662 -1052 -367 376 502 844 288 187 54 -822 874 -479 -478 -54 -33 864 238 577 785 462 -746
7449 -746 93 849 -160 148 583 -231 505 -287 736 143 -197 -516 445 258 332 -373 798 -467 -1070
7468 -1070 466 310 -41 -40 -868 954 -330 694 236 -676 -51 696 -69 -494 149 372 -236 169 120
7487 120 -446 1058 -845 227 267 -73 1244 -232 -197 -936 684 599 68 -749 -467 322 646 1303 327
7506 327 416 -332 249 -885 498 -1510 -945 -283 -609 387 37 401 663 -545 1436 627 -811 190
7524 190 -920 570 293 -268 1479 532 633 1811 -513 189 -234 -1462 -502 709 -918 -135 -942
7541 -942 -628 -10 1616 -878 -53 382 63 -440 -592 883 44 1032 1094 -170 -1214 1227 475 432 783
7560 783 -53 675 671 -751 294 186 1911 -295 -747 941 302 384 -200 -190 257 -560 -965 240 102
7579 102 34 507 -135 -703 833 618 356 580 -412 821 400 -615 130 -281 -826 395 -303 -199 343
7598 343 -11 80 -881 -595 -50 682 664 -4 801 1137 507 -502 -425 -535 35 -267 108 -192 781 362 -625
7619 -625 50 419 51 -261 -631 140 -276 1021 825 381 -137 -199 -37 -293 131 86 -431 827 -565 460
7639 460 -164 -1007 524 1279 775 -283 -729 -960 -759 265 229 -904 119 33 601 -315 225 100 -1110
7658 -1110 782 63 -1068 10 138 606 -73 -165 -215 454 177 -737 535 25 1112 35 -182 -28
7676 -28 -223 903 -513 85 283 -137 25 968 365 492 -193 -1015 540 -593 -486 748 415 -468 -1672
7695 -1672 18 738 -109 -332 113 1080 -88 1126 508 -38 392 613 141 -1133 -683 262 329 -320 268
7714 268 -907 -23 141 65 -701 -631 165 -215 -620 1159 -58 -860 -342 170 -552 -325 201 425 141 445
7734 445 -28 417 719 -628 491 -191 689 864 17 -691 147 555 -81 -108 -42 118 344 -299 -179 1164
7754 1164 -780 -1022 -389 -355 -1044 67 716 -1016 450 156 364 -486 98 368 366 -665 881 -613
7772 -613 1061 -92 793 -323 689 -58 -633 771 400 -257 220 345 825 887 -508 -648 94 -411
7790 -411 219 937 342 -637 175 -834 -593 -59 -180 -765 -847 1251 31 -470 -200 -558 -524 -753 -83 648
7810 648 -682 1017 82 801 569 -413 454 476 -260 -913 104 178 88 -1025 -1168 1220 170 -1153 -1150
7829 -1150 -398 907 -414 -12 -359 -470 347 92 -981 98 -302 -225 779 134 88 50 1279 -369
7847 -369 -392 344 678 -1034 -66 -308 475 -671 -900 -544 -547 -488 -54 -1134 549 -845 -701 -481 -307 -88
7867 -88 -207 -659 -676 -978 -635 -112 -281 335 136 106 247 -277 -1349 -372 -921 179 -587 -374 276 -254
7887 -254 -843 -315 -312 -1142 -540 285 -493 -8 419 6 -1638 184 328 190 -744 125 150 183 -520 -252 -305
7908 -305 326 662 -289 -397 115 211 -354 -7 238 -837 14 224 -238 -163 58 -834 -32 -242 225 -318
7928 -318 -651 526 -116 -411 18 104 -33 799 657 -42 -222 -34 132 -916 471 2068 -92 -300 -161
7947 -161 402 901 -731 -795 256 -218 -107 -281 447 -358 19 -1268 -205 -247 557 -538 -780 -243 257
7966 257 -215 -1009 -14 297 16 -331 53 -301 -20 341 -235 52 -197 508 -134 -141 686 -83 120 -83 20
7987 20 -539 -906 -130 -1 -54 706 191 -388 -860 89 -723 109 -429 -285 373 190 742 359 255 347 84
8008 84 -46 -519 113 -174 -19 -612 818 145 -639 252 741 -100 50 -43 -999 171 272 481 -171 -746
8028 -746 688 -277 -550 -210 41 -865 301 -43 -960 87 -161 298 221 -190 124 -149 -80 10 -42 144
8048 144 -413 -419 295 -534 -814 499 127 135 -4 -139 485 -481 -632 183 258 -917 -248 866 669 -582
8068 -582 -1160 -75 -1085 31 218 -301 247 242 -485 59 672 576 153 120 805 -765 91 -21 20 -65 -722
8089 -722 -264 -254 105 -193 185 -1 -653 -566 583 -849 -476 -589 105 -371 -1442 783 688 846 120 -427
8109 -427 717 230 -166 -181 -43 870 -154 1133 1218 1293 -1348 -750 83 265 1033 -442 -541 442 181 -320
8129 -320 -361 323 151 -15 84 -609 -352 -461 -1035 488 174 170 -599 800 -221 -768 283 -357 548 321
8149 321 943 43 310 494 630 488 4 -22 -187 406 681 -190 1265 1077 183 -205 -318 -1382 501
8168 501 989 -90 -7 -10 831 -75 116 -427 -129 176 238 138 -189 -320 587 -344 394 325 179 -264 169
8189 169 -498 -45
8191d5
##END NTUPLES=NMR FID
##END=
