##TITLE=1H_UGF2510
 CDCl3,108 sc, 
 25.10.2021
##JCAMPDX= 6.0         $$ Bruker NMR JCAMP-DX V2.0
##DATA TYPE= NMR FID
##DATA CLASS= NTUPLES
##ORIGIN= UXNMR, Bruker Analytische Messtechnik GmbH
##OWNER= root
$$ XWIN-NMR		Version 3.5
$$ Mon Oct 25 09:58:39 2021 Russian Standard Time (UT+4h)  she@DPX200
##.OBSERVE FREQUENCY= 200.1313468511
##.OBSERVE NUCLEUS= ^1H
##.DELAY= (6, 6)
##.ACQUISITION MODE= SIMULTANEOUS
##.ACQUISITION SCHEME= undefined
##.AVERAGES= 108
##.DIGITISER RES= 18
##SPECTROMETER/DATA SYSTEM= spect
##.PULSE SEQUENCE= zg30
##.SOLVENT NAME= D2O
##.SHIFT REFERENCE= (INTERNAL, D2O, 0, 15.7039)
##AUDIT TRAIL= $$ (NUMBER, WHEN, WHO, WHERE, WHAT)
$$ ##TITLE= Audit trail, XWIN-NMR		Version 3.5
$$ ##JCAMPDX= 5.01
$$ ##ORIGIN= Bruker BioSpin GmbH
$$ ##OWNER= she
$$ F:/spectra/data/she/nmr/H-F/1/audita.txt
$$ ##AUDIT TRAIL=  $$ (NUMBER, WHEN, WHO, WHERE, WHAT)
(   1,<2021-10-25 09:57:21.32 +0400>,<she>,<DPX200>,
      <continue with go, POWCHK disabled, PULCHK disabled
       configuration hash MD5:
       00 E9 B6 7A A2 85 ED C7 34 08 36 98 17 FE 4E 26
       data hash MD5: 16K
       A1 55 0B 5A D7 33 DC FF 2F 69 EE 76 37 CD CF D2>)
$$ ##END=
$$ 
$$ hash MD5
$$ AF CC 71 08 91 93 42 84 A6 D9 3F 4A EA B3 08 CF
##$RELAX= 
##$RELAX= 
##$RELAX= 
##$RELAX= 
##$RELAX= 
##$RELAX= 
$$ Bruker specific parameters
$$ --------------------------
##$DU= <F:/spectra>
##$EXPNO= 1
##$NAME= <H-F>
##$PROCNO= 1
##$TYPE= <nmr>
##$USER= <she>
##$AMP= (0..31)
100 100 100 100 100 100 100 100 100 100 100 100 100 100 100 100 100 100 
100 100 100 100 100 100 100 100 100 100 100 100 100 100 
##$AQSEQ= 0
##$AQ_mod= 1
##$AUNM= <au_zg>
##$AUTOPOS= <>
##$BF1= 200.13
##$BF2= 200.13
##$BF3= 200.13
##$BF4= 200.13
##$BF5= 200.13
##$BF6= 200.13
##$BF7= 200.13
##$BF8= 200.13
##$BYTORDA= 1
##$CFDGTYP= 0
##$CFRGTYP= 5
##$CHEMSTR= <none>
##$CNST= (0..31)
1 1 145 1 1 1 1 1 1 1 1 1 1 1 1 1 1 1 1 1 1 1 1 1 1 1 1 1 1 1 1 1 
##$CPDPRG= <>
##$CPDPRG1= <>
##$CPDPRG2= <>
##$CPDPRG3= <>
##$CPDPRG4= <mlev>
##$CPDPRG5= <mlev>
##$CPDPRG6= <mlev>
##$CPDPRG7= <mlev>
##$CPDPRG8= <mlev>
##$CPDPRGB= <>
##$CPDPRGT= <>
##$D= (0..31)
0 1.2 0 0 0 0 0 0 0 0.06 0 0.03 0 0 0 0 0.0002 0 0 0 0 0 0 0 0 0 0 0 0 
0 0 0 
##$DATE= 1635140941
##$DBL= (0..7)
120 120 120 120 120 120 120 120 
##$DBP= (0..7)
150 150 150 150 150 150 150 150 
##$DBP07= 0
##$DBPNAM0= <>
##$DBPNAM1= <>
##$DBPNAM2= <>
##$DBPNAM3= <>
##$DBPNAM4= <>
##$DBPNAM5= <>
##$DBPNAM6= <>
##$DBPNAM7= <>
##$DBPOAL= (0..7)
0.5 0.5 0.5 0.5 0.5 0.5 0.5 0.5 
##$DBPOFFS= (0..7)
0 0 0 0 0 0 0 0 
##$DE= 6
##$DECBNUC= <off>
##$DECIM= 32
##$DECNUC= <off>
##$DECSTAT= 4
##$DIGMOD= 1
##$DIGTYP= 9
##$DL= (0..7)
0 120 120 120 120 120 120 120 
##$DP= (0..7)
150 150 150 150 150 150 150 150 
##$DP07= 0
##$DPNAME0= <>
##$DPNAME1= <>
##$DPNAME2= <>
##$DPNAME3= <>
##$DPNAME4= <>
##$DPNAME5= <>
##$DPNAME6= <>
##$DPNAME7= <>
##$DPOAL= (0..7)
0.5 0.5 0.5 0.5 0.5 0.5 0.5 0.5 
##$DPOFFS= (0..7)
0 0 0 0 0 0 0 0 
##$DQDMODE= 0
##$DR= 18
##$DS= 0
##$DSLIST= <SSSSSSSSSSSSSSS>
$$ [...]
##$SUBNAM2= <"">
##$SUBNAM3= <"">
##$SUBNAM4= <"">
##$SUBNAM5= <"">
##$SUBNAM6= <"">
##$SUBNAM7= <"">
##$SUBNAM8= <"">
##$SUBNAM9= <"">
##$SW= 18.0517286264689
##$SWIBOX= (0..15)
0 0 2 0 0 0 0 0 0 0 0 0 0 0 0 0 
##$SW_h= 3612.71676300578
##$TD= 16384
##$TD0= 1
##$TE= 0
##$TE2= 300
##$TE3= 300
##$TEG= 300
##$TL= (0..7)
0 120 120 120 120 120 120 120 
##$TP= (0..7)
150 150 150 150 150 150 150 150 
##$TP07= 0
##$TPNAME0= <>
##$TPNAME1= <>
##$TPNAME2= <>
##$TPNAME3= <>
##$TPNAME4= <>
##$TPNAME5= <>
##$TPNAME6= <>
##$TPNAME7= <>
##$TPOAL= (0..7)
0.5 0.5 0.5 0.5 0.5 0.5 0.5 0.5 
##$TPOFFS= (0..7)
0 0 0 0 0 0 0 0 
##$TUNHIN= 0
##$TUNHOUT= 0
##$TUNXOUT= 0
##$USERA1= <user>
##$USERA2= <user>
##$USERA3= <user>
##$USERA4= <user>
##$USERA5= <user>
##$V9= 5
##$VALIST= <valist>
##$VCLIST= <CCCCCCCCCCCCCCC>
##$VD= 0
##$VDLIST= <DDDDDDDDDDDDDDD>
##$VPLIST= <PPPPPPPPPPPPPPP>
##$VTLIST= <TTTTTTTTTTTTTTT>
##$WBST= 1024
##$WBSW= 4
##$XGAIN= (0..3)
0 0 0 0 
##$XL= 0
##$YL= 0
##$YMAX_a= 3039391
##$YMIN_a= -2700974
##$ZGOPTNS= <>
##$ZL1= 120
##$ZL2= 120
##$ZL3= 120
##$ZL4= 120
##$ABSF1= 10
##$ABSF2= 0
##$ABSG= 5
##$ABSL= 3
##$ALPHA= 0
##$AQORDER= 0
##$ASSFAC= 0
##$ASSFACI= 0
##$ASSFACX= 0
##$ASSWID= 0
##$AUNMP= <proc_1d>
##$AZFE= 0.1
##$AZFW= 0.1
##$BCFW= 1
##$BC_mod= 2
##$BYTORDP= 1
##$COROFFS= 0
##$CY= 11.3945322036743
##$DATMOD= 1
##$DC= 2
##$DFILT= <>
##$DTYPP= 0
##$F1P= 2.36226072786647
##$F2P= -0.459571619588291
##$FCOR= 0.5
##$FTSIZE= 0
##$FT_mod= 4
##$GAMMA= 1
##$GB= 0.15
##$INTBC= 1
##$INTSCL= 1
##$ISEN= 128
##$LB= 0.24
##$LEV0= 0
##$LPBIN= 0
##$MAXI= 10000
##$MC2= 0
##$MEAN= 0
##$ME_mod= 0
##$MI= 1.114404
##$NCOEF= 0
##$NC_proc= 0
##$NLEV= 6
##$NOISF1= 3.799351
##$NOISF2= 2.8
##$NSP= 1
##$NTH_PI= 0
##$NZP= 0
##$OFFSET= 15.70392
##$PC= 1
##$PHC0= -14793.67
##$PHC1= 13.60083
##$PH_mod= 1
##$PKNL= yes
##$PPARMOD= 0
##$PSCAL= 0
##$PSIGN= 0
##$REVERSE= no
##$SF= 200.130013532006
##$SI= 16384
##$SIGF1= 3
##$SIGF2= 2
##$SINO= 400
##$SIOLD= 16384
##$SREGLST= <1H.CDCl3>
##$SSB= 0
##$STSI= 0
##$STSR= 0
##$SW_p= 3612.71676300578
##$SYMM= 0
##$S_DEV= 0
##$TDeff= 0
##$TDoff= 0
##$TI= <>
##$TILT= no
##$TM1= 0
##$TM2= 0
##$TOPLEV= 0
##$USERP1= <user>
##$USERP2= <user>
##$USERP3= <user>
##$USERP4= <user>
##$USERP5= <user>
##$WDW= 1
##$XDIM= 8192
##$YMAX_p= 0
##$YMIN_p= 0
$$ End of Bruker specific parameters
$$ ---------------------------------
##NTUPLES= NMR FID
##VAR_NAME=  TIME,          FID/REAL,        FID/IMAG
##SYMBOL=    X,             R,               I
##VAR_TYPE=  INDEPENDENT,   DEPENDENT,       DEPENDENT
##VAR_FORM=  AFFN,          ASDF,            ASDF
##VAR_DIM=   8192,          8192,            8192
##UNITS=     SECONDS,       ARBITRARY UNITS, ARBITRARY UNITS
##FACTOR=    0.0002768,     1,               1
##FIRST=     0,             0,               0
##LAST=      2.2672688,     0,               0
##MIN=       0,             -2700974,        0
##MAX=       2.2672688,     3039391,         0
$$ Real data points
##PAGE= N=1
##DATA TABLE= (X++(R..R)), XYDATA
$$ [...]
3166C083n246L146Q02l335L326j828j320L212m047M52K977m194J697K358m002
3181b919R50L72Q83N95M45m76l34l3J566l80q18L501l003L92K419l889K242J972
3199C485o085L923l96m116M410j68l358J954l77j123J11Q5R15j893J550J888l573
3216b768L120M73l683N660o72m589O413l116j946M557k673j144L827l771l86K380
3232A682j361j101J114J31j658k175N684m789k762O200k528k322O475m240j085
3247b735M446l521M58L226j517R7n43O67K924k759J296O77l444K946j251j519
3263e52L845m423J861J519n752K043K839m167L230l79m256K569l82J573N68j078
3279i42J322m53j739L794q38k08K675l697Q32O99k810M416j899j031L369n824
$$ plain form
3166 3083 -2163 983 1785 -1550 1776 -52 -1372 1840 -2207 -1755 1222 -2972 -1275 1083 -2919
3181 -2919 -1969 -1597 -714 -119 326 -150 -484 -517 1049 669 -149 3352 349 741 3160 -729 1513 3485
3199 3485 -2600 1323 927 -3189 1221 1053 -2305 -351 -728 -1851 -1740 -1655 -740 -2633 -1083 805 -2768
3216 -2768 352 825 -2858 2802 2130 -2459 3954 838 -1108 3449 776 -368 3459 -312 -698 1682
3232 1682 321 -780 334 465 -1193 -3368 2316 -2473 -5235 965 -1563 -3885 2590 -1650 -2735
3247 -2735 1711 -1810 -1352 1874 357 454 -89 578 3502 743 2039 2716 -728 2218 967 -552
3263 -552 3293 -1130 731 2250 -3502 -1459 1380 -2787 443 64 -4192 -1623 -2005 -432 136 -942
3279 -942 380 -73 -1812 1982 1144 936 3611 -86 746 1445 -1365 3051 1152 121 3490 -2334
3295b334K149K768m788J586J950l577J526j487l32K397j933R40J286l159K712
3310b96j318j090O410l006m43K290m347K880J372l548M882j533n098N217j197
3325A175j131K837k769q4j437M4K510k953N72K967n937J466L824o200M883J548
3341A315n062M085k351J141L028l174L282n89j876K772k060K88K082m406L415
3356A890K65n032N628j000n169N579k206l607M488j149j480k0L69J075j949P93
3372a525J966l751K991K415m920M949j38m275N820j175k924L861j836o83Q04j805
3388b26L91O02r89K83k458L114p29l232M075j125l819P354l367l985O648m316
3404a779l023P599k681p30J463L17j46j011J820L79j817K193o51l789N180k755
$$ plain form
3295 -2334 -185 2583 -2205 -619 1331 -2246 -720 -2207 -2539 -142 -2075 -1135 151 -3008 -296
3310 -296 -1614 -2704 3706 700 257 2547 -1800 1080 2452 -1096 3786 2253 -2845 2372 1175
3325 1175 44 2881 112 28 -1409 -1365 1145 -1808 -1236 1731 -4206 -2740 1084 -5116 -233 1315
3341 1315 -3747 338 -2013 -872 2156 -1018 2264 1675 -201 2571 511 799 2881 -1525 1890
3356 1890 2155 -2877 2751 1751 -3418 2161 -45 -3652 836 -313 -1793 -1813 -1444 -369 -2318 -1525
3372 -1525 441 -3310 -319 2096 -2824 2125 1987 -2288 3532 2357 -567 3294 1458 775 1579 -226
3388 -226 165 767 -222 61 -2397 717 -12 -3244 831 -294 -4113 3241 -126 -4111 2537 -1779
3404 -1779 -4802 2797 116 -614 849 1166 1020 9 1829 2208 391 2584 1933 -1856 3324 569
3420E69k283O120m742k242N007n267M12M860n510L43K675j696m86J890Q29k348
3436a869o51M157k998P02M690n529j73P357o797J605L645m782K187J556k686J015
3452A429L83j349q25j662J337j94j391J825j048o87K804l705L709M77n315M605
3468C93J22l507M798o73l263M271j760N88P25j770K807j129r32O9J1Q19O54m116
3486a893K300j197j135L639m018m25M937m497l55M417m353K012J832k075M29J440
3502A058j029J64m55K897j556j392L579k270j593L803l267J114J962l921J177
3517B71L98l712M182o12m415L149J88k510K294R06l15j844J534J181l654L775
3533H16J941m378J782K810n991N014K086n339M148q97k509Q69j40k74L66k0O89
$$ plain form
3420 569 -1714 4406 -336 -2578 2429 -2838 -2426 2434 -3076 -2733 -58 -1754 -2240 -350 479 -1869
3436 -1869 -2520 1637 -1361 -659 4031 -1498 -1671 5686 -1111 494 4139 -643 1544 3100 414 1429
3452 1429 1812 463 -362 -2024 -687 -881 -2272 -447 -1495 -2182 622 -3083 626 1103 -4212 393
3468 393 515 -2992 1806 1133 -2130 2141 381 969 1694 -76 2731 1602 670 739 750 1569 2223 -1893
3486 -1893 407 -790 -1925 1714 -2304 -2729 2208 -2289 -2644 1773 -2580 -568 1264 -811 -382 1058
3502 1058 29 193 -262 2635 1079 -313 3266 996 -597 3206 -61 1053 3015 -906 271
3517 271 669 -3043 1139 527 -3888 -739 -551 -3061 -767 139 -176 -2020 -486 695 -2959 816
3533 816 2757 -1621 161 2971 -3020 1994 4080 -1259 2889 1992 -517 352 212 -62 304 284 973
3550I73k111J68K253l364K559k16m801N602k260l230O654k207l676M906j493k869
3566c112N129j228q62J299J327n79k995M290j639m059O480k973m545O563l421
3581c25m247Q289n183j097N354m694j735M617k536n69J975R98l676L28M812l414
3597a103j393P115m842j924P612n226n77N148n849R26M931m997K6R77j610m98
3613a284K75J189j632j034L892l853Q79L660o299L021L053p239M855L366o244
3628c395M412K595n297K455K615k727j03O64J308m272K642K665n246J802L327
3643C445n614K610K89l647L366j671l157O031k692k066M006k588q00L144j282
3658f26m17K066O83j712j221N151k867k096N693m039k167O917n410j310M338m455
$$ plain form
3550 973 -1138 -970 1283 -2081 478 262 -4539 1063 -1197 -4427 2227 20 -3656 1250 -243 -3112
3566 -3112 2017 789 -73 1226 2553 1974 -1021 3269 1630 -2429 4051 1078 -3467 3096 -325
3581 -325 -4572 3717 -1466 -2563 2791 -1903 -3638 979 -1557 -2126 -151 847 -2829 -2501 2311 -1103
3597 -1103 -2496 4619 -223 -2147 5465 239 -338 4810 -1039 -113 4818 -179 -153 824 -786 -1284
3613 -1284 -1009 180 -1452 -2486 1406 -2447 -1568 2092 -4207 -1186 1867 -5372 -517 2849 -3395
3628 -3395 1017 3612 -1685 770 3385 658 555 1219 2527 -1745 897 3562 -1684 118 3445
3643 3445 -2169 441 730 -2917 449 -1222 -4379 1652 -1040 -3106 900 -1688 -2488 656 -626
3658 -626 -1043 1023 1706 -6 -1227 3924 1057 -1039 4654 615 -1552 5365 -45 -1355 2983 -1472
3674a472K56L404l864L33K624k313m51O67k99q22J007J368l043J087L701n815
3690c632K334M883n467K570L356o882L673L690n640K601J421m164J352J477m70
3705A102l63O47k60n147M201Q21m463L989J41n755N525N28n722N765M88n087M956
3722A366k01k555K954M03j728j8J527R37l337K822M8l945L876L47m724L550j888
3739e66j353L569k793o97L486m595J162K190j834J20N23L00L5k8J594j282m70
3756f39K775l135P59M678m042K1L743m529L38K436j907R7k92j993K119j400P67
3773b04M74j398N43R3j173J786r17o47J100j368K006N39k593L963k61l181L249
3790B011j441N0J920k987J465J062j368R58j48j434M23j833J409r9j508K181k248
$$ plain form
3674 -1472 -1216 2188 -1676 -1343 1281 -1032 -1483 -816 -1115 -1937 -930 438 -2605 -1518 2183 -3632
3690 -3632 -1298 3585 -1882 688 4044 -2838 835 4525 -1115 1486 2907 -1257 95 1572 1102
3705 1102 739 1386 1126 -4021 180 1001 -3462 527 668 -5087 438 966 -4756 1009 1497 -3590 1366
3722 1366 1165 -1390 1564 1967 239 221 1748 2685 -652 2170 2218 -1727 2149 2496 -2228 1322 -566
3739 -566 -1919 1650 -1143 -1840 1646 -2949 -1787 403 -1431 -1311 -788 -488 -453 -481 1113 -169 -639
3756 -639 2136 -999 -240 4438 396 417 4160 -369 -31 2405 498 595 303 -1690 429 -971 -204
3773 -204 270 -1128 -585 -492 -1665 121 -796 -1443 -343 -1711 295 834 -1759 2204 1943 -1238 2011
3790 2011 570 620 2540 -447 1018 2080 712 1670 1522 88 511 -1322 87 -12 -1520 661 -1587
3807a587j222K939j267j024L807l786q1L422l381K046M89m81Q87l24J006R89l705
3824a273L787j116k143K984j639j876L390k292l69J871m114K681P88l579L010
3839A10o28j330K038j783O73R36k116L148j926m72M139l733K76L891k435o45J743
3856A886l158J657M56L07L78j492P28n30k359M181k276l119M205j554k130M034
3872A214k830O80J458l086K115r7n22K766p3j962Q50l97J124l02M53J111k575
3889g3k19L795n555L959J798o296K196J935m819L057M13j435O79j923K662j526
3905a352j795L311r21j040L241m114K491K295l837K989J191m393M885j286k573
3920i08L370j657j57qj698J918j434P93Q06l057Q91K362l897J671J250k578K014
$$ plain form
3807 -1587 -2809 130 -1137 -2161 1646 -2140 -2221 1201 -2180 -134 355 -126 761 437 1443 2432 -1273
3824 -1273 2514 1398 -745 2239 600 -1276 2114 -178 -547 1324 -2790 -109 679 -2900 110
3839 110 -518 -1848 190 -1593 -920 16 -2100 1048 -878 -1350 2789 -944 -668 3223 788 143 1886
3856 1886 -1272 385 841 1148 1526 34 762 232 -2127 2054 -222 -3341 864 -690 -2820 1214
3872 1214 -1616 -936 522 -2564 -449 -546 -1068 1698 1625 -337 513 116 1240 938 1391 2502 -73
3889 -73 -292 3503 -2052 1907 3705 -2591 -395 1540 -3279 -222 191 -1244 -565 -2488 174 -1352
3905 -1352 -3147 164 -757 -1797 1444 -2670 -179 2116 -1721 1268 2459 -1934 2951 1665 -908
3920 -908 2462 805 648 640 -1058 860 -574 219 1025 -2032 -1141 1221 -2676 -1005 245 -2333 -319
3937c19m05j502K486j341P59J058j308N33L33K34K692j881p40J548k278K231N14
3954B614l096M244l528j013K388k348k13K226k667R35r7j641L439k772K452j102
3970a79k652K236J350k637K694L59k570L228q98q91K442k409J126L64k269K333
3986A627m70j271K796k746j193J540k291J828L90k676K233j653o56L451j760j19
4002i70O49o78J499q8j046K408k699K204J437l579K706K51k687J504N58j886Q28
4019D11k51L45l01j376J516p34k442L418j934j409L441j971L38J178k267Q98R41
4036a99j174J990j96q22J474j167L17K02m14K617k556N06K713m467J510L045n494
4053b115K304J064k947J087P5n34J033j032J01l38o76K432j801K28L353l957R03
$$ plain form
3937 -319 -724 -2226 260 -1081 -322 736 -572 -39 294 528 3220 1339 599 2147 -131 2100 2614
3954 2614 -482 3762 234 -779 1609 -739 -952 1274 -1393 -458 -555 -2196 1243 -1529 923 -179
3970 -179 -2831 -595 755 -1882 812 1171 -1399 1829 931 40 2482 73 1199 1563 -706 1627
3986 1627 1157 -114 2682 -64 -1257 283 -2008 -180 210 -2466 -233 -1886 -2542 909 -851 -970
4002 -970 -321 -999 500 412 -634 1774 -925 1279 2716 -863 1843 2094 -593 911 1469 -417 411
4019 411 160 505 204 -1172 344 -390 -2832 586 -1348 -2757 684 -1287 -949 229 -2038 -1140 -199
4036 -199 -1373 617 421 -401 1073 -94 223 425 11 2628 72 578 3291 -1176 334 3379 -2115
4053 -2115 189 1253 -1694 -607 -532 -1066 -33 -1065 -964 -1302 -1978 454 -1347 -1119 2234 -1723 -820
4070h20M220m818J838K022k160J62J381l068K016J040j493R46k87j127p77O44
4086b81J835l116J058Q55l444K494J913l865K961L95m543L252K10j719K499k73
4102B31L47Q90j346J092j92p86K217k924K016l31k008K726o78l619M708k443j951
4119b051L089j633o28J581k586J349j399O84J892j363O15K259l704J791J006k474
4135a572K949l61n68J454k270J877N91k426K453j859k046L019j266k053L619l196
4151a655l52K828k451J792o99j465J526j616Q22P10j305K999n52j991L195k312
4167e26O39K537l713J741K923n644L503J156l178N97R16q53N49r41N96j053K31
4184e20R54k140M68K199l047J636J003l341L128L39k232L579j540k851L532J90
$$ plain form
4070 -820 3400 -1418 420 2442 282 444 1825 -1243 773 1813 320 1266 979 -148 -925 -281
4086 -281 1554 -1562 -504 351 -3093 -599 1314 -2551 410 805 -3738 -486 -276 -1995 504 231
4102 231 578 1468 122 1214 1022 236 2453 -471 1545 1214 -794 1932 1254 -2365 2343 -100 -2051
4119 -2051 1038 -595 -1223 358 -2228 -879 -2278 -1594 298 -1065 -450 1809 -1895 -104 902 -1572
4135 -1572 1377 1016 448 1902 -368 1509 2100 -326 2127 268 -1778 1241 -25 -2078 1541 -1655
4151 -1655 -2007 821 -1630 162 -537 -2002 -476 -2092 -1270 -560 -1865 1134 582 -1409 1786 -526
4167 -526 113 2650 -1063 678 3601 -2043 1460 2616 -562 35 951 98 647 -294 302 -751 -520
4184 -520 434 -1706 -1238 961 -2086 -450 553 -2788 340 679 -1553 2026 486 -2365 1167 1357
4200A357j03J006r42l76j570J441J974l307J158R06l533K528J67l310L808j566
4216c62j137J260j580J334J019k558J638Q88k581L228r52p19O20O74k3q40L53
4233B62J912k756J336L334n791K278K230m820K592J847m363K979r00k367K614
4248C87j542r66J348r27J666j993N51J075j103K696j237k116M152j002k614M861
4264C236k104l200N100j833j730K684r52j922K266m97n34K44k84q13k111K518
4280F8j203j902M207l962K8M773m411O6M464m387J330K993j681j750L902j077
4296A458r90J03J208j086P8K272l752o97M280l796J20L514m376O76R98k613K059
4313e44J149l598L143r28q29J668L5l55Q52k87J060k988K255J166l428L474J124
$$ plain form
4200 1357 1254 2260 1318 942 -628 813 2787 -520 638 1544 -1989 539 706 -2604 1204 -362
4216 -362 -1499 -239 -1819 -485 534 -2024 -386 502 -2079 1149 197 -522 98 772 749 -91 262
4233 262 2174 -582 754 4088 -1703 575 2805 -2015 577 2424 -1939 1040 140 -2227 387
4248 387 -1155 -2121 -773 -1700 -34 -2027 -1476 -401 -1504 1192 -45 -2161 1991 989 -1625 3236
4264 3236 1132 -2068 3032 1199 -531 2153 1201 -721 1545 1048 514 758 474 -339 -2450 68
4280 68 -1135 -3037 1170 -2792 -2764 2009 -2402 -2336 2128 -2259 -929 2064 383 -1367 2535 1458
4296 1458 468 571 1779 693 771 3043 -709 -1406 2874 -922 -802 2712 -1664 -988 10 -2603 -544
4313 -544 605 -2993 150 -778 -1607 61 96 -259 593 306 1366 -1622 633 1799 -1629 1845 2969
4330B969m433L191P54n271M260N65l883K015j54o56N34J75l01j865P60J148j900
4347b092k2J792k367L644q96j743M169k358j061L520k143o00K348j667q01K767
4363B490j483N05j727L50k16j503L429j209k994L748k415j667M122l918k79M250
4379A483l744N43L021l083J299R76j706K728p24j02m15l05L286l719J399K165
4395C102m327R48L276n151K538K599m481J305K206m762K036J097j549L29K43k91
4411h82o35R76R30j362J127J656l842L389R90m911N437r8n081N191j779k881M013
4428B238l40l186K915k442J98l93J990l94l536L215q80k741M834k044l777O872
4444B529j923m079O056k758k485N354k661n62K196p50j205J417J42j253N45J564
$$ plain form
4330 2969 -1464 1727 2481 -2790 1470 2035 -1848 167 13 -643 -109 66 -235 -2100 -1340 -192 -2092
4347 -2092 -2114 -322 -2689 955 59 -1684 2485 127 -934 2586 443 -157 2191 524 -277 2490
4363 2490 1007 1512 -215 135 -81 -1584 1845 636 -2358 1390 -1025 -2692 1430 -2488 -2767 1483
4379 1483 -2261 -1718 1303 -1780 -481 495 -1211 1517 793 691 276 -29 3257 -462 937 3102
4395 3102 -1225 -277 2999 -2152 386 2985 -1496 -191 2015 -2747 -711 386 -1163 -834 -591 -882
4411 -882 -1517 -541 389 -973 154 1810 -2032 1357 2347 -2564 2873 2775 -2306 2885 1106 -1775 2238
4428 2238 1898 -1288 1627 -815 -617 -1010 980 586 -2950 265 -615 -3356 1478 -566 -4343 2529
4444 2529 606 -3473 2583 -175 -2660 2694 33 -529 1667 917 -288 1129 1271 18 563 2127
4460B127k779j715O383n908o13N666n694J44L921l307k48M057m804J198K258r89
4476c03m7N22l47p05K00L034l381J458K850m998K603K649o470M037J721n484L665
4493A004K032m376J405J701k365j21k8J101k646J117J146l217L443M66l377M302
4509A587m45l392L526p83k539M827j336k241K835j219j573K265L80j110j173K083
4525A692j245k067L368j849j516K614k100k228M461k561l08L184l622K686m67
4540D2j436J648M14j029K144j180q54Q74P37q23j823K120K263m369J991J355m323
4557b249K924J552n130L142J149l295P83K017k325J087n14J25q5P10j2j939K248
4574A88L50k434M200j13m186M326k163k311L564J580m831L377j420j251K160j150
$$ plain form
4460 2127 -652 -2367 4016 -1892 -2505 3161 -2533 -2389 1532 -1775 -2023 2034 -2770 -1572 686 -303
4476 -303 -350 172 -175 -880 -680 2354 -1027 431 3281 -1717 886 3535 -2935 1102 2823 -2661 1004
4493 1004 3036 -1340 65 1766 -599 -720 -748 353 -2293 -1176 -30 -3247 196 662 -2715 1587
4509 1587 1142 -2250 1276 493 -2046 2781 1445 -796 2039 820 -753 1512 1892 782 -391 1692
4525 1692 447 -1620 1748 -101 -1617 997 -1103 -3331 1130 -1431 -1739 1445 -2177 509 42
4540 42 -1394 254 668 -361 1783 603 -251 623 1360 537 -1286 834 3097 -1272 719 2074 -2249
4557 -2249 675 2227 -2903 239 1388 -1907 -1124 893 -1432 -345 -859 -734 -819 -109 -121 -2060 188
4574 188 538 -1896 2304 2191 -1995 2331 168 -2143 1421 3001 -1830 1547 127 -1124 1036 -114
4590a14N6o28L23o50q30K913j35m445L694o16k391L559j227j817L992k802p08
4607a826M362k160j351L375r25j717J294J184j383j676L100j562k430N075m688
4622a328j165M941k879k151L854k645j360L624j541q59J172r04N95N09J547j304
4638A06k249L596j238q76K977k382L2L257m006K049K056m436J890R75k828O37
4654d40J108j259l28N30P41k837Q60L335l325k66M042m461J151L882m974K844
4670F03J113j653Q89P83k088J394p79Q08p2n80P37q35M35N19j594L02J190l555
4688b383K908j88l168L580j160k311K999j388o1J498L19o38Q2j821K319l02j04
4705A81J091j746J558k73j100L709l638j233L208k603m3K320l178Q79J793j519
$$ plain form
4590 -114 -58 -686 -363 -1013 -1843 1070 935 -3510 184 -432 -2823 736 -491 -2308 1684 -1118 -1826
4607 -1826 2536 376 -975 2400 1475 -242 1052 2236 853 -823 2277 715 -1715 3360 -1328
4622 -1328 -2493 2448 -431 -2582 1272 -1373 -2733 891 -650 -1509 -337 -1241 -646 -137 1410 106
4638 106 -2143 1453 215 -661 2316 -66 -34 3223 -783 1266 3322 -1114 776 1751 -1077 -440
4654 -440 668 -591 -919 -389 352 -2485 -1625 1710 -1615 -1881 2161 -2300 -1149 2733 -2241 603
4670 603 1716 63 952 1735 -353 1041 262 1070 998 418 1155 320 755 1274 -320 -18 1172 -2383
4688 -2383 525 337 -2831 749 -411 -2722 277 -1111 -1172 326 645 7 89 -1732 587 285 181
4705 181 1272 -474 1084 811 -289 3420 -218 -1451 1757 -846 -889 1431 -1747 -868 925 -594
4721e94L78j038K60m19m78J494j65j394K265n72j050L350k873N78K787l325J975
4738A179K80k130K706q24k047J610J4j035M62N31j39k552R08J382l260L012M53
4755E50l695K201O15k874K910K068l596J339K54n0Q79QJ421j496N00P38j043Q24
4773A553k18k238J928j09k213L286j148l202L533j663j437K519k285n40J225j44
4789a153K87K63m63P64p10J097n66j6J792l20k285L931k100l94J879k591M69J818
4807A702k004m97J842m62p8p97N91r40k57Q95p07j23K406l131m00M311l882N76
4825i55K559j743O9J197j500J230J32j76J001p62l38O80r49j16k45m51J343k426
4843a450O42J068k729K005K082l867J879l41j615J844J033q72l94O60n40J83R35
$$ plain form
4721 -594 -216 -1254 -994 -1413 -1891 -397 -562 -1956 309 -263 -1313 2037 -836 -258 2529 -796 1179
4738 1179 1459 -671 2035 1211 -836 774 788 -247 215 746 607 -1945 -1037 345 -2915 97 550
4755 550 -3145 -944 -329 -3203 -293 1775 -1821 -482 -228 -278 601 609 2030 534 1034 1772 729 1553
4773 1553 1335 -903 1025 916 -1297 1989 841 -2361 1172 -491 -1928 591 -1694 -2234 -1009 -1153
4789 -1153 -866 -603 -1066 -302 -1012 85 -481 -497 1295 975 -1310 2621 521 127 2006 -585 -116 1702
4807 1702 -302 -799 1043 581 503 -294 297 -643 -900 -5 -712 -835 1571 -1560 -1960 2351 -1531 -955
4825 -955 1604 -139 -70 1127 -373 857 989 813 1814 1052 714 1394 445 329 84 -367 976 -1450
4843 -1450 -808 260 -2469 -464 1618 -2249 -370 -711 -2326 -482 551 -321 -715 -55 -595 -412 523
4860E23J100r96k72J761k517O79K134k567J286M62l034K512j36j470K264j968
4876b39k59O1m73Q19j015L88o4q63K386j461p27J912l1j958K908j137j774L395
4894A868j936mK781k996R44J027k174J019j394J423m61j94L08j732Q09Q99r24
4911g37k39J280l058J843K511m011J626K471l034J751J11j818K098Q49k154R78
4927D67o06J534r75q61J868k307J510L18k387K342q45k797M272k693m80K448k048
4944a240q17K507o05j311J097J03n22n5J382L3p21J061q4j926L468j429k617M308
4962B632k993r41L672k203K81J762j636J63j191n04N97k98M64R24k724K088j845
4979a752J15L269l086K95K319k422P22J919j473J328l21j652J942k48o50J180
$$ plain form
4860 523 1623 627 355 2116 -401 278 2412 -155 1131 1593 -1441 1071 935 -535 1729 -239
4876 -239 -498 -437 -910 -91 -1106 -718 -782 -1645 741 -720 -1447 465 434 -1524 1384 247 -1527 1868
4894 1868 -68 -72 2709 -287 657 1684 -490 529 -865 558 97 -97 211 -1521 -712 187 -737
4911 -737 -976 304 -2754 -911 1600 -2411 -785 1686 -1348 403 514 -1304 794 1643 -511 467
4927 467 -139 1395 420 -441 1427 -880 630 948 -1439 903 58 -2739 1533 -1160 -1640 808 -1240
4944 -1240 -2057 450 -155 -1466 -369 -266 -788 -843 539 572 -149 912 828 -1098 2370 941 -1676 2632
4962 2632 -361 -1302 2370 167 448 2210 574 737 -454 -958 -361 -659 -195 729 -1995 93 -1752
4979 -1752 -1637 1632 -1454 -1159 1160 -1262 -540 1379 -94 1234 913 -739 1203 955 305 1485
4995A485p41l46p49M14K47l36k75Q84k811K870q13k237L075j225j454K687j458
5012g83nJ587l049K011J637j914J151Nq34K133j873M01M75p70P44j400K89J794
5030A599l315J959R73l277J203J890k711J577j16k025J024M12K58n6L73M94r41
5047f79R06R21k206J901M19p61P93Q40l106K855q21k127K737j268j59q4r79L23
5065d95J37j95r6o30Q54j08j148J686k35j911K588n63q52J995n07j897K535n01
5083F57m54J423j746J017m37j29J220j877J068M8k313K123J21j655K301j465j859
5100a957K214l55k115K760j801K00J437j075O19o87J404k34j107M65J630j080
5116C18J329l24n37J160j311p48J299q39L55J574l222J188j106j40R44p58K32
$$ plain form
4995 1485 744 398 -351 63 310 -26 -301 583 -2228 642 -171 -2408 667 -558 -2012 675 -783
5012 -783 -788 799 -2250 -239 1398 -516 635 640 -194 1939 66 467 942 172 916 -484 -195 1599
5030 1599 -1716 243 1216 -2061 -858 1032 -1679 -102 -218 -2243 -1219 -807 -549 -605 -232 262 -679
5047 -679 227 1148 -1058 843 1262 501 1294 2134 -972 1883 1062 -1065 1672 404 245 161 -818 -495
5065 -495 -358 -553 -649 -1279 -425 -533 -1681 5 -230 -2141 447 -116 -968 1027 520 -1377 1158 657
5083 657 203 1626 -120 897 460 331 1551 -326 742 790 -1523 600 721 -934 1367 -98 -1957
5100 -1957 257 -98 -2213 547 -1254 -1054 383 -692 -73 -760 644 410 -697 -232 1398 318
5116 318 1647 1323 786 1946 635 -113 1186 347 702 2276 -946 242 -864 -1004 -60 -818 -586
5133e86M42j074J194j634Q28J932l215J275J639j061N81J123j957O86Q4p74K046
5150A529j369P08Q98j457O0N20j016Q32l06j627J715j169N52l55j308K867r11
5167A63j902K300j844n29L280j804M1J340j598J695N61j750J319j244J209k65
5183I72j547K732j318j902L014k624Q05R96k483J071M45j917Q76J568k079J210
5199a81P34j898N33m16R83M81j743K954j806J086R70j581J138J320k791J484J35
5216A402k346K755q34j464L62K07j100J213k32k43o87O61l80q42K239p79k034
5233b102J965l31k026L504P1k661K843p55o00J857p20J86k82j173J707j195o3
5250B25Q19j709J266j27k284J941l12k661M010k721N0K458k844O41J048j317P48
$$ plain form
5133 -586 -144 -1218 -24 -1658 -830 1102 -2113 -838 801 -260 321 1444 -513 173 257 -517 1529
5150 1529 160 868 1766 309 369 889 -127 705 399 -1228 487 -682 -130 -485 -1793 1074 163
5167 163 -1739 561 -1283 -1812 1468 -336 -295 1045 -553 1142 1703 -47 1272 28 1237 972
5183 972 -575 2157 839 -1063 1951 -673 132 1128 -1355 -284 161 -1756 -880 688 -1391 -181
5199 -181 553 -1345 -812 -1228 -245 236 -1507 1447 -359 727 1697 116 1254 2574 -217 1267 1402
5216 1402 -944 1811 977 -487 -125 82 -1018 195 -37 -280 -967 -306 -686 -1528 711 -68 -2102
5233 -2102 -137 -468 -2494 1010 1081 -1580 1263 508 -92 1765 1045 1231 949 -224 1483 288 225
5250 225 1044 -665 601 474 -1810 131 -181 -2842 1168 -1553 -1503 955 -1889 -1248 -200 -1517 -769
5267g69J032J91q43l0J076l98m58K304j957j293L793k445M37J730k973J222L50
5284I69j896J521J047k235jK39n97L37l12L86j471N03K255j708L01J550k461J348
5302b25J359k682K161L57j209Q38k82j83J795j226j71O63j734J265j722J322q55
5319e29n12J086m79j496K378j554j498L125o22j306K298j192j84J555n07j656
5335a093J357K3j6l67J224l21j779K533m71o47J429k137j082L013k687K028N38
5352A545k726K5M66j058Q04J780j340m68J07R45p83J03J898j438J72J524k644
5369a088J465J115k036J668o4j699K315j050j253J750o63j716J992m26j181O3
5385h08R53O77k835K330M29l072K173J551k869K505M86k504J618J71j030J382
$$ plain form
5267 -769 263 454 -389 -419 657 259 -199 2105 148 -1145 2648 203 640 2370 -603 619 969
5284 969 -927 594 1641 -594 -595 -356 -953 -616 -928 -542 -2013 -1510 745 -963 -662 888 -1573 -225
5302 -225 1134 -1548 613 970 -239 599 317 134 1929 703 532 1195 -539 726 -996 326 -529
5319 -529 -1041 45 -434 -1930 448 -1106 -2604 521 -101 -1407 891 -301 -485 1070 563 -1093
5335 -1093 264 287 271 -96 1128 807 -972 1561 1090 443 1872 -265 -1347 1666 -1021 1007 1545
5352 1545 -1181 -1156 -690 -1748 -944 836 -504 -972 -865 80 -703 -600 1298 -140 32 1556 -1088
5369 -1088 377 1492 -544 1124 1060 -639 1676 626 -627 1123 460 -1256 736 310 -871 -808
5385 -808 145 822 -2013 317 746 -2326 -153 1398 -1471 1034 1520 -984 634 805 -225 1157
5401A157k91o24O39P26q54r95J140Q98k720J764j363j922L495j366r33L328k198
5418a19k375L809j130p87R06k22r38M01Q34l74o72J763n83m54J426j942n63L947
5436B927k412j007L216l578J97K148k460J091P91r64p00N27p45L48r0l45L41p56
5454a471J989j220O83K353l978J711J657k567J569J393k539K006k6k029J248k77
5470E02l80p8L44m76m38M70r8o88M05P98k431J881l27j582L391j159k489L557
5488A202m08k568L095q40j31J73k84M79j058J099M25j557K691j677j958L311j195
5505G99j235J758k482q7K831k662J023J092l353J092J404r80j00P09L87r07l10
5522a021K906j541j467M033l552L70J959k539J509J240j785j78J330j848N48K54
$$ plain form
5401 1157 866 242 881 1607 753 -242 898 1796 -924 840 -523 -2445 1050 -316 -1249 2079 -119
5418 -119 -2494 1315 185 -602 304 82 -856 -455 379 5 -667 1096 513 59 1485 -457 -1020 2927
5436 2927 515 -492 2724 -854 -657 1491 -969 122 913 -51 -751 -224 -969 -621 -711 -1056 -715 -1471
5454 -1471 518 -702 -19 2334 -1644 67 1724 -843 726 2119 -420 1586 1560 -469 779 502
5470 502 122 44 388 -88 -526 -56 -154 -842 -437 361 -2070 -189 -516 -2098 1293 134 -2355 1202
5488 1202 794 -1774 1321 481 350 523 239 718 -340 759 1184 -373 2318 641 -1317 1994 799
5505 799 -436 1322 -1160 -1247 1584 -1078 -55 1037 -2316 -1224 180 -800 -900 -191 196 -711 -1021
5522 -1021 1885 344 -1123 2910 -642 -272 1687 -852 657 1897 112 -66 1264 -584 -36 218
5538B18j080N21P68J6j191j17Q41k159K223Q43l838L624j107j461L488l10k693
5555a414J816R19k338J384j60K59m62J244j63j585Q26L67k698K733K82k792K592
5572H10l48j270J476j196r74J923k162M99J579j601R17nJ127o23N7R36j110m60
5590d25J554K82j549J693j571O83Q75k967J652O60j814J110M81j593P83k27m58
5607h31M05K1K70l26N60m41j373J666J345k852J714R50j327J085L77j189J094
5624A148p26j327J420j034J205M1L11j705J066j787O91k0j12j93n07J368p14q83
5642a758K392p41j909K617r95l16J672m92p07J348k04j044P74j94k16K67M81k90
5660F85j297J087r86m59K870j935j240K647j643r7M50m32J17K73p46M6M74j81
$$ plain form
5538 218 -862 -341 427 443 -748 -865 -24 -2183 40 883 -2955 669 -438 -1899 1589 1279 -1414
5555 -1414 402 1321 -1017 367 207 466 4 1248 1085 -500 326 693 -2005 728 1010 -1782 810
5572 810 462 -808 668 -528 -1502 421 -1741 -1242 337 -1264 -347 -352 775 152 209 1145 35 -425
5590 -425 1129 1411 -138 1555 -16 667 1542 -1425 227 887 -927 183 664 -929 -146 -373 -831
5607 -831 -426 -405 -135 -461 99 -342 -1715 -49 1296 -1556 158 1108 -219 866 1243 54 1148
5624 1148 422 -905 515 -519 686 727 1038 -667 399 -1388 -697 -717 -829 -1022 -1529 -161 -875 -1758
5642 -1758 634 -107 -2016 601 -394 -710 962 470 -237 1111 907 -137 637 443 227 494 975 685
5660 685 -612 475 -511 -970 1900 -35 -1275 1372 -271 -368 82 -350 -233 40 -706 -660 -186 -367
5678c67j088R35J347j646J532R17q70k21P24l043K512J461k313O91M70k194K010
5695H57p6j179O09m86j65l80L88N60j196n78K519k120K063j040m02j22J235j288
5713h01J898j056l61J247l34K23L62j123R20j368k7J192j506J107O6j432Q96l2
5731a29n32O63q23n33Q74j338M49J242j354Q94R16n44O72R4j22j02M60N99j022
5750C64K41j02m77j164L023j586j397J658n86N59q49n78J464j080k44J61J24k58
5768g27K51j154J943L21j875J219q24J609r7o90O9l17L91J452r44K19j91j015
5786c60j7J232j232L41O50j079R53m52l81O29j240J511o70j413K047n93j398K913
5804A441j127l30j84o57J583p02r10J463L99n74N67n15Q03m61j245J297q06j275
$$ plain form
5678 -367 -1455 -520 827 -819 713 1630 760 539 1263 -1780 732 2193 -120 571 1041 -1153 857
5695 857 781 -398 211 -275 -440 -820 -432 128 -1068 -1646 873 -1247 816 -224 -626 -748 487 -801
5713 -801 1097 41 -320 927 593 816 1178 55 975 -393 -420 772 -734 373 439 -993 -97 -129
5731 -129 -661 2 -821 -1354 -480 -1818 -1369 -127 -1481 -587 329 -215 457 551 429 327 787 1386 364
5750 364 605 503 26 -1138 1885 299 -1098 560 -26 533 -316 -894 570 -510 -754 -593 -469 -727
5768 -727 -476 -1630 313 634 -1241 -22 -846 763 666 -24 45 -272 119 1571 627 846 655 -360
5786 -360 -377 855 -377 -36 614 -465 488 36 -345 284 -956 555 -115 -1528 519 -74 -1472 1441
5804 1441 314 -16 -200 -857 726 24 -886 577 976 402 969 454 1257 796 -449 848 42 -1233
5822a233J772j526J366P57l327K678k4j966J607N08k805L610j188r76K55q78J826
5839D56r04l96J761j400K89J317j294Q96N53k227J932J07n82M52n9j395J484j834
5857h44O37J90j082J880j145l16J337j776P66L64j521Q63P88r52J395q13o64J840
5875I47j271O24L70R06m9k282J284m26k0L38K1j940K607o08j270O72j400M81K80
5894g36l16M51N44r61J148N4q08J051q62J050j12J81k50J60j070J971p06p94J606
5913A601j550N61O06k898J872L05j863J405o37L63m51J046j500R90j336J203r94
5930a277P49R49o68K95L78p79N26L05r62P61k51n17K034j134oJ49q3n24j38M36
5950B43l28j418Q56R22j712J234m10j264K056k55j411K514k168k05K470n48j170
$$ plain form
5822 -1233 539 -987 379 1136 -2191 487 463 -1503 104 612 -2193 1417 229 -747 -492 -1370 456
5839 456 -448 -844 917 -483 -194 1123 -171 725 1278 -949 983 1090 508 960 901 -494 990 -844
5857 -844 -207 -17 -1099 781 -364 -680 657 -1119 -353 11 -1510 -647 141 -811 584 -229 -893 947
5875 947 -324 300 670 1576 1527 -755 529 103 83 421 442 -1498 1109 501 -769 -97 -1497 -1016 -736
5894 -736 -1052 -601 -57 -1018 130 184 -624 427 -435 615 503 684 434 594 -476 1495 789 -5 1601
5913 1601 51 612 1218 -1680 192 497 -1366 39 -598 -235 -686 360 -1140 -150 -1486 -283 -1277
5930 -1277 -528 421 -247 48 426 -353 173 478 -484 277 26 -491 1543 409 403 552 469 -55 -193 243
5950 243 -85 -1503 -647 275 -1437 -203 -613 -1877 179 -76 -1487 1027 -1141 -1346 1124 576 -594
5967e94J886p29p27O92q22O44j151K071l95j917K092j165o25J469j324l59J863
5984I09k399R69J224j032k87R59j191R35J72o03p9L1J10p3K0J618k088O70J631
6003A496j026m62J000j182J48R19j941J84R67k37N63j507O51L40Q56p53k42p99
6021a025J561j731P61O68o88O5J317j323J108k62n53J414q83m19J19P56j4m85
6039C86J1k26K39L53n33j222J313k09j813J649q81M33k65P88p96J31O9l58M50
6058d81O42j22N82K9j69q9O65r06p9K450k228m79K231j716j27O33j821J348O60
6077A023l200K587N77k002J41K03Q27j117o98J865j550N71J670j590J18J648k176
6094a103K556L79k598J888q64j855K782m53j742J215j69L37p93O22m8j243Q49
$$ plain form
5967 -594 1292 563 -164 528 -294 350 -801 1270 875 -1042 1050 -115 -740 729 -595 -954 909
5984 909 -1490 -521 703 -329 -616 343 -848 87 259 -344 -423 -392 -282 -355 -335 1283 -805 -135 1496
6003 1496 470 8 1008 -174 -26 893 -1048 -864 103 -134 429 -1078 -427 -87 769 16 -226 -1025
6021 -1025 536 -1195 -434 234 -454 -389 928 -395 713 451 -102 1312 429 10 129 885 871 386
6039 386 397 171 410 763 230 -992 321 112 -1701 -52 -933 -500 -765 23 -773 -642 -573 -931 -481
6058 -481 161 39 621 650 481 392 1057 151 72 2522 294 -185 2046 330 203 836 -985 363 1023
6077 1023 -2177 410 987 -1015 -874 -671 156 -961 -1659 206 -1344 -773 897 -693 -575 1073 -1103
6094 -1103 1453 1832 -766 1122 258 -1597 1185 732 -1010 205 36 373 -420 202 154 -1089 -240
6111b40O7p20J233m79j098J196l88o8K872k304j962L379k126J303J89k05j114
6128d65N92R7L92j068J843j254n75J824r68j938J994n27q54K822k892o13K115
6145E25j592J67N41J34P08j77n39K42J14Q46j290M02J781k702N06K455k308L21
6163A34J890k549O08R55j294M49m32M16L19j137LP70m58J227j908N03P45j592
6181a351J419R90k379J191P44p38J548o10j198R55M38j308Q40N25m78p88J106
6198I06l41j172J673j477J8R54o4j871K519p56l28K36q00m34J299j050K85Q57
6216D54j158R90M49o11n09J029O86q59o41K255j912j82J923k203l46J513j156
6233b78O9J339j686M74M12r90K76J42p15N66j07J564j746r3J163j083Q36O06k21
$$ plain form
6111 -240 -173 -893 340 -139 -1237 -41 -429 -497 2375 71 -1891 1488 -638 665 854 649 -465
6128 -465 127 224 616 -452 1391 137 -438 1386 418 -1520 474 -53 -907 1915 -977 -1590 525
6145 525 -1067 -900 -359 -225 483 306 -233 9 123 969 -321 81 1862 -840 -334 2121 -187 134
6163 134 2024 -525 83 1038 -256 193 -239 177 496 -641 -638 132 -326 901 -1007 -504 241 -1351
6181 -1351 68 1058 -1321 -130 614 -124 1424 814 -384 571 1009 -299 541 1066 588 -200 906
6198 906 565 -607 1066 -411 -393 561 497 -1374 1145 389 61 297 -503 -937 362 -688 -403 454
6216 454 -704 286 735 124 -385 644 1330 471 -170 2085 173 -9 1914 -289 -635 878 -278
6233 -278 -209 1130 -556 -82 330 -660 -384 -242 -957 -391 -498 1066 -680 -773 390 -693 143 749 528
6252E28M39N30k421J528j3j038K10J232j543K012j11k186O54K07j33m5J26k75
6270b99r07Q77R37k111K031m04k731K505J42j289K515l60o90J203j911j16P40
6287A32L40j98m16J396n32k184K359r67j089J860j413n89K027q01k74Q10k893
6304b432J331J889p48m10O63n74Q6p22J263o47l34J833j974j86K724k325L09K197
6322A943k834J508J159k729N91J755k028m26j6J062l06K71J95j274L75J532k577
6339a799J73J378j16R12K10k249J967J220j723Q52K4j312K263p92j054N27M07
6356H88k51Q5m35O26j870J836M26k268J058l22j234K097q03Q5P26j695J92J566
6374G07r30J264j398P41L62m09j78J11r36J517l29p15J982j455o69K200l132J198
$$ plain form
6252 528 967 1497 -924 604 591 -447 -237 995 -548 1464 1353 -833 -179 28 -105 -150 -24 -299
6270 -299 -1206 -329 608 -1503 528 124 -2607 -102 40 -1249 1266 906 216 1419 -492 -608 132
6287 132 472 274 -142 1254 722 -1462 897 -70 -1159 701 -712 -1301 726 -75 -349 461 -2432
6304 -2432 -1101 788 40 -370 293 -281 -195 -917 346 -301 -635 1198 -776 -962 1762 -563 -254 1943
6322 1943 -891 617 1776 -953 -362 1393 -635 -1061 -1077 -15 -321 -50 145 -1129 -754 778 -1799
6339 -1799 -1626 -248 -364 548 758 -1491 476 1696 -27 825 849 -463 1800 1008 -46 481 888
6356 888 637 722 287 913 -957 879 1305 -963 95 -227 -1461 636 -167 -82 644 -1051 -859 707
6374 707 -223 1041 -357 384 746 337 159 270 -666 851 522 -193 1789 334 -335 1865 -1267 -69
6392f9L42l35k32o98Q43q4l72q28J808l27o82l8n16J440j67q8P84j434J272P20
6412A339j876J095M95j141J644m53j118N97L89r13l59K84J78j349K77J709k207
6429a409R4K450k670J881M15j733J601j377l3J386n63l38J241r20Q19r32L54K55
6447E21m3L60k24j193P40N01j526J169k58k053K148J00j445J245j810O66J226
6464A24n01l42l93M96k63N84P62p14q98K808j250p95J425n42q57J785j094R5O8
6483D98m73N14m70K40j103J30m6J043l76M63j15j284J606j533K42K273k069P44
6501B84M50l17K49j239J565J99k74j337Q94m07L27l5J82N65j376n12J085l64N73
6520E12O87k589J475j5k040J577O79j433R81L06j61n66L78J84J47L64r86M70M78
$$ plain form
6392 -69 273 -62 -294 -992 -149 -233 -605 -1433 375 48 -634 -672 -1188 252 85 -3 781 -653 619 1339
6412 1339 -537 558 1053 -88 1556 1103 -15 582 971 58 -301 -17 161 -1188 -911 798 -1409
6429 -1409 -1315 1135 -1535 346 761 -972 629 -748 -781 605 42 -296 945 25 844 -88 266 521
6447 521 478 838 614 -579 161 662 -864 305 47 -2006 142 242 -1203 42 -1768 -1102 124
6464 124 -377 -719 -1112 -616 -879 -295 467 -247 -1145 1663 413 -382 1043 501 -356 1429 335 430 498
6483 498 25 539 69 309 -794 -664 -710 333 -43 420 305 -979 627 -906 -664 1609 -460 284
6501 284 734 417 666 -573 992 1191 917 -420 474 67 394 359 541 1106 -270 -782 303 -61 512
6520 512 1199 -1390 85 70 -1970 -393 286 -1147 -166 140 -21 -587 -209 -25 122 486 -500 -30 448
6539D48L87j444R91J31J00P41j839J82J603k041O05O44j675R3J045j195J122j075
6557a177J042J61r81Q92k4j026J933p82k72J389j261j00J705j315j6J995k089
6574G4m44K032k223O92L67J2l78q69J060j347O48M07p11K82L07n03R42l87j648
6593a687K686m03j854J543K03j134J163j30q25N64j96N09n21M72k51j005J062
6610A96m51j024J894l58j737J444k9r61Q48J15K28M21j275J064m93r21P86k72
6628e25L27P53j376J443p49l02J213j737Q38J839j423J09K46j155P09R48k077
6645i19O99M27o43R22j957J680m03m98J460j333J73J345j615M67K14J05k51L85
6663B58N27l78M82k93L64q75K41l31k99J195l89o02q2j86R20l67j340J725n98
$$ plain form
6539 448 835 -609 382 513 613 1354 -485 -303 1300 -741 -136 508 -1167 -1074 -29 -1224 -102 -1177
6557 -1177 -135 26 -955 -63 -87 -1113 820 38 -234 1155 -106 -206 1499 184 168 2163 74
6574 74 -370 1662 -561 131 498 510 132 -737 323 -1024 -376 31 -680 -398 -91 -594 348 -39 -1687
6593 -1687 999 596 -1258 285 488 -646 517 387 -438 126 -70 439 -82 390 139 -866 196
6610 196 -255 -1279 615 257 -1480 -36 -65 -1026 -178 -63 165 586 -689 375 -118 -1039 -253 -525
6628 -525 -198 555 -821 622 -127 -429 784 -953 -115 1724 301 410 656 -499 210 1158 -919
6645 -919 -220 207 -436 486 -1471 209 -194 -692 768 -565 -392 953 -662 -195 19 124 -127 258
6663 258 785 407 889 596 960 85 326 -5 -304 891 502 -100 -182 -368 552 185 -1155 570 -28
6682b8j86Q2m86k44N85l74Q55K31r89L07P34j300J275j133j40J595n5k64K83n07
6702B41J465j669j81J615j161p51K78K5p27J693j139Q5K20j40L27j942J839l42
6720b64m09J467j321P1M91k77J446j40j673J188J033j968J079J58j363J394j506
6737e94R3J097J48q43j78M29o97q72R55J86k68M53J401j906J076J0o00P57n02
6756A45j042P98O96K4k5n86Q51j803J603n90j26O37J53p08m5j250N39J584j158
6775c03j101J592o70r37J345o76J087m34q95K140j015M38J72j200J813k34j294
6792a72R25j001K18J332p97o45N53r02M17N86l92K4q20M52M00k120K188q43J29
6811d68L17j574J513K92j123O69J058p14L85J1J80L42n51r05J833r79k90P35j285
$$ plain form
6682 -28 -214 -132 -618 -862 -277 -651 204 435 -554 -247 487 -813 462 -671 -811 784 729 465 748 241
6702 241 1706 37 -144 1471 310 -441 -163 -138 -865 828 -311 -226 -6 -146 181 -1761 78 -264
6720 -264 -673 794 -527 -456 35 -242 1204 1064 -609 579 1612 -356 723 881 -482 912 -594
6737 -594 -501 596 744 -99 -277 152 -545 -1417 -462 -276 -544 -91 1310 -596 480 490 -110 647 145
6756 145 -897 -99 597 621 596 10 861 -942 661 71 -55 582 735 27 -18 -1268 -729 855 -303
6775 -303 -1404 188 -482 -1419 -74 -750 337 -97 -992 1148 133 571 743 -457 1356 1122 -172
6792 -172 753 -248 -30 1302 505 -140 413 -489 -72 514 122 146 -674 -222 178 -1942 246 -597 -468
6811 -468 -151 -1725 -212 80 -1043 -374 684 -30 355 366 546 888 337 -568 1265 286 -4 731 -554
6830e54M86O38k95k18n03P33o90l32Q51j04q07J907j199j256J662j3j079N86n03
6849f90M08P12o45J011m86P83q76o3j75Q66n53J530k009L58N88j845R27K68J44
6868B53q76J456j951L03O41q81R37M33r51P67j345J644q60L13J595k174L29J532
6886A165j843R39M78j748J804P15j635o20J836r84j41o82Q15j097L32N34J56k35
6904b11Q80j641J105J54j178L53L2J069k66j9p26J079m15M39N51j381Q55r72J243
6923I51r30O05k52N3o47J42M6j409K045j177M17L75j254Q7J90j83L79N95L28o80
6943c19Q03k73K63j153J383n90r55K164j416O76q01Q83Q1Lq18M12Q31j662Q51
6962C63J53p94p5m6J78j250N88J548j337O62K37m04L42J123j109J67j73m72J072
$$ plain form
6830 -554 -68 570 275 57 -446 287 -403 -735 116 12 -795 1112 -87 -1343 319 306 -773 -187 -690
6849 -690 -282 430 -215 796 310 1093 217 154 -21 845 292 1822 -187 171 759 -1086 -159 109 253
6868 253 -623 833 -1118 -815 -174 -1055 -118 315 -636 131 -1214 430 -430 -117 1478 -696 -367 1165
6886 1165 -678 261 739 -1009 795 1510 -125 -745 1091 107 -34 -716 99 -998 -666 -132 24 -211
6904 -211 669 -972 133 287 -891 -538 -506 563 297 278 -448 631 216 655 1206 -175 680 -292 951
6923 951 21 626 374 427 -220 -78 -32 -1441 604 -573 -156 219 -1035 -948 -758 -941 -562 33 361 -319
6943 -319 484 211 474 -679 704 114 -841 1323 -93 583 -218 665 746 749 -69 343 1174 -488 363
6962 363 516 -278 -353 -399 -221 -1471 -883 665 -672 -10 227 -177 165 1288 179 346 173 -299 773
6981G73L41n52k55k33M28J858k362J23N91r24Q58j017K83p52k13O87j81l64P37
7000a74P1m41M07l84J61J78k00R18k89o54N24k47Q53r49j30Q77Q14j533J324j634
7020e08k40J689j371l2J471j869Q97J67r06N91O3m98l89O81q2L83J17K65m66L20
7040B83R32j415L39J702j029j315P26Q46j062J222j730J322J75j510J059m83l2
7057C0l14J61l73L72L21K15r05J51L69j456J827O78j694J484o77K22L08N14j653
7076d20N93J625j198q62O15O29j367N77m63L48P48r25r17J787r90j620K322n25
7094d3j264J553p33m7N82J80N06j310OR68o6j68N03l84N64r09K1M53l91L53M34
7115H08o46k37R41k298Q31P35j573J013K47j33l50O75N72k84j61Q57j145PK5l67
$$ plain form
6981 773 1114 562 307 74 502 2360 -2 121 712 -212 646 -371 -88 -840 -1053 -366 -547 -911 -174
7000 -174 -103 -544 -137 -521 -360 -182 -382 536 247 -407 117 -130 723 -226 -356 521 1335 -198 1126 -508
7020 -508 -748 941 -430 -462 1009 -860 37 204 -702 -111 -48 -546 -935 -254 -336 47 164 429 -37 283
7040 283 1215 -200 139 1841 812 -503 223 1069 7 1229 -501 821 996 -514 545 62 30
7057 30 -284 -123 -496 -124 197 412 -493 -342 27 -1429 398 1076 -618 866 189 411 719 1233 -420
7076 -420 173 1798 600 -262 353 982 -385 192 -271 77 825 -100 -1017 770 -220 -1840 482 -43
7094 -43 -1307 246 -487 -534 48 228 734 -576 -570 398 332 164 667 283 847 -62 -41 412 21 374 808
7115 808 162 -75 866 -1432 -601 134 -1439 -426 -179 -312 -662 13 585 301 140 997 -148 -141 -116 -483
7135d83J146J023j307L89j217L1J498q53n76M72n59K75M82m7j86j83N24J22j774
7154a223O33Q81j149M00J68j524K024p25L12J563j248j346J734m91N05M41q20
7171A35n0N60R0K69j403R76m83j018J931j617O52K64j209M68L89J08l28K34RQ60
7191H37j642J449R90j489J218j168n46J040l13m52R45m22j66O43n43N0L33j427
7209f63J089l27N47k57Q44j515N66K01p09n39M02J756j758J82J221k217J594j58
7227B59j087J167M82k717K072N0k41n50J262l15m62R04l83p11M19Q41j985R76
7245a9M55j573J476K11j994K300n00j777J789k29J38k8O70p23r74l17J959k039
7263a175J870r37L76j75q9j43K432k651M05M78J10l17Q81j220q4L42r46l8J187
$$ plain form
7135 -483 663 1686 379 768 -449 -418 1080 227 -349 123 -436 -161 321 274 88 -95 429 551 -1223
7154 -1223 -590 291 -858 -458 -290 -1814 210 -515 -203 1360 112 -1234 500 9 514 955 135
7171 135 85 645 735 1004 -399 577 94 -924 1007 -610 42 306 -903 -435 -46 62 -266 -32 -23 837
7191 837 -805 644 1634 145 1363 195 -351 689 376 -76 869 447 281 924 381 431 764 -663
7209 -663 426 99 646 389 1233 -282 284 485 -224 -763 -361 1395 -363 -181 1040 -1177 417 259
7227 259 -828 339 821 -1896 176 226 -15 -565 697 382 -80 824 441 -270 149 990 -995 -19
7245 -19 436 -1137 339 550 -1444 856 356 -1421 368 139 277 249 919 196 -778 -1095 864 -1175
7263 -1175 695 -242 134 -41 -130 -273 2159 -492 -87 391 501 184 1065 -155 -239 103 -843 -881 306
7282C06l48k33j15Q82n22j72Q44j162L50J395j392J007J70j403R65K57L31j259
7300i9R28k74K56k29l9o19M61o5o06P28q67n98J309l68j366K251r39j005K536
7319A395q89r51J762q45n91P48M9O54m49K64j581J416j421J014j56J106j670m47
7337e92J073k49q76Q02K8q43P87j671Q64J504j191k5R75r59J58O77L42j249J56
7356b89R97q14K8O38l44o49R96j137J15J796j416k59Q8n15J55P63q45K23J28p4
7376d15J53m2J61o02M23J729j984R33N05k299J947J5k1J49m56n22R21j288N11
7395a82l89L51J377j746O99L60m87NJ34j480K065j532o53K534j205j017J401r81
7413g46K55N21L21o1J22l61j35N46L47N1j632J223k82j9M74l54k2O67j598L52
$$ plain form
7282 306 -42 -275 -390 492 -30 -202 642 -520 -170 1225 -167 840 1010 -393 572 829 1160 -99
7300 -99 829 555 811 582 543 -76 385 320 -286 442 -425 -1023 286 -82 -1448 803 -136 -1141 1395
7319 1395 506 -445 1317 472 -119 629 678 1332 883 1147 -434 982 -439 575 419 1525 -145 -592
7337 -592 481 232 -644 158 186 -657 130 -1541 -677 827 -364 -389 586 -373 -215 462 804 -445 -289
7356 -289 708 -106 -78 560 216 -433 563 -574 -459 1337 -79 -338 -250 -765 -610 153 -692 -469 -341 -415
7376 -415 -262 -304 -143 -745 -322 1407 -577 356 861 -1438 509 524 503 652 196 -326 595 -693 -182
7395 -182 -571 -220 1157 -589 110 470 -17 -12 122 -1358 707 -825 -1478 1056 -149 -1166 235 -746
7413 -746 -491 30 351 290 412 51 -84 462 809 860 -772 451 169 150 624 270 248 915 -683 -331
7433c31R61j698J315n16j128J273k22o72J065m28j9r0J3K91o81M58Q90M30l60
7452E51K06j142J22K82P23q4k85l8M85L48p47n70J58k05j85K29Q31j413L6J148
7472D50j956J343K75k61O66o54l86J078q11N22j07k24j26M6j74J05o92K584j109
7491E69j107J170m08n22J867k517O31P64j18j717J811K87j672J223k491K218P49
7508G37j182O93r52k68J050l15J058r43K3Q58k84O84j319l23Q2K324l023R22L80
7527B02j153O41j3J04r61M04N17rj406J096q91R84J272k320J217J335j684J127
7545D62N65j068Q03r5j046k03J190p8P4r77J077j215R83o3j217R57j06J58M40
7564F41j171q68K368l44j158J98J74O37j47j003O06k68J68K24R42o70l63k15O04
$$ plain form
7433 -331 630 -1068 247 -269 -1397 -124 -346 -1018 47 -381 -400 -490 -477 -186 -867 -409 481 911 551
7452 551 757 -385 -263 19 742 658 373 335 820 1168 421 -149 9 -196 -381 -152 679 -734 -698 450
7472 450 -1506 -163 112 -149 517 -137 -523 555 -256 266 159 -65 -191 -145 -319 -214 -906 1678 569
7491 569 -538 632 224 -298 1569 -948 -317 447 329 -1388 423 710 -962 261 -2230 -12 737
7508 737 -445 248 -704 -972 78 -237 821 -122 -99 759 475 1159 -160 -483 -401 1923 -1100 -178 202
7527 202 -951 -310 -323 -219 -1180 -776 -259 -268 -1674 -578 -1469 -485 787 -1533 -316 1019 -665 462
7545 462 1027 -41 762 667 -379 -582 608 530 604 -373 704 -511 472 409 -808 149 43 201 641
7564 641 -530 -1398 970 626 -532 -334 -160 477 330 -673 -67 -335 -167 57 999 329 -34 -249 355
7583C55p7O29j337P35r77K572k026J97P9j407J469p77l09O57K60r00N61m27L00
7602d23Q46r25Q60j06m56O54n78m0R26j101N69O71k317J298K99o05J062p78n07
7621f51j69L13k44JM24P98k43j599Q90j97m38R48q33L38L38m5Q52l08k61P07j093
7642d72L41N09r76J451p7L5m19M65n36o13J00l31O31l69rL37n83l85J6K32Q39
7663A86j012J395o17k41J32Q94m81Mj170J427o16O93j012R52j503J494k14j653
7681a342J295p96P62J97K37n49oJ0R7N0m47R65j788R98J58j071J619p56j91K128
7701A570k284R08J178j941J437q46n12J911j674j3R11q00J198j268o46J783j322
7718d10j6K15l08n9J083j518J182l59m25J072k86N30m19j297J090p17L11Q06o48
$$ plain form
7583 355 278 907 -430 305 -672 1900 -126 71 150 -1257 212 -565 -874 -217 43 -857 -296 -723 -423
7602 -423 423 -502 358 252 -204 450 -128 -168 758 -343 226 897 -1420 -122 177 -428 634 -144 -651
7621 -651 -820 -507 -751 -750 -326 472 229 -1370 -480 -677 -1115 -167 -1000 -662 -324 -369 483 175 -86 621 -472
7642 -472 -131 378 -598 853 776 811 392 857 321 -292 -192 -523 108 -261 -270 67 -516 -901 -885 -653 186
7663 186 -826 569 -48 -289 -157 737 256 260 -910 517 -99 594 -418 534 -969 525 311 -1342
7681 -1342 -47 -843 -81 116 353 -196 -202 -192 -95 -45 -492 473 -1315 -317 -159 -1230 389 -367 -558 1570
7701 1570 -714 194 1372 -569 868 22 -490 1421 -253 -266 645 -155 1043 -225 -871 912 -410
7718 -410 -426 -211 -519 -578 505 -1013 169 -190 -615 457 171 701 282 -1015 75 -642 -331 475 -173
7737a73L44J73n22n07J455j540P00Q67r05m36Q91k58j01j91j36kn11p4M64m50
7757i12P62p25M20J486k296J552m53M2M21p74O2N23j070J206O20j272J231r63
7775a40P0J061j074k95J582j834J218r17j6N93r70L56Q11o00N36P35k423J524
7793B17j50K03p9q48p12J942km64P47j64J88q75N06L90j083n91J252j454Q48J49
7813B0n36Q46j017R12J52j13j264O08p29J329L95j042r6K67J675j869M23m26R97
7832E32q97Q88j96k52M17q03l68J698j462P91J27j510J435q20N81M75n25K13j50
7851A74j161J461j01N1K15j245L12j35R0j16J082j039J009n1r11R93j71q08K33
7870a18P05p76P52j015L51q9O74j409M8O46R38j007Q26q36L74J22m77l83R61n62
$$ plain form
7737 -173 171 344 -178 -685 770 -770 -70 797 -108 -544 347 89 -12 -203 -339 -341 -852 -926 -462 -912
7757 -912 -150 -875 -455 1031 -1265 287 -166 -124 297 -477 -415 108 -962 244 864 -408 823 -140
7775 -140 -70 991 -83 -378 1204 -630 588 -329 -345 248 -722 -366 445 -155 381 1116 -1307 217
7793 217 67 270 191 -657 -1369 573 571 107 854 690 878 3 509 899 -184 -775 477 -977 -129 20
7813 20 -516 330 -687 225 377 264 -1000 -392 -1121 208 603 -439 -535 -268 1407 -462 -39 -465 532
7832 532 -365 523 327 75 492 -311 -679 1019 -443 348 475 -1035 400 -420 161 636 111 324 174
7851 174 -987 474 373 424 639 -606 -294 -429 -339 -455 627 -412 597 546 -365 628 457 -351 -118
7870 -118 587 -189 563 -452 -101 -190 484 -925 -877 -231 707 -300 526 -310 64 186 -291 -674 287 -275
7890b75n24R76M12j581J456j26K32j019N34P3L56k5o6o24O63oj436R00k39l72
7910f91J427j527M02M09o98O16M32n55R78j061P7K14QL7n36M70L18M8m5k58j73
7931a08N21l62p51O76r13P96O11j107J354l57j013k78Q12m59Q83n78N58k25q02
7950g42J270J65j125N33M77M45q50M58m01K79K06n18j63R04j045M35l97R1k87
7969b65N80k78n77J794k109K14R65j150L27J596j456l51P20p15P66j91p3R17j098
7988c84L46QK90J35m45n4L48n36Q1P70q18P64P0o33mL87p44K78J00j79j065Q14
8010d71N50k00P3J78m68J99r4N17o4j36l93J556Q9k039J422m51K11n2k55m05M78
8031B45n06J115j013J41R44j423J171j043q95J545J36M11m15q77K92K58m86K43
$$ plain form
7890 -275 -799 177 589 -992 464 338 570 -449 85 158 514 489 423 -201 462 456 -980 -80 -319 -691
7910 -691 736 -791 -389 20 -678 -62 370 -185 793 -268 -191 23 31 68 -468 2 320 368 323 65 -108
7931 -108 413 51 -700 -24 -937 -141 470 -637 717 360 -653 -931 -119 -578 305 -273 285 60 -742
7950 -742 528 693 -432 101 578 1023 173 631 230 509 715 197 34 938 -107 328 -69 22 -265
7969 -265 315 37 -540 1254 -855 -641 324 -826 -499 1097 -359 -710 10 -705 61 -130 -203 714 -384
7988 -384 -38 -30 260 395 -50 -104 244 -292 -211 559 -259 505 575 -58 -62 325 -419 -141 -41 -220 -1285 -471
8010 -471 79 -121 -48 130 -338 -139 -233 284 220 84 -309 1247 1336 -703 719 268 479 427 172 -233 245
8031 245 -261 854 -159 -18 926 -497 674 -369 -1264 281 417 828 413 -464 -172 86 -400 -157
8049a57k40K60j41L36k61L6O1J030o43o12Q97l58j367J542l21j030J288j209M77
8068d12mK46j518J923q34K65O36k74L29J92n44q1k75J194j117K4P97l77O2L12
8088E44l46j571K188j501R61l22m76Q36n93k15R54k09j249J013L19r26R6J582
8106A085p51j120O59O48p13L18K43o19P56M84j207J610j359L07n46l36J118m4
8124E33M17m83j297R12k22n80J461k4q91n09J37j02N98M29l73Q96j460Q35J33
8143D10j70M24K21n00K71o05N28N64j634J526j107j12M16P25m69n70L54j627J250
8162a05m00K28J491j086l16q4R42p51o74M50L29j86Q73j178O96k29M07l59L26
8181C74q13N38m08N72m3L96m02L60j113J713
$$ plain form
8049 -157 -397 -137 -278 58 -203 -167 -106 924 281 -331 566 208 -1159 383 62 -968 320 -889 -412
8068 -412 -416 -170 -1688 235 -599 -334 302 28 357 549 5 -76 -351 843 -274 -250 547 170 232 544
8088 544 198 -1373 815 -686 275 -47 -523 313 -280 -495 459 250 -999 14 333 -593 -497 1085
8106 1085 334 -786 -127 521 -192 126 369 -250 506 990 -217 1393 34 341 -205 -541 577 533
8124 533 950 467 -830 82 -140 -720 741 717 -174 -683 -546 -648 -50 379 6 902 -558 277 410
8143 410 240 664 885 385 656 51 579 1143 -491 1035 -72 -184 232 957 488 -82 272 -1355 -105
8162 -105 -505 -277 1214 128 -188 -272 670 -81 -755 -305 24 -162 711 -467 229 0 407 48 374
8181 374 -439 99 -309 263 220 616 214 574 -539 1174
8191A174
$$ plain form
8191 1174
$$ Imaginary data points
##PAGE= N=2
##DATA TABLE= (X++(I..I)), XYDATA
0@%%%%%%%%%%%%%kJ10k16K16k16K16l24M32m32N40o48P45q54R73j149J289j453
30g73J658j900K166k445K754l100L472l876M320m807N352n943O573p267Q024q855
46d647R768j0760J1849j3043J4363j5831J7460j9275K1314k3640K6307k9389L3004
59A7480l7309M2540m9046N7387o8462Q3882j06803J44157k14394L86862j482131
70a225837j475137N128805k040581k688666M171275m70008l704482K731343J134839
79A561551k918811J371962J666132k516603K69931J718054j551930J4408J440211
88A054905j246005q2722R09335j066828K89467P84328j114329M75174N86732j317961
98g27904N96545Q12643j408350N81200J175898j662267M0073J721094j560977
$$ plain form
0 0 0 0 0 0 0 0 0 0 0 0 0 0 0 -2 108 -108 108 -108 108 -216 216 -216 324 -324 421 -433 540 -609 680 -773
30 -773 885 -1015 1151 -1294 1460 -1640 1832 -2044 2276 -2531 2821 -3122 3451 -3816 4208 -4647
46 -4647 5121 -5639 6210 -6833 7530 -8301 9159 -10116 11198 -12442 13865 -15524 17480
59 17480 -19829 22711 -26335 31052 -37410 46472 -60331 83826 -130568 256294 -1225837
70 -1225837 -2700974 2427831 387250 -2301416 1869859 1399851 -2304631 426712 1561551
79 1561551 -1357260 14702 1680834 -835769 -565838 1152216 -399714 -385306 1054905
88 1054905 -191100 -273822 635513 -431315 -141848 642480 -471849 3325 590057 -727904
98 -727904 -131359 681284 -727066 -145866 1030032 -632235 -592162 1128932 -432045
107d32045n95532K335754j154228j553664K443461m94652k164537K351753L59708
116A096018k559152J658055J055029k448790Q43350J635667j875950o4105J668065
125A008187j202304o79397J475982m90272q03954J127404k18734p67938Q17885
134B66859j22694m36312O75527l80601k74279P11451n82535j58821R39865p08272
144f9812m11101J095775n29007p05971J162504k01920j116333J054244K96492
153E74871j382491Q34798P85330j596774M11966J251356j426305j3965J464914
162I03700j130919n24414J397464n78073p60631J131506j13426r29380P14533
171A10360K94089q06956L88288M77071o70519Q9677M04356m59463R1846K80995
$$ plain form
107 -432045 -1027577 1308177 153949 -1399715 1043746 549094 -1615443 736310 1096018
116 1096018 -1463134 194921 1249950 -1198840 -355490 1280177 -595773 -659878 1008187
125 1008187 -194117 -873514 602468 112196 -691758 435646 216912 -551026 266859
134 266859 144165 -292147 383380 2779 -271500 439951 -142584 -301405 638460 -69812
144 -69812 -480913 614862 85855 -620116 542388 340468 -775865 278379 574871
153 574871 -807620 27178 812508 -784266 -372300 879056 -547249 -561214 903700
162 903700 -227219 -751633 645831 67758 -692873 438633 325207 -604173 110360
171 110360 404449 -402507 -14219 462852 -207667 -117990 286366 -173097 -81251 199744
181A99744l13752J88141J6754l70282L98055j1469m45368N32318J8743o82719
191d69835M86173L14307p18473K95668N91194p60489r0792Q61189n52537m18464
201d62059R79004l26635p39323R15648j6396q62016P03712K41370q33050L88736
211a1009M33569o49228M7664M89847l84578j81686M47743j58092l03814L29893
221F0309j4859k44985K42865r874j54153J58276q9847l429J68045k23116Q2719
232b8049K26699l24432P4964L21666l45390o0270L99579k22642k35221L98442
242B05346n7421m34128L63039J86131n52461K63938L69245o27478R4267N28606
252C39084n05586p2324N39800l27518k47988M19420p1908k94623K82563J50028
$$ plain form
181 199744 -114008 74133 90887 -279395 118660 107191 -338177 194141 212884 -469835
191 -469835 16338 330645 -387828 -92160 499034 -261455 -352247 508942 -43595 -462059
201 -462059 516945 190310 -549013 366635 350239 -511777 191935 433305 -399745 -11009
211 -11009 422560 -226668 -179004 310843 -73735 -255421 192322 34230 -269584 60309
221 60309 45450 -199535 43330 33456 -120697 37579 -52268 -55697 112348 -110768 -28049
232 -28049 198650 -125782 -50818 270848 -74542 -134812 264767 42125 -193096 205346
242 205346 147925 -286203 76836 262967 -289494 -25556 343689 -283789 -189522 339084
252 339084 -166502 -238826 300974 -26544 -274532 144888 72980 -221643 60920 210948
262B10948l29307O1067K55294k69713l5197L31056j56273j46105J60798q1645
272I23o7801P7850N2279L3643j58387k9405J51007j68567N383K79443j81354j89641
284a94627K11303r499j89686J76099J92317k72548q0734L17649j82361j71161
294b03248M25742r5440l27549L25448Q822l16353K25610J53833k34991j0579J69005
305A20300j02049j68068J97572Q4141k39763J01651J18745k44969M1158J69452
315G8170j01499k9776P4941k165j03197j4513J84676o4290j31178K16444m8032
326E9581k06181J99066N1412j59530Q9860P6077j20176o0649J17805Q266j42375
337h6844J33810P6227k53537Q1460J42651j99189O0624J51719j52534m9743Q4197
$$ plain form
262 210948 -118359 -57292 198002 -71711 -106908 224148 67875 -78230 82568 923
272 923 -66878 10972 63251 96894 -61493 -90898 60109 -108458 -103075 176368 -4986 -194627
284 -194627 16676 7177 -182509 -6410 185907 -86641 -167375 150274 -32087 -203248
294 -203248 222494 127054 -200495 124953 133775 -182578 43032 196865 -38126 -48705 120300
305 120300 18251 -149817 47755 131896 -107867 -6216 112529 -132440 -91282 78170
315 78170 -23329 -53105 21836 19671 -83526 -98039 86637 22347 -108831 107613 59581
326 59581 -146600 52466 103878 -55652 34208 110285 -9891 -70540 47265 55531 -86844
337 -86844 46966 123193 -130344 -48884 93767 -105422 -44798 106921 -45613 -95356 -11159
348a1159l817m8034L8805R6157j18039o4401J71692o8697o5633J88188o6697j16574
360f8209J11099O917n4988K8476N4936l3504j02815R5263M6427j58617J02262
371B7247P7976j91366N3454J04038j14549j120P6589j6606p5248J2462J03840
382E6717r7211m8975J70737r4399j00193J86434l5029j16504J21404L5504j09805
393c1320Q53J24289m1327j39502J46364L6706k14742J34239J08476k22767O1384
404c7347J23709j50511Q438J23714o3495r0676P0684O5223j18742J9264J37875
415H8136j26483m6734J48700m9724l6229P4370k7394k1565j0302K8771M7442q6653
427a7665L0648P3917j35022K6060J24419j15666l9630J00789m1767q3930N8504
$$ plain form
348 -11159 -14976 -63010 -24205 71952 -46087 -110488 61204 -7493 -73126 115062 48365 -68209
360 -68209 42890 49807 -5181 23295 78231 44727 -58088 37175 83602 -75015 27247
371 27247 105223 -86143 -32689 71349 -43200 -44320 32269 15663 -59585 -47123 56717
382 56717 -40494 -89469 81268 -13131 -113324 73110 38081 -78423 42981 78485 -31320
393 -31320 -30467 93822 52495 -87007 59357 96063 -118679 15560 124036 -98731 -37347
404 -37347 86362 -64149 -55711 68003 4508 -86168 -15484 49739 -69003 -49739 88136
415 88136 -38347 -85081 63619 13895 -22334 52036 24642 3077 -7225 21546 68988 -17665
427 -17665 12983 86900 -48122 -22062 102357 -13309 -52939 47850 6083 -77847 -19343
438a9343O6975j17086j1922J45355j18670o1939J90375j02835r3213J97147n1527
449B3317j09267J23577o085p8437O2466M5413n3876j7639O2743l4983n0675R9727
461F6281k8059r5202Q8062j1853o9190O0929n997j2273J5226l9699L5700j4168
473a0243n7084P8146j3089n6952Q1299k3422o6602P2300L9767m9955m74P0195
485F3886m4391q6338J25278L9650j32512R4041K0716j66198R8113P9137j19791
496b8409M5373M0240j07702n527P7690N715o1566J7943L3210q3773K5008Q9506
508D7708o8441K803M6763o4444J0703L1654k042K6377l4261K4371L4153q6584
520c1240N0060P1816j06955J1395O8961p6839k7483P3333N218q2303K9561Q3502
$$ plain form
438 -19343 47632 -69454 -81376 63979 -54691 -116630 73745 -29090 -122303 74844 23317
449 23317 -85950 37627 31542 -46895 15571 60984 7108 -10531 52212 17229 -33446 66281
461 66281 38222 -56980 31082 19229 -49961 10968 4971 -7302 7924 -31775 3925 -10243
473 -10243 -67327 10819 -2270 -59222 22077 -1345 -67947 4353 44120 -5835 -6309 63886
485 63886 19495 -66843 58435 98085 -34427 59614 80330 -85868 12245 91382 -28409
496 -28409 16964 57204 -50498 -56025 21665 27380 -34186 -16243 16967 -66806 -41798 47708
508 47708 -20733 -17930 28833 -35611 -24908 6746 4704 31081 -3180 21191 55344 -31240
520 -31240 18820 90636 -16319 -4924 64037 -12802 -40285 33048 38266 -44037 -14476 69026
532F9026j19317k8010J48019j03201o8503J55798o2388q4007J05683j4072m4241
543d5213N3429J9344k3357j0602L4528j2008l1822O6873j3788n9986N1845l9746
555a0503k6312Q1373l9214R05L5179r3727K3362N8038n9088K5700J6846p0632
567e8073J416L4154J0584p842J5202P903o4789M6074N9303q5416P1574N6399j48686
580f2197P6301Q7589j49595N9854R7663j36514K018J07536p0578n7427R4169n804
592D3015j15102Q2709N3117j55423O5976Q8966j53949P4100R2019j58552N7658
603b5466Q1185j27831N5130Q7284r1720j271P4670m5545m4560Q6449K834q4393
615c3234P7096L747j20868J08881K3900j23405J20487j1515j56878J24041J4877
$$ plain form
532 69026 -50291 -78301 69718 -33483 -101986 53812 -8576 -92583 13100 -972 -45213
543 -45213 8216 27560 4203 -6399 28129 16121 -15701 51172 37384 -22602 29243 -10503
555 -10503 -36815 44558 5344 6249 41428 -52299 -28937 29101 -29987 -4287 12559 -58073
567 -58073 -56657 -22503 -11919 -19761 -4559 3344 -61445 -15371 43932 -41484 30090 86489 -62197
580 -62197 14104 101693 -47902 11952 109615 -26899 -24881 82655 12077 -45350 48819 43015
592 43015 -72087 10622 63739 -91684 -25708 63258 -90691 -16591 75428 -83124 -25466
603 -25466 55719 -72112 -16982 70302 -21418 -22689 51981 6436 -38124 48325 51159 -33234
615 -33234 43862 47609 -73259 35622 59522 -63883 56604 45089 -111789 12252 27129
626B7129j21020J17899K5299j41895N2394Q2161r6263K266J34450q7767r5882
637a01229J66512m4336j27116J91117j5368j65634J58124O677j52354J17991M4044
648G8428j02501M5192K5990o3660m496L2664j5607n774L8592m9002k9110O9778
660B0494n2485o903J05026r2861k9727J03607j01251K189J32280r7703k1436J04871
672F6101p6944l7512R8123j3243o4143O0453K1774j05109L8331P8966j11465L1669
684a2999J01842j41243j38J05779j05794K2674R6922j00921q345N9178o0943J1137
696c2851O7136k8554m2184L6907O516m6722N9895L3505q3849M0348L4717q0707
708c5843O4387L0930q5667N3260M055o6463P2148j0122o6672O0693o826n9553
$$ plain form
626 27129 -93891 24008 49307 -92588 -40194 41967 -54296 -52030 82420 -5347 -101229
637 -101229 65283 20947 -106169 84948 69580 -96054 62070 68747 -83607 34384 78428
648 78428 -24073 21119 47109 -16551 -21047 11617 -3990 -9764 28828 -20174 -49284 20494
660 20494 -31991 -38894 66132 -26729 -56456 47151 -54100 -51911 80369 -17334 -38770 66101
672 66101 -10843 -48355 49768 36525 -27618 32835 54609 -50500 -12169 66797 -44668 -12999
684 -12999 88843 -52400 -52538 53241 -52553 -29879 67043 -33878 -42223 16955 -43988 -32851
696 -32851 34285 5731 -36453 454 6970 -39752 20143 53648 -30201 10147 44864 -35843
708 -35843 28544 59474 -26193 27067 31122 -35341 36807 26685 -39987 20706 13880 -45673
720d5673N1307K7292o6581k347O5260n0512l5656J01449m3971p6476J12136k8857
732G371q0701J18291j3322q5483Q1995o55n9728M6312J7595k9322L236J0618j1867
745D340j3383K5204q825j4913K5667l1831p669M2190n1137J3823N0053q2983K9187
758b0277O2524r6004K7075P7922q4783M958Q3491n2154m2128O7657K315o6295
770c5699N6094M8751j03045K1920P7374r5914K0061Q9290r5248j0262N9295o1276
782b8659N573M8635l4653r782J1415j3060l847J6597J2847k2503J0385J2541l7243
795c1754L7048J5414n2865N8052O509p4395O8293P526p0257O7455J1122o0708
807a8560L9401R380n0982J4887L4291l0336k7211N3799j8780o5249P3574k183
$$ plain form
720 -45673 5634 32926 -33655 -36002 29258 -21254 -56910 44539 568 -75908 36228 7371
732 7371 -73330 44961 31639 -53844 28151 27496 -32232 14080 31675 2353 5589 16207 4340
745 4340 -9043 16161 7336 -7577 18090 -13741 -21410 20780 -30357 -16534 33519 -49464 -20277
758 -20277 42247 -53757 -26682 51240 -33543 -28585 54906 2752 -39376 28281 30596 -35699
770 -35699 20395 69146 -33899 -11979 65395 -30519 -10458 78832 -16416 -26678 32617 -28659
782 -28659 -23086 25549 -9104 -18886 -7471 -20531 -24378 -7781 5066 -17437 -7052 5489 -31754
795 -31754 5294 20708 -32157 25895 32404 -41991 26302 33828 -36429 31026 42148 -18560
807 -18560 20841 30221 -20761 -5874 28417 -1919 -29130 24669 5889 -59360 14214 12031
819A2031p2770Q4369m245q0807P9813n778p0469P8158J8501o0436K2990K0701
831B2058l5806o815N7189n11m6984M0213j3479n6580P1369M058n4798M9866k9215
844E65m7349N3438j5766k542L5536m6125o389K8112k3583P532K6315l127k5256
857a8639M522K6770m2479J1412O8220o7551J439Q1525q6493j0237R4812n7729
869E572j9005O2117m3760l4257L1169R206k0483O574L2245m6318k6051N9976k9799
882a2814j7010N7745l7478j5929K8900l4303K7244J6751l3024L6180r164l3300
894b6202M0786l482j0607L1460r552k0208m970J6389K05k5505M2981k010o9985
907d0700M7373J1132o1608N6798M979n8178L8190l93k6412L1863K640j2152k561
$$ plain form
819 12031 -60739 23630 19385 -61422 18391 12613 -57856 20302 38803 -21633 1357 22058
831 22058 -13748 -20563 36626 36115 -10869 29344 15865 -40715 30654 34712 -20086 29780 565
844 565 -46784 6654 -9112 -11654 23882 -22243 -28632 -520 -24103 -16571 9744 6617 -18639
857 -18639 -14117 12653 -29826 -18414 49806 -17745 -16306 65219 -21274 -31511 63301 5572
869 5572 -13433 48684 4924 -29333 1836 11042 -9441 -2867 29378 -16940 -42991 16985 -12814
882 -12814 -29824 27921 -9557 -25486 3414 -30889 -3645 13106 -19918 16262 7098 -26202
894 -26202 14584 11102 495 31955 22403 2195 -2775 13614 13819 -11686 31295 29285 -40700
907 -40700 6673 17805 -43803 12995 17974 -40204 -2014 -2407 -28819 3044 5684 -6468 -9029
920i029Q127N390j9791K1508J0930l5959L5577N791l8783M2757r875l4292M7134
933B9485j4785k1796L1502k6177o855J6022j5103P915j615q398M035j2020J2122
946e668n86r576K6717k6146p372L9521m2295R081N5695n2632K970M8364n2452
959a4379K276M7067k4812j8290K4855J564l6664J5537L9939n4205n442N8573o4811
972b8792j3373P4433n2633j6744N8261l6426j1693L7443j8784q647J6415q03m213
985e556N198J2643j9752K902K5002k5029J8279J9953m9797L0525K0885o1877M9139
998B2515K2291p9940L2466L0605o2614K4010L9197m0957j0153L7224j7450l1818
1010c4624M7456N630n9731M4842K0815o7003M7689K8503o1031L8017J5064m7958
$$ plain form
920 -9029 -902 4488 -15303 6205 17135 -18824 16753 22544 -16239 26518 16643 -17649 29485
933 29485 14700 -7096 24406 -1771 -8626 7396 -7707 208 -1407 -9805 -5770 -17790 -5668
946 -5668 -6254 -15830 10887 -15259 -22631 16890 -25405 -16324 39371 -13261 -10291 38073 -14379
959 -14379 -12103 34964 10152 -8138 16717 18281 -18383 -2846 37093 -17112 -22554 36019 -28792
972 -28792 -42165 32268 -20365 -37109 21152 -15274 -26967 10476 -8308 -16955 -540 -1343 -5556
985 -5556 -358 12285 -7467 -4565 20437 -4592 13687 33640 -16157 14368 35253 -26624 22515
998 22515 44806 -35134 -2668 27937 -34677 -10667 28530 -12427 -22580 14644 -2806 -34624
1010 -34624 12832 18462 -41269 3573 24388 -42615 5074 33577 -27454 10563 25627 -22331
1022b2331L6966Q491l4164K5039k07k0549J5245O268j5612l577J5919j9148q513
1035a6173M1715k6428l0315M8138l3322k2024O6947l4118k4159N1856m5518q312
1047c1713O5543l0915j6797L7132k8297k1595M1025J0870k9803J7135J6327n8165
1059b9253K3398N3444o7395J1858N5400q0106Q050O2663o3784Q838M8834n6498
1071b4551L324L7392l8970k786L6347j0195j8528K5221m534l3628L9595J0193
1083A8880m2889N3645m093p2510O9391J0192p2697P4635N358q6548N6455J8328
1095B8147o5381M4957L4016o6158K6N2043m7171k2998P8879l1062n6800Q2012
1107C0510k7540o2779R3116j7626o0412Q1514k6453n6145P3554j1188l8250N9407
$$ plain form
1022 -22331 14635 23126 -11038 14001 13794 -6755 8490 14758 -854 -4431 11488 -7660 -16173
1035 -16173 25542 -886 -31201 16937 -16385 -38409 28538 -5580 -29739 22117 -23401 -31713
1047 -31713 33830 2915 -13882 23250 -5047 -26642 14383 25253 -4550 12585 28912 -29253
1059 -29253 -5855 47589 -19806 -7948 47452 -32654 -24604 38059 -25725 -16887 31947 -24551
1071 -24551 -21227 16165 -22805 -25591 10756 561 -17967 7254 2720 -30908 8687 18880
1083 18880 -24009 29636 25543 -46967 22424 32616 -40081 34554 39912 -46636 9819 28147
1095 28147 -37234 7723 41739 -24419 -24393 27650 -19521 -42519 36360 5298 -51502 30510
1107 30510 2970 -59809 33307 15681 -44731 36783 10330 -45815 27739 16551 -21699 37708
1119C7708j0359n4787L7656K3345n3318K2536N0943p7849o230P9658p1337j2527
1131c4561R2973q1302k5211R3054o7204k2777Q6607m9704l6268O6043j8673l8357
1143c5380M8243J1080n2331L2082L3418o4732K8178N0624q0292K3801N6323q2641
1155c1627K7081N7543q3249K2475M7771o9153J5436M9476n4503j0200M8193k7527
1167h284l2427N7459r55o1226N4193J2168p1244O5680J9085p8078O0881J3410
1179C0662p1916O0188J7560o4198L9691J7688m8513K1717K9065m1967o393M8231
1191C1815l4064l0129O3481l2579n1174P7483j6680n4831P0441k0786n1867O1355
1203A2465l331l2103L6381q969k3827K0270P494p437J0265P525k9331P201L0368
$$ plain form
1119 37708 27349 -27438 10218 33563 -19755 2781 53724 -24125 -30355 49303 -22034 -34561
1131 -34561 58412 -22890 -48101 44953 -22251 -45028 41579 -8125 -44393 21650 2977 -35380
1143 -35380 12863 23943 -28388 3694 37112 -27620 558 51182 -29110 -5309 51014 -31627
1155 -31627 -4546 52997 -30252 -7777 39994 -29159 -13723 35753 -18750 -28950 19243 -8284
1167 -8284 -40711 16748 15793 -45433 8760 20928 -50316 15364 34449 -43629 17252 30662
1179 30662 -41254 18934 36494 -27704 11987 29675 -18838 2879 31944 -10023 -16416 31815
1191 31815 -2249 -32378 31103 -1476 -52650 24833 8153 -46678 23763 2977 -48890 12465
1203 12465 9134 -22969 13412 4443 -19384 886 8380 943 11208 18733 -10598 -3397 26971
1216B6971l2904R449L9428o0441M587M9693n8266J3133N0151o6894L70M9300m7049
1229b2472l386M7712k4699k3131K9574J408l0043K6570J9704m2780K1980K1111
1241B1548n0094L3147K7804n3169L2247J3576n0991L9918J3522m1561K9310M483
1253A9740m3418K0738K1644k9756l686K8655k5221k0121M7638j3044l4381N0885
1265A9673j7968m1591O3095j5197m1060N7930j5399l7311N0298q233l1855L6049
1277A8431N8l1057K3873J5777l6837P411L2667m1233m211M5723n0082j1370O0079
1290B9229m6895j2010O0547m5450j7812N2767k8600j4235L8674j9552j8159K9659
1302H163j286k2501K6329J2243l8862J9737K4743m6721K5946K9827n5086K1149
$$ plain form
1216 26971 -5933 3516 42944 -17497 -12910 36783 -21483 -8350 41801 -25093 -24723 24577 -22472
1229 -22472 -25858 21854 -2845 -25976 3598 5006 -25037 1533 21237 -21543 437 21548
1241 21548 -28546 4601 32405 -20764 11483 25059 -25932 13986 27508 -14053 15257 19740
1253 19740 -23678 -2940 18704 -11052 -14738 13917 -11304 -31425 16213 3169 -31212 19673
1265 19673 1705 -39886 23209 8012 -33048 24882 9483 -27828 22470 14237 -17618 18431
1277 18431 18489 -12568 11305 27082 -9755 -2344 30323 -10910 -15121 30602 -19480 -30850 29229
1290 29229 -17666 -29676 30871 -14579 -32391 20376 -8224 -22459 16215 -3337 -21496 8163
1302 8163 6877 -15624 10705 22948 -15914 3823 28566 -18155 7791 37618 -17468 3681
1314C681K7704o1036K6804L5416n6957J2536L4866m5330k516M2694j7336k3528
1326b3002L2288m777m0096L7153J8288m5299L0570J6865n1556L0671K4552l6745
1338a1088K5256N918l2782K2439L323j6651J7424k220j8608L216Q016j0741k555
1351i053K1690j5854j6419L2830j7978k1928M4213k0314k5058M1513j8100j9278
1363b3736L6809r257j2266J8357l603q824N290Q085n134n741J4814j0016j1652
1376f874K0605j4429p715K4106k1840l413K3392k6327K314J6839j7465N927M057
1389h23j0641P391m510L927R239p685O828m155o049J3415p358N286Q212j6559
1403c482J2384m57j5786K6364j0668k0239K4973r841j3843J9084p284o520M005
$$ plain form
1314 3681 31385 -29651 -2847 32569 -24388 -11852 23014 -22316 -24832 17862 526 -23002
1326 -23002 9286 4509 -35587 1566 19854 -25445 5125 21990 -29566 1105 25657 -11088
1338 -11088 14168 20086 -12696 9743 13066 -3585 13839 11619 -6989 -3773 4243 -6498 -9053
1351 -9053 12637 -3217 -19636 13194 -4784 -26712 17501 -2813 -27871 13642 -4458 -23736
1363 -23736 13073 3816 -8450 9907 6304 -2520 2770 10855 5721 -20 14794 4778 -6874
1376 -6874 13731 -698 -8413 15693 -6147 -9560 13832 -12495 -10181 6658 -10807 -4880 -823
1389 -823 -11464 -4073 -8583 -4656 4583 -3102 3726 -429 -6478 6937 -421 4865 13077 -3482
1403 -3482 8902 8445 -7341 19023 8355 -11884 13089 3248 -10595 8489 1205 -5315 -1310
1416a310k496J723q663O583M335j9322J7103Q546k2078J7178L192j7210J8206
1429E787k389j881P463j3075Q773M439j1078J4821m510j0568J1609q890l54O767
1443F914q604Q373p833r062J6179j5037m495K1583j5167k114J2291j4294N686
1456e580N307Q33L302j0858P478K320j4837K4121K820k2252J8807m970j4690K0210
1470A2011m710p405Q882j1327K16L585j287K108j0266N707L908j7203J5140L67
1484b74j5272J9239p972q849K2768j4848p175K2069j0240k33J2363p698l864L115
1498C129L987k040k129R262j0998j0061K0956j1280q588K3445k0035q648J9375
1511F375j9145K793J7698j6998M33J0024j0096J552Q834K766p883R86J1570j3937
$$ plain form
1416 -1310 -3806 -2083 -10746 -4163 172 -19150 -2047 6499 -15579 1599 4791 -12419 5787
1429 5787 3398 1517 8980 -4095 4678 9117 -1961 12860 8350 -2218 9391 501 147 6914
1443 6914 -1690 6683 -1150 -10212 5967 -9070 -13565 8018 -7149 -9263 3028 -11266 -5580
1456 -5580 -273 560 3862 -6996 482 2802 -12035 12086 14906 -7346 11461 6491 -8199 12011
1470 12011 7301 -104 8778 -2549 -2333 1252 -35 2073 -8193 -2486 1422 -15781 -641 -274
1484 -274 -15546 3693 -4279 -13128 9640 -5208 -12383 9686 -554 -787 11576 3878 14 3129
1498 3129 7116 5076 2947 12209 1211 -8850 12106 826 -7762 15683 -4352 -13000 6375
1511 6375 -12770 -9977 7721 -9277 -8844 1180 -8916 -7364 1470 4236 -3647 -2661 8909 -5028
1525e028K327K0732j9470k098K1314j9691J895J4362j3757J587K957p585P583
1538E128n910m358P488r190R99P455p157O17P50n93k430j928J7021q702j2119
1553a2929K5023j2189j5016L2518q610j9418K3234o636j3672J7844r03r741M529
1566D034L542p678m896J1179m819j1146J4215p172q796J3503j1261K60J6314j9279
1580a2000N121J6242k3400Q078J7436j8784L726J3966j1956j419J2305k184j0129
1593b998J0486P262k2023J0955J4407k8480Q940J7168k9215J2748J2712k8862
1605a6900J2670J1227k1823J1251R970j7833J182J0650l812n456J5277k003k0561
1618a6161K1052O876k4563K3676P098l0980K0767O338k4374J9475L476j9650J2282
$$ plain form
1525 -5028 -2701 18031 -1439 -3537 17777 -1914 -19 14343 586 2173 5130 -2455 5128
1538 5128 -782 -5140 2348 -6842 -5843 1612 -5545 -4928 -4178 -4771 -7201 -9129 7892 -810 -12929
1553 -12929 12094 -95 -15111 17407 8797 -10621 12613 5977 -7695 10149 9246 -495 4034
1566 4034 7576 -102 -4998 6181 1362 -9784 4431 -2741 -11537 1966 -9295 -9035 7279 -12000
1580 -12000 -6879 9363 -14037 -5959 11477 -7307 -3581 10385 -1571 -2990 9315 7131 -2998
1593 -2998 7488 14750 -7273 3682 18089 -10391 -1451 15717 -13498 -750 11962 -16900
1605 -16900 -4230 6997 -14826 -3575 6395 -11438 -10256 394 -3418 -8874 6403 4400 -16161
1618 -16161 4891 11767 -12796 10880 17978 -13002 7765 14103 -10271 9204 12680 -6970 5312
1631E312K051j1140L057L212l586n114N854p91r560J0505m662q022J9511r050
1645b423j1516K6441j6589j0356K8580j3739n621K0238j3186r007J5746j891o112
1658E65N906P036j5433q468J9880q082q903K0786j5593r739J4990j4343N861J4265
1672H728j8008M816L907j4448J3771Q489j0013L266J732l938j581Q025P350j4287
1686b191M878J1100k0420R462J2441k2062J0553O094j7556J0758m50j1368Q600
1699a61k680j578M713n336r1j428R26O019n344O388n5j1674J1317K216o570J4835
1715A1497r429n519J2484j1570M861J2283j6310N071L739j2748Q732O06o977O518
1729C238l042m404j448L864K234r026P055M855j7498J4093O179k1089K0017L645
$$ plain form
1631 5312 7363 -3777 -720 2492 -1094 -6208 -354 -1145 -10705 -200 -4862 -12884 6627 -2423
1645 -2423 -13939 12502 -4087 -14443 14137 398 -5223 15015 1829 -7178 8568 6677 565
1658 565 6471 13507 -1926 -10394 9486 1404 -7499 13287 -2306 -12045 2945 -11398 -5537 8728
1672 8728 -9280 -4464 -557 -15005 -1234 7255 -2758 508 2240 -1698 -3279 4746 12096 -2191
1686 -2191 2687 13787 -6633 2829 15270 -6792 3761 9855 -7701 3057 2607 -8761 -161
1699 -161 -2841 -4419 294 -5042 -5133 -6561 -5635 384 -4960 1428 1373 -10301 1016 3232 -3338 11497
1715 11497 2068 -3451 9033 -2537 2324 14607 -1703 3368 7107 -5641 3091 3697 -3280 3238
1729 3238 196 -4208 -5656 -1792 442 -8584 -1529 3326 -14172 -79 6100 -14989 5028 8673
1743H673k3175K0957N032k1974J3148P107j2328N648O509n462o430N903M78r116
1757e030J2569r15j6731J4590o007j3626K5294r008j3441K0434j4351j0478K5372
1770H672p429j1410J5621l237j3970R294J1845j1733l37J9262j9563p187K6758
1783A6586j5660r039K6813j7245j0445K0032j2601l574J5796j3169k898P034p864
1796f234k729Q513J862q368L932N952j4354O429J4178j9293Q646J3068k2121R519
1810a000J6703k1927O310J2457j5057N092M780q366J990J795k61k720K268kp954
1825e892N149L101j0100R596k368j3166J6595l937j1752J9626o247j1840J7295
1838F060m181n855J0883l749l883M576N46n4k827L868m059l090R857o700l816
$$ plain form
1743 8673 -14502 6455 11487 -10487 2661 9768 -2560 3088 9597 4135 -2295 3608 4086 -5030
1757 -5030 7539 6624 -10107 4483 -1524 -15150 10144 1136 -12305 8129 -6222 -16700 8672
1770 8672 1243 -10167 5454 2217 -11753 -2459 9386 -2347 -2684 16578 -2985 -10172 16586
1783 16586 926 -8113 18700 1455 -8990 11042 -1559 -5133 10663 -2506 -5404 1630 -6234
1796 -6234 -8963 -450 1412 -6956 -3024 2928 -11426 -4997 9181 -10112 -1466 11602 -10519 -1000
1810 -1000 15703 -6224 86 12543 -2514 2578 7358 -1008 982 2777 2516 -204 2064 2062 -5892
1825 -5892 -743 2358 -7742 1854 -514 -13680 2915 -1022 -12774 6852 605 -11235 6060
1838 6060 1879 -3976 6907 3158 -725 3851 4397 4343 1516 5384 1325 -1765 8092 1392 -2424
1853b424R753j3266M08J3851j6769N623J0365k0108M687J2730j5303O651J0696
1866F894j3713j50J0391l889m707J0839M109j5511O297P987j5757J1334R366j8215
1880d725J0098J700j8099J7362L584j7466J3553l380j6499J2407L834r836O224
1893a243N279j1544m044J8170p824j2022K5920r391k0264K7187m975j8980K6454
1906A2723m751j7585J9710m010j3422J4410N10j0216M266N178j0738k610J3697
1919G162j0629m591J8050j7086p139K5438j7832o395K6094j7630q729K1397j0701
1932b591n132J3917l412n470M767K681o748K859R832r644j326J1820j6007K852
1946a602J2756j7836O263R390k0042Q931Q756j6611Q810N374j3015M820O473o179
$$ plain form
1853 -2424 7329 -5937 -5529 8322 -8447 -2824 7541 -12567 -7880 4850 -10453 -3802 6894
1866 6894 -6819 -6969 3422 -467 -5174 5665 9774 -5737 560 8547 -7210 4124 13490 -4725
1880 -4725 5373 7073 -11026 6336 9920 -7546 6007 2627 -13872 -1465 2369 -7467 -1243
1893 -1243 4036 -7508 -11552 6618 -1206 -13228 12692 3301 -16963 10224 5249 -13731 12723
1906 12723 7972 -9613 10097 6087 -7335 7075 7585 -2631 1635 6813 -3925 -6535 7162
1919 7162 -3467 -8058 9992 -7094 -14233 11205 -6627 -13022 13072 -4558 -13287 8110 -2591
1932 -2591 -7723 6194 2782 -2688 2079 4760 -1988 871 10703 1059 -267 11553 -4454 -1602
1946 -1602 11154 -6682 -419 8971 -11071 -2140 6616 -9995 -1185 4189 -8826 -4006 2467 -3712
1960c712k502P291L58j1716J2597P112j9404J2912P338j9665J5320O523j7906
1973e454J1442Q18j3282R903K206n259J372k732o90j515J133L486m308J839k193
1988c234q524J4380m942o170J6744j2062p041J8413j0426j761J6728j1436l306
2001b637R052m667j500M391L328o613l393P792p333k606J4418j2798k862J3298
2015G870j7425K370J5723j7008K184J1588j4331K031R526o001j629O914J574q256
2029d870M886P985j2565M774J3821j8223M784J1539j8516P615R616j5640N891
2042A097M935j1906N856K782m255Q66L5k881l606Q334j88r082J0193P26j5521
2057a2615J6027M439j7256J6396Q22j7801J5931J128j2171J0778J503q991j32
$$ plain form
1960 -3712 -6214 1077 1435 -10281 2316 9428 -9976 2936 10274 -9391 5929 12452 -5454
1973 -5454 5988 6806 -6476 3427 5633 374 1746 -986 -1676 -3191 -2058 1428 -2880 -1041 -3234
1988 -3234 -11758 2622 -2320 -8490 8254 -3808 -10849 7564 -2862 -4623 12105 669 -2637
2001 -2637 6415 1748 248 4639 7967 1354 -2039 5753 -1580 -4186 10232 -2566 -5428 7870
2015 7870 -9555 -7185 8538 -8470 -6286 5302 -9029 -6998 2528 -3473 -5102 1812 3386 -4870
2029 -4870 16 8001 -4564 210 14031 -4192 592 12131 -6385 1230 10846 -4794 1097
2042 1097 6032 -5874 -18 2764 -1491 -625 -590 -3471 -7077 1257 1069 -8013 2180 2906 -12615
2057 -12615 3412 7851 -9405 6991 7813 -9988 5943 7071 -5100 5678 7181 -1810 -1942
2070a942O346l095m801P556j128r217Q721k289r171J3502m760r803J3523q273
2084d831o345J7267q591k623J1636r966k400J0106j044m294M743K608q761J138
2098a357J0630p778j677J1124j4203j447J6056j4197J637J0751j6442K676R307
2111E080j2646M084O984j0535J586O107l401k220O169K551j1072P661O108j4958
2125h502J0747Q125j8458J1043Q231j8511J0149O306j2786M868N046p681K639
2138A216J00l405J55L949l096m007N700l059n990J2328l330j0240J5317p753r457
2153a1572K1041p207r787J6928p575q890J3117M93o789L052K637p067o10J0604
2167H375o114n983J1563j0236o965J7756j0971m284J2995j3989N69J2672j1112
$$ plain form
2070 -1942 4404 1309 -3492 4064 2936 -6281 2440 151 -9020 4482 -278 -10081 3442 -4831
2084 -4831 -11176 6091 -2500 -5123 6513 -3453 -5853 4253 3209 -1085 3658 6266 -2495 -1357
2098 -1357 9273 1495 -182 10942 -3261 -4708 11348 -2849 -1212 9539 -6903 -4227 5080
2111 5080 -7566 -3482 3502 -7033 -5447 660 -2741 -4961 1208 3759 -7313 348 6456 -8502
2125 -8502 2245 10370 -8088 2955 11186 -7325 2824 9130 -3656 1212 6258 -1423 1216
2138 1216 1316 -2089 -1934 2015 -1081 -5088 612 -2447 -8437 3891 561 -9679 5638 -2115 -11572
2153 -11572 9469 2262 -7525 9403 1828 -7062 6055 6548 -241 2811 5448 -1619 -2229 8375
2167 8375 2261 -3722 7841 -2395 -9360 8396 -2575 -6859 6136 -7853 -7284 5388 -5724
2180e724J329Q920r216r48Q856j341l886M709K382q970M279J0266j4358M727J0972
2195A1997j9037N915J3534j7825N637P263j4332N447N023p909M40M423l934k712
2209f070N237J676p562N717N445j3996J0360N155j6362J4929M249j6791J4425
2222F412J950j4964J1156J775p363L454J958l268m778P982o17r790P833J530j3942
2237a0672J1824J671j2211J1870l121r049J3342o920m606J2513m621l029N089
2250B080r07l210J122P890m332n110J0787o405r623J8161o369j0448J5140q993
2264b17q432J2098j522m884L966k570k765j112K236K713k884M087j878m564P737
2279B009l809j53Q987q832J387P187j1489O034Q695j0800K956K761p371L573J082
$$ plain form
2180 -5724 -4395 4525 -4691 -5639 3217 1876 -2010 2699 5081 -3889 390 10656 -3702 1025 11997
2195 11997 -7040 -1125 12409 -5416 221 7484 -6848 -1401 3622 -4287 -3847 576 -3358 -6070
2209 -6070 -833 843 -6719 -1002 4443 -9553 807 5962 -10400 4529 8778 -8013 6412
2222 6412 8362 -6602 4554 6329 -1034 2420 4378 1110 -3668 4314 3697 -6093 1740 3270 -10672
2237 -10672 1152 2823 -9388 2482 -639 -9688 3654 -3266 -7872 4641 20 -3009 2080
2250 2080 1173 -2037 -915 6975 2643 -2467 8320 1915 -7708 10453 4084 -6364 8776 -217
2264 -217 -8649 3449 1927 -2957 1009 -1561 -4326 -5438 -3202 -489 -3373 714 -1164 -5728 2009
2279 2009 -1800 -1953 7034 -1798 -411 6776 -4713 1321 10016 -784 2172 4933 -2438 1135 2217
2294B217j527J414j788j075k147K8N639o989K961K650j0586Q473J379q403J1339
2309C585k750r589J4703l934p475J1589l457m026N113J33k834k36L090k135m426
2324b649R322n062p124J0753n508n642J1394p477n206J0668r770M61J0597r107
2338d350k36Q505o879j331Q125k248n873O542L078r625N472Q897j4907M420J2261
2353A1851j7606M774J2585j6476K926J0237j3334J505R514j0021j111N975l697
2366b878l557N405L378q824O658K651j0604J0908L270j3775J0101L585j4621J2917
2380D614L926j3172J0220Q50j0910O310M795p647R04N051m977o504Q964k082p127
2395f785R581l733q195J2922m628o451J2284p365m406J2556o327l239R534m861
$$ plain form
2294 2217 690 2104 316 -759 -2906 -2878 2761 -4228 -1267 1383 -9203 -730 649 -7754 3585
2309 3585 835 -8754 5949 2015 -5460 6129 2672 -1354 3759 3892 1058 822 3912 1777 -2649
2324 -2649 6673 1611 -5513 5240 -268 -5910 5484 -1993 -7199 3469 -6301 -5840 4757 -4350
2338 -4350 -4586 3919 -2960 -4291 3834 1586 -4287 2255 5333 -4292 1180 10077 -4830 -410 11851
2353 11851 -5755 -981 11604 -4872 -1946 8291 -5043 -3538 5976 -4045 -5156 819 -2878
2366 -2878 -6435 -1030 2348 -6476 182 2833 -7771 3137 6407 -7368 2733 6318 -8303 4614
2380 4614 8540 -4632 5588 6438 -4472 1838 6633 -1014 -110 4941 -36 -6540 2424 342 -6785
2395 -6785 2796 -937 -9132 3790 -838 -7289 4995 -2370 -6776 5780 -547 -3786 5748 887
2409H87l245N798J324m609J204M065o201q05R237p843m627R915o837k982Q858
2424D139p619M11M959o884L750K181n280M646q05l164L661k817M79J784J664J471
2440B576k766J532J988o040P060J447r133Q320j851r605J0670j253n738O386l285
2455C08m189N218m061kK050j514j69l27K727k716k931R086m487k854J0112r494
2471c243k161J3549p915j221R562r149k335P952l781O6K267j154k475k630M162
2486A494k265j183O699p306j974O587p612K721N331q830O931J272r825Q821J913
2501B774n824N588J688m500n2K734J217l176L070Q20p025M119L820r265P304K513
2517E805j1320P828j929o380P619k824l262M591l333n36J951M66J111o12J478
$$ plain form
2409 887 -2358 3440 4764 155 1359 5424 -777 -1582 7655 -188 -4815 5100 -1737 -4719 4139
2424 4139 -3480 -3069 1890 -4994 -1244 937 -4343 303 -502 -3666 -5 -2822 -2343 -559 1105 2576
2440 2576 -190 1342 3330 -2710 4350 5797 -3336 4984 3133 -6472 4198 2945 -2793 3593 308
2455 308 -3881 1337 -2724 -2726 -676 -2190 -2359 -2686 41 -2675 -5606 3480 -1007 -3861 6251 -3243
2471 -3243 -5404 8145 230 -991 8571 -578 -2913 5039 1258 1324 3591 2437 -38 -2668 1494
2486 1494 -771 -1954 4745 -2561 -4535 2052 -5560 -2839 2492 -6338 593 1865 -7960 861 2774
2501 2774 -3050 2538 4226 -274 -326 2408 3625 449 3519 4339 -2686 1433 5253 -4012 3292 5805
2517 5805 -5515 2313 384 -5996 1623 -1201 -4463 128 -3205 -3741 -1790 -1324 -213 -825 653
2532F53Q9m581N698N95n588R979m046o626R272l720k982O515m965K80J132l798
2548b093J893n72r06K335k690J481o17k910M444l221m81M931n310K447M791r120
2564e598O204M346o816L109J874l921J858K715o40j470j640K992k567j594O013
2579D865o178l35L738o132K008L055n012L838j539k321N529m937l55N347l326
2594a755J013L398k614Q98k395K128K649k331K380o15m977N360j029k920N230
2609D420m486j534M160n766K973K805n576K980m41l740L549q62k75R13p86J991
2625C25q95j30L915n732P44O909p176K928M475o357K041J803l323K695j244q68
2641A10M73j717J013J193l142K545j431j057J409k369L368k17l989M692j675m448
$$ plain form
2532 653 742 -3839 1859 2454 -3134 6845 2799 -3827 5445 1725 -1257 5258 293 573 1705 -2093
2548 -2093 -200 -772 -1678 657 -2033 -552 -1169 -4079 365 -2856 -3337 1594 -3716 -1269 3522 -5598
2564 -5598 606 4952 -1864 1245 3119 -802 1056 3771 3131 1661 21 3013 446 -1148 4865
2579 4865 -1313 -1648 2090 -4042 -2034 1021 -3991 -153 -1692 -4013 1516 -3421 -3776 1571 -1755
2594 -1755 -742 2656 42 940 -1455 673 3322 991 3371 2756 -2221 3139 2110 -810 4420
2609 4420 -66 -1600 2560 -3206 -233 2572 -3004 -24 -465 -4205 -656 -1518 -1793 -880 -1666 325
2625 325 -570 -700 3215 -2517 -1773 5136 -2040 888 5363 -994 1047 2850 -473 2222 978 110
2641 110 583 -1134 -121 1072 -2070 475 -956 -2013 -604 -2973 395 178 -3811 881 -794 -5242
2657e242Q365j592m398N241j592j431M535j968J228q63r77J343k579J71K770n061
2673b050J144L949l625J080p03k578K846k892K064J227m732K818K95m110O884
2688A617M40n178M091j555L86K771j802K492j086k740L120j630J907M93l620J503
2704A209n25m063N361j807l840N849n531j798O481m469p60M123j361k298K121
2719a308M43R85j505M117m56l765M885j979l200O938l767j549O226p124K88L593
2735B822l880K058J499m626J600N34j892k6L52J360k448j667M655l801K24O202
2751B966o236J962M993o926L319L890m362L026j15k488J751l427M142N33m039
2766a011L517k685j947L396l376J744M43k957K925j750k409N106k846q51L872
$$ plain form
2657 -5242 3123 1531 -2867 2374 782 -649 3886 1918 3146 2283 1306 2649 70 241 3011 -2050
2673 -2050 -906 3043 -582 498 -205 -2783 63 -2829 -765 462 -4270 -1452 -1157 -5267 1617
2688 1617 2057 -3121 970 -585 -199 2572 770 3262 2176 -564 2556 926 2833 3326 -294 1209
2704 1209 684 -3379 1982 175 -3665 2184 -3347 -5145 1336 -3133 -3893 230 -1131 -3429 -1308
2719 -1308 -865 120 -1385 2732 2276 -1489 3396 1417 -1783 5155 1388 -161 6065 -1059 -771 2822
2735 2822 -1058 1000 2499 -2127 -527 7 -1885 -1911 -1559 -199 -2647 -4314 341 -3460 -3236 2966
2751 2966 -3270 -1308 3685 -3241 78 3968 -394 2632 2517 29 1780 -1647 2495 3028 -1011
2766 -1011 2506 -179 -2126 1270 -2106 -362 81 -2876 49 -1701 -4110 996 -1850 -2701 1171
2781A171l829J004L103l359L667r62k259M395k024q35L887l318j83J154j347J024
2797A289k337J948J81m358M612J275q270O735R0p741Q055jo587M396n65k328M459
2814H53J71q53q21N76Q41k521M866l99m875O599l513l511R776o447m017R858o795
2831b12m644R711n200l748O287k871l478K101M503o184k66O863n904k594J0701
2846E065o393l032R575o999m06P830o477P87O184o066L39L459k991j708L071m12
2862A826l618J677J728o616L862N181j0027M054O100j1315N444N201q628L812
2876a319L742m671J360K478k688Q85J759J097k905J498J722l331L825M28n969
2891b089N416j450o971Q583j422o253P350l801m851P049j947k908M517j837k449
$$ plain form
2781 1171 -2658 -1654 1449 -1910 1757 795 -1464 2931 907 72 3959 641 458 1612 265 1289
2797 1289 -1048 900 1081 -3277 1335 2610 -5660 1075 1165 -6576 1479 1478 -5109 -713 -1278 -3606 853
2814 853 1024 171 -650 -74 767 -1754 3112 2713 -2162 4437 924 -2587 7189 742 -3275 6583 -212
2831 -212 -4856 4855 -345 -4093 2194 -677 -4155 -2054 2449 -3735 -4001 2862 -3042 -5636 5065
2846 5065 -1328 -4360 5215 -1784 -2190 5640 -837 -50 6134 68 407 3866 875 -833 2238 1826
2862 1826 -1792 -115 1613 -5003 -1141 4040 -5987 -1933 4167 -7148 -1704 3497 -5131 -1319
2876 -1319 2423 -2248 -888 1590 -1098 -213 1546 2643 -262 1236 2958 -373 3452 3880 -2089
2891 -2089 3327 1877 -5094 3489 2067 -4186 3164 -637 -5488 1561 -386 -3294 1223 -614 -3063
2906c063R77L131r57j685L087j377k389M881o15j652M291m637l5M615o132K548
2922I88M471o975J512L230n383P22L208l184o77J213N15l169J076L584n542L478
2938i33L376o876N124K710o934N512Q21o166N770L64n324O346r65m557L900P42
2954B910l878L13L459k466m291O802k511o477Q564k513o471Q999k846o587Q862
2969A869j901m718O085m80l045L080q66k44J785J60p34j107M257m214j399P638
2985F166m554l401P498p470k341Q505p450N58O336o074j650M784j491k216K380
3000d20K83k163r82M818k838o63O267o135K592L712p874M250M331p292M075K751
3016D712o421J820J767j854k69J267P43m681J094L382n725K500N451r086J598
$$ plain form
2906 -3063 -2086 1045 88 -1597 1490 113 -2276 2605 1990 338 4629 -8 -43 4572 -1560 988
2922 988 5459 -1516 -4 3226 -2157 -1435 1773 -1411 -2088 -875 -360 -3529 -2453 1131 -4411 -933
2938 -933 2443 -4433 691 3401 -3533 1979 2800 -3366 2404 2768 -2556 3790 2825 -1732 2168 2910
2954 2910 -968 -655 2804 338 -3953 2849 338 -6139 2425 -88 -6559 2440 -406 -6993 1869
2969 1869 -32 -4750 1335 855 -2190 890 24 -220 1565 1725 991 -116 4141 -73 -1472 6166
2985 6166 1612 -1789 5709 -1761 -4102 4403 -3047 -2489 3847 -2227 -3877 907 -584 -2800 -420
3000 -420 -137 -2300 -3282 1536 -1302 -1965 4302 -1833 759 4471 -3403 847 5178 -2114 1961 4712
3016 4712 -1709 111 1878 24 -245 1022 1765 -2916 -1822 1560 -4165 -1665 3786 -5300 -3702
3031c702O233q801N691M257o287L608n52k852L298L93N03J421l138P78m78R81
3047A353R01k937K979o55n371O252k595l217P629n720m263P614m873j178O256
3062B175k215j411M0k03J524j856L873J283n210M249p11l777O801j482l974M789
3078C895m254J634J297l802K086Q26n025L343k46k931L434l029J518o0p71R36
3094a149j397O5L826k558N50J585m194M490P22l474O272k813l841N640l177j123
3110e76M503k240j944M42N7N94j946K424j513m138N483j571m630O390j433m276
3126d374N048k688N1M432l493Q97J082k340K634P91r97J290j916Q67l56j88K080
3143B820l597L29M572o893K829M632p918O86M902o808K714K786l591N91L26N37
$$ plain form
3031 -3702 2531 -6270 -579 3678 -2609 999 447 -2405 893 1286 1789 3210 72 850 372 1353
3047 1353 2254 -683 2296 1641 -3730 2522 -73 -3290 4339 -1381 -5644 1970 -2903 -4081 2175
3062 2175 -40 -1451 -1411 -1614 -90 -1946 1927 3210 -2000 2249 1538 -2239 4562 3080 -894 3895
3078 3895 -359 1275 2572 -1230 856 1682 -3343 0 -246 -3177 257 -2772 -1254 -1314 -2085 -1149
3094 -1149 -2546 -2481 1345 -1213 -663 922 -3272 1218 1940 -1534 4738 1925 -1916 3724 547 -576
3110 -576 3927 1687 -257 185 242 836 -1110 1314 -199 -4337 1146 -425 -5055 1335 -98 -4374
3126 -4374 674 -2014 -1963 2469 -1024 -127 955 -1385 1249 2040 1043 2333 417 1284 928 740 2820
3143 2820 -777 -448 4124 -2769 60 4692 -3226 -2540 2362 -4446 -1732 1054 -2537 -1946 -1620 -1083
3159a083p9jL129k972j118M841l306o12N103l686J255J489l970L901j967j771
3175h47M014l381m49K919l894N49R68j698J346l32n72k9j418J614J866k952L053
3192G57j522j360L965k355k18L900m537J489L491l890J435J558l646K599q6k287
3208g07J238q51J479k209n61K801l312m10L660m955J951K447m175K994J011n242
3224d841O433m39l773M530k81k046L966k185r51P48J043k63k808M469j808m725
3240b931N375r1n526N642k605m422M765k041j307L652j286p61J268k673L689j385
3256f37K80J845l418J861J390j424L223j167k974M105l036p13M832m038L86J983
3272B498m576J258J360j526J698j957j76Q17l132L408J145l399L300k254j150
$$ plain form
3159 -1083 -1162 -1163 1966 -1006 -2124 2717 -589 -1201 3902 216 1471 2960 -1010 2891 924 -847
3175 -847 3167 -214 -663 2256 -1638 -1089 -121 -1819 -473 -805 -1377 -1406 -2824 -1210 656 -2296 757
3192 757 -765 -2125 1840 -515 -733 3167 -1370 119 3610 -280 1155 2713 -933 1666 1580 -707
3208 -707 531 -320 1159 -1050 -1611 1190 -2122 -2532 1128 -3827 -1876 571 -3604 -610 401 -4841
3224 -4841 1592 1153 -2620 1910 1629 -417 3549 1364 413 1161 2204 1941 -867 3602 1794 -2931
3240 -2931 2444 2353 -3173 2469 -136 -4558 207 -1834 -3141 511 -775 -1536 -268 -2941 748 -637
3256 -637 -357 1488 -1930 -69 1321 -103 3120 1953 -1021 3084 48 -665 4167 129 515 2498
3272 2498 -2078 -820 540 -986 712 -1245 -1421 -604 -3736 -328 817 -2582 718 -1536 -2686
3287b686L795k123K266N64k506K954j273k345N313k336j619L467m003N37J946
3302A951k730J696k18j037P83k890J753R5j014K414j489k900L243j709K71M676
3318B895n018K853J332n085L862K415l896L777j583r95j68J55K049j808j269K909
3334B425l741l87N291n863J467K963n642J875J679l727L890r16j552K080k600
3349b758K202O90r28K695k916J447K727m013J991L438p344M369J959n113L777
3364B223M06m253J681N81k56l93j393K121k995k17N603o513J115M784p463L066
3380a903L185n166M494L53k871K929j49n76R43r41K356j250o49K877m846K462
3396A248K419o282N035j34o310N754q1o225N201j9l132J395j49J8m12J51K257
$$ plain form
3287 -2686 1109 -1014 1252 1816 -690 2264 991 -1354 3959 1623 4 3471 -532 5 1951
3302 1951 -779 917 699 -338 445 -2445 -692 -597 -1611 803 -686 -3586 -343 -2052 -1781 2895
3318 2895 -2123 730 2062 -3023 839 3254 -642 3135 1552 557 389 544 2593 785 -484 2425
3334 2425 -1316 -1703 3588 -2275 -808 2155 -3487 -1612 67 -3660 230 -686 -2238 -158 -2758
3349 -2758 -556 134 -794 1901 -1015 432 3159 -854 1137 4575 -2769 1600 3559 -1554 2223
3364 2223 2629 -1624 57 638 382 -11 -1404 717 -2278 -2495 3108 -3405 -2290 2494 -4969 -1903
3380 -1903 1282 -3884 610 963 -1908 1021 872 296 1239 298 2654 1404 755 3632 -1214 1248
3396 1248 3667 -2615 2420 2286 -4024 1730 1649 -4576 625 606 -2526 -1131 -1280 -1262 -1674 -1523 734
3413G34k490J467J900m107N431J26m118L439J29n172O751l114k288N780l680p72
3429A6K147k476K3J278j091j254j849L171j266j999N540l221m271Q045l219m031
3445d457P524m546q15M592k767J568J819k353O12M29m57L92m46r2o29k251L841
3462A964l343P96J656m764J979M041n625K289J878m047K099R64j475K270m06k53
3478B3Q50j904K382M65p35J803k475J011k47k219L258o47k822L707j476m019O159
3495C114l318k369M075k112j500Q00r47K139k090J557M97k378K325O72l410N011
3511B066q72k016M294l333o86L961m044J848J978n160K223J849l497J767J193
3526A571j216j652M66K031l814P73N120o696k18O045o343K359N122n515Q47M096
$$ plain form
3413 734 -1756 -289 1611 -2496 2935 3061 -1057 2382 2511 -2661 4090 976 -1312 4468 788 16
3429 16 2163 -313 -290 988 -103 -1357 -3206 -35 -1301 -3300 2240 -981 -5252 2793 -426 -4457
3445 -4457 3067 -1479 -2294 2298 -469 1099 2918 565 1177 1606 1149 1541 1095 1003 374 -1877 1964
3462 1964 -1379 -583 1073 -3691 -1712 2329 -3296 -1007 871 -3176 -1077 -113 -1588 682 276 23
3478 23 873 -1031 1351 1816 1081 2884 409 1420 1173 -1046 2212 1565 -1257 2450 974 -3045 3114
3495 3114 -204 -2573 1502 -610 -2110 -1310 -2257 -118 -2208 -651 -154 -2532 -207 465 -2945 2066
3511 2066 1194 -822 3472 139 -547 3414 -630 1218 3196 -1964 259 2108 -1389 378 1571
3526 1571 355 -1297 -831 1200 -2614 -1841 3279 -3417 -3635 2410 -3933 -1574 3548 -1967 -1120 2976
3542B976m404K366O76n95O78K07J47p68j580K060j593O36J326m291K963J960o809
3559d045N653Q17p366N222R20m138K546P16l431K695K22n84j604K983J136l475
3575a733L758P38n373M488L68m888P011j106m942M888l036l161N022n5k585L42
3591b64O69j854j793M665j301m910M684j55n555Q675k842m400P857l023l798O388
3607C043q29k744K456j742J075J17k51k88q81K000k199J41M125m716j247N668
3623C728o061p91O708p439J094N497o009Q89L847l027j54K247L55k249J139M142
3639C916m863J52M892n617K097L390n521K409J709m905M718n10m259L153j256
3654d95k049K698p57j703K530j138j332n69L965l75m392M701l51m783O157o89
$$ plain form
3542 2976 -1428 938 1614 1019 1697 1904 2051 1283 -297 1763 170 806 2132 -2159 804 2764 -4045
3559 -4045 1608 2425 -4941 281 1201 -2937 -391 325 -3106 -411 -189 -773 -2377 606 1742 -1733
3575 -1733 2025 2763 -2610 1878 2246 -2642 4369 3263 -1679 3209 173 -2988 2034 1979 -606 -264
3591 -264 405 -1449 -3242 1423 122 -4788 -104 -259 -5814 2861 19 -4381 3476 453 -3345 3043
3607 3043 2214 -530 1926 184 1259 1376 1125 837 -44 1956 -243 -102 4023 -693 -1940 3728
3623 3728 -2333 -3124 3584 -3855 -2761 2736 -3273 -2384 1463 -1564 -1718 529 884 -1365 -226 3916
3639 3916 -947 -795 4097 -1520 577 3967 -1554 855 2564 -2341 2377 1867 -2392 761 -495
3654 -495 -2544 154 -603 -2306 224 -914 -2246 -2815 1150 775 -3617 1084 733 -4050 2107 1418
3670A418m679N806j422l671O939k831k404L638k478j055J601m24o59k54J575l006
3686a906J74K777l965n98O289n463p04O336n820k48O621m672L13L538m316J547
3702i7K541j121j005Q91K85k066J303K810l858J343L166p288K720L044n833K997
3718a68K751o940L049K670m753K699O66k712P61K720P0k846K180K306l899J920
3734D74K972m564K337J947l917L534p22k169K834j730j934L444k942m10J244j713
3750a315Q3J207L2o40k409L680j795j599N324k056l166M637k588j297N338k180
3766A256j047J484k120J760p12O41J203j611p02Q45j247L17j5o78l7o91K23J158
3784B7k296J407R56l938L381J019l619L648j160r1K146j194N86P14j622J086q5
$$ plain form
3670 1418 -3261 2545 1123 -2548 4391 1560 -844 2794 316 -739 862 438 -221 -475 1100 -1906
3686 -1906 -1732 1045 -2920 -3518 2771 -2692 -3396 2940 -2880 -3128 3493 -1179 -866 2672 -1644 -97
3702 -97 2444 1323 318 1209 1494 -572 731 3541 -317 1026 4192 -3096 -376 2668 -3165 -168
3718 -168 2583 -4357 -1308 1362 -3391 -692 -26 -2738 -1977 743 813 -2033 147 2453 -1446 474
3734 474 3446 -1118 1219 3166 -751 2783 2061 -108 2726 996 -938 2506 -436 -846 398 -1315
3750 -1315 -1232 -25 7 -633 -3042 638 -1157 -2756 2568 512 -2654 1983 -605 -1902 3436 1256
3766 1256 209 1693 -427 1333 621 1262 2465 854 152 997 -250 67 52 -626 -663 -1354 -1131 27
3784 27 -2269 -862 94 -3844 -463 556 -3063 585 -575 -666 1480 286 872 1586 -36 1050 965
3801I65P00K4j125J76O31j655J319k36k875L048l038o33L844k141j396K743k429
3818b078M21L05j35J511j516M40K425l176K288J951l033K625p08j874L002k099
3834C49L38J556k735K077p57j652J509j499J54R90k124Q66K88k334L174n30j938
3851b268L646j732k038M156k860j33L119j026m41l56L13N55j673L182N88m246
3867a214L788j820k917L849l65k941K364k745J010J932m008K864l79k562K160
3882i84J68n83J291j663J729q93j056L347k275j23M234l676l87L705k887J061
3898A008K218j705r28l17j4O01k227J702n00k559L709k821j336M382l089Q8K094
3915C06k510J851J548k782K296M34j638J954r94Q64Q27o79J702k959R96K684m383
$$ plain form
3801 965 1665 1689 564 740 1371 -284 1035 799 -2076 972 -2066 -2699 1145 -996 -2392 351 -2078
3818 -2078 -1657 -1352 -1487 24 -1492 -1052 1373 -1803 485 2436 -597 2028 1320 -554 2448 349
3834 349 687 2243 -492 1585 828 -824 685 -814 -660 330 -1794 -928 -640 -2974 200 -330 -2268
3851 -2268 1378 -354 -2392 1764 -1096 -1229 1890 864 423 67 380 935 -738 2444 3032 -1214
3867 -1214 2574 754 -2163 1686 1321 -1620 744 -2001 -991 941 -3067 -203 -582 -3144 -984
3882 -984 -816 -1399 -108 -1771 -42 -935 -1991 1356 -919 -1042 3192 -484 -871 2834 -53 1008
3898 1008 3226 1521 593 276 262 863 -1364 338 -162 -2721 988 -1833 -3169 1213 -1876 -1788 306
3915 306 -2204 -353 1195 -1587 709 1143 -495 1459 465 1329 2156 1477 3179 220 1216 3900 -483
3932d83L00K938n224J980J940l782K200P9j251J789k104O25O15k739L892k429
3948a654k64K645j066J12J978j846J190Q66l993M915p36k500L160k150j473K164
3964A348o97n00O3j888J613j704P95K369l132M81J285k776J449J089j606K071
3980B60o61j349K140k306K159R03j524K308j10k390L928k416l08J156l745L171
3996A216k05j995J891j028j357J739j599L29M51q67R09n82o89K206k539P91L163
4013A834k982O74L485l349P25J243j631J788m56K60J031l851L359q35k464K783
4029A614p38k389K606j866k58J045j750J408J72k195K616j847N3J866j612J530
4045B55K77j932L548j651j060L756l545K11L350l187J51K715k241K92k95o33K99
$$ plain form
3932 -483 -183 2755 -2469 -489 1451 -2331 -131 -52 -1303 486 -1618 -993 -378 -3117 775 -1654
3948 -1654 -1918 727 -339 -227 1751 -95 1095 1961 -2032 2883 2147 -353 2807 657 -816 1348
3964 1348 651 151 214 -1674 -61 -1765 -970 1399 -1733 -1252 33 -2743 -1294 -205 -1811 260
3980 260 -401 -1750 390 -1916 243 1146 -378 1930 1820 -570 3358 942 634 1790 -1955 1216
3996 1216 1011 -984 907 -121 -1478 261 -1338 -1009 -558 -1425 -516 -1098 -1787 419 -2120 -1329 1834
4013 1834 -1148 -474 3011 -338 387 1630 -1 1787 1331 1591 2622 -1229 2130 1295 -1169 1614
4029 1614 876 -1513 1093 -773 -1031 14 -1736 -328 -156 -2351 265 -1582 -1529 337 -1275 255
4045 255 532 -1400 2148 497 -563 3193 -352 -141 3209 22 173 2888 647 939 644 11 310
4062C10j437J701n42k400M758l743k323M038l289L84L655k949R64J479k766K895
4078G35J972k834J616r60m20Q24mJ053r44p99K281k537l79L648m338N90K237m788
4096c047K500M81j725J763j512O80K77p09j13J570k258L507k063j90K145j717
4112d11J182J800l271J967J270m101L395N94l041K225j200j086J985k404J521
4127D25j249o03J214l391J736K856k792KK236k680K205L67j079K177k898K143
4143F69R60k625L417q12j922L460j149l707M623k436j114J080j103J104j030m71
4159a056K444k064j527J307j948K666l47j681K916k058J77L809l744R2L659l313
4175f68J204K236j507J059j051n53R63k477K819q09k446K793k073m62K379m132
$$ plain form
4062 310 -1127 574 32 -2368 2390 -1353 -3676 362 -2927 -2543 1112 -1837 -873 606 -2160 735
4078 735 2707 -127 1489 529 109 933 929 1982 1038 239 2520 -17 -396 3252 -1086 -496 1741 -3047
4096 -3047 -547 -66 -1791 -28 -1540 -860 -583 -1292 -1405 165 -2093 1414 -649 -839 1306 -411
4112 -411 771 2571 -700 1267 2537 -1564 1831 2425 -616 1609 409 -677 1308 -1096 425
4127 425 -824 -1427 -213 -3604 -1868 988 -1804 -1802 434 -2246 -41 326 -753 1424 -1474 669
4143 669 1629 -996 2421 1609 -313 3147 1998 -1709 2914 478 -636 444 -659 445 -585 -1056
4159 -1056 1388 -676 -2203 -896 -2844 -178 -525 -2206 710 -1348 -1171 2638 -1106 -1014 2645 -668
4175 -668 536 2772 1265 2324 1273 720 1683 -794 2025 1216 -1230 1563 -510 -972 1407 -2725
$$ [...]
##END NTUPLES=NMR FID
##END=
