##TITLE=1H_Toluen
 , 8 sc, 
 7.2.2019
##JCAMPDX= 6.0         $$ Bruker NMR JCAMP-DX V2.0
##DATA TYPE= NMR FID
##DATA CLASS= NTUPLES
##ORIGIN= UXNMR, Bruker Analytische Messtechnik GmbH
##OWNER= root
$$ XWIN-NMR		Version 3.5
$$ Thu Feb  7 16:48:38 2019 Russian Standard Time (UT+4h)  she@DPX200
##.OBSERVE FREQUENCY= 200.1313
##.OBSERVE NUCLEUS= ^1H
##.DELAY= (6, 6)
##.ACQUISITION MODE= SIMULTANEOUS
##.ACQUISITION SCHEME= undefined
##.AVERAGES= 8
##.DIGITISER RES= 18
##SPECTROMETER/DATA SYSTEM= spect
##.PULSE SEQUENCE= zg30
##.SOLVENT NAME= DMSO
##.SHIFT REFERENCE= (INTERNAL, DMSO, 0, 15.7039)
##AUDIT TRAIL= $$ (NUMBER, WHEN, WHO, WHERE, WHAT)
$$ ##TITLE= Audit trail, XWIN-NMR		Version 3.5
$$ ##JCAMPDX= 5.01
$$ ##ORIGIN= Bruker BioSpin GmbH
$$ ##OWNER= she
$$ F:/spectra/data/she/nmr/H-F/1/audita.txt
$$ ##AUDIT TRAIL=  $$ (NUMBER, WHEN, WHO, WHERE, WHAT)
(   1,<2019-02-07 16:47:48.23 +0400>,<she>,<DPX200>,
      <created by zg, POWCHK disabled, PULCHK disabled
       configuration hash MD5:
       00 E9 B6 7A A2 85 ED C7 34 08 36 98 17 FE 4E 26
       data hash MD5: 16K
       BA 29 08 51 2D AE A6 8C FF 7E F3 92 17 F5 69 1A>)
$$ ##END=
$$ 
$$ hash MD5
$$ 36 18 43 B0 0D C5 B6 BC 92 ED F4 0F BB D4 22 45
##$RELAX= 
##$RELAX= 
##$RELAX= 
##$RELAX= 
##$RELAX= 
##$RELAX= 
$$ Bruker specific parameters
$$ --------------------------
##$DU= <F:/spectra>
##$EXPNO= 1
##$NAME= <H-F>
##$PROCNO= 1
##$TYPE= <nmr>
##$USER= <she>
##$AMP= (0..31)
100 100 100 100 100 100 100 100 100 100 100 100 100 100 100 100 100 100 
100 100 100 100 100 100 100 100 100 100 100 100 100 100 
##$AQSEQ= 0
##$AQ_mod= 1
##$AUNM= <au_zg>
##$AUTOPOS= <>
##$BF1= 200.13
##$BF2= 200.13
##$BF3= 200.13
##$BF4= 200.13
##$BF5= 200.13
##$BF6= 200.13
##$BF7= 200.13
##$BF8= 200.13
##$BYTORDA= 1
##$CFDGTYP= 0
##$CFRGTYP= 5
##$CHEMSTR= <none>
##$CNST= (0..31)
1 1 145 1 1 1 1 1 1 1 1 1 1 1 1 1 1 1 1 1 1 1 1 1 1 1 1 1 1 1 1 1 
##$CPDPRG= <>
##$CPDPRG1= <>
##$CPDPRG2= <>
##$CPDPRG3= <>
##$CPDPRG4= <mlev>
##$CPDPRG5= <mlev>
##$CPDPRG6= <mlev>
##$CPDPRG7= <mlev>
##$CPDPRG8= <mlev>
##$CPDPRGB= <>
##$CPDPRGT= <>
##$D= (0..31)
0 1.2 0 0 0 0 0 0 0 0 0 0.03 0 0 0 0 0 0 0 0 0 0 0 0 0 0 0 0 0 0 0 0 
##$DATE= 1549543667
##$DBL= (0..7)
120 120 120 120 120 120 120 120 
##$DBP= (0..7)
150 150 150 150 150 150 150 150 
##$DBP07= 0
##$DBPNAM0= <>
##$DBPNAM1= <>
##$DBPNAM2= <>
##$DBPNAM3= <>
##$DBPNAM4= <>
##$DBPNAM5= <>
##$DBPNAM6= <>
##$DBPNAM7= <>
##$DBPOAL= (0..7)
0.5 0.5 0.5 0.5 0.5 0.5 0.5 0.5 
##$DBPOFFS= (0..7)
0 0 0 0 0 0 0 0 
##$DE= 6
##$DECBNUC= <off>
##$DECIM= 32
##$DECNUC= <off>
##$DECSTAT= 4
##$DIGMOD= 1
##$DIGTYP= 9
##$DL= (0..7)
0 120 120 120 120 120 120 120 
##$DP= (0..7)
150 150 150 150 150 150 150 150 
##$DP07= 0
##$DPNAME0= <>
##$DPNAME1= <>
##$DPNAME2= <>
##$DPNAME3= <>
##$DPNAME4= <>
##$DPNAME5= <>
##$DPNAME6= <>
##$DPNAME7= <>
##$DPOAL= (0..7)
0.5 0.5 0.5 0.5 0.5 0.5 0.5 0.5 
##$DPOFFS= (0..7)
0 0 0 0 0 0 0 0 
##$DQDMODE= 0
##$DR= 18
##$DS= 0
##$DSLIST= <SSSSSSSSSSSSSSS>
##$DSPFIRM= 0
##$DSPFVS= 10
$$ [...]
##$SUBNAM2= <"">
##$SUBNAM3= <"">
##$SUBNAM4= <"">
##$SUBNAM5= <"">
##$SUBNAM6= <"">
##$SUBNAM7= <"">
##$SUBNAM8= <"">
##$SUBNAM9= <"">
##$SW= 20.0189088683792
##$SWIBOX= (0..15)
0 0 2 0 0 0 0 0 0 0 0 0 0 0 0 0 
##$SW_h= 4006.41025641026
##$TD= 16384
##$TD0= 1
##$TE= 0
##$TE2= 300
##$TE3= 300
##$TEG= 300
##$TL= (0..7)
0 120 120 120 120 120 120 120 
##$TP= (0..7)
150 150 150 150 150 150 150 150 
##$TP07= 0
##$TPNAME0= <>
##$TPNAME1= <>
##$TPNAME2= <>
##$TPNAME3= <>
##$TPNAME4= <>
##$TPNAME5= <>
##$TPNAME6= <>
##$TPNAME7= <>
##$TPOAL= (0..7)
0.5 0.5 0.5 0.5 0.5 0.5 0.5 0.5 
##$TPOFFS= (0..7)
0 0 0 0 0 0 0 0 
##$TUNHIN= 0
##$TUNHOUT= 0
##$TUNXOUT= 0
##$USERA1= <user>
##$USERA2= <user>
##$USERA3= <user>
##$USERA4= <user>
##$USERA5= <user>
##$V9= 5
##$VALIST= <valist>
##$VCLIST= <CCCCCCCCCCCCCCC>
##$VD= 0
##$VDLIST= <DDDDDDDDDDDDDDD>
##$VPLIST= <PPPPPPPPPPPPPPP>
##$VTLIST= <TTTTTTTTTTTTTTT>
##$WBST= 1024
##$WBSW= 4
##$XGAIN= (0..3)
0 0 0 0 
##$XL= 0
##$YL= 0
##$YMAX_a= 239573
##$YMIN_a= -245230
##$ZGOPTNS= <>
##$ZL1= 120
##$ZL2= 120
##$ZL3= 120
##$ZL4= 120
##$ABSF1= 10
##$ABSF2= 0
##$ABSG= 5
##$ABSL= 3
##$ALPHA= 0
##$AQORDER= 0
##$ASSFAC= 0
##$ASSFACI= 0
##$ASSFACX= 0
##$ASSWID= 0
##$AUNMP= <proc_1d>
##$AZFE= 0.1
##$AZFW= 0.1
##$BCFW= 1
##$BC_mod= 2
##$BYTORDP= 1
##$COROFFS= 0
##$CY= 11.3945322036743
##$DATMOD= 1
##$DC= 2
##$DFILT= <>
##$DTYPP= 0
##$F1P= 18.9103706918063
##$F2P= -1.10871071338519
##$FCOR= 0.5
##$FTSIZE= 0
##$FT_mod= 4
##$GAMMA= 1
##$GB= 0.15
##$INTBC= 1
##$INTSCL= 1
##$ISEN= 128
##$LB= 0.24
##$LEV0= 0
##$LPBIN= 0
##$MAXI= 10000
##$MC2= 0
##$MEAN= 0
##$ME_mod= 0
##$MI= 1.114404
##$NCOEF= 0
##$NC_proc= 0
##$NLEV= 6
##$NOISF1= 3.799351
##$NOISF2= 2.8
##$NSP= 1
##$NTH_PI= 0
##$NZP= 0
##$OFFSET= 15.70392
##$PC= 1
##$PHC0= -8753.442
##$PHC1= 9.80019
##$PH_mod= 1
##$PKNL= yes
##$PPARMOD= 0
##$PSCAL= 0
##$PSIGN= 0
##$REVERSE= no
##$SF= 200.130013532006
##$SI= 16384
##$SIGF1= 3
##$SIGF2= 2
##$SINO= 400
##$SIOLD= 16384
##$SREGLST= <1H.CDCl3>
##$SSB= 0
##$STSI= 0
##$STSR= 0
##$SW_p= 3612.71676300578
##$SYMM= 0
##$S_DEV= 0
##$TDeff= 0
##$TDoff= 0
##$TI= <>
##$TILT= no
##$TM1= 0
##$TM2= 0
##$TOPLEV= 0
##$USERP1= <user>
##$USERP2= <user>
##$USERP3= <user>
##$USERP4= <user>
##$USERP5= <user>
##$WDW= 1
##$XDIM= 8192
##$YMAX_p= 0
##$YMIN_p= 0
$$ End of Bruker specific parameters
$$ ---------------------------------
##NTUPLES= NMR FID
##VAR_NAME=  TIME,          FID/REAL,        FID/IMAG
##SYMBOL=    X,             R,               I
##VAR_TYPE=  INDEPENDENT,   DEPENDENT,       DEPENDENT
##VAR_FORM=  AFFN,          ASDF,            ASDF
##VAR_DIM=   8192,          8192,            8192
##UNITS=     SECONDS,       ARBITRARY UNITS, ARBITRARY UNITS
##FACTOR=    0.0002496,     1,               1
##FIRST=     0,             0,               0
##LAST=      2.0444736,     0,               0
##MIN=       0,             -245230,         0
##MAX=       2.0444736,     239573,          0
$$ Real data points
##PAGE= N=1
##DATA TABLE= (X++(R..R)), XYDATA
0@%%%%%%%%%%%%%%%%%qJ6j6J6j6J6k4L2l2L8m6M8n6O5p3Q5r4J05j20J35j51J68
$$ 0 0 0 0 0 0 0 0 0 0 0 0 0 0 0 0 0 0 -8 8 -8 8 -8 8 -16 16 -16 22 -24 24 -32 33 -40 45 -49 56 -64 71 -80 88
39H8j87K08k30K55k83L14l45L79m19M61n08N59o16O79p49Q30r19J021j140J281
$$ 88 -99 109 -121 134 -149 165 -180 199 -220 241 -267 292 -324 355 -394 436 -483 538 -602 679
59F79j447J649j902K224k653L249m137N603q398J5476o4443j25360J27641o1441
$$ 679 -768 881 -1021 1203 -1450 1799 -2338 3265 -5133 10343 -54100 -179460 -51819 -113260
73a13260j31970J35781Q5667j01321J05714J63758q0082j15J64309p3671j32883
$$ -113260 -245230 -109449 -23782 -125103 -19389 144369 64287 64172 228481 154810 21927
84B1927R9637k5664k02315K7886O0375j57789j3137J48400n6575l9649J83933
$$ 21927 121564 95900 -106415 -78529 -18154 -175943 -189080 -40680 -97255 -136904 47029
95D7029L4102r3003J31116Q4056j48005R079R8778j45756r8604R8529o8055j34545
$$ 47029 81131 -11872 119244 203300 55295 64374 163152 17396 -81208 17321 -50734 -185279
107a85279J00628M7022j16540Q0940J42858q5881O098J68690n1645r8633J17797
$$ -185279 -84651 -37629 -154169 -73229 69629 -16252 -10154 158536 106891 8258 126055
118A26055p326j63070M1307N1621j52585j4759J18889q2822n6634J55651Q493
$$ 126055 118729 -44341 -3034 48587 -103998 -118757 132 -82690 -139324 16327 24820
129B4820r7981J20389P8321j23975K7720J06530j13723o5731J09413n8761j20998
$$ 24820 -73161 47228 125549 1574 29294 135824 22101 -43630 65783 7022 -113976
140a13976R9374K9071j30274O3636J09569j02669l577J40373n4415p8698J15249
$$ -113976 -14602 14469 -115805 -52169 57400 -45269 -48846 91527 37112 -41586 73663
151G3663J728j27344O0430O1221j28638m28J12458q3009n7951J29083j1659j01853
$$ 73663 75391 -51953 8477 69698 -58940 -59368 53090 -29919 -87870 41213 29554 -72299
163g2299R4915N3741j18081K7586R5907r9766m1974J15220m6575r3495J05244
$$ -72299 22616 76357 -41724 -14138 81769 -17997 -59971 55249 8674 -84821 20423
174B0423K7119j14141N7754Q7689j00648j2716J11269o1883p8476J02121l776
$$ 20423 47542 -66599 -8845 78844 -21804 -34520 76749 14866 -63610 38511 34735
185C4735j17369O8526O4456j14144J4798J14117p2589m5803J19524j6535r5750
$$ 34735 -82634 -14108 50348 -63796 -48998 65119 -7470 -53273 66251 49716 -46034
196d6034Q3220L6635j19661K4256Q2798j01861l6579J10479m2539p9600J03138
$$ -46034 37186 73821 -45840 -21584 61214 -40647 -77226 33253 -9286 -88886 14252
207A4252K9446r6641N8855Q0736r2592p814J00922o7098p3868R3497j4173j10104
$$ 14252 43698 -52943 5912 86648 -5944 -13758 87164 20066 -53802 39695 25522 -84582
219h4582O2546N1833j00346J7339R9087o0213l2488J08704j4263q1341P9984L1289
$$ -84582 -22036 29797 -70549 -53210 45877 -14336 -46824 61880 47617 -33724 46260 77549
231G7549j10585K3463P1869r5686l4182R4245m1836p0037R1313K1626q6137O0100
$$ 77549 -33036 -9573 62296 -33390 -67572 26673 -15163 -85200 6113 27739 -58398 1702
243A702P2334q7044J028R6196o3252o2664Q6716j4845r7309N5483M1550r3571
$$ 1702 74036 -13008 -11980 84216 20964 -41700 45016 30171 -67138 -11655 29895 -63676
255f3676J6355Q7642o3449k9454J05147j8795p5119Q1375K8119r8671K8292O3770
$$ -63676 -47321 40321 -23128 -52582 52565 33770 -41349 40026 68145 -30526 -2234 61536
267F1536q6219k5280Q3254m3979o2871Q3961J2462q2685N6978O3009q0808M078
$$ 61536 -24683 -49963 33291 -10688 -73559 10402 22864 -59821 -2843 60166 -20642 -16564
279a6564Q6457n5208n0618P9000j3833q3624N3820L3882q7949J8717P6003o4539
$$ -16564 69893 14685 -35933 43067 29234 -54390 -570 33312 -54637 -35920 40083 -24456
291b4456k4391R2174k1842o2874P2081K1952q1812K9186N5340p5749j7643P6299
$$ -24456 -48847 43327 21485 -41389 30692 52644 -29168 18 55358 -20391 -38034 38265
303C8265m4093n6629P7826N740p7280N2255N2343p3870P197P6635n1413m0128
$$ 38265 -5828 -62457 15369 21109 -56171 -3916 48427 -25443 -18246 58389 6976 -33152
315c3152P6145j6007p4591N5968K7624q3898K0320O6105o2937k1246Q1328k2908
$$ -33152 42993 26986 -47605 8363 35987 -47911 -27591 38514 -24423 -45669 35659 12751
327A2751n5567O8086J8543p4876L3935N2069p3443j0220P1942m6277m9471P0268
$$ 12751 -42816 25270 43813 -31063 2872 54941 -18502 -28722 43220 -3057 -52528 17740
339A7740j333o8701M7027M1361o5924J0669O7655m7473l0375P1901j6251o4058
$$ 17740 16407 -52294 -5267 36094 -29830 -19161 48494 1021 -29354 42547 26296 -37762
351c7762N2564K2033p4466J7495N4056n7717j8598O9786k4385m7764O4924J3812
$$ -37762 14802 36835 -37631 -20136 33920 -23797 -42395 27391 3006 -44758 20166 33978
363C3978o6003L7538M6348o5407m591O2558m2501m2634N9692n363o2980M2602
$$ 33978 -32025 5513 51861 -13546 -18137 44421 1920 -40714 18978 13615 -49365 -6763
375f763L4355o3708J3586O4009m6433k3612P0405j6016n5633N0882J7288o8430
$$ -6763 27592 -36116 -22530 41479 -4954 -28566 41839 25823 -29810 21072 38360 -30070
387c0070J7954M5479n8210j5318O3533k8367m2629O2599J0802n7955L7499M2568
$$ -30070 -12116 33363 -24847 -40165 23368 -4999 -47628 14971 25773 -32182 5317 47885
399D7885n6554j881N6355l9572l8439N4597r752o0185M0922K7219o0614J5562
$$ 47885 -8669 -10550 45805 6233 -32206 22391 12639 -47546 -6624 20595 -40019 -24457
411b4457N6355m1334j6348O2740j3407m4763M6318J3596o0755J7378L7893n6072
$$ -24457 31898 -9436 -25784 36956 23549 -21214 25104 38700 -22055 -4677 33216 -22856
423b2856j3746N5108k8672l7741N5734Q976m9274L6267L8574m9636L055N2267
$$ -22856 -36602 18506 -10166 -47907 7827 16803 -32471 3796 42370 -7266 -4211 48056
435D8056l9111l2492N1105j4215n5587L7120K0371n5846J4036M9254l7308j3026
$$ 48056 8945 -23547 27558 13343 -42244 -5124 15247 -40599 -26563 22691 -14617 -27643
447b7643N9493j2439l9765M8197J2216n7878K0425L4214n5308j1392M8603l0306
$$ -27643 31850 19411 -20354 27843 40059 -17819 2606 36820 -18488 -29880 18723 -11583
459a1583l4177N0089M476m4641L6353L3818m5718P971M8842l6096k5932M6724
$$ -11583 -45760 4329 8805 -35836 517 34335 -11383 -3412 45430 9334 -16598 30126
471C0126j3817m8747L1973J5685n0985J2141M1816l6830j0081N4329j4705l3269
$$ 30126 16309 -32438 -465 15220 -35765 -23624 18192 -18638 -28719 25610 10905 -22364
483b2364M6324R049m8729K1158K8961m7100p801M1624k8251k9766M4739J56m2350
$$ -22364 23960 33009 -15720 5438 34399 -12701 -20502 21122 -7129 -36895 7844 8000 -34350
496c4350L4095K7643m4267R057M3789l3792k0436M4595j2909m1434L3894J3067
$$ -34350 -255 27388 -16879 -7822 35967 2175 -18261 26334 13425 -28009 5885 18952
508A8952m7603J5767L6630l8812p749M7845j8582l0638M0983N622m3919K0874
$$ 18952 -28651 -12884 23746 -15066 -22815 25030 6448 -24190 16793 22415 -21504 -630
520f30K7128m2519l095M1858k6866k4590M4899k280l9052L1869K1233m2202P155
$$ -630 26498 -16021 -19116 22742 -4124 -28714 16185 13905 -25147 6722 27955 -14247 -7092
533g092L5390l2998j8223L9243j3151l5252L3925J2607l9996J8320L4230l2612
$$ -7092 28298 -4700 -22923 16320 3169 -32083 1842 14449 -25547 -7227 27003 -5609
545e609n402M1449j7493k8807L3701J123m2680J7987K1460m1004qL8629k3914
$$ -5609 -11011 30438 12945 -15862 17839 18962 -23718 -5731 15729 -25275 -25283 13346 -10568
558a0568j7272M2980q2l0633L0093J9185l7532N870L0116l4114j9097L4525j6725
$$ -10568 -27840 15140 15058 -15575 14518 33703 -3829 2041 32157 -1957 -21054 13471 -3254
571c254l4888L1809J0395l6499J9751L3508k7717n49M1524j5790k4242L3776k009
$$ -3254 -38142 -6333 4062 -32437 -12686 20822 -6895 -7444 34080 18290 -5952 27824 25815
584B5815m1494J6515J5180m1590j934L1692k3385j5703L8939J413k5154L1443
$$ 25815 -15679 836 16016 -25574 -27508 4184 -19201 -34904 4035 5448 -19706 11737
596A1737K0356l2118J0087K9174l1992j5888K9413j8672l2735K4204M847l3717
$$ 11737 32093 -25 10062 39236 7244 -8644 20769 2097 -30638 -6434 -1587 -35304
608c5304J5496K7615k4265J674L9105j2063j7661L4013N60l4453J5991J3425l7628
$$ -35304 -19808 7807 -16458 -14784 24321 12258 -5403 28610 29170 -5283 10708 24133 -13495
621a3495l746K5280k4988j7102L3166l338k4686L0620J7448k8187J4080K8903
$$ -13495 -17241 8039 -16949 -34051 -885 -4223 -28909 1711 19159 -9028 5052 33955
633C3955k5798r819K8783j5459k8534K1878J883l4685J2448K1616k8248P0L4706
$$ 33955 8157 -1662 27121 11662 -16872 5006 6889 -27796 -15348 6268 -21980 -21910 12796
646A2796j3771j4779L3537K296k7209J9174J5013l1431R5K3624k4738j6074K7662
$$ 12796 -975 -15754 17783 20079 -7130 12044 27057 -4374 -4279 19345 -5393 -21467 6195
659F195q165k5486K3995J1811k6545J1313K5851k0530n939K9283j0489k1629K3909
$$ 6195 -1970 -27456 -3461 8350 -18195 -6882 18969 -1561 -7500 21783 11294 -10335 13574
672A3574K396l0381J2309J6281k8036k265K5787j5479j5074K6644Q82k3036J9031
$$ 13574 15970 -14411 -2102 14179 -13857 -16122 9665 -5814 -20888 5756 6638 -16398 2633
685B633J5321k5264M923K4609k0277j1707K5967q140k4287J9170P129k7822P689
$$ 2633 17954 -7310 -2387 22222 1945 -9762 16205 8065 -16222 2948 10077 -17745 -10056
698a0056K0471k2295m785K8010j0419j6345K6386M061k4097J4593J6045k4517
$$ -10056 10415 -11880 -16665 11345 926 -15419 10967 15028 -9069 5524 21569 -2948
710b948k323K1863j6967j6564K2083l610k3941J7615J2216k3450P384K3915j5892
$$ -2948 -5271 16592 -375 -16939 5144 1534 -22407 -4792 7424 -16026 -8642 15273 -619
723f19o748K5429n310j9299J7640M937k5683N965J4664k2893n717K2147j0570
$$ -619 -7367 18062 12752 -6547 11093 16030 -9653 -3688 10976 -11917 -17634 4513 -6057
736f057j4501K2590N203j8762J4361J6603j9342L98K0915j5851j4111J9522o267
$$ -6057 -20558 2032 7235 -11527 2834 19437 95 493 21408 5557 -8554 10968 4701
749D701k2930J3965P867k2040N452K0069j3775m716K4346l740j5243J9190N191
$$ 4701 -18229 -4264 3603 -18437 -12985 7084 -6691 -11407 12939 9199 -6044 13146 18337
762A8337k2847P280J2946k2259n849J8468j2012j4650J9559K673j7840J4708J4776
$$ 18337 -4510 2770 15716 -6543 -12392 6076 -5936 -20586 -1027 1646 -16194 -1486 13290
775A3290j7469L678K0271j3712j0299J8251n326k0017J1257O002k0862L227J6555
$$ 13290 -4179 -501 19770 6058 -4241 14010 8684 -11333 -76 5926 -14936 -11709 4846
788D846j4242m694K1899m325j2633J8664N189j8266P900J1851j8129m536J5370
$$ 4846 -9396 -14090 7809 3484 -9149 9515 14704 -3562 4338 16189 -1940 -6476 8894
801H894j1183j3289J5934L37j6576J2279J1621j5306L577J7871j0653p874J7093
$$ 8894 -2289 -15578 356 693 -15883 -3604 8017 -7289 -3712 14159 3506 -4368 12725
814A2725l462j6933J1168N216j9476L584J3485j4995m020J8426n685j1049J6577
$$ 12725 9263 -7670 3498 8714 -10762 -7178 6307 -8688 -12708 5718 33 -11016 5561
827E561M517j5564Q130J1742j5754k679J5106j0932j1565J5125j558j5994J1065
$$ 5561 10078 -5486 2644 14386 -1368 -4047 11059 127 -11438 3687 2129 -13865 -2800
840b800R068j4937L154J5768r966o076J6292l399j3670J1703L931j6693M115J0851
$$ -2800 6268 -8669 -5515 10253 287 -5789 10503 7104 -6566 5137 9068 -7625 -3510 7341
854G341j3341l998J4716n122j0296J3589L843j3612P783J0495j3662p39J3658
$$ 7341 -6000 -9998 4718 -404 -10700 2889 6732 -6880 903 11398 -2264 -3003 10655
867A0655r599r031J3018j725j3726Q743P086j3361K343J3148r373m736J4747l398
$$ 10655 1056 -7975 5043 3318 -10408 -1665 5421 -7940 -5597 7551 -1822 -6558 8189 4791
881D791j1229J1410L674j4460M121R908j2295l707J3153o110r409J2950J552j2557
$$ 4791 -6438 4972 8646 -5814 -1693 8215 -4080 -7787 5366 -744 -10153 2797 4349 -8208
895h208Q649Q520j2375P76J2259q250p380J1656j618j2271Q049N526j2935K678
$$ -8208 441 8961 -3414 -2638 9621 1371 -6009 5647 4029 -8242 -193 5333 -7602 -4924
909d924J1319r545l666J3278l312r313J0361L335j2101M140Q385j0993k554J1050
$$ -4924 6395 -3150 -6816 6462 3150 -6163 4198 7533 -4568 -428 7957 -3036 -5590 5460
923E460o312p750J0835O02j0423P094P196r991N70J0815o793o126J0665j928j0627
$$ 5460 -852 -8602 2233 2835 -7588 -494 6702 -3289 -2719 8096 1303 -4823 5842 3914 -6713
938f713P797L801j1614K973Q983q631k837J1216l013p832R386K795j0613M601
$$ -6713 1084 4885 -6729 -3756 5227 -3404 -6241 4975 1962 -5870 3516 6311 -4302 299
952B99P315j0294j472R965o367o856R817M0r747O650O239r661J393R866p080m380
$$ 299 7614 -2680 -4152 5813 -554 -7410 2407 2447 -7300 -650 5589 -4072 -2679 7187 107 -4273
968d273J0138k680q701P317K750r924K517P560p583k740R764k929o903Q577J986
$$ -4273 5865 3185 -5516 1801 4551 -5373 -2856 4704 -2879 -5619 4145 1216 -5687 2890 4876
983D876r130M636N998q702q08Q329n275n718Q173mq303N626M865q336J506P960
$$ 4876 -4254 382 6380 -2322 -3130 5199 -76 -5794 2379 2375 -5928 -302 4563 -3773 -2267 5693
999E693o229l387Q501k116p362O279K861q690K382O867p205j838Q773l814n671
$$ 5693 -536 -3923 4578 2462 -4900 1379 4240 -4450 -2068 4799 -2406 -4244 4529 715 -4956
1014d956P960O48q045M413M882p694m22P525m765m612P889n13p175N855L733p813
$$ -4956 3004 3652 -4393 20 4902 -2792 -3214 4311 -454 -5066 2823 2310 -4865 990 4723 -3090
1030c090J724O707o024l176P408k197o592N946K205p527L117N757o288o59P440
$$ -3090 -1366 5341 -683 -3859 3549 1352 -5240 706 2911 -4616 -1499 4258 -2030 -2689 4751
1045D751l357m636O303N54p037L063M100o844m76O430m379l404P177o29n567N434
$$ 4751 1394 -3242 3061 3615 -3422 -359 3741 -3103 -3579 2851 -1528 -4932 2245 1616 -3951 1483
1061A483L194o297J442N485n203k848N946k543n675N119J187o421L106M970n196
$$ 1483 4677 -1620 -178 5307 104 -2744 3202 659 -5016 103 1290 -5131 -2025 2945 -2251
1076b251k58O900k552l967N978L25o563L279K910o965J84N160m800k563O282p78
$$ -2251 -2509 4391 1839 -2128 3850 4175 -2388 891 3801 -3164 -2980 2180 -2620 -5183 1099 321
1092C21m497N084L076n214J776N026m764k060N217k968m965M331L73n807K493
$$ 321 -4176 908 3984 -1230 546 5572 808 -1252 3965 997 -3968 363 736 -5071 -2578
1107b578M035m389r0O036j983k774N456J47m897K999K010n625j21L776l955k760
$$ -2578 1457 -2932 -3022 3014 1031 -1743 3713 3860 -1037 1962 3972 -1653 -1774 2002 -1953 -4713
1123d713M750m91m060M255K726m372K206M436m011r76M596k649m021L598K2n222
$$ -4713 37 -454 -4514 -259 2467 -1905 301 4737 726 -250 4346 1697 -2324 1274 1296 -3926
1139c926J861L018m241M5N013k208j909N131Jl854L157J996m780Q2L491l809k496
$$ -3926 -2065 953 -3288 -3243 1770 -438 -2347 2784 2785 -1069 2088 4084 -696 -614 2877 -932 -3428
1156c428M138j357l654L848J464l784K280L562l097m89M097j650l199L129K48
$$ -3428 710 -647 -4301 -453 1011 -2773 -493 3069 -28 -517 3580 1930 -1269 1860 2108
1171B108m461J525K206l990p0L733k194j635M038J36k971K694K031l503M14K958
$$ 2108 -2353 -828 1378 -2612 -2682 1051 -1143 -2778 1260 1396 -1575 1119 3150 -353 61 3019
1187C019l010j659L137j458k948K675Q28l209J362K922k506n33L733j246k348
$$ 3019 9 -1650 1487 29 -2919 -244 584 -2625 -1263 1659 -847 -1380 2353 1107 -1241
1202a241L228R9l496J857J523l515L5K775k216j659L184j47k683K497J617k908
$$ -1241 1987 2086 -1410 447 1970 -1545 -1510 1265 -951 -2610 574 427 -2256 241 1858 -1050
1218a050R98K647k488q74K827j251k505K193N56l065R58K135k450k79K875j273
$$ -1050 -52 2595 107 -767 2060 809 -1696 497 1053 -2012 -1054 1081 -1369 -1648 1227 -46
1234d6j365K678J01k237J483J399k404k56K179j608j663K245l08k249J827J012
$$ -46 -1411 1267 1368 -869 614 2013 -391 -647 1532 -76 -1739 506 198 -2051 -224 788
1250G88k239Q78K095j696n74K396o63j896J789M39k430Q26J318k148j49J989j191
$$ 788 -1451 -573 1522 -174 -748 1648 985 -911 878 1317 -1113 -287 1031 -1117 -1266 723 -468
1267d68j119K101K32j864J358J397j990J19J915j605r48J900p74j661J494M40
$$ -468 -1587 514 746 -1118 240 1637 -353 -234 1681 76 -872 1028 254 -1407 87 527
1283E27j827O13J599j343n03J966n03j339J581K43j728Q06R46j636j83J511q88
$$ 527 -1300 -687 912 -431 -934 1032 529 -810 771 1014 -714 92 1038 -598 -781 730 -158
1300a58j069J525J58j471J024Q81j392L11J187j063m61J196l29j143Q63N64j310
$$ -158 -1227 298 456 -1015 9 890 -502 -191 996 -67 -528 668 339 -804 59 623 -687
1317f87K62J197j019l53J353n70q50J152lj193O28P03j109r9J183o24o60J214
$$ -687 -425 772 -247 -600 753 183 -667 485 482 -711 -83 620 -489 -588 595 -29 -689 525
1335E25p0r77Q58L71j086K65P92q85m96R99k56r55Q72L95r91N41P39p94J00Q14
$$ 525 455 -522 336 707 -379 -114 678 -207 -703 296 40 -915 -43 352 -639 -98 641 -153 -53 761
1355G61n08m62O30Lq42J98M84p40j39P20l56k83P34Jm14N31L34n58K5N38m79m54
$$ 761 253 -209 421 424 -418 -220 264 -476 -615 105 -251 -534 200 201 -213 318 652 94 119 657 178 -276
1377b76M85k43n52M07J9m41L28L35k82Q5N28o9l35M42J16n63J87J54n84N8K30
$$ -276 209 -34 -586 -179 -160 -601 -273 62 -220 -135 393 324 -11 431 547 -16 171 325 -259 -201 29
1398B9m66l7L86j16k07L80K37k59J59L35k23n3K25k58j42J48j49k48O8J42k07
$$ 29 -437 -474 -88 -204 -411 -31 206 -53 106 441 218 165 390 132 -10 138 -11 -259 -191 -49 -256
1419b56q5L01k8r5K63l2qJ72p4k8J20r2n6n7n6L1j24r3L9m5K2m3K1J72l1L0J83
$$ -256 -341 -40 -68 -163 100 68 60 232 158 130 250 158 102 45 -11 20 -104 -197 -158 -203 -181 -224 -203 -31 -62 -32 151
1446A51L3J7Q7m7k0j8l8j83j23R6k09j91K10m0j03K40J11K8J88J54J1MJ41q1l21
$$ 151 184 201 288 241 221 203 165 -18 -141 -45 -254 -445 -235 -275 -378 -138 -27 1 189 343 354 358 499 418 97
1471I7P0k9m70nQ3l29K3K60q0Q5M28J09j03L99K19l91R9J64n29k32J30m15l19
$$ 97 167 138 -332 -337 -254 -583 -560 -300 -380 -295 133 242 139 538 757 366 465 629 100 -132 -2 -417 -736
1494g36K35n8k43L55M49j93K48O87j60j33M99j95n23J44j79o63o3J07m40j63N61
$$ -736 -501 -559 -802 -447 2 -191 57 744 584 451 950 755 232 376 197 -466 -529 -422 -862 -1025 -464
1515d64N5j95P32M23k60L94M26m39j38K49n11o32K05k16p50K53L77m60K71P85
$$ -464 -409 -604 128 551 291 685 1111 672 534 783 272 -360 -155 -371 -1121 -868 -491 -951 -680 105
1535A05r1R0P49K6l24L65L5p87j29K20p89m43N02k97m14P26K81k95O76O11l88
$$ 105 14 104 853 879 555 920 955 168 39 259 -530 -973 -471 -768 -1182 -456 -175 -470 206 817 429
1556D29J57O49m68n71M36l33r29K29R9p85J69O09l24L0R36O8l64P55L25q02J74
$$ 429 586 1235 767 196 632 299 -630 -401 -302 -1087 -918 -309 -633 -603 333 401 37 792 1117 315 489
1577D89M03q92l36M37n64n60N76O6n48N52O64m61J67Q90l29m16O75j64q09L10
$$ 489 892 0 -336 101 -463 -1023 -447 -381 -929 -377 287 -174 -7 883 554 138 813 649 -160 150
1597A50J13q79M1N59n83k52R26q1n14Q31L47p02L83N19p45j72O15n33o32O57k2
$$ 150 263 -616 -575 -16 -599 -851 75 -6 -520 311 658 -44 339 858 113 -59 556 23 -609 48 26
1618B6q24N05N67p68J57Q65n07k87Q40j76p00N64K32q88J75O49p08k87Q74k98
$$ 26 -798 -293 274 -494 -337 528 21 -266 574 398 -302 262 494 -394 -219 430 -278 -565 309 11
1638A1n88P28K05p66L75N79p29j22Q42m71n67Q27J8q34N42M55q10P8P22n66l91
$$ 11 -577 151 356 -410 -35 544 -185 -307 535 64 -503 324 342 -492 50 505 -305 -227 495 -71 -462
1659d62P84j64p61O43L66q75K71P66o90j81Q71l34o17P20Q8r04L59N26q59q9Q73
$$ -462 322 158 -603 40 406 -469 -198 568 -122 -303 568 234 -383 337 425 -479 -120 406 -453 -542 331
1680C31n03m65R15Np07O38M53q08J17P38p06m68Q36l05q44O99K72q75L78P44o56
$$ 331 -172 -637 278 283 -424 214 667 -141 -24 714 8 -460 376 71 -773 -74 198 -677 -299 445 -211
1701b11o4R35l23n95P92P4r81L87M69r48r0P90n39m34Q62L1o85O89N34q21J80
$$ -211 -275 660 337 -258 534 608 -373 14 483 -465 -555 235 -304 -738 124 155 -530 159 693 -128 52
1722E2Q06p25m30P86l65q25O31J83q74L39P10o50n9R87k85n56Q73R6r35M19M30
$$ 52 858 133 -297 489 124 -701 -70 113 -761 -422 288 -362 -421 566 281 -275 598 694 -241 178 608
1743F08r47r4P16o20m69Q77m5p24P64N04q02K80Q13o88l04P77l67p83N89J22r60
$$ 608 -339 -433 283 -337 -806 71 26 -698 66 570 -232 48 861 173 -131 646 279 -504 85 207 -753
1764g53L34O62p50o8R94l23n06R15Q6p95M78M39q97p4P22o66n36Q40j26p79P08
$$ -753 -419 243 -507 -575 419 96 -410 505 591 -204 274 713 -184 -258 464 -202 -738 102 -24 -803 -95
1785i5M55p63K80Q24o08k63Q51k96p43O48J13r72L10N78q17q4Q77l79m58Q65R9
$$ -95 360 -403 -123 701 93 -170 681 385 -358 290 403 -569 -259 319 -498 -582 295 -84 -542 323 422
1806D22p33N29M94q44NP43o57m93P93k09p57O30L32p82K70P49o21j85Q86l07o27
$$ 422 -311 218 712 -132 -127 616 -41 -534 259 50 -707 -77 255 -527 -257 492 -129 -314 572 265 -362
1827c62P09J13q91L47N18p86j05P82m14n02Q23M8p53N58M87q13J06P36n91l94
$$ -362 347 460 -431 -84 434 -352 -457 325 -89 -591 232 280 -473 85 572 -241 -135 601 10 -384
1847c84P62j96p24N88K92q07K38O98o49k03Q30k91n97P00J43q06L50N21p32p7
$$ -384 378 182 -542 46 338 -469 -231 467 -182 -385 445 154 -443 257 400 -406 -56 465 -267 -344
1867c44P65m56m65P72j8p27N27M00p58R3O94n55l54P58j68o63O17K65p65K61O17
$$ -344 421 -35 -500 272 254 -473 54 454 -304 -211 483 -72 -426 332 164 -499 118 383 -382 -121 496
1888D96o46j73P53l03n42O38Q9p57L62N01o99l9P39m28m21P40j8o74M84L61p29
$$ 496 -150 -323 430 127 -415 223 312 -445 -83 418 -281 -320 419 -9 -430 310 292 -382 102 463 -266
1909b66P2O54n61l29P12j97o13N94K36o91K70N78n68j54P15k85n34O14O3p18L34
$$ -266 -194 460 -101 -430 282 85 -528 66 302 -389 -119 459 -109 -263 452 167 -367 247 310 -408 -74
1930g4M29o79j1O61l92l75O93nn97M85L41o72J10N81n52k74O35k23n73N25J97
$$ -74 355 -324 -335 326 -66 -441 252 247 -350 135 476 -196 -86 495 -57 -331 304 81 -492 33 230
1951B30o42K32N50n29j11O94k93m42O01N9o64L15L75o32l2N73m01l50O26j9n52
$$ 230 -412 -180 370 -159 -270 424 131 -311 290 349 -315 0 375 -257 -289 284 -117 -467 159 140 -412
1972d12M72L27n95J34N64m81k44N86j88n48M55J67o31K07M71n18p5O24k53l68
$$ -412 60 387 -208 -74 490 9 -235 351 163 -385 70 237 -394 -187 284 -234 -309 315 62 -306
1992c06N66P9n78L08L72n94k5N14l98l36N48q5n25M37K64n39J56N18l89j95N78
$$ -306 260 339 -239 69 441 -153 -178 336 -62 -398 150 65 -460 -23 241 -298 -142 376 -13 -208 370
2013C70j63m61M45J13n88J83L77n19r6N42k60l56N36Q1m74L41L41m93K5M76l68
$$ 370 207 -254 191 304 -284 -101 276 -243 -339 203 -57 -413 123 204 -270 71 412 -81 -56 420 52
2034E2k77M70j14m99L45J82n16J17M69l78j14N46j27l63M56J18n22J96L16m84
$$ 52 -225 245 131 -368 -23 159 -357 -240 229 -149 -263 283 156 -207 249 367 -155 41 357 -127
2054a27j22M37k79l38M41L0m34L36L11m09R1M67k90k29M50r4m49K79J37n15Q0
$$ -127 -249 188 -91 -429 12 42 -392 -56 255 -154 -63 404 114 -115 335 241 -208 71 208 -307 -227
2075b27L57l64j12M77j10k89M29J45m09K20L23m21q4L78k84l20L32l4m03K53K46
$$ -227 130 -234 -346 131 21 -268 161 306 -103 117 440 19 -65 313 29 -291 41 7 -396 -143 103
2096A03l69O5M62k34j54M48m8l83K84J19m53O3K70l68j35L75j29k84L83J38l41
$$ 103 -266 -201 261 27 -127 321 273 -110 174 293 -160 -97 173 -195 -330 45 -84 -368 15 153 -188
2117a88K17L16l31k5L67k32k54K98n3l97K04J71l59L5L68k20j19L91k6k61K86
$$ -188 29 345 14 -11 356 124 -130 168 115 -282 -78 93 -266 -231 137 -83 -202 189 163 -98 188
2138A88J19l60P7K39l13j51L25j55k90L02P0l25J97K53k62NL37j63k06L08k0l29
$$ 188 307 -53 24 263 -50 -201 124 -31 -321 -19 51 -274 -77 176 -86 -81 256 93 -113 195 175 -154
2160a54J80J42l52K4K64k15j18L15m6k37K83J28l07J12K53k65r6K88j38k37K35
$$ -154 26 168 -184 -160 104 -111 -229 86 40 -197 86 214 -93 19 272 7 -89 199 61 -176 59
2181E9K0k85J30J90k47j4K99j39j59K95j9k49J85J21k77L6K01j93j39K61o9k32
$$ 59 79 -206 -76 114 -133 -147 152 13 -146 149 130 -119 66 187 -90 -54 147 -46 -185 76 7 -225
2203b25K17R4k55J19J96j93l5K60r7j88K17K4k74J22J56k54j7K31j43j20K38n
$$ -225 -8 86 -169 -50 146 -47 -82 178 81 -107 110 134 -140 -18 138 -116 -133 98 -45 -165 73 68
2225F8j80J67J17k15M5J96j68j21K29r1k09J74M2k21P8J71j79j8K31p9j39K26
$$ 68 -112 55 172 -43 2 198 30 -91 138 47 -162 12 54 -167 -89 82 -97 -115 116 37 -102 124
2247A24Mj96J09J05k05l1J71j42j10J79j3j59J48J18j89P0J98j41p3K04p0j62
$$ 124 128 -68 41 146 -59 -90 81 -61 -171 8 -5 -164 -16 102 -87 -17 181 40 -33 171 101 -61
2269f1J23K5k10N2J19j67k5K01p2j07J96M9j50J13R9j65j8J21j27j18J34m3j74
$$ -61 62 87 -123 -71 48 -119 -144 57 -15 -122 74 123 -27 86 185 20 2 123 -4 -122 12 -31 -205
2292b05J14R0j46O6J64r0k4J77k1j25J08K5j69QR9j88m4J43p2q4J57L3r1R7J32
$$ -205 -91 -1 -147 -81 83 -7 -31 146 125 0 108 133 -36 -28 71 -117 -161 -18 -90 -174 -17 16 -75 22 154
2317A54j08K5J40j16r2J19o3j64N5L2j45J0J26p3j5J66J6p3J33M5j28M0P0j42
$$ 154 46 71 211 95 3 122 59 -105 -50 -18 -163 -153 -27 -100 -115 51 67 -6 127 172 44 84 154 12
2341A2o8P5r6j07Q2J7j15J03J13q0M8J60m4m3J23k9j25L7J3j53j0M4j04l9J33
$$ 12 -56 19 -77 -184 -102 -85 -200 -97 16 -64 -16 144 100 57 180 151 26 63 76 -77 -87 -43 -147 -186 -53
2366e3j6n2J42O1m9O1Q9p4l0O8p6j11M6l9j29L5M4o3MJ22nlJ20K7n4N9L6j24q
$$ -53 -69 -121 21 82 33 94 183 109 79 147 71 -40 6 -33 -162 -127 -83 -146 -142 -20 -25 -28 92 119 65 124 160 36 28
2395B8L1j06o1M1n3o1N3O4k1N5J07l0J1R9j2p3N0j9j10oJ2r6j8M1l0j8Q4K1k2
$$ 28 59 -47 -108 -67 -120 -181 -128 -64 -85 -30 77 47 58 157 145 72 122 103 -7 -13 -1 -97 -115 -74 -104 -122 -38 -17 -39
2424c9R2O6m1J1M9m6o0K1l8p1pJo8J4O5n2K0R2J9j4N7L7m0J1K0o7l1Rm9m7M2j1
$$ -39 53 119 78 89 138 92 32 53 15 -56 -63 -62 -130 -116 -51 -103 -83 9 28 14 71 108 68 79 99 32 1 10 -39 -86 -44 -55
2456e5l6L9M2j8K3O3oMN0on4J9Mp4rKm8k1J2K2l0L1M1oL4N2k8NL2k7l8lj2l6k8
$$ -55 -91 -52 -10 -28 -5 58 52 56 106 100 46 65 69 -5 -14 -12 -60 -81 -69 -47 -77 -46 -5 -11 23 75 47 52 84 57 19 16 4 -32 -60
2491f0K3l6qL6MOM2K6j7L7K3j7j2J5k2l3onm0J2J3k6K0J7NrL7K5j8OL1l2j8J6
$$ -60 -37 -73 -81 -45 -41 -35 7 33 16 53 76 59 47 62 40 7 1 -4 -44 -32 -19 -45 -25 -8 -3 -12 25 50 32 38 69 37 19 35
2525C5l4plj1j7Pkk0J0K7OKK1Rj1J6J3j9LJj8k3J3j1j4%K9k9NK8k0J7K8jKJ7J4
$$ 35 1 -6 -9 -20 -37 -30 -32 -52 -42 -15 -9 -7 14 23 12 28 41 22 25 26 8 -15 -2 -13 -27 -27 2 -27 -22 6 -14 3 31 30 32 49 63
2562F3l7qK4k9j9oj9k0J4JqlM0KJL5J8j8J0Mk1j2j1k8k2Nkl9M0J7j3K8N0nMK7
$$ 63 26 18 42 13 -6 -12 -31 -51 -37 -36 -44 -47 -7 -5 -4 31 49 31 41 45 24 12 1 -27 -49 -44 -46 -85 -45 -28 -41 -13 37 32 36 63
2598F3Kj7Orm2Lj5l1k0K1Jk2N4K4nK1K6rjJ5l1k7J1l1m2PLk5NM0nKM6K2k5L6Q
$$ 63 65 48 54 45 3 6 -9 -40 -60 -39 -38 -60 -6 18 13 34 60 51 50 65 34 7 18 -13 -55 -48 -45 -70 -65 -25 -30 -28 18 40 15 51 59
2635E9l3lJ8m2j7Qj5m5L1J7j4J9L6rKM9ql0L0Mm5R%l6k0K3j8j5K1K2k6L9L0l8
$$ 59 26 23 41 -1 -18 -10 -25 -70 -39 -22 -36 -17 19 10 12 61 53 23 53 57 12 21 21 -15 -35 -12 -30 -45 -24 -2 -28 11 41 3
2669CJ7K3j6l9K6j0j5j2J3l0kL9j1j9M9ok8M0%k2J6Qk5pM2l8l0N3om0L1K0l0L
$$ 3 20 43 27 -12 14 4 -11 -23 -10 -40 -42 -3 -14 -33 16 10 -18 22 22 0 16 24 -1 -8 34 -4 -34 19 13 -27 4 24 -6 -3
2703cM1k1k2L4pl8L4K3o1KM9l6k1M0k5k0K0K3m6J6K6m3%N5k0l1M7J1l7J5J8l1
$$ -3 38 17 -5 29 22 -16 18 41 -20 -18 31 -5 -26 14 -11 -31 -11 12 -34 -18 8 -35 -35 20 0 -31 16 27 -10 5 23 -8
2735hkK8k9j2M5j5m7L5J4k7J2L7k6qL5Om6L0J7m4MJ7m2j6O1k4k9L1J9k8J0L5m1
$$ -8 -10 18 -11 -23 22 7 -40 -5 9 -18 -6 31 5 -3 32 38 -8 22 39 -5 -1 16 -26 -42 19 -5 -34 -3 16 -12 -2 33 -8
2768hJ2K8l0l1L6pm0K5J6k9PK3mk6N8Kl3L8Ml4LJ7k7k5K8ml5L5J5l7K9M1l5LK4
$$ -8 4 32 2 -29 7 0 -40 -15 1 -28 -21 2 -2 -28 30 32 -1 37 41 7 10 27 0 -25 3 -1 -36 -1 14 -23 6 47 12 15 39
2803C9j5k0K4on1K2Qm9J0L1j0mL3k4nL2J4l2NL3l7k6L0pl4L1ll0L4K3k8K0M4j7
$$ 39 24 4 28 22 -29 -7 1 -48 -38 -7 -17 -21 12 -12 -17 15 29 -3 2 35 -2 -28 2 -5 -39 -8 -11 -41 -7 16 -12 8 52 35
2837C5k0K2J5l5JJ3n3OK0j5k5L8Pl5M1K7l0J7J5l3k1K8j1m8K6nl2J3K6l1J7M5
$$ 35 15 37 52 17 18 31 -22 -16 4 -11 -36 2 9 -26 15 42 12 29 44 11 -10 18 7 -41 -15 -20 -52 -39 -13 -44 -27 18
2869A8pk0M4Ol9J8J4n3jK5l2k9M2jk2L3K9j7K8L6l3rK6k7k1K1j8m8LJ2j6j1M0
$$ 18 11 -9 35 41 2 20 34 -19 -20 5 -27 -56 -14 -15 -37 -4 25 8 36 72 39 30 56 29 8 29 11 -37 -34 -22 -38 -49 -9
2902iJj0M2J6l4J8L0m7qK1l4k6J2nl1K0K2k0J8N4l3MM0Rk8K3Km8jMl4j2K6k0J
$$ -9 -8 -18 24 40 6 24 54 7 -1 20 -14 -40 -28 -33 -64 -44 -22 -42 -24 30 -3 1 41 50 22 45 47 -1 -2 2 -32 -44 -18 -38 -37
2937c7L5QrL0L5l3KM1m2l2K0l0l7OJ5l2RK5pNM4Mj5L7Om2J1Jk9j8J4l3j7J9Rp
$$ -37 -2 6 -3 27 62 29 31 72 30 -2 18 -12 -49 -43 -28 -60 -51 -26 -33 -28 16 20 5 42 48 6 17 18 -11 -29 -15 -48 -65 -46 -37 -44
2973d4L2K1oK0M0j9j5K6j1l0Nj3l7lOqj2L5kKL9J6k2K3J8l8j4J8k5m1J9k9k2J9
$$ -44 -12 9 3 23 63 44 29 55 44 14 19 6 -31 -34 -28 -36 -48 -13 -15 -13 26 42 20 43 61 23 9 27 2 -39 -20 -49 -71 -52
3007e2J5j2J7L6lQL5Nl9K1Pn1JPl3j3K7mk1N0Pj3L1L8j9lK5l0j5%j9l1Qk0joK5
$$ -52 -37 -49 -32 4 1 9 44 49 10 31 38 -13 -12 -5 -38 -51 -24 -28 -49 1 8 -5 26 64 45 42 67 37 22 22 3 -28 -20 -40 -41 -47 -22
3044b2oLM3J0k4K9J0k7qJ1l9k0K4l4j6K7NoK0K8pPK9kj1J6qk8lMl1j1J9k0MK7
$$ -22 -28 -25 18 28 4 33 43 16 8 19 -20 -40 -16 -50 -66 -39 -34 -40 -20 8 1 8 37 35 24 40 32 4 1 5 -26 -37 -18 -38 -34 -7
3080gRrL5LlKL0j9j9Kk3l3NJ0k5mK5qJ3L1j3LK0Rk9J7pl1j0K4k6k8K7Nj7K6L1
$$ -7 2 -7 28 31 28 30 60 41 22 24 1 -32 -27 -17 -42 -46 -21 -29 -16 15 2 5 25 34 5 22 15 -16 -26 -2 -28 -56 -29 -24 -41 -15 16
3117A6j8J3L4kk0L4l0j2Nj0k0nNj6rL0ooL6J5k3J6J1j8rOk7j0Joj8J8Pj6J6K3
$$ 16 -2 11 45 43 23 57 27 15 20 10 -10 -15 -10 -26 -35 -5 -11 -17 19 34 11 27 38 20 11 17 -10 -20 -19 -25 -43 -25 -18 -34 -18 5
3153EqkJ8Lj2J6qk1NPk0k1K7j1j4K1J3kJ4J3kJ3Kll3K1j7k2ONk5OK8j9JJ7J5k0
$$ 5 -3 -5 13 16 4 20 12 -9 -4 3 -17 -38 -11 -22 -36 -15 -2 -4 10 23 21 34 36 33 0 21 4 -18 -12 -7 -32 -26 2 -17 -16 1 16 -4
3191dJ4Rl1J1J0k3j0J2j3j2J9J3k9J2K3kOJ6lk4K4pj3JLk0PRnqK3j3PJ4Oj8J1
$$ -4 10 19 -12 -1 9 -14 -24 -12 -25 -37 -18 -5 -34 -22 1 -1 5 21 18 -6 18 11 -2 -1 2 -18 -11 -2 -7 -15 8 -5 2 16 22 4 15
3228A5KMj7J1j0l0J5Kk1J1J3j7J4J6nNJlj1KJ0k2Ojj4j6K5jj2K3QjMJ5k7J6K0
$$ 15 17 21 4 15 5 -25 -10 -8 -29 -18 -5 -22 -8 8 3 8 9 6 -5 -3 7 -15 -9 -10 -24 -40 -15 -16 -28 -5 3 2 6 21 -6 10 30
3265C0k6mMKk5PK0j5J3J%KJ5pj5J9kk1PKk4lLKj5K4nkNJ4jj1K5k1j8K7mk2J0j
$$ 30 4 0 4 6 -19 -12 8 -7 6 7 7 9 24 17 2 21 19 -2 5 7 -17 -20 -17 -15 -30 -6 -11 -13 -8 6 5 -6 19 -2 -20 7 3 -19 -9 -10
3305a0j4OJ9nkK8j1KJ9Oj2j1J2j8kmKj7J2%k1J4K2olOQj3Nok4Qj3j3jRLnK0L%
$$ -10 -24 -18 1 -4 -6 22 11 13 32 38 26 15 27 9 7 3 5 -12 0 0 -21 -7 15 9 6 12 20 7 12 6 -18 -10 -23 -36 -37 -28 -25 -30 -10 -7 -7
3346gJ2J1j4J6mqlKj4kk%pLJ6nJ1K1Mj1J9qj4J4j3k5Kolj9K3j6nJ6J9KJ2J1j8
$$ -7 5 16 2 18 14 6 3 5 -9 -11 -13 -13 -20 -17 -1 -6 5 26 30 19 38 30 16 30 17 -8 -6 -12 -15 -34 -11 -27 -32 -16 3 5 17 28 10
3385A0kJ1%j6mj3k2Ojp%L0oKK3J2OOoJpjk9JOj8qQOlPK9lJ9jLj6Lok1krk6lJ2
$$ 10 8 19 19 3 -1 -14 -36 -30 -31 -38 -38 -8 -14 -12 11 23 29 35 29 30 23 22 -7 -6 0 -18 -26 -18 -12 -15 -8 21 18 37 36 39 23 26 20 -1 -3 -12 -38 -41 -29
3430b9rMK4jRJ5P%lJ8j4nj4j9orj5PJ2OJ2MK5OmK8j0%o%k6j0oj1k1J3K3k3K0J5
$$ -29 -38 -34 -10 -11 -2 13 20 20 17 35 21 16 2 -17 -23 -32 -47 -40 -28 -22 -10 -6 19 25 21 49 39 39 33 33 7 -3 -9 -20 -41 -28 -5 -28 -8 7
3470GkJ2RpJJ8k4nj0j2k0Jj5rJ3J8JML5nPQQj0Jj0j9j1pnj2J5OKK6POMJ9mnm%
$$ 7 5 17 26 19 20 38 14 9 -1 -13 -33 -32 -47 -56 -43 -25 -24 -20 15 10 17 25 33 23 24 14 -5 -16 -23 -28 -40 -25 -19 -17 9 16 22 26 45 41 36 32 32
3513C2l0Lrk2Npj0J0K1mJ3J4J1j4JJ0rmj6j3k7K4j6j1J4J3pJ6K0J4oJ7Jrj%j1
$$ 32 2 5 -4 -26 -21 -28 -38 -28 -7 -11 2 16 27 13 14 24 15 11 -5 -18 -45 -21 -37 -48 -34 -21 -28 -12 8 22 16 33 34 25 24 24 13
3550A3j7Kj6j0OnNK5LRPJ9rmQj0k7j7Qj7pMj5pK3J9%K1LrJ2Jpr%j1j7Oj0pLK0
$$ 13 -4 -2 -18 -28 -22 -27 -22 3 6 15 22 41 32 28 36 26 -1 -18 -10 -27 -34 -30 -45 -52 -29 -10 -10 11 14 5 17 18 11 2 2 -9 -26 -20 -30 -37 -34 -14
3592a4pJ1K5QoK7j2Lj1Nk5Oml6P%J1rK0mJ0J8Pj1QPk8oJj5l1J2Nj4kJ8QJ2J3P
$$ -14 -21 -10 15 23 17 44 32 35 24 29 4 10 6 -30 -23 -23 -12 -21 -1 -5 5 23 30 19 27 34 6 0 1 -14 -45 -33 -28 -42 -44 -26 -18 -6 7 14
3632A4J0J3nqmnk8Oj3pjK3olJ4J3MJ1K1j0Qj0kj4rl0mOj3QJJ4rQK5J3k0J3mrj1
$$ 14 24 37 32 24 20 15 -13 -7 -20 -27 -28 -5 -11 -14 0 13 17 28 49 39 47 37 35 21 12 -18 -22 -16 -29 -21 -20 -6 -15 -7 18 31 11 24 20 11 0
3673@jj7k1K1k6mL4kj0J6K1jMOJ3j0Pj7j0Rk0koPpKK2Oj0K1%qRRk2NJk4k2J4j0
$$ 0 -1 -18 -39 -18 -44 -48 -14 -16 -26 -10 11 10 14 20 33 23 30 13 3 12 -8 -10 -16 -9 -16 -14 8 14 4 25 25 17 26 35 13 18 19 -5 -27 -13 -23
3714b3j5J4QnmL2%nJ2mJlrj1Kj0OrNpLJ0KJ0J1LQrJ2poKmj8%MpMRpnJ9Lj1J1l
$$ -23 -38 -24 -16 -21 -25 7 7 2 14 10 11 8 -1 -12 -10 -20 -14 -23 -18 -25 -22 -12 -10 0 11 14 22 13 25 18 12 14 10 -8 -8 -4 -11 -7 2 -5 -10 9 12 1 12 9
3760IpOOk6lJqrJ0kmJ5J2%jNLnJ2j9JqKj2J3J1rlK5Mj2K1Kk5J9Mk4Mjj5jKJrJ
$$ 9 2 8 14 -12 -15 -14 -22 -31 -21 -23 -27 -12 0 0 -1 4 7 2 14 -5 -4 -12 -10 -22 -9 2 -7 -10 15 19 7 28 30 5 24 28 4 8 7 -8 -9 -7 -6 -15 -14
3805a4J8kLK3oj9M%j6qKj1nQj1JJ6J7LQ%J1KrJj9Ppj4Kkk1K2OOJ3K3knJ4mj8%
$$ -14 4 2 5 28 22 3 7 7 -9 -17 -15 -26 -31 -23 -34 -33 -17 0 3 11 11 22 24 15 16 -3 4 -3 -17 -15 -17 -38 -16 -10 -4 9 32 30 25 39 35 17 17
3848A7qqj4Nj8j1QLnK8RQJ0LrmJ5k6k2mnj9J2pKJ6J4MJ0K5ONNj4mj1jl2Nmj1j0
$$ 17 9 1 -13 -8 -26 -37 -29 -26 -31 -3 6 14 24 27 18 14 29 3 -19 -23 -28 -47 -35 -42 -40 -24 -10 -6 4 29 35 40 45 31 27 16 15 -17 -12 -16 -27 -37
3890c7QPOJ7K0oPJ0nJkj8j6j1lj1qMj1PJ8MRJ9PLNjj1qkk0lnlj0KJ4KJ8J4MJ0
$$ -37 -29 -22 -16 1 21 15 22 32 27 28 26 8 -8 -19 -22 -33 -41 -37 -48 -41 -23 -19 -10 9 16 19 24 23 12 4 2 -18 -21 -26 -29 -39 -37 -23 -21 -3 11 15 25
3933B5J8Pj1jj2j2j2ok0nj9J5pK0J1OJ3J9rJ2Qk0koll6Oqk4mK8nnL6J1PJ0J4j0
$$ 25 43 50 39 38 26 14 2 -4 -24 -29 -48 -33 -40 -20 -9 -3 10 29 20 32 40 20 18 12 9 -27 -21 -29 -53 -57 -29 -34 -39 -3 8 15 25 39 29
3972B9Nj0oj5nj0k2Lj%%J6J2J5K1LJ2Qj6oj6ok4j2nrOjJPJ1J3J0K1%Mj5plj3j5
$$ 29 34 24 18 3 -2 -12 -34 -31 -32 -32 -32 -16 -4 11 32 35 47 55 39 33 17 11 -13 -25 -30 -39 -33 -34 -33 -26 -15 -2 8 29 29 33 18 11 8 -5 -20
4013b0Jj5j3NJ2KRK1OK6pNPrKj0nj7j4Ok0QNRj4J4J1J2KNML%k3j6Lk2JnnMMNJ1
$$ -20 -19 -34 -47 -42 -30 -28 -19 2 8 34 27 32 39 30 32 22 17 0 -14 -8 -28 -20 -15 -6 -20 -6 5 17 19 24 28 31 31 8 -8 -5 -27 -26 -31 -36 -32 -28 -23 -12
4057a2NJ6J5j9J3o%Joppj8J0j1NRjJ4Q%J3JNrNrkrj2%qJkkJ0J0%JMlJ5pKj9mL
$$ -12 -7 9 24 5 18 12 12 13 7 0 -7 -25 -15 -26 -21 -12 -13 1 9 9 22 23 28 19 24 15 13 4 -8 -8 -16 -15 -17 -19 -9 1 1 2 6 3 18 11 13 -6 -10 -7
4103gj2jMk0J3oK5J%K1qNOnPj3j2J3k0OJ0j3MjJ3kNRjPj9RpPrj0Mk1rPkNOrK5
$$ -7 -19 -20 -16 -36 -23 -29 -4 -3 -3 18 10 15 21 16 23 10 -2 11 -9 -3 7 -6 -2 -3 10 8 13 22 21 28 9 18 11 18 9 -1 3 -18 -27 -20 -22 -17 -11 -20 5
4148EqKOn%pJjKnj2J5kLQJlJ0JkPOj4J0mj1LmnOj3J6oKpJ7pOj1KPlnjrKmm%kR
$$ 5 -3 -1 5 0 0 -7 -6 -7 -5 -10 -22 -7 -9 -6 2 3 0 10 11 9 16 22 8 18 14 3 6 2 -3 3 -10 6 0 2 -5 12 5 11 0 2 9 6 1 0 -9 -7 -11 -15 -15 -17 -8
4199hnOnJ2Kj0J3moRJpKMoJ0Jmj0J5jLjQrKMJk2Rnj1J1%lpkNoO%jnJ0j5RK2j7
$$ -8 -13 -7 -12 0 2 -8 5 1 -5 4 5 -2 0 4 -2 8 9 5 -5 10 9 12 11 19 10 12 16 17 -5 4 -1 -12 -1 -1 -4 -11 -13 -8 -14 -8 -8 -9 -14 -4 -19 -10 12 -5
4247ejPpj4J9Kj4KJ1onK2oMRJ3j6jPj6mPj3J0Rj5j2J5JnKJ1qlQKj0JkKpqj3LJ1
$$ -5 -6 1 -6 -20 -1 1 -13 -11 0 -6 -11 11 5 9 18 31 15 14 21 5 1 8 -5 5 14 -1 -13 2 3 -2 0 11 3 0 8 10 0 1 -1 1 -6 -14 -27 -24 -13
4292a3j2jJ5J2rMJ7k2PJ6nL%njjKj7K5lrJ3ljlJ9mj1OJ0nk3J3nj2jjk5J9%MqO
$$ -13 -25 -26 -11 1 -8 -4 13 -9 -2 14 9 12 12 7 6 5 7 -10 15 12 3 16 13 12 9 28 24 13 19 29 24 1 14 9 -3 -4 -5 -30 -11 -11 -7 -15 -9
4335iJ1j0K0nqLj2NkLj5%J0pj5K2J4pJ5MLQPj3nOqmoRk1jOj0ROJpK1J2k5J6rj2
$$ -9 2 -8 12 7 -1 2 -10 -5 -7 -4 -19 -19 -9 -16 -31 -9 5 -2 13 17 20 28 35 22 17 23 15 11 5 14 -7 -8 -2 -12 -3 3 4 -3 18 30 5 21 12 0
4379@oKj1rJ4j3JJ1lOLPlLJ3Qj9kOj7PLj6pK0j3J9mJ8pJ4J0j9J5Npk6J4j1%j1
$$ 0 -6 -4 -15 -24 -10 -23 -22 -11 -14 -8 -5 2 -1 2 15 23 4 2 8 -9 -2 1 -15 -22 -2 -15 4 0 18 11 25 35 16 31 36 29 3 17 6 6 -5
4420ejj5JJ2j2J7KRmJ3%j5LJj0j1J1j6j0J4j1jJ1J8%J5QJj0J5Mk1J2qj6k1J7j
$$ -5 -6 -21 -20 -8 -20 -3 -1 8 4 17 17 2 5 6 -4 -15 -4 -20 -30 -16 -27 -28 -17 1 1 16 24 25 15 30 34 13 25 17 1 -20 -3 -4
4458dnJ9j2lL1Jj8J0J5j3qJ0j1qjkk2nnqJ6J2KmK2NmJ0qj5nKllNoKJ5Jj3K2Qp
$$ -4 -9 10 -2 -5 26 27 9 19 34 21 13 23 12 4 3 1 -21 -26 -31 -39 -23 -11 -9 -13 9 14 10 20 12 -3 -8 -6 -9 -12 -7 -13 -11 4 5 -8 14 22 15
4501A5j1K6lk0J0Pk4Ljj0qJ6knOOrJ1LnNlj8kJ9k4nJ3jj4MJ9j5QJ3Kk3K3k2OJ9
$$ 15 4 30 27 7 17 24 0 3 2 -8 -16 0 -2 -7 -1 5 -4 7 10 5 10 7 -11 -13 6 -18 -23 -10 -11 -25 -21 -2 -17 -9 4 6 -17 6 -16 -10 9
4542Ij1mLQrlK0jj4RJ3k7K2mjKK%j1LQj1%Oj2rJ6j0pnNKjQpLJ2pj8K1j1j3J7l
$$ 9 -2 -6 -3 5 -4 -7 13 12 -2 7 20 -7 15 11 10 12 14 14 3 6 14 3 3 9 -3 -12 4 -6 -13 -18 -13 -11 -12 -4 -11 -8 4 -3 -21 0 -11 -24 -7 -10
4586a0k2J6J5qJ2J2j6jJ1J5k0J4Ok1PJj3OljrNJ7j1RJ4j8rJ9rolJ0l2MJ0j9pL2
$$ -10 -32 -16 -1 -9 3 15 -1 -2 9 24 4 18 24 3 10 11 -2 4 1 0 -9 -4 13 2 11 25 7 -2 17 8 2 -1 9 -23 -19 -9 -28 -35 -3
4625cn%J3Lj3lK4l0J5Oj1j8J6pnJ7J2pkJ8JjQKj7J0rj3JJ5j9j2J5omJ3J4j8QM
$$ -3 -8 -8 5 8 -5 -8 16 -14 1 7 -4 -22 -6 -13 -18 -1 11 4 2 20 21 20 28 30 13 23 14 1 2 17 -2 -14 1 -5 -9 4 18 0 8 12
4665A2rn%j0j5J5pJJ0JnJ3K0k6JJ2JnkKj2nJ2kkJ5j0%K1%jj2K5j6mJlk2J2Lj1
$$ 12 3 -2 -2 -12 -27 -12 -19 -18 -8 -7 -12 1 21 -5 -4 8 9 4 2 4 -8 -13 -1 -3 -5 10 0 0 21 21 20 8 33 17 13 14 11 -11 1 4 -7
4706gN%oORj5J3lkj0J4j6j9K7rpJ1J1qk0K8rK1nRpj2J4qj9J3J2j6RRnLQnpJ0P
$$ -7 -2 -2 -8 -2 7 -8 5 2 0 -10 4 -12 -31 -4 -13 -20 -9 2 -6 -26 2 -7 14 9 18 11 -1 13 5 -14 -1 11 -5 4 13 8 11 19 14 7 17 24
4748B4j8J3j0j7NJ1j8LRpMKOqlJ1k1J7j1mnJJ3j8J2J1j0rK4p%J1njJ5kk1lJ5k
$$ 24 6 19 9 -8 -3 8 -10 -7 2 -5 -1 1 7 -1 -4 7 -14 3 -8 -12 -17 -16 -3 -21 -9 2 -8 -17 7 0 0 11 6 5 20 18 -3 -6 9 7
4788GlRJj2J6J4j4Mrj4POj0j4QJj7J5LmjQnj4J6j1rJ1Mk1J6kPKOJj6J4lKJ0kn
$$ 7 4 13 14 2 18 32 18 22 13 -1 6 12 2 -12 -4 -3 -20 -5 -2 -6 -7 1 -4 -18 -2 -13 -22 -11 -7 -28 -12 -14 -7 -5 1 2 -14 0 -3 -1 9 7 2
4831BP%qmJ3Qj2QLj0%J0j1jRlj4Qqj3MJ3j6oK2lj4J2Nj6pJ5rmJJ4j6KPlK0Rmm
$$ 2 9 9 1 -3 10 18 6 14 17 7 7 17 6 5 14 11 -3 5 -3 -16 -12 1 -15 -21 1 -2 -16 -4 1 -15 -22 -7 -16 -20 -19 -5 -21 -19 -12 -15 5 14 10 6
4875FJ2j1oJ8j4lKmqlK2qJQmpJ5%rlnrNLmr%kjQQlP%kj3J0%nqJ7k4RP%NjklJ2
$$ 6 18 7 1 19 5 2 4 0 -8 -11 11 3 4 12 8 1 16 16 7 4 -1 -10 -5 -2 -6 -15 -15 -17 -18 -10 -2 -5 2 2 0 -13 -3 -3 -8 -16 1 -23 -14 -7 -7 -2 -3 -5 -8 4
4925DPRpQj0okJ1j0MJ3k3J1pPpJ0j6LjPj0QJ1k6nNOj1KMj3J8Mj2KPqJ8kMnLro
$$ 4 11 20 13 21 11 5 3 14 4 8 21 -2 9 2 9 2 12 -4 -1 -2 5 -5 3 14 -12 -17 -12 -6 -17 -15 -11 -24 -6 -2 -14 -12 -5 -13 5 3 7 2 5 -4 -10
4970a0J2Onj0J0KoKQpKJ4qj4J1Mj0J4rk0J3klpQj5KJ5rJJNmnNKj5J3Qk0%J9j2
$$ -10 2 8 3 -7 3 5 -1 1 9 2 4 18 10 -4 7 11 1 15 6 -14 -1 -3 -6 -13 -5 -20 -18 -3 -12 -11 -10 -5 -9 -14 -9 -7 -22 -9 -1 -21 -21 -2 -14
5013a4mJ4j0J0JQnJ1kkLJonJ1Kj5PKMqMnJPL%j4jMqMk3MJ4pnJ2Kj6K0j3KRQlj7
$$ -14 -18 -4 -14 -4 -3 5 0 11 9 7 10 11 5 0 11 13 -2 5 7 11 3 7 2 3 10 13 13 -1 -2 2 -6 -2 -25 -21 -7 -14 -19 -7 -5 -21 -1 -14 -12 -3 5 2 -15
5060a5J9nj2J1J0j8KR%mJ4Lj1J3Qk0J0Kj3qJ2lrPMk0J6J0j4%J2k1mJ0Nj5QLnm
$$ -15 4 -1 -13 -2 8 -10 -8 1 1 -3 11 14 3 16 24 4 14 16 3 -5 7 4 -5 2 6 -14 2 12 -2 -2 10 -11 -15 -5 0 -15 -7 -4 -9 -13
5100a3J1j4qRmKQN%%J3j6J1J4lj5J5j3lPK1j9j0J3nN%ojNNqOlroJ8mk6J7Kk9j
$$ -13 -2 -16 -24 -15 -19 -17 -9 -4 -4 -4 9 -7 4 18 15 0 15 2 -1 6 27 8 -2 11 6 11 11 5 4 9 14 6 12 9 0 -6 12 8 -18 -1 1 -28 -29
5143b9K5nj4J4Kj0J7Lk1J3Qj3lQmkPRj4J7PmqK3j3nMmKj3J1j9J2Pk3QJ5Oj7Qk
$$ -29 -4 -9 -23 -9 -7 -17 0 3 -18 -5 3 -10 -13 -5 -9 -11 -4 5 -9 8 15 11 3 26 13 8 12 8 10 -3 8 -11 1 8 -15 -7 8 14 -3 5 3
5184Cj4NJ5k3kJ1j5j2K1J0j5kRpKJ5j4KJ3rnRNrpK0j1lK7j4%LRq%J2j9oJ7pj7
$$ 3 -11 -6 9 -14 -16 -5 -20 -32 -11 -1 -16 -18 -9 -16 -14 1 -13 -11 2 -7 -12 -3 2 -7 -14 6 -5 -8 19 5 5 8 17 9 9 21 2 -4 13 6 -11
5225a1J2lj0PJ2j0jOj0jJ1mk3J3jj1nJ2ppK4qj8L2J8k5Rjj5JL4l0qK1Lj3J4J1
$$ -11 1 -2 -12 -5 7 -3 -4 2 -8 -9 2 -2 -25 -12 -13 -24 -29 -17 -24 -31 -7 -15 -33 -1 17 -8 1 0 -15 -14 20 -10 -18 3 6 -7 7 18
5263A8j7OJ0j0pJ8ok2K3kk3JJ6j5nK4j0j7QQpkJ4j9kJ0pj6J7Mk0K4J4j8LJ8j0
$$ 18 1 7 17 7 0 18 12 -10 13 11 -12 -11 5 -10 -15 9 -1 -18 -10 -2 -9 -11 3 -16 -18 -8 -15 -31 -14 -10 -30 -6 8 -10 -7 11 1
5300ArJ0jnKJ4j5pK5j4KOLqJ4nj1J7Ol2QPrj2J1Qk7J3J6k2QJ0j9mJ0Pl3K6Kk7
$$ 1 -8 2 1 -4 -2 12 -3 -10 15 1 3 9 12 4 18 13 2 19 25 -7 1 8 -1 -13 -2 6 -21 -8 8 -14 -6 4 -15 -19 -9 -2 -35 -9 -7 -34
5340c4K1NprK3J1j9J4Pj6LKrlL3k2j5K7Jj2J4J6k8J3Rj2j4NJ7l3NNj6NJ7rlJ5
$$ -34 -13 -8 -15 -24 -1 10 -9 5 12 -4 -1 1 -8 -11 22 0 -15 12 13 1 15 31 3 16 25 13 -1 4 21 -12 -7 -2 -18 -13 4 -5 -8 7
5378G%k8K3Pk6lL1k6j3K2j6j2K4JMOJ8j9JL3k9mJ4j2j8J3Jj3J3J7rMK8j9j0Qk
$$ 7 7 -21 2 9 -17 -20 11 -15 -28 -6 -22 -34 -10 -9 -5 1 19 0 1 34 5 1 15 3 -15 -2 -1 -14 -1 16 7 11 39 20 10 18 16
5415A6j7J2J6k7nJj7j3K3Ok3K5Nk1K5J2k0j0J8qk3J3Ml7K7Rj1RL1k3NJ9rpJ5l
$$ 16 -1 11 27 0 -5 -4 -21 -34 -11 -5 -28 -3 2 -19 6 18 -2 -12 6 -2 -25 -12 -8 -45 -18 -9 -20 -11 20 -3 2 21 12 5 20 17
5451A7j9JJ0ml5L9%j3QK3k2J0K3k3j7K3j7k0K4rj3j2K0j8j3L3Mj8K6j3j8J9Mp
$$ 17 -2 -1 9 5 -30 9 9 -4 4 27 5 15 38 15 -2 21 4 -16 8 -1 -14 -26 -6 -24 -37 -4 0 -18 8 -5 -23 -4 0 -7
5485gj1RpoQJ0j6K2Nj6KM1k6oK8j3k0J0J2l1J2J9j9j0L6j4j7K4j2k0J5J6k5kJ4
$$ -7 -18 -9 -16 -22 -14 -4 -20 2 7 -9 -7 34 8 2 30 17 -3 7 19 -12 0 19 0 -10 26 12 -5 19 7 -13 2 18 -7 -9 5
5520Ej5j5K2Lk1K2Jj9ML3j6nJ8k2j9J7J2k6MJ3qML9j6j0K5nj9J3jk0%J8k6oL6
$$ 5 -10 -25 -3 0 -21 1 2 -17 -13 20 4 -1 17 -5 -24 -7 5 -21 -17 -4 -12 -8 31 15 5 30 25 6 19 18 -2 -2 16 -10 -16 20
5556B0j7qK2K4l0lJ3k1jQj0k5K4nl6K1J6j8lL9rmK4ml0J4J4k2nJ4j6j3K1rKL2
$$ 20 3 -5 17 41 11 8 21 0 -1 7 -3 -28 -4 -9 -45 -24 -8 -26 -29 10 1 -3 21 17 -13 1 15 -7 -12 2 -14 -27 -6 -15 -13 19
5592A9jkLK2j7rK2j5l1K3%l6J6%mj3L5Mk1K7oj3J1Lk6rJ7k2j6J9Jj7K5K2k9K6
$$ 19 18 16 19 41 24 15 37 22 -9 14 14 -22 -6 -6 -10 -23 12 16 -5 22 16 3 14 17 -9 -18 -1 -23 -39 -20 -19 -36 -11 11 -18 8
5628HJ2pqJ8rk9K3Ml5K0J0k4LK6j0LJ9J0j6PJ5l7%J2j6k7L0j2k1K1Qj7J6Qj2m
$$ 8 20 13 5 23 14 -15 8 12 -23 -3 7 -17 -14 12 2 5 24 34 18 25 40 3 3 15 -1 -28 2 -10 -31 -10 -2 -19 -3 5 -7 -11
5664a1K4oj6%%k7J2Lj8QK6j3JJ6K1k3J3J1j5%K1l2nK7k3k0K8J8l0K1J8j4j5K6
$$ -11 13 7 -9 -9 -9 -36 -24 -21 -39 -31 -5 -18 -17 -1 20 -3 10 21 6 6 27 -5 -10 17 -6 -26 2 20 -10 11 29 15 0 26
5698B6j4k2K6ol2J8%roJ9oj2K2Qm2L2J1k1j0J9rk4K5pj9K1LrNK2ojK9rk1J9Pl3
$$ 26 12 -10 16 10 -22 -4 -4 -13 -19 0 -6 -18 4 12 -30 2 13 -8 -18 1 -8 -32 -7 -14 -33 -12 -9 -18 -13 9 3 2 31 22 1 20 27 -6
5736fOQj8MK3j7kK4Lk7K0J3l3J5Lj8j8J9rj6K3Lk1QK4j6pJ6kk3J5kj9J0K9l8%
$$ -6 0 8 -10 -6 17 0 -2 22 25 -2 18 31 -2 13 16 -2 -20 -1 -10 -26 -3 0 -21 -13 11 -5 -12 4 2 -21 -6 -8 -27 -17 12 -26 -26
5773b6K8j0j2K7OKR%k4LJ7j8mRpk8L4Mk1QK7j1j4K3j3j2K0rk7QJ3k1pK3pj6K3
$$ -26 2 -8 -20 7 13 15 24 24 0 3 20 2 -2 7 0 -28 6 10 -11 -3 24 13 -1 22 9 -3 17 8 -19 -11 2 -19 -26 -3 -10 -26 -3
5810cNj7J1K2k7OPj9j6L9j6mJ0mkJ3J0%j3K8j1k7K1J1k6NK7m4K2J2lj1J4oqMJ0
$$ -3 2 -15 -4 18 -9 -3 4 -15 -31 8 -8 -12 -2 -6 -8 5 15 15 2 30 19 -8 13 24 -2 3 30 -14 8 20 17 6 20 14 6 10 20
5847B0k4PQj6nJ3j8j0K8%k0K1nkoQmj7K5%k5j1K2j1QL7j9j8L5qj3J4J0j9MJ6k6
$$ 20 -4 3 11 -5 -10 3 -15 -25 3 3 -17 4 -1 -3 -9 -1 -5 -22 3 3 -22 -33 -11 -22 -14 23 4 -14 21 13 0 14 24 5 9 25 -1
5884aJ0J0j7j5K3J4k5nL5k6MJ9k6j6J6%k4RJ2l0QJ7j0mL3Kk5J7J0k3KJ6k7rJ5
$$ -1 9 19 2 -13 10 24 -1 -6 29 3 7 26 0 -16 0 0 -24 -15 -3 -33 -25 -8 -18 -22 11 13 -12 5 15 -8 -6 10 -17 -26 -11
5919a1J1k4K3J1j1J5Ok1J2K0mj5J1pk3J6qj7J4Oj3OJ4Jj1J9Jl2jK2j7k1K8j4j7
$$ -11 0 -24 -1 10 -1 14 20 -1 11 31 27 12 23 16 -7 9 1 -16 -2 4 -9 -3 11 12 1 20 21 -11 -12 10 -7 -28 0 -14 -31
5954c1J4lj0J9J2j4lJ4kk0L0Kj5J9Jk9J4K1j8pJ3Mk0L0opOJ0k6oJ6Pk9K6jk6N
$$ -31 -17 -20 -30 -11 1 -13 -16 -2 -4 -24 6 8 -7 12 13 -16 -2 19 1 -6 7 11 -9 21 15 8 14 24 -2 -8 8 15 -14 12 11 -15 -10
5991a0K1j9j5K4rj8K1Nk4J4J3k2%J4j5QPkrJ4J5k3MJ9j8nK2Lk5K7oj5L0oj7J4
$$ -10 11 -8 -23 1 -8 -26 -5 0 -24 -10 3 -19 -19 -5 -20 -12 -5 -7 -16 -2 13 -10 -6 13 -5 -10 12 15 -10 17 11 -4 26 20 3 17
6027A7Onj4J7j2j6J2J4k4JJ4qlJ0j3j7K1%j4QJ2k6jJ9j2j1K3j1rJ8MprK0mj5K3
$$ 17 23 18 4 21 9 -7 5 19 -5 -4 10 2 -1 9 -4 -21 0 0 -14 -6 6 -20 -21 -2 -14 -25 -2 -13 -22 -4 0 -7 -16 4 0 -15 8
6064HNqjK9k1j2J7qkJ5jj9J5jk2K2Pk1KPj2NJrjoJ1j8OJ5rpJQk6K2J4k1RrRqK3
$$ 8 13 5 4 33 12 0 17 9 7 22 21 2 17 16 -6 16 23 2 4 11 -1 4 5 -4 -5 -11 0 -18 -12 3 -6 -13 -12 -4 -30 -8 6 -15 -6 -15 -6 -14 9
6107Ij1lJ3Kj4J1J4nk5J7KrK0oo%Oj0LJ3nj0J2nj1kMKmlj0qJ8Lj1MJj4J1Pj8P
$$ 9 -2 -5 8 10 -4 7 21 16 -9 8 10 1 21 15 9 9 15 5 8 21 16 6 18 13 2 0 4 6 2 -1 -11 -19 -1 2 -9 -5 -4 -18 -7 0 -18 -11
6149a1Nmj1K1qmPJ5j6MJ8qj1K5j3nLMmjPj0%NoqJ7Pj2JJ6l0J1lj1knLkNJ3j6R
$$ -11 -6 -10 -21 0 -8 -12 -5 10 -6 -2 16 8 -3 22 9 4 7 11 7 6 13 3 3 8 2 -6 11 18 6 7 23 -7 4 1 -10 -12 -17 -14 -16 -11 2 -14 -5
6192eJ1j6lJ3nkKJ4j7qJ4jj1K0KlRnkLL0k8mMj4JJ0kk1J4J1k1J7RMlNpj8pKrn
$$ -5 6 -10 -13 0 -5 -7 -5 9 -8 -16 -2 -3 -14 6 8 5 14 9 7 10 40 12 8 12 -2 -1 9 7 -14 0 11 -10 7 16 20 17 22 15 -3 -10 -8 -17 -22
6235b2JmnJ5kj0J9NpRPoj1K5j8j1J1j5JMJ6jJRPj0J9mk2J8Oj9oNk0%J0Nj0J1P
$$ -22 -21 -25 -30 -15 -17 -27 -8 -3 -10 -1 6 0 -11 14 -4 -15 -4 -19 -18 -14 2 1 2 11 18 8 27 23 1 19 25 6 0 5 -15 -15 -5 0 -10 1 8
6276HkLj%oOk3noOj9NJ3jPQqLK3Lj4LJ4k4qJ5k0RRJ1j0K2Nj2Q%rkKprQj4n%Mn
$$ 8 6 9 8 8 2 8 -15 -20 -26 -20 -39 -34 -21 -22 -15 -7 -15 -12 11 14 0 3 17 -7 -15 0 -20 -11 -2 9 -1 21 26 14 22 22 13 11 13 6 -3 5 -9 -14 -14 -10 -15
6323a5K0j0J3rROj1j2J5l1qJ8pNOoKJ3J2jrJ2qNMk1NOj2NLJ6j3J4J0j2KLLkl%
$$ -15 5 -5 8 -1 8 14 3 -9 6 -25 -33 -15 -22 -17 -11 -17 -15 -2 10 9 0 12 4 9 13 -8 -3 3 -9 -4 -1 15 2 16 26 14 16 19 22 20 17 17
6365A7j5mOpoLLoNRj1J1Oj5oMJk1OpOMOJlJ0MMLkJ2j0LmprRpjJ7lPKOLolkkpk
$$ 17 2 -2 4 -3 -9 -6 -3 -9 -4 5 -6 5 11 -4 -10 -6 -5 -26 -20 -27 -21 -17 -11 -10 -13 -3 1 5 8 6 18 8 11 7 0 -9 0 -7 -8 9 6 13 15 21 24 18 15 13 11 4 2
6416Bj3Kj3J%OmK0Nk4J4Ljj8J4j0pMj5%J2JlJ0J6J2JRj3%J5j3k0J6j2JKJ4j1O
$$ 2 -11 -9 -22 -21 -21 -15 -19 1 6 -18 -4 -1 -2 -20 -6 -16 -23 -19 -34 -34 -22 -21 -24 -14 2 14 15 24 11 11 26 13 -7 9 -3 -2 0 14 3 9
6456IKqK5Lpj2Qoj5kKj8mNNj2MJ0MRmKnMjj6PkjpknK0LNOLRrNj%rJkj4OJ4j6J7
$$ 9 11 3 28 31 24 12 20 14 -1 -3 -1 -19 -23 -18 -13 -25 -21 -11 -7 2 -2 0 -5 -1 -2 -18 -11 -13 -14 -21 -23 -28 -8 -5 0 6 9 18 9 14 13 13 4 5 3 -11 -5 9 -7 10
6506A0mLPJ9j6qjnj1Nj4Qj2m%J1oJ0ojJ6j0%Ol%Lj6j1J0QjPP%jJ4NkPqknj3LQ
$$ 10 6 9 16 35 19 11 10 5 -6 -1 -15 -7 -19 -23 -23 -12 -18 -8 -14 -15 1 -9 -9 -3 -6 -6 -3 -19 -30 -20 -12 -13 -6 1 1 0 14 19 17 24 16 14 9 -4 -1 7
6552GqPj0QMJNmOnRj7jPk3j5J2kj5L0k2RkOKQPj9NKkoQLppOOOOK1pOKrOj2Lj3
$$ 7 -1 6 -4 4 8 9 14 10 16 11 20 3 2 9 -14 -29 -17 -19 -34 -4 -26 -17 -19 -13 -11 -3 4 -15 -10 -8 -10 -16 -8 -5 -12 -19 -13 -7 -1 5 26 19 25 27 18 24 12 15 2
6601BkMj5J8rPjRj3NPkj2kJj5nONj3ONmRNmRJ5j3j4J9ok3QMmJ5JNRlJ2j8J1Lj0
$$ 2 0 4 -11 7 -2 5 4 13 0 5 12 10 -2 -4 -3 -18 -23 -17 -12 -25 -19 -14 -18 -9 -4 -8 1 16 3 -11 8 2 -21 -13 -9 -13 2 3 8 17 14 26 8 19 22 12
6647A2lJ4k0kknnJ6j1qJ9kkLJj0LmJj5Mmj5QJ9ooRKOOJ0qkNj2LkRj1J4j2J6pJ3
$$ 12 9 23 3 1 -1 -6 -11 5 -6 -14 5 3 1 4 5 -5 -2 -6 -5 -20 -16 -20 -35 -27 -8 -14 -20 -11 -9 -3 3 13 5 3 8 -4 -1 -3 6 -5 9 -3 13 6 19
6692A9NpJ4oj2Nkk9PMoqNLoJ2MjQqpqJ2lkorNJ6rlJ9kkMJ0j0KNpoJ0qjLOj0jJ2
$$ 19 24 17 31 25 13 18 16 -13 -6 -2 -8 -16 -11 -8 -14 -2 2 1 9 1 -6 -14 -2 -5 -7 -13 -22 -17 -1 -10 -13 6 4 2 6 16 6 8 13 6 0 10 2 1 4 10 0 -1 11
6741A1KRpJ1pj1Qrj6J5j2jloMOLMj4J9j2nKMj3J2jj7J2jL%J1kkPJ1j5J4j0OQq
$$ 11 13 22 15 26 19 8 16 7 -9 6 -6 -7 -10 -16 -12 -6 -3 1 -13 6 -6 -11 -9 -5 -18 -6 -7 -24 -12 -13 -10 -10 1 -1 -3 4 15 0 14 4 10 18 10
6784A0nkKOLrJ1lpJ2j3nRj2J2k1NKmMj2pRNpJ0Kj3J1lkOkqOMKp%J9j6%J2Kj0J1
$$ 10 5 3 5 11 14 5 16 13 6 18 5 0 9 -3 9 -12 -7 -5 -9 -5 -17 -24 -15 -10 -17 -7 -5 -18 -7 -10 -12 -6 -8 -16 -10 -6 -4 -11 -11 8 -8 -8 4 6 -4 7
6830G%j1J0jnKJ6j1Mk%pjOqonjRrJ3j1MKolNj0J1kJ3j6oL%J0MOoJnJ4j4OJ0KM
$$ 7 7 -4 6 5 0 2 18 7 11 9 9 2 1 7 -1 -7 -12 -13 -4 -13 0 -11 -7 -5 -11 -14 -9 -19 -8 -10 3 -13 -19 -16 -16 -6 -2 4 -2 -1 -6 8 -6 0 10 12 16
6877A6ooJ2j8NPPqLllLQrjm%j7Rkm%JPrjJ4j5OQj8J3kKkljORoPNqJ0%Rj6JK0k0
$$ 16 10 4 16 -2 3 10 17 9 12 9 6 9 17 8 7 3 3 -14 -5 -7 -11 -11 -10 -3 -12 -13 1 -14 -8 0 -18 -5 -7 -5 -7 -10 -11 -5 4 -2 5 10 2 12 12 21 5 6 26 6
6927FLmRrJ2Jj5QPrkOmpjNnj1KJKjomRpJ1pJrJ2%mnJ2JLJqPmJ1mlMLjqJ4j1RJ
$$ 6 9 5 14 5 17 18 3 11 18 9 7 13 9 2 1 6 1 -10 -8 -7 -5 -6 -12 -16 -7 -14 -3 -10 -9 -18 -6 -6 -10 -15 -3 -2 1 2 -6 1 -3 8 4 1 5 8 7 -1 13 2 11 12
6979A2%%Kj2KjRkmolLQj2j0NJj2LMOpJn%J7j1%LMj2pK0LkPM%JLmnK4j4nJ2lkj2
$$ 12 12 12 14 2 4 3 12 10 6 0 -3 0 8 -4 -14 -9 -8 -20 -17 -13 -7 -14 -13 -18 -18 -1 -12 -12 -9 -5 -17 -24 -4 -1 -3 4 8 8 9 12 8 3 27 13 8 20 17 15 3
7028CPkMmjKMjqLJrl%Mk2J6lOj2Lj%NkJJ0rLj0J3lJ6kmOJj4J1J0krJMLJPj9KK
$$ 3 10 8 12 8 7 9 13 12 4 7 8 -1 -4 -4 0 -22 -6 -9 -3 -15 -12 -13 -13 -8 -10 -9 1 -8 -5 -15 -2 -5 11 9 5 11 12 -2 9 19 17 8 9 13 16 17 24 5 7 9
7078IKqJmqJ2klkkqRJnKqj0JJ3j2J6j6K7j5qJ1KkKRPrJ2Jj2pJ1oJ6j2jQJ0qqP
$$ 9 11 3 4 0 -8 4 2 -1 -3 -5 -13 -4 -3 -8 -6 -14 -24 -23 -10 -22 -6 -22 5 -10 -18 -7 -5 -7 -5 4 11 2 14 15 3 -4 7 1 17 5 4 12 22 14 6 13
7124A3kJj0J4j6MNkj2PnqPJj6J2knJ2j%jOk1QJLjJRKj2K0j6kK6j1pKkkJ3oNkM
$$ 13 11 12 2 16 0 4 9 7 -5 2 -3 -11 -4 -3 -19 -7 -9 -14 -2 -3 -3 -4 2 -19 -11 -10 -7 -8 -7 2 4 -8 12 -4 -6 20 9 2 4 2 0 13 7 12 10 14
7170A4J2k8%M%MpQj0LLrJPprJ0qLOkkqJ2pQjNpNoLPRj0oJ0pJ4lOkLmj3J2Nj3J5
$$ 14 26 -2 -2 2 2 6 -1 7 -3 0 3 -6 -5 2 -5 -14 -4 -12 -9 -3 -5 -7 -15 -3 -10 -2 -3 2 -5 0 -6 -3 4 13 3 -3 7 0 14 11 17 15 18 14 1 13 18 5 20
7219B0qj0J3j9KJ0jKqjkj2NMlj3J1onjJ0%mJ1nnJ3%j6K2j5J0%lRnQMmnJ2mkQk
$$ 20 12 2 15 -4 -2 8 7 9 1 0 -2 -14 -9 -5 -8 -21 -10 -16 -21 -22 -12 -12 -16 -5 -10 -15 -2 -2 -18 4 -11 -1 -1 -4 5 0 8 12 8 3 15 11 9 17 15
7264A5pOj2jJ3Pk6pK3kqONj3JqKQmpj7K6q%mJ2j5J4j%jkPjMkJNLj4RPoj4K2qJ4
$$ 15 8 14 2 1 14 21 -5 -12 11 9 1 7 12 -1 0 -8 -6 2 -2 -9 -26 0 -8 -8 -12 0 -15 -1 -2 -2 -3 -5 2 1 5 3 4 9 12 -2 7 14 8 -6 16 8 22
7311B2j3MlJJ7k7Llj0kJ1pK%oJ0j1J4nqOj1mkJ2KkQlkpJ1kJ0kLlKjMjQlkJ1k3
$$ 22 9 13 10 11 28 1 4 1 -9 -11 0 -7 -5 -5 -11 -1 -12 2 -3 -11 -5 -16 -20 -22 -10 -8 -10 -2 -5 -7 -14 -3 -5 5 3 6 3 5 4 8 7 15 12 10 21 -2
7357bJ5kOoPlk%kn%mRj7LpPkokJJ3j9J5%j4J1lqQLpNLNQJQklKOk0J9Mk1OnJ1j2
$$ -2 13 11 17 11 18 15 13 13 11 6 6 2 11 -6 -3 -10 -3 -5 -11 -13 -12 1 -18 -3 -3 -17 -6 -9 -17 -9 -6 -13 -8 -5 0 8 9 17 15 12 14 20 0 19 23 2 8 3 14 2
7407BMQMQk0J0kRmk4MJ5j8j0J6j4LLj4OJ0k%QpmnJ5rKOj7J3qJ4jjJ8omQj0MMP
$$ 2 6 14 18 26 6 16 14 23 19 -5 -1 14 -4 -14 2 -12 -9 -6 -20 -14 -4 -6 -6 2 -5 -9 -14 1 -8 -6 0 -17 -4 -12 2 1 0 18 12 8 16 6 10 14 21
7452B1j3Pj0NKrMj0J0qPPj2nJJ5j9KKnLj0JpMjJ1j0J3prPJ7nlJMMKJ%MJoPLrJ1
$$ 21 8 15 5 10 12 3 7 -3 7 -1 6 13 1 -4 -3 12 -7 -5 -3 -8 -5 -15 -14 -21 -17 -18 -7 -17 -4 -11 -20 -13 4 -1 -4 -3 1 5 7 8 8 12 13 7 14 17 8 19
7500A9qJ%Rjj0n%%pjolLkJ5%oNnj3OlQoqPqKJ4JnJ0mJ2j0J4r%J4j1qKJ2j2KJ2
$$ 19 11 12 12 21 20 10 5 5 5 -2 -3 -9 -12 -9 -11 4 4 -2 3 -2 -15 -9 -12 -4 -10 -18 -11 -19 -17 -3 -2 -7 3 -1 11 1 15 6 6 20 9 1 3 15 3 5 17
7547A7mmJ0j4LLK0k5MJpj2QJ3k9J4j7LQKrJ2JKj6jJ6k0J6qmkJ9qnK4j4jJ5PJj0
$$ 17 13 9 19 5 8 11 31 6 10 11 4 -8 0 13 -16 -2 -19 -16 -8 -6 -15 -3 -2 0 -16 -17 -1 -21 -5 -13 -17 -19 0 -8 -13 11 -3 -4 11 18 19 9
7589IJ0j0j%OpLMmMmLklkj2KJ0llLmrJlPoLJ1j0OnJRmMrj3J0Rj%%MoK1jnlJ1J
$$ 9 19 9 8 8 14 7 10 14 10 14 10 13 11 8 6 -6 -4 6 3 0 3 -1 -10 -9 -12 -5 -11 -8 3 -7 -1 -6 -5 4 0 4 -5 -18 -8 1 0 0 0 4 -2 19 18 13 10 21 22
7640B2%lmJnJrJ2j0N%PqrjJ3j8KOlpJ1k0KMkmoK9j3OoMjNnkMMlmONLqQjKmlRL
$$ 22 22 19 15 16 11 12 3 15 5 10 10 17 9 0 -1 12 -6 -4 2 -1 -8 3 -17 -15 -11 -13 -17 -23 6 -7 -1 -7 -3 -4 1 -4 -6 -2 2 -1 -5 1 6 9 1 9 8 10 6 3 12 15
7692A5mKKkmMrjj1J2Jk0NJMJ0Lj5nLNnRj2llRlNj0mJ6lQJ2Nk0J7mPj1J5r%j0%
$$ 15 11 13 15 13 9 13 4 3 -8 4 5 -15 -10 -9 -5 5 8 -7 -12 -9 -4 -9 0 -12 -15 -18 -9 -12 -7 -17 -21 -5 -8 0 12 17 -3 14 10 17 6 21 12 12 2 2
7738BK1k3J3jNnNpKmlOkrpkj2k%OMkJ3PqLLqK0j4okkOnNQm%RMOOpQKj3Mjjj6m
$$ 2 23 0 13 12 17 12 17 10 12 8 5 11 9 0 -7 -9 -21 -23 -23 -17 -13 -15 -2 5 -3 0 3 -5 15 1 -5 -7 -9 -3 -8 -3 5 1 1 10 14 20 26 19 27 29 16 20 19 18 2 -2
7790bJ5j5MJ0j3J6j1RpOkj0%j2KmnJMQj3J2JJ1jj2K4oLolpJ0lj3J1RoKK6qmjL
$$ -2 13 -2 2 12 -1 15 4 13 6 12 10 0 0 -12 -10 -14 -19 -18 -14 -6 -19 -7 -6 5 4 -8 16 10 13 7 4 -3 7 4 -9 2 11 5 7 33 25 21 20 23
7834B3QrrKj0nKnJ1Jj6NNmjNnj1JJ1j3qJ0pMJ1pKMRKJPj6J1pLqNOoJ6mmmJ2qP
$$ 23 31 22 13 15 5 0 2 -3 8 9 -7 -2 3 -1 -2 3 -2 -13 -12 -1 -14 -22 -12 -19 -15 -4 -11 -9 -5 4 6 7 14 -2 9 2 5 -3 2 8 2 18 14 10 6 18 10 17
7882A7PJj7Qnj0J4j8MOnj0lKMonJ6roJ8rjLkMLKJj1JMkMRp%J0j0J0MklN%q%jL
$$ 17 24 25 8 16 11 1 15 -3 1 7 2 -8 -11 -9 -5 -11 -16 0 -9 -15 3 -6 -7 -4 -6 -2 1 3 4 -7 -6 -2 -4 0 9 2 2 12 2 12 16 14 11 16 16 8 8 7 10
7931A0NlnlNmRmJj5Poj3J1mMqnJ3j3KRMoNoPNj3J3nnJ1oRj5J1kJ0J0MKklmNoP
$$ 10 15 12 7 4 9 5 14 10 11 -4 3 -3 -16 -5 -9 -5 -13 -18 -5 -18 -16 -7 -3 -9 -4 -10 -3 2 -11 2 -3 -8 3 -3 6 -9 2 0 10 20 24 26 24 21 17 22 16 23
7979B3j8Lkjj1J7ooLNJ7k2%nJmj0j2LmJ0JLj0K5LLj3J8JppOroJ2MqKMJ2LRj0R
$$ 23 5 8 6 5 -6 11 5 -1 2 7 24 2 2 -3 -2 -6 -16 -28 -25 -29 -19 -18 -15 -25 0 3 6 -7 11 12 5 -2 4 -5 -11 1 5 -3 -1 3 15 18 27 17 26
8024B6LmpJpj2JmjmRj2RjJ2kOj7L%mKj1JoKlQkJ0KLRKkJ5j3NqkOqJJOOrQjP%r
$$ 26 29 25 18 19 12 0 1 -3 -4 -8 1 -11 -2 -3 9 7 13 -4 -1 -1 -5 -3 -14 -13 -19 -17 -20 -12 -14 -4 -2 1 10 12 10 25 12 17 9 7 13 5 6 7 13 19 10 18 17 24 24 15
8076A5Njonkj3llLo%RlJNpQKnj4J6j5oJ3rJ2%JMkJ5OmQkN%j4%KqmPPqQOPj2j1
$$ 15 20 19 13 8 6 -7 -10 -13 -10 -16 -16 -7 -10 -9 -4 -11 -3 -1 -6 -20 -4 -19 -25 -12 -21 -9 -9 -8 -4 -6 9 15 11 19 17 22 22 8 8 10 2 -2 5 12 4 12 18 25 13 2
8126BK2j2J3j0Pk4Kj1klOj4OJR%LmJ2pPr%J3k0qJ5Nj0%K0Jj1J4NNnMjJoljoMk1
$$ 2 24 12 25 15 22 -2 0 -11 -13 -16 -10 -24 -18 -17 -8 -8 -5 -9 3 -4 3 -6 -6 7 -13 -21 -6 -1 -11 -11 9 10 -1 13 18 23 18 22 21 22 16 13 12 6 10 -11
8172a1J5KoKKkjkJOqpJj0Nj0Rjm
$$ -11 4 6 0 2 4 2 1 -1 0 6 -2 -9 -8 -18 -13 -23 -14 -15 -19
8191a9
$$ Imaginary data points
##PAGE= N=2
##DATA TABLE= (X++(I..I)), XYDATA
0@%%%%%%%%%%%%Qj6J6j6J6k4L2m0M8n6P2q1R0j06J23j46J70j95K26k58K91l30
$$ 0 0 0 0 0 0 0 0 0 0 0 0 0 8 -8 8 -8 8 -16 16 -24 24 -32 40 -41 49 -57 66 -80 90 -105 121 -137 154 -176
34a76L75m22M74n31N94o65P41q24R16j013J118j238J368j508J662j833K020k223
$$ -176 199 -223 251 -280 314 -351 390 -434 482 -531 587 -651 717 -791 871 -962 1058 -1165
52a165K450k701K984l302L657m066M541n095N753o550P540q813J0513j2910J6572
$$ -1165 1285 -1416 1568 -1734 1923 -2143 2398 -2697 3056 -3494 4046 -4767 5746 -7164 9408
67I408k2937L7130j25419J378R5399j29164J56508J33969q8745J9350J52696j11658
$$ 9408 -13529 23601 -101818 -100440 -5041 -134205 22303 156272 67527 86877 239573 127915
79A27915r9244R7154o5717j94060O5995L1627j68946K5456J51856q0595r168J90481
$$ 127915 28671 125825 60108 -133952 -67957 -36330 -205276 -179820 -27964 -108559 -117727 72754
91G2754P818p6137J45600M5304j49013L6729P3665j75013o6556J04394j02040
$$ 72754 80572 4435 150035 195339 46326 83055 156720 -18293 -84849 19545 -82495
102h2495j16642J27079K1737j07549J10234J20693r0406L8943J52656q0163p3997
$$ -82495 -199137 -72058 -50321 -157870 -47636 73057 -17349 21594 174250 94087 20090
113B0090J26093m6333j61623O8359K7571j65269J5834J09907r8930k4732J58726
$$ 20090 146183 99850 -61773 6586 34157 -131112 -115278 -5371 -104301 -129033 29693
124B9693j8163p5150J41815M6180j28319N9455Q7479j39743l9635J07283q8587
$$ 29693 11530 -63620 78195 124375 -3944 55511 142990 3247 -36388 70895 -17692
135a7692j01818J10958J391j19778Q9837Q9040j11006K8990J36457q1815n6295
$$ -17692 -119510 -8552 -7161 -126939 -37102 51938 -59068 -30078 106379 24564 -31731
146c1731J28537l1011j21540Q2418L4296j35156K5749R6785j00350l0847J31613
$$ -31731 96806 65795 -55745 26673 60969 -74187 -48438 48347 -52003 -82850 48763
157D8763l8719q5069J17198K7701j20399N6739Q0410j15494j7011J09835p0002
$$ 48763 10044 -75025 42173 69874 -50525 6214 86624 -28870 -45881 63954 -6048
168f048p4671J13634j242j08616Q3194O6441j14107J7840J06489q5252n5052J08806
$$ -6048 -80719 32915 31673 -76943 6251 72692 -41415 -23575 82914 -2338 -57390 51416
180E1416k9174j03083Q4657L9354j15324M0384J00079r2803k2141J24420m4441
$$ 51416 22242 -80841 3816 43170 -72154 -31770 68309 -24494 -46635 77785 33344
191C3344q3780J00635J2190j17953M7839O4918j11653r734J06066o5894o0415
$$ 33344 -50436 50199 62389 -55564 -7725 57193 -54460 -64194 41872 -24022 -84437
202h4437J17085K173r4643Q2786O1358j03430J5756R1330q4357n2685R6006l7394
$$ -84437 32648 34821 -59822 22964 84322 -19108 -3352 87978 3621 -49064 46942 9548
214I548r7891Q1816L0575j06604M4695R0869p9992j1028J11172l6906o7125Q8951
$$ 9548 -88343 -6527 24048 -82556 -37861 53008 -26984 -38012 73160 36254 -30871 58080
226E8080P095j05235M3562N3274j07184r271R3540o4203n4421J04271Q53q0619
$$ 58080 65175 -40060 3502 56776 -50408 -59679 33861 -30342 -84763 19508 20361 -60258
238f0258P6764N3834r0008K2073Q3698q0379m2220R1729m0001q9479P5307K2277
$$ -60258 16506 70340 -19668 2405 86103 5724 -36496 55233 15232 -74247 1060 23337
250B3337r7887L8967P6427p4163q014J01072l7483n9093R0662N374r7991M9451
$$ 23337 -74550 -35583 40844 -33319 -41333 59739 22256 -36837 53825 59199 -38792 10659
262A0659M9931j00464l949Q2325o2882m6997R1035p064p3275P2036M4330q4707
$$ 10659 60590 -39874 -43823 38502 -24380 -71377 19658 12594 -60681 11355 55685 -29022
274b9022K5839P8108p3796l3158Q5301l5582p6216O7577J6655q7293L5866O3705
$$ -29022 -3183 74925 1129 -32029 53272 17690 -58526 9051 25706 -61587 -25721 37984
286C7984p2515m902R0570m0816n0540Q4850J469q2736M8130M1766q4491Q96O9656
$$ 37984 -34531 -39433 51137 10321 -40219 44631 46100 -36636 11494 53260 -31231 -30335 39321
299C9321n7292l9640Q0626j2471o8428O7273L6016p9584K6941O9815o6599k4345
$$ 39321 -17971 -57611 23015 10544 -57884 9389 45405 -34179 -7238 62577 -4022 -28367
311b8367P7945l3355o4322O4836J0628q1528L7283N4433p3154j962Q1714m1858
$$ -28367 49578 16223 -48099 16737 27365 -54163 -16880 37553 -35601 -37563 44151 2293
323B293m3619P8219N6p1806M7609L7906p7451N713O5077n8943l4735P6316j9387
$$ 2293 -41326 36893 36949 -34857 12752 50658 -26793 -21080 43997 -14946 -49681 26635 7248
336G248o3538O3387K7034p1266K8075N9837n8370j5481P0459l1565n3542O1205
$$ 7248 -56290 7097 34131 -37135 -9060 50777 -7593 -23074 47385 15820 -37722 23483
348B3483N362p4189L4812M4302o7777j799O8967l8173l6203O9615r31o0676M8222
$$ 23483 28845 -45344 -10532 33770 -34007 -35806 33161 -5012 -41215 28400 27469 -33207 15015
361A5015L3034p0094J1277N7688n6949k9003O5711k1848n6172N4095K0469o3155
$$ 15015 48049 -22045 -10768 46920 -10029 -39032 26679 4831 -51341 2754 23223 -39932
373c9932K7377N4010n3881r275O9103l1305m6884O0765J846o9082L3067L6031
$$ -39932 -12555 41455 -12426 -21701 47402 16097 -30787 29978 31824 -37258 -4191 31840
385C1840o4885n76O0095l9399l0522O6814m209n3674N0506K9720o3256J3967N1644
$$ 31840 -33045 -33621 26474 -12925 -43447 23367 19158 -34516 15990 45710 -17546 -3579 48065
398D8065n1991k5966N6746k2509n2171M8610J5232n9969K8711M9047n1032l086
$$ 48065 -3926 -29892 26854 4345 -47826 784 16016 -43953 -15242 33805 -17227 -20313
410b0313O4440k8705l7514N4637k33n9079K8588K7664n9427l65N1019l8944k6372
$$ -20313 44127 15422 -22092 32545 32312 -26767 1821 29485 -29942 -30307 20712 -18232 -44604
423d4604O1062n115m5845M7983K7231n3652J5216M5887m7087k1515N0740k5626
$$ -44604 16458 11343 -34502 13481 40712 -12940 2276 48163 1076 -20439 30301 4675
435D675m8122M5516Q372n6693K8528M2287m6220K99N8726k4352l0964N1813p7
$$ 4675 -43447 2069 10441 -46252 -17724 24563 -21657 -21358 37368 13016 -17948 33865 33788
448C3788n4344K9338K4460n9702J287M6503m1605k4070N6167q073m0646M5885
$$ 33788 -20556 8782 33242 -26460 -25173 21330 -20275 -44345 11822 3749 -36897 8988
460H988K3557m7336J8659M2274m3970j5371M7600k6519m2720M1006L993n1588
$$ 8988 32545 -14791 3868 46142 2172 -13199 34401 7882 -34838 6168 10161 -41427
472d1427K4227L4989m1770Q05N2091k2949k5260M9912j839m7065L1022K0143n3012
$$ -41427 -17200 17789 -23981 -23176 28915 5966 -19294 30618 28779 -18286 12736 32879 -20133
485b0133M026L8631l7859k0113M6874r849l6128M0583J8223m4145J9482L8130
$$ -20133 -16107 22524 -15335 -35448 11426 1577 -34551 6032 24255 -19890 -408 37722
497C7722m1366j0309M5521k4367l5567L9819K572m6295K4439K9176m2355K508
$$ 37722 -3644 -13953 31568 7201 -28366 11453 14025 -32270 -7831 21345 -21010 -18502
509a8502M5979k7760k2507M6583n768m1712L0957J8079m5753P222L6892l3652
$$ -18502 27477 -283 -22790 23793 18025 -23687 7270 25349 -20404 -13182 23710 -9942
521i942j5997M5196j1746l4472L8936J2379m4300J8146L1210m0185q294L9871
$$ -9942 -25939 19257 7511 -26961 11975 24354 -19946 -1800 29410 -10775 -19069 20802
533B0802k2182k8788L8139L221l8447K6275K6940l7733M323L9926k7045k1471
$$ 20802 -1380 -30168 7971 11192 -27255 -980 25960 -11773 -7450 32476 5431 -16040
545a6040L7815q309l9095K4977J4181m1465Q520L4647k9850r336M4759j0232k7243
$$ -16040 21775 13466 -25629 -652 13529 -27936 -19416 15231 -14619 -23955 20804 10572 -16671
558a6671L7187R694l9061J4808K4102l8390j0091L2869k3387k7716L5978K095
$$ -16671 20516 30210 -8851 5957 30059 -8331 -18422 14447 -8940 -36656 -678 1417
570A417l5010K8531K7207l2804Q153L9231k3933j7989L5261j0519l8148K2503
$$ 1417 -33593 -5062 22145 -10659 -2506 36725 12792 -5197 30064 19545 -18603 3900
582C900Q193m3021P777K9195l0329o965M1716p745k0875L6586J1949l2102J6190
$$ 3900 12093 -30928 -23151 6044 -24285 -31250 10466 2721 -18154 18432 30381 -1721 14469
595A4469K3125l6055q918K8587k6344k7409L0039k990l2723K4338K2403k6935
$$ 14469 37594 1539 -7379 21208 -5136 -32545 -2506 -5496 -38219 -13881 8522 -18413
607a8413R640L6192j7738j1632L4425p744l1989K1514O001m0086M713K2434l0129
$$ -18413 -8773 27419 9681 -1951 32474 24730 -7259 14255 20256 -19830 -15117 7317 -22812
620b2812r445L4133r125j9490L4260J0952k7555K0385K3718l1170k769K8052k4108
$$ -22812 -32257 1876 -7249 -26739 7521 18473 -9082 11303 35021 3851 1082 29134 5026
633E026k3555K5575n832l2178J8683J6248k8747P529L2545j8651q663L5779n787
$$ 5026 -18529 7046 1214 -30964 -12281 3967 -24780 -17251 15294 -3357 -12020 23759 17972
646A7972k5435K4947P788l3895O718J9764k9079r866K7772j3728k0886K8721N642
$$ 17972 -7463 17484 25272 -8623 -1905 17859 -11220 -21086 6686 -7042 -27928 793 6435
659F435k6253J9165K1552k5097R97K8136j6891j7468K5130l812k8681J6603J1443
$$ 6435 -19818 -653 20899 -4198 -3201 24935 8044 -9424 15706 11894 -16787 -184 11259
672A1259k9893M737K4661k1065q860K9579n825k0131K3472R404k5537R831K0297
$$ 11259 -18634 -13897 10764 -10301 -19161 10418 4593 -15538 7934 17338 -8199 1632 21929
685B1929k3904o372K5456j4512k0418K3421R20k7131J4250J6699k4315J114K6667
$$ 21929 -1975 -8347 17109 2597 -17821 5600 6520 -20611 -6361 10338 -13977 -12863 13804
698A3804j4606j2189K7831k113k3046J9693J0355k7505M578J9753k2129j0955
$$ 13804 -802 -12991 14840 12727 -10319 9374 19729 -7776 -3198 16555 -5574 -16529
710a6529K3344q424k0594K0961P735k3245J2749K0800k0301j235K5862j2142j6420
$$ -16529 6815 -1609 -22203 -1242 6493 -16752 -4003 16797 -3504 -4739 21123 8981 -7439
723g439K0956o55k5231J0375J1185k4250k98K1219j4925r781K5347q74j7455J9241
$$ -7439 13517 12862 -12369 -1994 9191 -15059 -15357 5862 -9063 -18844 6503 5629 -11826 7415
737G415J1617k1025M945J8142j8919j0267J9482j0443k0320J7610L507k2496J1522
$$ 7415 19032 -1993 2952 21094 2175 -8092 11390 947 -19373 -1763 1744 -20752 -9230
750i230J7492j7334P50K4014q599j2006K0572L64k1913J0699R140k4210o12J7564
$$ -9230 8262 -9072 -8322 15692 7093 -4913 15659 16023 -5890 4809 13949 -10261 -10873 6691
764F691j6598j0094K1967k279j5944J8426J0982j8167P511J7995j7090o498J8914
$$ 6691 -9907 -20001 1966 -313 -16257 2169 13151 -5016 2495 20490 3400 -3098 15816
777A5816j0860j7825J5281J083k1119Q391J3900j6165k61K1305p573r826K0389
$$ 15816 4956 -12869 2412 3495 -17624 -9233 4667 -11498 -11759 9546 1973 -7853 12536
790A2536R25j8211J1915Q472k0826Q0J4364j5045r545J7194l469j4649J5285Q476
$$ 12536 13461 -4750 7165 15637 -5189 -5109 9255 -5790 -15335 1859 -1610 -16259 -974 7502
804G502j5879P615J6009j3954l941J7336q207j4548J3473J132j9069O844J1324
$$ 7502 -8377 -762 15247 1293 -2648 14688 6481 -8067 5406 6538 -12531 -5687 5637
817E637j6364n44J8250q971q172J8814n8j4901J2093Q064j7361J171J3495j3554
$$ 5637 -10727 -11271 6979 -1992 -10164 8650 8592 -6309 5784 13848 -3513 -2342 11153 -2401
831b401q590J5617m802j4306J4060N770j5776P628J4045j3000k507J6507o950
$$ -2401 -10991 4626 -176 -14482 -422 5348 -10428 -2800 11245 -1755 -4262 12245 5295
844E295j1845J3359P32j6678P291Q710j5508K3J4647q945p224J5440O0j2527J0307
$$ 5295 -6550 6809 7541 -9137 -1846 6864 -8644 -8621 6026 -2919 -10143 5297 5357 -7170 3137
859C137P811j4344J846J2462j1914o550J3919n282j2346J1827L811j3876N932
$$ 3137 10948 -3396 -1550 10912 -1002 -7552 6367 1085 -11261 566 4377 -9499 -3567
872c567J1467j1100k016J4454n871r424J2752M43j4200P426P331j4142p1J2631
$$ -3567 7900 -3200 -5216 9238 3367 -6057 6695 7138 -7062 364 7695 -6447 -6518 6113
886F113q701p058J3734q20j1540J0563O244j3300L948J1126j1374m319J2597n246
$$ 6113 -2588 -9646 4088 3268 -8272 2291 8535 -4765 -817 10309 -1065 -5384 7213 1967
900A967j0730J0137K838j2717N129R706j0796j130J3309o157p621J2274J40j2059
$$ 1967 -8763 1374 4212 -8505 -3376 6330 -4466 -5596 7713 1556 -6065 6209 6349 -5710
914e710P014O274j2245L8J0493q234n910J1767j824r689R505M757j0881L765R430
$$ -5710 1304 7578 -4667 -4629 5864 -2370 -8280 3487 1663 -8026 1479 6236 -4645 -880 8550
929H550q980l604J0737m176r362Q879J955j1561N084P702j0182j18J1223n848
$$ 8550 -430 -4034 6703 2527 -6835 2044 3999 -7562 -2478 5224 -4958 -5076 6147 299
943B99n827J0703K9r992O433N447j0875O10R198q199m870J0677k617q726Q811
$$ 299 -5528 5175 5204 -4788 1645 7092 -3783 -3173 6025 -2174 -7044 3633 1016 -7710 1101
958A101L887j0016L791Q680q483k568J0321m686p821Q911N72j0215N184N912r069
$$ 1101 4988 -5028 -1237 7443 -1040 -3608 6713 2027 -5794 3117 3689 -6526 -1342 4570 -4499
973d499M2R364n057n165R358J26q759O130M656r573J251P771p317l712Q871k426
$$ -4499 -4457 4907 -150 -5315 4043 4169 -4590 1540 6196 -3377 -2126 5645 -1672 -5384 3487 1061
989A061p357P176L192q529L149P142p298j733Q655m227o093P646N00q473M341
$$ 1061 -6296 880 4072 -4457 -1308 5834 -1464 -3197 5458 1231 -4862 2784 3284 -5189 -848
1004h48N359p895k01Q344m965m555Q607j003p679O261L231q563J960O691o431
$$ -848 4511 -3384 -3585 4759 -206 -4761 3846 2843 -4836 1425 4656 -3907 -1947 4744 -1687
1019a687k785Q045k205o342O793K292p955L433N772p339j152P546m244n312P007
$$ -1687 -4472 3573 1368 -4974 1819 4111 -3844 -411 5361 -1978 -3130 4416 172 -5140 1867
1034A867M97p370M402M822o967O64P215m937l348P229j597o518M890K487p229
$$ 1867 2364 -5006 -604 4218 -2749 -2085 5130 193 -3155 4074 2477 -4041 849 3336 -3893
1049c893J166N803n158k338P257j804m984O448J643o611L269M456o382j197N898
$$ -3893 -2727 3076 -2082 -4420 2837 1033 -3951 2497 4140 -2471 798 5254 -1128 -2325 3573
1064C573l824m702N691J05o121M237L940n802J426O367m127k559O381j333n988
$$ 3573 -251 -4953 738 843 -5278 -1041 2899 -2903 -1477 4890 763 -1796 4585 3252 -2736
1079b736M147J914p095J221M809n579j396O658k382l647O310J308n321L276M010
$$ -2736 1411 3325 -3770 -2549 2260 -3319 -4715 1943 -439 -4086 2224 3532 -1789 1487 5497
1094E497n519r59N063l925m247M944q00n532L907K960n000J559N661l188j818
$$ 5497 -22 -981 4082 157 -4090 854 54 -5478 -1571 1389 -3611 -2052 3609 421 -1397
1109a397N747r24m736L713J178n992J081L248m927j241M893j876l109M955J697
$$ -1397 4350 3426 -1310 2403 3581 -2411 -1330 1918 -3009 -4250 643 -1233 -4342 613 2310
1124B310m231K876L886m464l13M482l653l279M136j335m847L072K025m501J203
$$ 2310 -1921 955 4841 377 64 4546 893 -2386 1750 415 -4432 -1360 665 -3836 -2633
1139b633M704k819j195N321r47l507L882Q33m990J346K682m580j335M150k140
$$ -2633 2071 -748 -1943 3378 2431 -1076 2806 3639 -1351 -5 2677 -1903 -3238 912 -1228
1154a228l114M373Q93l834L152L070l817O61L896k933k270L505r33m160K205J624
$$ -1228 -4342 31 924 -2910 242 3312 -505 156 4052 1119 -1151 2354 1421 -2739 -534 1090
1170A090m156O43L654k776r30M387q78k553L481R91l676J245K470l511j137L202
$$ 1090 -3066 -2423 1231 -1545 -2475 1912 1034 -1519 1962 2953 -723 522 2992 -519 -1656 1546
1186A546k046k590L205Q0l114K366K195k874M92L407j886j798L261m29l391K203
$$ 1546 -500 -3090 115 195 -2919 -553 1642 -1232 -740 2667 781 -1017 2244 1815 -1576 627
1202F27J099l776Q10K539k919p21L389j073k143L009R65k952J483K350k901l97
$$ 627 1726 -2050 -1240 1299 -1620 -2341 1048 -25 -2168 841 1806 -1146 337 2687 -214 -611
1218f11K849k018k008K657l48k878J763J611k702K91K905j680j155K986m56k211
$$ -611 2238 220 -1788 869 521 -2357 -594 1017 -1685 -1394 1511 -169 -1324 1662 1206 -1005
1234a005K105O82k658O18J765k171j000K323p36k045K080Q26k301J282J871k088
$$ -1005 1100 1782 -876 -258 1507 -664 -1664 659 -77 -2122 -42 784 -1517 -235 1636 -452
1250d52M9K315j366j429K064j42k385J176J143k320J73K000j556o79K297m62j523
$$ -452 -403 1912 546 -883 1181 1039 -1346 -170 973 -1347 -1174 826 -730 -1409 888 426 -1097
1267a097J830P51k033N81J687j850p90K017j039j624J840M8j868J264J151j656
$$ -1097 733 1484 -549 32 1719 -131 -921 1096 57 -1567 273 321 -1547 -283 868 -788
1283g88J64J869r36j082J749Mj814J049P75j844K60J358j317n60J654l28j292
$$ -788 -624 1245 309 -773 976 980 -834 215 990 -854 -594 764 -553 -1113 541 213 -1079
1300a079J299P14j538N03J249j324l02J350p96q90J175K1j229O39R17j111j59
$$ -1079 220 934 -604 -101 1148 -176 -478 872 76 -814 361 382 -847 -208 709 -402 -561
1317e61J360o62q34J291j50j204R24M16j242L18J005q88m08J241k40r83R82L10
$$ -561 799 137 -697 594 444 -760 164 580 -662 -344 661 -227 -635 606 366 -617 365 675
1335F75j181M84O70j075r0R40o10o59R86J78r95O46P73r53J21R49p46l50Q22l95
$$ 675 -506 -22 648 -427 -517 423 -187 -846 140 318 -677 -31 742 -211 -90 859 113 -237 585 190
1355A90p16N19J95p97Q5P17m46k87Q36n9m57O62J39n92K77L33o32k40M94l17n91
$$ 190 -526 -7 188 -609 -524 193 -253 -540 296 237 -220 442 581 -11 266 599 -33 -273 221 -96 -687
1376f87M96J04n50M18L56l82K71M40k77q0M21r2n15K04J70o16j7L53m67m4M55
$$ -687 -191 -87 -637 -219 137 -245 26 466 189 109 530 438 -77 127 297 -319 -336 17 -450 -494 -39
1397c9k42n9N02J1k27L14K52l17p1K71k47k61J93j81k24J80k1j94J37K30p9p4
$$ -39 -281 -340 162 173 -54 260 512 195 124 395 148 -113 80 -101 -325 -145 -166 -360 -223 7 -72 -146
1419a46L19O7j98J82M4j80J25q7j65R1p9j26ml8L1l2m4J16N2M2L3M4J66Lp1J43
$$ -146 173 240 42 224 268 88 213 126 -39 52 -27 -153 -157 -195 -164 -196 -240 -124 -72 -30 3 47 213 216 145 288
1445B88m8j04j0r0j21l6n4j20o5J58j9j06K89J52j16K39J57q6N5L2j46j32m1j16
$$ 288 240 136 126 36 -85 -121 -175 -295 -360 -202 -221 -327 -38 114 -2 237 394 308 363 395 249 117 76 -40
1469d0l37qJ21l23L7L68j03Q5M21L7lL29L7k90R9N2n21j99J87m39k83L19q2j56
$$ -40 -377 -385 -264 -587 -550 -182 -285 -200 221 258 255 584 621 331 430 482 -39 -238 -51 -490 -773 -454 -536 -692
1493f92M39K52p0L43M71j88q2M50k78n74K22k07p16Q7Q3m68J01M64n3J2P15K72
$$ -692 -253 -1 -71 272 743 555 473 923 645 71 293 86 -630 -543 -460 -928 -827 -363 -416 -404 311 583
1515E83k53M41L51n62r1K20o32m92J90l29n49L48K68m03L99P89j84R3Q14j34l33
$$ 583 330 771 1122 560 469 689 57 -435 -245 -574 -1123 -775 -507 -910 -511 278 94 187 1001 867 534
1536E34M07j68p19mOp70k42M78l40l08Q18K45l22P62N16m22K72M63o10l81L66
$$ 534 941 773 54 50 56 -714 -956 -478 -818 -1126 -308 -63 -385 377 893 471 743 1206 596 215 581
1557E81n12q38L38K8p81L16O27m26K25R03q5j84P57N7p15K76K30r74k51M98o92
$$ 581 69 -769 -431 -403 -1184 -868 -241 -667 -442 461 376 192 949 1006 291 567 797 -177 -428 70 -622
1578f22m74P12r4m31P37M47m27L89P32m77k54O70l44q17M26j7q93J82M55o12j3
$$ -622 -1096 -384 -478 -909 -172 275 -152 237 969 492 238 908 564 -253 173 156 -737 -555 -100 -712 -725
1599g25Q44k05l26Q81J88p07N07M34q70m2N58o93m37O38k21o57O18L86p34L41
$$ -725 119 -86 -412 469 657 -50 457 891 21 -21 537 -156 -593 45 -176 -833 -215 171 -563 -222
1619b22Q13o09j83R07l59o28O55J0q37L39M56p92m2Q19m48m83Q89L3p58N66M34
$$ -222 591 -18 -201 706 347 -281 374 384 -453 -114 342 -450 -492 327 -121 -604 285 318 -440 126 560
1640E60q06J02O97n98l80Q19j98p38O72L18q88K77O81p20j96Q07l79n80P17J36
$$ 560 -246 -144 553 -45 -425 394 196 -542 130 448 -440 -163 518 -202 -398 409 30 -550 167 303
1660C03q12M54O19q00k3Q84n20n20Q24j01q45N21L44q60J35P65o33l06R82j98
$$ 303 -509 -55 564 -236 -259 625 105 -415 409 308 -537 -16 328 -532 -397 368 -265 -571 411 213
1680B13o66P92K78q53L04N94p98k30P85m92o74P99J08q83N75O44p96J20R08n23
$$ 213 -453 339 617 -236 68 662 -136 -366 419 -73 -747 52 160 -723 -148 496 -300 -180 728 205
1700B05m16Q24j64q64N27K85r93J30P40p09k85R67j67n87Q12L04p98L60O37q23
$$ 205 -211 613 449 -415 112 397 -596 -466 274 -435 -720 247 80 -507 305 609 -189 171 808 -15
1720a5k43P92n51p26P77Pq73N55N67p18J62Q96m55l78R02j16q71N67K75j032J10
$$ -15 -258 534 -17 -743 34 41 -832 -277 290 -428 -266 630 175 -203 699 583 -288 279 554 -478 -368
1741c68O73p76k75Q99k37n69Q66K96p91M84O81q44j40Q06n95o62P06r0q72M93
$$ -368 305 -471 -746 153 -84 -653 213 509 -282 202 883 39 -101 705 110 -552 154 64 -808 -315
1761c15M89p68J53R19m85l38R82j18p82O44K75r71J44N83p72l19Q40l03o36Q27
$$ -315 174 -594 -441 478 -7 -345 637 519 -263 381 656 -315 -171 412 -360 -679 161 -142 -778 49
1781D9K72p83M98P08p34p7Q25m97o16P11p8r08M55M29q60J14Q49n42l06R39j10
$$ 49 321 -462 36 744 10 -67 758 261 -355 356 278 -630 -175 254 -606 -492 357 -185 -491 448 338
1802C38o64O71L04q63J91O10p73l20Q02l78o71P81J61p88M86O24p01%Q39m67n15
$$ 338 -326 345 649 -214 -23 587 -186 -506 296 -82 -753 28 189 -599 -113 511 -190 -190 649 182 -333
1823c33P89q2q45M87L81q80J00P46n74l19Q51j22o58O81L22q40K75O48p39k36
$$ -333 456 374 -471 16 397 -483 -383 363 -211 -530 321 199 -459 222 544 -296 -21 627 -112 -348
1843c48P88l92o16P27R0p82M07N57p13qP99m69m53P85o8p60N19L58q00J13O99
$$ -348 440 48 -568 159 249 -533 -126 431 -282 -290 509 40 -413 372 304 -456 63 421 -379 -266 433
1864D33n83l13Q01j86o54O62K50p93L00O03o92j69P60l58n25O85Q7p52M18M98
$$ 433 -150 -463 338 152 -502 160 410 -383 -83 520 -172 -341 419 61 -464 221 308 -444 -26 472
1884D72p34J3P30m79m28P33p7o97M90L43p32J30O72n47k81P82k15n97O07K14p49
$$ 472 -262 -249 481 2 -426 307 230 -467 23 366 -366 -236 436 -111 -392 390 175 -422 185 399 -350
1905c50K49N28o34j77P16l26n28O96P1o83M26M71o70K5O84m49l87O58j02o69M62
$$ -350 -101 427 -207 -384 332 6 -522 174 245 -438 -12 459 -211 -186 498 49 -338 320 218 -451 11
1926A1L19p33J60O11n30k19P27j80n21N89J98o93K61M80o44j39O46l62m73O10
$$ 11 330 -403 -243 368 -162 -381 346 166 -355 234 432 -261 0 480 -164 -303 343 -19 -492 118
1946A18L1o19M07M17n89K9O66m03l50O44r5o18M41K35o79J32N38n07k19O55j56
$$ 118 149 -470 -63 354 -235 -206 460 57 -293 351 256 -362 79 314 -365 -233 305 -202 -421 234 78
1967G8m75N50K04o12K74M72n61j20N95l42m37N41J0o23L47L81n80N8N99l70k65
$$ 78 -397 153 357 -255 19 491 -70 -190 405 63 -374 167 177 -446 -99 282 -298 -240 359 -11 -276
1988b76O19q1n25M32K22o25R3M84n06k22N80j96m65N26J51n49L00M19m78m3N55
$$ -276 343 262 -263 169 391 -234 -141 343 -163 -385 195 -1 -466 60 211 -338 -38 381 -97 -140 415
2009D15k87l95N08j1n70K98K84n50M0N07l53k30N66o1m31M27K23n04J29M34m72
$$ 415 128 -267 241 230 -340 -42 242 -308 -268 239 -114 -344 222 161 -270 157 380 -124 5 439 -33
2030c3j86M90k40m22M29Q0n09K51L82m31j4N39k46k80M80K0n00K76K25n36J8M00
$$ -33 -219 271 31 -391 38 118 -391 -140 242 -189 -203 336 90 -190 290 310 -190 86 311 -225 -207 193
2052A93l56k46M89p7m01M23K29m38J92M11l72j25M52k08m13L57M2m94J75L14m23
$$ 193 -163 -409 80 3 -398 25 254 -184 8 419 47 -78 374 166 -247 110 152 -342 -167 147 -276
2073b76j7M75j99k13M75L6l87K95K20m61ML48l69k51M04j33l73L46J59l91K01
$$ -276 -293 182 -17 -230 245 281 -106 189 409 -52 -48 300 -69 -320 84 -49 -422 -76 83 -308 -107
2094a07L89l03o1M50j63l35L55K0m62J48K16m03m2L70j96k15M32M1l22K97K56
$$ -107 282 -21 -82 368 205 -130 225 245 -217 -69 147 -256 -298 72 -124 -339 93 134 -188 109 365
2115C65l84O6L28l13j95L30j46l63K65J23l82J18L23k65l9M24j26k34L37M2l68
$$ 365 -19 47 375 62 -133 197 51 -312 -47 76 -306 -188 135 -130 -169 255 129 -105 232 274 -94
2136i4J44J89l71n7L05k25k20L43Kl10K77K09l01Q1L15k44j19L11j10k96K27P8
$$ -94 50 239 -132 -189 116 -109 -329 14 16 -294 -17 192 -109 -28 287 43 -76 235 125 -171 56 134
2158A34l61R6K53k77m6L21j04j97L19M7k94J91J89l09j9K61k23j73K65l1k71K09
$$ 134 -227 -131 122 -155 -201 120 16 -181 138 185 -109 82 271 -38 -57 204 -19 -192 73 42 -229 -20
2180b0J22k63P3K55j91j03L00o4k44K43O4k99R1J78k43o8K59j30j70K58L0k61
$$ -20 102 -161 -88 167 -24 -127 173 109 -135 108 172 -127 -36 142 -101 -169 90 -40 -210 48 78 -183
2202a83J77J92k47QK57j67j41K32j8k44J55R0k53M6K16k00p8K66n7j73K22O3k39
$$ -183 -6 186 -61 -53 204 37 -104 128 110 -134 21 111 -142 -96 120 -80 -158 108 51 -122 100 163 -76
2225g6R9J55k04m9K19j41j91K08Qk31J47J35j97L4K10j23q2K18l4j99J49Q0k34
$$ -76 23 178 -26 -75 144 3 -188 20 28 -203 -56 79 -118 -84 126 3 -79 139 105 -94 55 135 -99
2248i9K6J60j92o1K00n8j29J69P3j66R5J70j64l0J85j09j60J65k5j85P8Q9j63
$$ -99 -73 87 -105 -166 34 -24 -153 16 89 -77 18 188 24 -6 179 70 -90 75 50 -135 -57 32 -131
2271a31QJ85r8p3K17Kj51J38P1j81J6J18j62q4J43o7j59J51O4j71J17J53j30K6
$$ -131 -123 62 -36 -109 108 110 -41 97 168 -13 3 121 -41 -125 18 -49 -208 -57 7 -164 -47 106 -24 2
2295BJ76o5j21J40k5j72O7N2j81rJ38j04o1J83Pq8J42Q1j20M1J12j28p7J11r4
$$ 2 178 113 -8 132 107 -65 2 54 -127 -136 2 -102 -163 20 27 -61 81 162 42 83 195 67 -10 101 7
2320Gj39Q6Jj50P0J01r0K5J54j4n6J34L5j37O7L1j69k5O6j10q1J01kp9J08R0n9
$$ 7 -132 -46 -45 -195 -125 -24 -114 -89 65 51 -5 129 164 27 94 125 -44 -69 -3 -113 -194 -93 -95 -174 -66 24 -35
2347c5P2J38p4l8J39o2j33N8j5j53pO2j14jJ28l0k8J59L6o9J01M9j00j4M7r0j00
$$ -35 37 175 101 63 202 140 7 65 50 -103 -110 -48 -162 -163 -35 -65 -93 66 102 33 134 183 83 69 116 26 -74
2374g4M5m5j09M9M5q4O8J18l7QJ34Jm1M3J9j05j5L0j31m6N8o5m1Q9L6k7Q0R2l3
$$ -74 -29 -74 -183 -134 -89 -173 -105 13 -24 -16 118 119 78 121 140 35 20 50 -81 -127 -69 -134 -175 -86 -50 -77 3 95 62
2403F2L4Q0m9o0O4o4j11J9mj02mM7k3NP0M0j9R2L4m4K6L5o6n0L1o8p6J2Nn4K0
$$ 62 96 176 127 67 131 67 -44 -25 -29 -131 -135 -88 -111 -106 -36 4 -15 77 111 67 93 128 62 12 43 -25 -101 -89 -84 -138 -118
2434a18O2l7M7R0qj2Q7Qn9K9no2l6J3n1n2L3Nm4P0M1l0N0O0rrM0j7m2Pj1p8j1
$$ -118 -56 -93 -46 44 36 24 111 119 60 89 84 22 -14 -1 -52 -104 -71 -66 -110 -40 1 -29 21 81 72 63 103 86 44 51 40 -38 -49
2467d9K0n8j5L8JpM7K8oK3N4k8oL6m2l4J8l8m8KJ4k4lL2J1J4M6J5oM0J0l1OLm0
$$ -49 -29 -87 -102 -64 -63 -70 -23 5 -1 22 76 48 42 78 36 2 20 -18 -66 -64 -50 -74 -77 -45 -34 -20 26 41 35 75 85 54 60 63 23
2502B3l1J5k0m3J6J0k5J3L9pJ3L7Lj2kJ5l0qJ4l3k8J8om0K5%nK1K1KRJ3J5j6J5
$$ 23 -8 7 -13 -56 -40 -30 -55 -42 -3 -10 3 40 43 31 29 44 14 6 20 -13 -41 -23 -29 -69 -44 -44 -49 -28 -7 -5 4 17 32 16 31
2537C1Pj3mj3k1NKk0j4J8J0j5QL4noM2j0%J4j3j3lpk3k0%kl7K3J6rJ5J8JJ0L5
$$ 31 38 25 21 8 -13 -8 -6 -26 -40 -22 -12 -27 -19 15 10 4 46 36 36 50 37 24 21 14 -9 -29 -29 -31 -68 -45 -29 -38 -23 -5 -4 6 41
2574D1ppJ0Nl3j0Kl8j8J9j2oJ4K0LK2L1QOL4j2l3J3l5k4j6%l3kJ3krL9J7j4N1
$$ 41 34 27 37 42 9 -1 1 -37 -55 -36 -48 -54 -40 -20 -17 5 36 44 50 84 72 39 52 17 -7 -23 -23 -56 -58 -45 -47 -56 -17 0 -14 37
2610C7K3k1J1nk2l5J1k7l5jJ1k0RM2j7J4M8J5pL2Nk3j3Qm0l7L7l3k7L1Pk1L6M1
$$ 37 60 39 50 45 23 -12 -1 -28 -63 -64 -53 -73 -64 -22 -39 -25 23 38 31 63 68 45 32 40 0 -37 0 -33 -60 -29 -22 -43 -7 34
2644C4j1J4L0k3j6J3Mn8J0J2n1jK5k2j1L9nlK7J1k0K5K6n0j4L4k2k9K1j0k8J4
$$ 34 23 37 67 44 28 41 45 -13 -3 9 -42 -43 -18 -40 -51 -12 -17 -20 7 18 -2 23 49 -1 -15 19 -3 -32 -11 -21 -49 -35
2676c5K4j1KL3Jj5M0Lm1L9J0n9OL2k7k7M2j0l2L5J5m6K4L0k2k4N2j5m6K7J0m0
$$ -35 -11 -22 -20 13 14 -1 39 42 1 40 50 -9 -3 29 2 -25 17 7 -25 10 25 -21 3 33 11 -13 39 24 -22 5 15 -25
2708b5J6L0m4PL2l9j0K6Om0J7L2k5%L1k1k1N8j3l5L1K5m5OL2k1k7K9pk7K7K3m7
$$ -25 -9 21 -23 -16 16 -23 -33 -7 -1 -41 -24 8 -17 -17 14 -7 -28 30 17 -18 13 38 -7 -1 31 10 -17 12 5 -22 5 28 -19
2741a9L0L3l1j9N2k0k3K3jm0LJ9m0qM2k4j5M4Rk7J1K4l1J4K4m6j3L7j2l6K3J3
$$ -19 11 44 13 -6 46 26 3 26 25 -15 -12 7 -33 -41 1 -23 -38 6 15 -12 -1 23 -8 6 30 -16 -29 8 -4 -40 -17 -4
2773dl1OM1lj8M6j9%K1J0m0OJ2l4pL6l3k0L2J0k2J3K2j7jK7k6k9M8k2l4J9kl4
$$ -4 -35 -29 12 9 -9 37 18 18 39 49 9 15 27 -7 -14 22 -11 -31 1 11 -11 2 24 7 6 33 7 -22 26 4 -30 -11 -13 -47
2807d7JL2j9j0N2ql1M9Jk8J4J5k8j0K7l4k0L3kk4K9L2k8J5M2k4j4L4j3l6NJ9n4
$$ -47 -46 -14 -33 -43 9 1 -30 19 20 -8 6 21 -7 -17 10 -24 -44 -11 -13 -37 -8 24 -4 11 53 29 15 49 36 0 5 24 -30
2840c0%L1m3OL8k2j0M3J0j6QJ6k5k1L0l0l7L6j6l6M1J7k2J6K7lj0M0Ql9J4J4n3
$$ -30 -30 1 -42 -36 2 -20 -30 13 23 7 15 31 6 -15 15 -15 -52 -16 -32 -68 -27 -10 -32 -16 11 8 -2 38 46 7 21 35 -18
2873a8MJ7l0j3L7j0j7M1K2l6K4M5l3mK1j9l9J9k1l3J1J7l7J0M1k0JM8j0j7L2M
$$ -18 -14 3 -27 -40 -3 -13 -30 11 33 -3 21 66 33 29 50 31 -8 11 -10 -43 -32 -15 -52 -42 -1 -21 -20 28 18 1 33 37
2905C7n0J4Rk6k4J2j9j9K7Rj0K3N3j7PL8l2k0L4j4l6Njm3%K3k2j4N3J0j4L9K3
$$ 37 -13 1 10 -16 -40 -28 -47 -66 -39 -30 -40 -17 36 19 26 64 32 12 46 32 -4 1 0 -43 -43 -20 -42 -56 -3 7 -7 32 55
2938E5l4J0J6l1j8Pk6k9J2%l8K2L4k8J9O1j5j1L9Om6OPl9j0J0k4j8M1krK2K4%
$$ 55 21 31 47 16 -2 5 -21 -50 -38 -38 -76 -54 -20 -48 -29 32 17 6 45 51 5 11 18 -21 -31 -21 -45 -63 -22 -24 -33 -11 13 13
2972A3J8L6k5oK6l3k5Kon2J1J4k1lM6k0K0L9Ok0J1K6l4k3J0k8l7J7qk9K7J7j8
$$ 13 31 67 42 36 62 29 4 6 0 -52 -41 -27 -48 -51 -5 -25 -5 34 40 20 31 57 23 0 10 -18 -55 -38 -46 -75 -48 -31 -49
3005d9L7L8k0J7L2k0j6J2ql0j1J3l0qL1k2jM2J0JJ3L6l0J0Ok9j6jl2l1L2j1k9
$$ -49 -12 26 6 23 55 35 19 31 23 -7 -18 -5 -35 -43 -12 -34 -35 7 17 18 31 67 37 47 53 24 8 7 -25 -56 -24 -35 -64
3038f4J0L5LrM1Mj7L0Lk5rjk1j6J3k7j6L7oqJ6L7j3K4L3k9lK5j7l8Ool3KJ6j2
$$ -64 -54 -19 -16 -25 16 20 3 33 36 11 2 1 -20 -36 -23 -50 -66 -29 -35 -43 -27 10 -3 21 54 25 22 47 30 -8 -2 -8 -41 -39 -23 -35
3074c5jK8KmM1J0j7LRk5rNk0k9J2pk9K2J8k0J7M0%j0M2j2k8J4Rk4k4J3k4j8L0
$$ -35 -36 -8 -6 -10 31 41 24 27 36 11 2 7 -13 -42 -30 -37 -66 -44 -26 -46 -29 11 11 1 43 31 3 17 26 2 -22 -9 -33 -51 -21
3109b1rrM9n%J3L7j8%Rk3j5knk0rjJlK7j0%L9qj5K5oj2kj1j6j7Rj5rJ1J1jJ5K1
$$ -21 -30 -39 10 5 5 18 55 37 37 46 23 8 6 1 -19 -28 -29 -28 -31 -4 -14 -14 25 17 2 27 21 9 7 -4 -20 -37 -28 -43 -52 -41 -30 -31 -16 5
3149EoJ4K2j0j1Qqk4OJ6l5JJ1njL5Kk2L8Lj5%J0k2j2Mj0k4NPj4PJ3j0NK3Rj7J2
$$ 5 -1 13 35 25 14 22 14 -10 -4 12 -23 -22 -11 -16 -17 18 20 -2 36 39 24 24 34 12 0 4 -6 -30 -25 -18 -32 -25 -12 -22 -17 6 15 -2 10
3188A0J1l5J3%k8J5j3%j2K2Rj0J5K2j5MJ8kj1K3j6j7Nmj4j0K1j3KJ9mj9L0Lj1
$$ 10 21 -14 -1 -1 -29 -14 -27 -27 -39 -17 -8 -18 -3 19 4 8 26 24 13 36 20 3 8 4 -10 -20 1 -12 -10 9 5 -14 16 19 8
3223HRJj6kj0nj4J3%j7%K2j2kL4j1ORj2j0J1Lk5J2qQj1J8%l0M5qLPRpoJ4j7j2
$$ 8 17 18 2 0 -10 -15 -29 -16 -16 -33 -33 -11 -23 -25 9 -2 4 13 1 -9 2 5 -20 -8 -16 -8 -19 -1 -1 -31 14 6 9 16 25 18 12 26 9 -3
3263cRlk0J4J3l0J4J5j0M%moJ4Mk3Nrj4LMqpK3Nj2K2Mj1J3jrj3K4j5oP%lOlOQ
$$ -3 6 3 -17 -3 10 -20 -6 9 -1 3 3 -1 -7 7 11 -12 -7 -16 -30 -27 -23 -31 -38 -15 -10 -22 0 4 -7 6 5 -4 -17 7 -8 -14 -7 -7 -10 -4 -7 -1 7
3306GJ2%n%Qj2J4ok0j5J2qj4PJ1oNJ5j0OJ5j3j5J7nj9kJ3k9QJpK1NlNK8kj2J1
$$ 7 19 19 14 14 22 10 24 18 -2 -17 -5 -13 -27 -20 -9 -15 -10 5 -5 1 16 3 -12 5 0 -19 -21 -8 -37 -29 -28 -35 -14 -9 -12 -7 21 19 7 18
3346A8J0j5j5J5rj1Lj9%L4roJ4K5k0RJ4j0j0mkl1mJj3NLMmJ7PKJ2RknPl0rNmj0
$$ 18 28 13 -2 13 4 -7 -4 -23 -23 11 2 -4 10 35 15 24 38 28 18 14 12 -19 -23 -22 -35 -30 -27 -23 -27 -10 -3 -1 11 20 18 13 20 -10 -19 -14 -18 -28
3388b8MplJ1K5MKK4klJ1lmmk3j0lMj2lJ0joK2J7j9K2Ojj2Kj2j8j5lk3J0J2j7J1
$$ -28 -24 -31 -34 -23 2 6 8 32 30 27 38 35 31 27 4 -6 -9 -5 -17 -20 -10 -11 -17 5 22 3 25 31 30 18 20 8 -10 -25 -28 -51 -41 -29 -46 -35
3428c5J8%K5KNpK2Kk8j2Mj8%pkj1K0J4KK0NMNJ0j1Nj1nk1mj0k2QPNj3K7J1mJ4
$$ -35 -17 -17 8 10 15 8 30 32 4 -8 -4 -22 -22 -29 -31 -42 -22 -8 -6 14 19 23 28 38 27 32 21 16 -5 -9 -19 -41 -33 -26 -21 -34 -7 4 0 14
3468A4J2j2QMk5j2mrk4J0lKj2K7NJ1L3Kj3K5%j7knj5k7J3pj3J0J0KK9L%RJ8qj4
$$ 14 26 14 22 26 1 -11 -15 -24 -48 -38 -41 -39 -51 -24 -19 -8 25 27 14 39 39 22 20 15 0 -27 -14 -21 -34 -24 -14 -12 17 20 20 29 47 39 25
3507B5Nj5j1j3rj8pJ1oOK2oK0QjRNOk3lJk7j6QnqJ7NNPK6RjJ3Mj2Jpk2j0Kj0j2
$$ 25 30 15 4 -9 -18 -36 -43 -32 -38 -32 -10 -16 4 12 11 20 25 31 8 5 6 -21 -37 -29 -34 -42 -25 -20 -15 -8 18 27 26 39 43 31 32 25 3 -7 -5 -15 -27
3550b7QrJ8J5PqJ5J6j4Qnj2k7%nj9rJ8k4RK5JJ1L2oRNpj6Nj1pk4J7j4nJ0lJ3J2
$$ -27 -19 -28 -10 5 12 4 19 35 21 29 24 12 -15 -15 -20 -39 -48 -30 -54 -45 -20 -19 -8 24 18 27 32 25 9 14 3 -4 -28 -11 -25 -30 -20 -23 -10 2
3590BK0nJ0K6j9mJ1k6k4%mk0jJ4j4J6J8pOJ9J0rN%j6j4rj3qpKmQK0JK5J2MpJ6
$$ 2 22 17 27 53 34 30 41 15 -9 -9 -13 -33 -34 -20 -34 -18 0 -7 -1 18 28 19 24 24 8 -6 -15 -28 -36 -43 -41 -45 -37 -17 -16 9 21 25 18 34
3630C4Ok5%oj5lmqqJ6%oL7lkJ2J4j0oKok2mj2j1mj1OMJ5qK3K4j5PJ8rk6Nok0%
$$ 34 40 15 15 9 -6 -9 -13 -21 -29 -13 -13 -19 18 15 13 25 39 29 23 25 19 -3 -7 -19 -30 -34 -45 -39 -35 -20 -28 -5 19 4 11 29 20 -6 -1 -7 -27 -27
3672b7j0lJJ5J3NPJ4JJ3J3j6Oprj5Pmk4%NqJ2jPJJ8M%Qmj5oQk7j6JOk1K1kmK6
$$ -27 -37 -40 -39 -24 -11 -6 1 15 16 29 42 26 32 25 16 1 8 4 -20 -20 -15 -23 -11 -12 -5 -4 14 18 18 26 22 7 1 9 -18 -34 -33 -27 -48 -27 -29 -33 -7
3715gkRnPJ0j4RJj4j%k3J6KnMMJ9%QNoLRk5J1mnk1jPrqK2j3OK3rOnKKnj4lrNk3
$$ -7 -9 0 -5 2 12 -2 7 8 -6 -7 -7 -30 -14 -12 -17 -13 -9 10 10 18 23 17 20 29 4 15 11 6 -15 -16 -9 -18 -26 -4 -17 -11 12 3 9 4 6 8 3 -11 -14 -23 -18 -41
3763d1J4NRlJ2OMPnKpJ7kk0JNppJ2j4QK1pMoJ7jk4Pj3rJ0j6j0LQMJ5RnmK0k8R
$$ -41 -27 -22 -13 -16 -4 2 6 13 8 10 3 20 18 -2 -1 4 -3 -10 2 -12 -4 17 10 14 8 25 24 0 7 -6 -15 -5 -21 -31 -28 -20 -16 -1 8 3 -1 19 -9 0
3807@Oqj2joj6NK2k1QK0kKK3KnJ6qrqMj3j2NKj7J6NkJ2K4j2nJ8lj6pj9onj0j4
$$ 0 6 -2 -14 -15 -21 -37 -32 -10 -31 -23 -3 -5 -3 20 22 17 33 25 16 8 12 -1 -13 -8 -6 -23 -7 -2 -4 8 32 20 15 33 30 14 7 -12 -18 -23 -33 -47
3849d7OMjJ5J8NkK0Rjj3Krj9jorNOj0J0J1J8KJ8J1j2J8jj2j9oj2j6Pj9KmJ7oJ0
$$ -47 -41 -37 -38 -23 -5 0 -2 18 27 26 13 15 6 -13 -14 -20 -29 -24 -18 -28 -18 -7 11 13 31 42 30 48 47 35 16 10 -2 -18 -11 -30 -28 -32 -15 -21 -11
3890a1K6mJ1J2Ok2Ok8j7%k1qJpOJK1J1J6K4LJ3j1%j0pKj7j9qlj5ML0NJ1K4jJ4
$$ -11 15 11 22 34 40 18 24 -4 -21 -21 -42 -50 -49 -56 -50 -49 -28 -17 -1 23 26 39 28 28 18 11 13 -4 -23 -31 -34 -49 -45 -15 -10 1 25 24 38
3929C8RpoJk3pj1j1j1qkj3J0K8j0J6J1OJ1mQKk1k4Pj9jj6lQJ1J0NJ0K5OK0Ljq
$$ 38 47 40 34 35 12 5 -6 -17 -28 -36 -38 -51 -41 -13 -23 -7 4 10 21 17 25 27 6 -18 -11 -30 -31 -47 -50 -42 -31 -21 -16 -6 19 25 45 48 47 39
3969C9j9Jj6rk7oRoOLK8j9L0K3%nkj3Mj2j9k2oOj7%pK0K2jJ7MJ1J0j2Jkok2jr
$$ 39 20 21 5 -4 -31 -37 -28 -34 -28 -25 3 -16 14 37 37 32 30 17 21 9 -10 -32 -38 -32 -49 -49 -56 -36 -14 -15 2 6 17 27 15 16 14 8 -14 -15 -24
4010b4j4QoJK0J1NJ8J1J1qK0j8lqj8j2j4jj7OKMJ1PjJ9oRQj2Jj1j7rj2nkj0K4
$$ -24 -38 -30 -36 -35 -15 -4 1 19 30 41 33 53 35 32 24 6 -6 -20 -21 -38 -32 -30 -26 -15 -8 -9 10 4 13 21 9 10 -1 -18 -27 -39 -44 -46 -56 -32
4050c2LNJ2OJ7J9kJnj0lj4kj3J3j7J2pLJ9KJ3jNlMpqmrj0j2LKpqJ5%J3jNNjKr
$$ -32 -29 -24 -12 -6 11 30 28 29 24 14 11 -3 -5 -18 -5 -22 -10 -17 -14 5 7 20 19 24 21 25 18 10 6 -3 -13 -25 -22 -20 -27 -35 -20 -20 -7 -8 -3 2 1 3 -6
4095fJ5j6JqoNqJNPnJ2J1JJ0kNQpk1Rqj0nOmnJ1j0J0J6mmNjmlpplkrPKJk%MJ6
$$ -6 9 -7 -6 -14 -20 -15 -23 -22 -17 -10 -15 -3 8 9 19 17 22 30 23 2 11 3 -7 -12 -6 -10 -15 -4 -14 -4 12 8 4 9 8 4 1 -6 -13 -16 -18 -27 -20 -18 -17 -19 -19 -15 1
4144AnKmJ9j2Kj0NlMq%jJ7oKKR%Ol%Jj0Rk2j%Lj0RnlpJ2lJ5nJj1J1j9LQrqQPq
$$ 1 -4 -2 -6 13 1 3 -7 -2 -5 -1 -9 -9 -10 7 1 3 5 14 14 20 17 17 18 8 17 -5 -6 -6 -3 -13 -4 -9 -12 -19 -7 -10 5 0 1 -10 1 -18 -15 -7 -16 -24 -16 -9 -17
4193a7lQPj4J5J4j4RPj6OlQp%Rj7J3Pj9JkJ6j3%J3nPmpj1K2k6mJ6j4pJJ5j9J8
$$ -17 -20 -12 -5 -19 -4 10 -4 5 12 -4 2 -1 7 0 0 9 -8 5 12 -7 -6 -8 8 -5 -5 8 3 10 6 -1 -12 10 -16 -20 -4 -18 -25 -24 -9 -28 -10
4234a0kKj0J9Ooj1J1k0K0Nj2L%oKkJ3Oj0J3jqK0j4jMQk5QLj5NmJ4j5Lj2NJ3jn
$$ -10 -12 -10 -20 -1 5 -1 -12 -1 -21 -1 4 -8 -5 -5 -11 -9 -11 2 8 -2 11 10 2 22 8 7 11 19 -6 2 5 -10 -5 -9 5 -10 -7 -19 -14 -1 -2 -7
4276g%RnrJ0lj2N%qnJ0mOJ2Rj1ROj1LK4j5j3K4ok3J5qk2J3K1k4RJ3j2NJ3pj2K3
$$ -7 -7 2 -3 -12 -2 -5 -17 -12 -12 -20 -25 -15 -19 -13 -1 8 -3 6 12 1 4 28 13 0 24 18 -5 10 2 -20 -7 14 -10 -1 12 0 5 18 11 -1 22
4317B2j0k0RKj6ljnmJ2lkKJ5j1OJ6llOomj4Op%OOoOKJ0J7%k0OJ8pMk6Pk9Rkj1
$$ 22 12 -8 1 3 -13 -16 -17 -22 -26 -14 -17 -19 -17 -2 -13 -7 9 6 3 9 3 -1 -15 -9 -16 -16 -10 -4 -10 -4 -2 8 25 25 5 11 29 22 26 0 7 -22 -13 -15 -26
4362b6J6J4j1j0J3KJ2jLj4Qj0j1o%nlKLj1J4J1%NOJpL7j8mMlk8RJ0k2J3kMLJ2
$$ -26 -10 4 -7 -17 -4 -2 10 9 12 -2 6 -4 -15 -21 -21 -26 -29 -27 -24 -35 -21 -10 -10 -5 1 2 -5 32 14 10 14 11 -17 -8 2 -20 -7 -9 -5 -2 10
4403A0jJJ2J3j9oJ8j6j3Mj1j6Plj1ONMnJ9lqL2j5l%Rj4j2Mk5PJ3okJ0J9pJ2K1
$$ 10 9 10 22 35 16 10 28 12 -1 3 -8 -24 -17 -20 -31 -25 -20 -16 -21 -2 -5 -13 19 4 1 1 10 -4 -16 -12 -37 -30 -17 -23 -25 -15 4 -3 9 30
4443C0qR%po%pk0NKj3oJ2jmK1%JNNk0JRj6k3K1j2k4K7rjnL0MMJ4J1j7kJ2k9J1
$$ 30 22 31 31 24 18 18 11 -9 -4 -2 -15 -21 -9 -10 -14 7 7 8 13 18 -2 -1 8 -8 -31 -10 -22 -46 -19 -28 -29 -34 -4 0 4 18 29 12 10 22 -7 4
4485Dlj8J1J0k4J1KJ4j3K0J7j7kJ5j8j4J7qqK%k7J0J2j3RJ3jj2J2Nj9JmoLMJ0
$$ 4 1 -17 -6 4 -20 -9 -7 7 -6 14 31 14 12 27 9 -5 12 4 -4 -2 -2 -29 -19 -7 -20 -11 2 1 -11 1 6 -13 -12 -16 -22 -19 -15 -5
4523ek8J9Nj6K1J3k4%K7j1JJ7kj2J7rj3PJ2j0jJ2j3j2J0%qJ0kjoPKpJ4j5j1OP
$$ -5 -33 -14 -9 -25 -4 9 -15 -15 12 1 2 19 17 5 22 13 0 7 19 9 8 20 7 -5 5 5 -3 7 5 4 -2 5 7 0 14 -1 -12 -6 1
4562Aj6jMqlOJ1j9J5Rj1J0NpKKj0MPRj2LQrPM%mjOMmQj7lNqqOj2jJ3Pj2J6Jmr
$$ 1 -15 -16 -12 -20 -23 -17 -6 -25 -10 -1 -12 -2 3 -4 -2 0 -10 -6 1 10 -2 1 9 0 7 11 11 7 6 12 16 12 20 3 0 5 -3 -11 -5 -17 -18 -5 2 -10 6 7 3 -6
4610fMOk1ONk6J8Lk5K0NRj3J8kj1K3Jj5JJ3j0pO%j2J5LOpK3k5jJ9j1k1J9nj9K
$$ -6 -2 4 -17 -11 -6 -32 -14 -11 -36 -16 -11 -2 -15 3 1 -10 13 14 -1 0 13 3 -4 2 2 -10 5 8 14 7 30 5 4 23 12 -9 10 5 -14 -12
4650a2Ol1jK7j3MMJ5jJQk7PLj5qLK5k5J9Mj9K0J3j1J6J3j6mJ4j1j7OJjj0J2pQ
$$ -12 -6 -37 -38 -11 -24 -20 -16 -1 -2 -1 7 -20 -13 -10 -25 -33 -30 -5 -30 -11 -7 -26 -6 7 -4 12 25 9 5 19 8 -9 -3 -2 -3 -13 -1 -8 0
4689@J0Jj4J7Qk3NKj0j1%nqJ4O%j7J8kJLKj3K0qj6mJ6j1KJ6j2QJ3LjJMj3pK4k2
$$ 0 10 11 -3 14 22 -1 4 6 -4 -15 -15 -20 -28 -14 -8 -8 -25 -7 -9 -8 -5 -3 -16 4 -4 -20 -24 -8 -19 -17 -1 -13 -5 8 11 10 11 15 2 -5 19 -3
4731c%OLj8K5opkJ5%j3K6k2j8J4poLmj4JK0j4NJ0jmJ0Jjk3J9roKKNJ0pnPK7j7
$$ -3 -3 3 6 -12 13 7 0 -2 13 13 0 26 4 -14 0 -7 -13 -10 -14 -28 -27 -7 -21 -16 -6 -7 -11 -1 0 -1 -24 -5 -14 -20 -18 -16 -11 -1 -8 -13 -6 21 4
4774DpK6j6pLJ0j5QMk5QJ9j1jJ1qJMoj3LklrJ2Oj6qK0jJJ1j8Nj0K1j6k%PoR%o
$$ 4 -3 23 7 0 3 13 -2 6 10 -15 -7 12 1 0 11 3 4 8 2 -11 -8 -10 -13 -22 -10 -4 -20 -28 -8 -9 -8 3 -15 -10 -20 1 -15 -17 -17 -10 -16 -7 -7 -13
4818a3K3j4LJ6orJ2LplQnLkrnJ3NooNj8kK2j2j6QOj9J4kj0J6JJJmOmmKqKR%j4
$$ -13 10 -4 -1 15 9 0 12 15 8 5 13 8 11 9 0 -5 8 13 7 1 6 -12 -14 8 -4 -20 -12 -6 -25 -11 -13 -23 -7 -6 -5 -4 -8 -2 -6 -10 -8 -16 -14 -5 -5 -19
4864a9J8Oj8J4J6k1J4KJkRk0j1J5jj7PJ0j1%J0K%Nkj4j2K0j0j1OJqoPoKJ4koK4
$$ -19 -1 5 -13 1 17 -4 10 12 13 11 20 0 -11 4 3 -14 -7 3 -8 -8 2 4 4 9 7 -7 -19 1 -9 -20 -14 -13 -21 -27 -20 -26 -24 -10 -12 -18 6
4905Fj7KK2mj5nK4l1J2JKnRKmK5jmklj4jMNj3%%oMJ2pqRn%%j1NLOj3nJ6n%mJ5
$$ 6 -11 -9 13 9 -6 -11 13 -18 -6 -5 -3 -8 1 3 -1 24 23 19 17 14 0 -1 3 8 -5 -5 -5 -11 -7 5 -2 -10 -1 -6 -6 -6 -17 -12 -9 -3 -16 -21 -5 -10 -10 -14 1
4952Ak3K1Jj0PK1j8qJ1qPMOj0NOj3PjJkMKnoJ3j3NJ6k4jjnMj0RpmJ3ommOmMJ3
$$ 1 -22 -1 0 -10 -3 18 0 -8 3 -5 2 6 12 2 7 13 0 7 6 7 5 9 11 6 0 13 0 5 21 -3 -4 -5 -10 -6 -16 -7 -14 -18 -5 -11 -15 -19 -13 -17 -13 0
4998@j4RQj5JP%qQNj2P%RkPkpJ2jpJJ1qj3J2j2nOJLlQpoJ5j7oJ1lnj7OJ2j1Rj0
$$ 0 -14 -5 3 -12 -11 -4 -4 -12 -4 1 -11 -4 -4 5 3 10 8 1 13 12 5 6 17 9 -4 8 -4 -9 -3 -2 1 -2 6 -1 -7 8 -9 -15 -4 -7 -12 -29 -23 -11 -22 -13 -23
5045b3QJ7j0j6K3MqJ6jj4jJ5qj3K1oj0J0RkmOKj0J3%j2nPj5JNj4pJ7mqJ5rJNN
$$ -23 -15 2 -8 -24 -1 3 -5 11 10 -4 -5 10 2 -11 10 4 -6 4 13 11 7 13 15 5 18 18 6 1 8 -7 -6 -1 -15 -22 -5 -9 -17 -2 -11 -10 -5 0
5087@nj3J6rj3J6J5k7MJ9j9RJ0qLJ3Rk3J4KlqJ3oj6L0kk3LJ0j4nJ0r%J2Lj7J5
$$ 0 -5 -18 -2 -11 -24 -8 7 -20 -16 3 -16 -7 3 -5 -2 11 20 -3 11 13 10 2 15 9 -7 23 21 -2 1 11 -3 -8 2 -7 -7 5 8 -9 6
5126FLj7N%j0rJ4konOkPJ1j5%J7m%J9rmlJjpRnJLlrK1J4k1QJ2k3N%lj1NOj7MN
$$ 6 9 -8 -3 -3 -13 -22 -8 -10 -16 -21 -15 -17 -10 1 -14 -14 3 -1 -1 18 9 5 2 3 2 -5 4 -1 0 3 0 -9 12 26 5 13 25 2 7 7 4 -7 -2 4 -13 -9 -4
5173dmrJ9j2pJ5Pk4JJ7j2OQl1KK0n%%NMMJ2qnNrMJ5qj2OQj2NJ0jjQmj5J6%j6P
$$ -4 -8 -17 2 -10 -17 -2 5 -19 -18 -1 -13 -7 1 -30 -28 -8 -13 -13 -13 -8 -4 0 12 4 -1 4 -5 -1 14 6 -6 0 8 -4 1 11 10 9 17 13 -2 14 14 -2 5
5218Elj4j3J1Kj1OJ7k2QJ2j4mJ5Nk8K2Pj7Rjj3RJ7ojQPj6J3%j1JJ8j8oJ2LomK0
$$ 5 2 -12 -25 -14 -12 -23 -17 0 -22 -14 -2 -16 -20 -5 0 -28 -6 1 -16 -7 -8 -21 -12 5 -1 -2 6 13 -3 10 10 -1 0 18 0 -6 6 9 3 -1 19
5259A9k1J2J1j7j0J8pj5OMj7KK2l3J2Q%j2QJ0j1lJ0j7%K1nk9K6Kj0OK6k5MJ5p
$$ 19 -2 10 21 4 -6 12 5 -10 -4 0 -17 -15 7 -26 -14 -6 -6 -18 -10 0 -11 -14 -4 -21 -21 0 -5 -34 -8 -6 -16 -10 16 -9 -5 10 3
5296CoJ8orJ7mj9J5Qk2MJ0jmQMk8J9jj1jKj0rJ9qKJJ4j7JK1j2k1J5kj4J5Oj5J
$$ 3 -3 15 9 0 17 13 -6 9 17 -5 -1 9 8 4 12 16 -12 7 6 -5 -6 -4 -14 -23 -4 -12 -10 -9 5 -12 -11 10 -2 -23 -8 -10 -24 -9 -3 -18 -17
5337a7K5j6lL2j5j0K6pk0J8%j0j5J6jrK5j0j8J1J3j7J8mk1%J1j5kQlj3NJ1k2J2
$$ -17 8 -8 -11 21 6 -4 22 15 -5 13 13 3 -12 4 3 -6 19 9 -9 2 15 -2 16 12 -9 -9 2 -13 -15 -7 -10 -23 -18 -7 -29 -17
5373a7L3k0j8K2kj9J7lj5KJ7k1%K3%pJ3J4j2J1J8k0rK3k6j3RKnrK6k7J6K1j4r
$$ -17 16 -4 -22 0 -2 -21 -4 -7 -22 -20 -3 -24 -24 -1 -1 -8 5 19 7 18 36 16 7 30 4 -9 0 2 -3 -12 14 -13 3 24 10 1
5409AK4j7Mj2J0k5j8J8oj1J5Kj5L1%j7LK0rj3J7j5j2K6j5j6J6K2l2J9J5Mj0J8
$$ 1 25 8 12 0 10 -15 -33 -15 -21 -32 -17 -15 -30 1 1 -16 -13 7 -2 -15 2 -13 -25 1 -14 -30 -14 8 -24 -5 10 14 4 22
5443B2qk1K0J5l3JJ8k3rJ7%k5L3Kq%J6k4nJ2kk6J2Ol1RK4k3J0J6lj1K2J5j7nJ2
$$ 22 14 -7 13 28 -5 -4 14 -9 -18 -1 -1 -26 7 9 1 1 17 -7 -12 0 -2 -28 -16 -10 -41 -32 -8 -31 -21 -5 -8 -19 3 18 1 -4 8
5480Hk0jJ7j0j1K7Ok3PJ2j5J5J1k6OJ8j5j6J5pk0J8J0k0KK6k3oJ6kk3J3Oj1rK3
$$ 8 -12 -13 4 -6 -17 10 16 -7 0 12 -3 12 23 -3 3 21 6 -10 5 -2 -22 -4 6 -14 -12 14 -9 -15 1 -1 -24 -11 -5 -16 -25 -2
5516bk3j5L8j9oK5Qk8K0J0j5pK6k5qK4%k6J8J4j9NK8j2j1K7pk8J6Jk8KK0l3lL0
$$ -2 -25 -40 -2 -21 -27 -2 6 -22 -2 8 -7 -14 12 -13 -21 3 3 -23 -5 9 -10 -5 23 11 0 27 20 -8 8 9 -19 -17 3 -30 -33 -3
5552cj2j8L9Lj5J5mj8NJ5l0j5QRj5K1Jj9PM0j2j0K7mpOjl3J4K0l7PK1ojK1%nJ5
$$ -3 -15 -33 6 9 -6 9 5 -13 -8 7 -23 -38 -30 -21 -36 -15 -14 -33 -26 14 2 -8 19 15 8 14 13 -20 -6 14 -23 -16 5 -1 -2 19 19 14 29
5591B9J1l2kK2k1k3K9k6k1J3Rk0J8J9j5JL0j4k2K8Kl1qJ4k1j5K7rrK8nRKM0m0
$$ 29 40 8 6 28 7 -16 13 -13 -34 -21 -12 -32 -14 5 -10 -9 21 7 -15 13 15 -16 -24 -10 -31 -46 -19 -28 -37 -9 -14 -5 -3 37 -3
5626cJ1K8k6k3K9ql3J9Rk7J8K9k4jL2j1k3K9Mk5%lj1k3K2pj7K6prJ6Qj0NL1l5
$$ -3 8 36 10 -13 16 8 -25 -6 3 -24 -6 23 -1 -2 30 19 -4 25 29 4 4 1 -10 -33 -11 -18 -35 -9 -16 -25 -9 -1 -11 -6 25 -10
5662a0mJ0oq%J0k6K4J2k0J0K7mk0L1Rk5%K2l9mK0j0k2K3Oj2J3J4j8mJ2%k6K2n
$$ -10 -14 -4 -10 -18 -18 -8 -34 -10 2 -18 -8 19 15 -5 26 35 10 10 32 -7 -11 9 -1 -23 0 6 -6 7 21 3 -1 11 11 -15 7 2
5698Bl5K1J0l4NK5j9j2M7nl2K8Qk8LJ9j6oJ8j1k5L2JoJ6K5k9RJ1pj9L2nl5K5q
$$ 2 -33 -12 -2 -36 -31 -6 -25 -37 10 5 -27 1 9 -19 -16 3 -13 -19 -1 -12 -37 -5 -4 -10 6 31 2 11 22 15 -4 28 23 -12 13 5
5734Ek0J3J6onJ9pk0K6kk5KLk1oJ8j2k9L5Qj3J4J7k1JK6j2j3J4mk2J2Rk5J8J9
$$ 5 -15 -2 14 8 3 22 15 -5 21 19 -6 -4 -1 -22 -28 -10 -22 -51 -16 -8 -21 -7 10 -11 -10 16 4 -9 5 1 -21 -9 0 -25 -7 12
5770A2j1rL0%j9K5Ll8K2Ok2mJ3j6rJ6Oj3QJ5k1PJ0j6j2K3j4k2J2%k0RK2k3RK2
$$ 12 1 -8 22 22 3 28 31 -7 15 21 -1 -5 8 -8 -17 -1 5 -8 0 15 -6 1 11 -5 -17 6 -8 -30 -18 -18 -38 -29 -7 -30 -21 1
5806ALj7K2kk3J5Pk7KJ8rj4L5krJ7kj8QK4j5j2J1j1k9L4mk0NJ8k3kM5j9k1J7N
$$ 1 4 -13 9 7 -16 -1 6 -21 -19 -1 -10 -24 11 9 0 17 15 -3 5 29 14 2 13 2 -27 7 3 -17 -12 6 -17 -19 26 7 -14 3 8
5843Hk7KNqj0J4rj2K6Oj2PJ6j3MK2j9j8K1pj8K7Jk2J0J2Lj8L0lj2J7Jj9mQk6n
$$ 8 -19 -17 -12 -20 -30 -16 -25 -37 -11 -5 -17 -10 6 -7 -3 19 0 -18 3 -4 -22 5 6 -16 -6 6 9 -9 21 18 6 23 24 5 1 9 -17 -22
5881b2L0j5j5K3Kk9K2J7k3LJ3j8LMoj7PMj8RJ7j6nM3k6PK1lk4QJ1j6j8K3nk5L9
$$ -22 8 -7 -22 1 3 -26 -4 13 -10 -7 6 -12 -9 -5 -11 -28 -21 -17 -35 -26 -9 -25 -30 13 -13 -6 15 12 -12 -4 7 -9 -27 -4 -9 -34 5
5918Ekj1J3J8j8JJ1mj6J7j1k5J4Lk6jL0k1lK8j4oK0j2Mj2J0j8J4Kj5rK5Lk4K4
$$ 5 3 -8 5 23 5 6 17 13 -3 14 3 -22 -8 -5 -31 -32 -2 -23 -26 2 -12 -18 2 -10 -6 -18 -8 -26 -12 -10 -25 -34 -9 -6 -30 -6
5954fJ6k4J3J1mj3K7qj8J4mj0J2Kj6jK2Ok5K6nk0J5kj2qK6k9LOoj4J9Jj8J8rq
$$ -6 10 -14 -1 10 6 -7 20 12 -6 8 4 -6 6 8 -8 -9 13 19 -6 20 15 -5 10 8 -4 -12 14 -15 -12 -6 -12 -26 -7 -6 -24 -6 -15 -23
5992b3mK4Kj9J0LpJK1k8NRPj7K7J2k9RJ7k2PJ3j7mJ9nk1J2J3j3jJ5j7j1J8mk8
$$ -23 -27 -3 -1 -20 -10 -7 -14 -13 8 -20 -15 -6 1 -16 11 23 -6 3 20 -2 5 18 1 -3 16 11 -10 2 15 2 1 16 -1 -12 6 2 -26
6029b6K0Lj8POr%J5j1rJ7J6k7NKnMJj1mL1j2j0RJ6j7J1Qj4jK2pmPj2j1RJ3j3n
$$ -26 -6 -3 -21 -14 -8 -17 -17 -2 -13 -22 -5 11 -16 -11 -9 -14 -10 -9 -20 -24 7 -5 -15 -6 10 -7 4 12 -2 -3 19 12 8 15 3 -8 1 14 1 -4
$$ [...]
8191b
##END NTUPLES=NMR FID
##END=
