##TITLE=1H_SA_sl.SOH.5
 CDCl3, 8 sc, 
 29.9.2020
##JCAMPDX= 6.0         $$ Bruker NMR JCAMP-DX V2.0
##DATA TYPE= NMR FID
##DATA CLASS= NTUPLES
##ORIGIN= UXNMR, Bruker Analytische Messtechnik GmbH
##OWNER= root
$$ XWIN-NMR		Version 3.5
$$ Tue Sep 29 09:54:00 2020 Russian Standard Time (UT+4h)  she@DPX200
##.OBSERVE FREQUENCY= 200.1315066352
##.OBSERVE NUCLEUS= ^1H
##.DELAY= (6, 6)
##.ACQUISITION MODE= SIMULTANEOUS
##.ACQUISITION SCHEME= undefined
##.AVERAGES= 8
##.DIGITISER RES= 18
##SPECTROMETER/DATA SYSTEM= spect
##.PULSE SEQUENCE= zg30
##.SOLVENT NAME= CDCl3
##.SHIFT REFERENCE= (INTERNAL, CDCl3, 0, 15.7039)
##AUDIT TRAIL= $$ (NUMBER, WHEN, WHO, WHERE, WHAT)
$$ ##TITLE= Audit trail, XWIN-NMR		Version 3.5
$$ ##JCAMPDX= 5.01
$$ ##ORIGIN= Bruker BioSpin GmbH
$$ ##OWNER= she
$$ F:/spectra/data/she/nmr/H-F/1/audita.txt
$$ ##AUDIT TRAIL=  $$ (NUMBER, WHEN, WHO, WHERE, WHAT)
(   1,<2020-09-29 09:52:18.68 +0400>,<she>,<DPX200>,
      <created by zg, POWCHK disabled, PULCHK disabled
       configuration hash MD5:
       00 E9 B6 7A A2 85 ED C7 34 08 36 98 17 FE 4E 26
       data hash MD5: 16K
       3E 2B 72 4C 3B 3F 5E 96 2C E2 FA ED ED 6B 2C 69>)
$$ ##END=
$$ 
$$ hash MD5
$$ 29 34 9B 39 12 50 0D 6B CA 7C 83 04 60 8E E1 45
##$RELAX= 
##$RELAX= 
##$RELAX= 
##$RELAX= 
##$RELAX= 
##$RELAX= 
$$ Bruker specific parameters
$$ --------------------------
##$DU= <F:/spectra>
##$EXPNO= 1
##$NAME= <H-F>
##$PROCNO= 1
##$TYPE= <nmr>
##$USER= <she>
##$AMP= (0..31)
100 100 100 100 100 100 100 100 100 100 100 100 100 100 100 100 100 100 
100 100 100 100 100 100 100 100 100 100 100 100 100 100 
##$AQSEQ= 0
##$AQ_mod= 1
##$AUNM= <au_zg>
##$AUTOPOS= <>
##$BF1= 200.13
##$BF2= 200.13
##$BF3= 200.13
##$BF4= 200.13
##$BF5= 200.13
##$BF6= 200.13
##$BF7= 200.13
##$BF8= 200.13
##$BYTORDA= 1
##$CFDGTYP= 0
##$CFRGTYP= 5
##$CHEMSTR= <none>
##$CNST= (0..31)
1 1 145 1 1 1 1 1 1 1 1 1 1 1 1 1 1 1 1 1 1 1 1 1 1 1 1 1 1 1 1 1 
##$CPDPRG= <>
##$CPDPRG1= <>
##$CPDPRG2= <>
##$CPDPRG3= <>
##$CPDPRG4= <mlev>
##$CPDPRG5= <mlev>
##$CPDPRG6= <mlev>
##$CPDPRG7= <mlev>
##$CPDPRG8= <mlev>
##$CPDPRGB= <>
##$CPDPRGT= <>
##$D= (0..31)
0 1.2 0 0 0 0 0 0 0 0.06 0 0.03 0 0 0 0 0.0002 0 0 0 0 0 0 0 0 0 0 0 0 
0 0 0 
##$DATE= 1601358738
##$DBL= (0..7)
120 120 120 120 120 120 120 120 
##$DBP= (0..7)
150 150 150 150 150 150 150 150 
##$DBP07= 0
##$DBPNAM0= <>
##$DBPNAM1= <>
##$DBPNAM2= <>
##$DBPNAM3= <>
##$DBPNAM4= <>
##$DBPNAM5= <>
##$DBPNAM6= <>
##$DBPNAM7= <>
##$DBPOAL= (0..7)
0.5 0.5 0.5 0.5 0.5 0.5 0.5 0.5 
##$DBPOFFS= (0..7)
0 0 0 0 0 0 0 0 
##$DE= 6
##$DECBNUC= <off>
##$DECIM= 32
##$DECNUC= <off>
##$DECSTAT= 4
##$DIGMOD= 1
##$DIGTYP= 9
##$DL= (0..7)
0 120 120 120 120 120 120 120 
##$DP= (0..7)
150 150 150 150 150 150 150 150 
##$DP07= 0
##$DPNAME0= <>
##$DPNAME1= <>
##$DPNAME2= <>
##$DPNAME3= <>
##$DPNAME4= <>
##$DPNAME5= <>
##$DPNAME6= <>
##$DPNAME7= <>
##$DPOAL= (0..7)
0.5 0.5 0.5 0.5 0.5 0.5 0.5 0.5 
##$DPOFFS= (0..7)
0 0 0 0 0 0 0 0 
##$DQDMODE= 0
##$DR= 18
##$DS= 0
##$DSLIST= <SSSSSSSSSSSSSSS>
$$ [...]
##$SUBNAM2= <"">
##$SUBNAM3= <"">
##$SUBNAM4= <"">
##$SUBNAM5= <"">
##$SUBNAM6= <"">
##$SUBNAM7= <"">
##$SUBNAM8= <"">
##$SUBNAM9= <"">
##$SW= 16.880792210976
##$SWIBOX= (0..15)
0 0 2 0 0 0 0 0 0 0 0 0 0 0 0 0 
##$SW_h= 3378.37837837838
##$TD= 16384
##$TD0= 1
##$TE= 0
##$TE2= 300
##$TE3= 300
##$TEG= 300
##$TL= (0..7)
0 120 120 120 120 120 120 120 
##$TP= (0..7)
150 150 150 150 150 150 150 150 
##$TP07= 0
##$TPNAME0= <>
##$TPNAME1= <>
##$TPNAME2= <>
##$TPNAME3= <>
##$TPNAME4= <>
##$TPNAME5= <>
##$TPNAME6= <>
##$TPNAME7= <>
##$TPOAL= (0..7)
0.5 0.5 0.5 0.5 0.5 0.5 0.5 0.5 
##$TPOFFS= (0..7)
0 0 0 0 0 0 0 0 
##$TUNHIN= 0
##$TUNHOUT= 0
##$TUNXOUT= 0
##$USERA1= <user>
##$USERA2= <user>
##$USERA3= <user>
##$USERA4= <user>
##$USERA5= <user>
##$V9= 5
##$VALIST= <valist>
##$VCLIST= <CCCCCCCCCCCCCCC>
##$VD= 0
##$VDLIST= <DDDDDDDDDDDDDDD>
##$VPLIST= <PPPPPPPPPPPPPPP>
##$VTLIST= <TTTTTTTTTTTTTTT>
##$WBST= 1024
##$WBSW= 4
##$XGAIN= (0..3)
0 0 0 0 
##$XL= 0
##$YL= 0
##$YMAX_a= 291114
##$YMIN_a= -242697
##$ZGOPTNS= <>
##$ZL1= 120
##$ZL2= 120
##$ZL3= 120
##$ZL4= 120
##$ABSF1= 10
##$ABSF2= 0
##$ABSG= 5
##$ABSL= 3
##$ALPHA= 0
##$AQORDER= 0
##$ASSFAC= 0
##$ASSFACI= 0
##$ASSFACX= 0
##$ASSWID= 0
##$AUNMP= <proc_1d>
##$AZFE= 0.1
##$AZFW= 0.1
##$BCFW= 1
##$BC_mod= 2
##$BYTORDP= 1
##$COROFFS= 0
##$CY= 11.3945322036743
##$DATMOD= 1
##$DC= 2
##$DFILT= <>
##$DTYPP= 0
##$F1P= 16.9975609425685
##$F2P= -3.02152046262296
##$FCOR= 0.5
##$FTSIZE= 0
##$FT_mod= 4
##$GAMMA= 1
##$GB= 0.15
##$INTBC= 1
##$INTSCL= 1
##$ISEN= 128
##$LB= 0.24
##$LEV0= 0
##$LPBIN= 0
##$MAXI= 10000
##$MC2= 0
##$MEAN= 0
##$ME_mod= 0
##$MI= 1.114404
##$NCOEF= 0
##$NC_proc= 0
##$NLEV= 6
##$NOISF1= 3.799351
##$NOISF2= 2.8
##$NSP= 1
##$NTH_PI= 0
##$NZP= 0
##$OFFSET= 15.70392
##$PC= 1
##$PHC0= -9968.177
##$PHC1= 11.20089
##$PH_mod= 1
##$PKNL= yes
##$PPARMOD= 0
##$PSCAL= 0
##$PSIGN= 0
##$REVERSE= no
##$SF= 200.130013532006
##$SI= 16384
##$SIGF1= 3
##$SIGF2= 2
##$SINO= 400
##$SIOLD= 16384
##$SREGLST= <1H.CDCl3>
##$SSB= 0
##$STSI= 0
##$STSR= 0
##$SW_p= 3612.71676300578
##$SYMM= 0
##$S_DEV= 0
##$TDeff= 0
##$TDoff= 0
##$TI= <>
##$TILT= no
##$TM1= 0
##$TM2= 0
##$TOPLEV= 0
##$USERP1= <user>
##$USERP2= <user>
##$USERP3= <user>
##$USERP4= <user>
##$USERP5= <user>
##$WDW= 1
##$XDIM= 8192
##$YMAX_p= 0
##$YMIN_p= 0
$$ End of Bruker specific parameters
$$ ---------------------------------
##NTUPLES= NMR FID
##VAR_NAME=  TIME,          FID/REAL,        FID/IMAG
##SYMBOL=    X,             R,               I
##VAR_TYPE=  INDEPENDENT,   DEPENDENT,       DEPENDENT
##VAR_FORM=  AFFN,          ASDF,            ASDF
##VAR_DIM=   8192,          8192,            8192
##UNITS=     SECONDS,       ARBITRARY UNITS, ARBITRARY UNITS
##FACTOR=    0.000296,      1,               1
##FIRST=     0,             0,               0
##LAST=      2.424536,      0,               0
##MIN=       0,             -242697,         0
##MAX=       2.424536,      291114,          0
$$ Real data points
##PAGE= N=1
##DATA TABLE= (X++(R..R)), XYDATA
0 0 0 0 0 0 0 0 0 0 0 0 0 -4 8 -8 8 -8 16 -16 24 -25 32 -40 48 -56 66 -79 93 -106 124 -143 166 -190 215
33 215 -245 276 -314 353 -397 446 -497 554 -617 687 -762 845 -935 1031 -1140 1255 -1384
50 -1384 1523 -1677 1847 -2037 2245 -2480 2740 -3039 3378 -3772 4232 -4779 5444 -6267 7319
65 7319 -8715 10668 -13589 18574 -50998 291114 -42048 -145966 132040 -133298 35679
76 35679 -13341 -90236 138781 -70641 -92226 174816 -67559 -67704 93339 -3082 -2515 -20161
88 -20161 -47632 102815 -26298 -87768 143219 -51914 -113029 142339 -32563 -45195 58060
99 58060 -59668 48200 15161 -81750 99697 -17970 -65344 82449 -45221 -36779 48280
110 48280 -11621 -5703 -9668 -23530 35806 6603 -37403 43628 -8192 -55063 67954 2858
122 2858 -60203 73386 -11337 -43710 48704 -37919 25398 10029 -78455 60555 1047 -63581
134 -63581 61338 -9905 -40628 30983 -22797 17780 -5223 -53410 76473 20 -89930 72601
146 72601 17343 -78288 66711 -10758 -48079 57505 -42162 25347 41888 -96284 62838
157 62838 50985 -97635 50611 21214 -37465 37884 -35057 27894 17820 -66074 76449
168 76449 10732 -87977 68423 19491 -46436 47896 -28972 -3237 50443 -54770 29454 39410
180 39410 -82555 47311 48170 -82487 35037 22461 -31724 32483 -29266 12469 30416 -54106
192 -54106 40861 23205 -72888 47096 24274 -49384 28096 -8347 -2314 24602 -43892 20097
204 20097 35278 -68792 23268 51012 -68378 10431 33954 -26414 8902 -16440 6123 28062
216 28062 -55090 21119 46141 -74112 23694 40403 -49270 19767 -3573 -10060 34517 -48000
228 -48000 7058 65152 -69743 -81 67064 -51493 1266 27892 -24027 20576 -9492 -6400
240 -6400 44195 -41505 882 55295 -51898 7568 30547 -31446 28950 -9314 -20094 51242
252 51242 -34447 -11337 57224 -56044 4147 50003 -50184 16208 25071 -35786 27001 640
264 640 -24274 32540 -27957 -1335 40005 -46541 9153 31964 -37437 16367 7173 -29320 27046
277 27046 -20323 -6039 41683 -55140 6371 54474 -55902 -2704 38127 -33833 6137 5470
289 5470 -13559 29110 -32224 -1569 49252 -47364 -12550 46965 -24767 -8051 12691 -9085
301 -9085 27600 -27632 -10152 59076 -47000 -22724 65044 -29384 -22306 36938 -13477 11264
313 11264 -4068 -19276 47259 -26371 -29145 58699 -17375 -30038 37069 -5842 795 850 -19694
326 -19694 41321 -18770 -32604 58273 -17979 -34246 47976 -13653 -14259 22644 -25910 22401
338 22401 3393 -38430 42475 -3339 -36743 38984 -6817 -23251 24735 -18542 6989 10531
350 10531 -30995 29601 -2159 -31667 39044 -11564 -31606 39346 -17156 -16403 28421 -27775
362 -27775 8247 13740 -30974 24876 -315 -33428 37276 -5747 -29750 32001 -10700 -5179
374 -5179 13318 -19659 19847 -1435 -27853 38180 -6231 -35416 42893 -7043 -22184 26592
386 26592 -16268 7420 12844 -31237 28506 8652 -42863 40771 6677 -38243 29782 -1206
398 -1206 -7479 12685 -20250 19221 8305 -35457 33280 6373 -37249 32707 320 -17430
410 -17430 19825 -14146 6052 14377 -29406 21726 13482 -40419 29866 9156 -33323 21988
422 21988 -2607 -9992 13435 -20332 13024 11403 -37707 29267 7709 -40237 29646 2213
434 2213 -23985 17224 -8351 149 12563 -28302 17383 15903 -41277 20604 18742 -32394 9059
447 9059 11543 -8089 5316 -13213 12872 13142 -37665 25017 21031 -41139 17199 18173 -17429
460 -17429 9205 -9188 5272 20410 -36422 14647 30810 -42529 9275 30323 -24970 -739
472 -739 9190 -4337 11860 -19680 3606 29747 -32709 3094 30817 -26644 1873 15373 -14056
485 -14056 13944 -11107 -4749 32023 -30420 106 33110 -31651 2446 21439 -22404 9630
497 9630 2315 -13074 21896 -17077 -7122 23992 -24625 358 19033 -27434 7008 14162 -24273
510 -24273 14344 -2452 -14796 22736 -19755 -4200 27138 -28227 1180 28235 -27042 3642
522 3642 16030 -14208 8133 -7010 2659 16455 -25137 5901 27122 -27399 -1131 21127
534 21127 -14668 4508 -2641 -2351 20094 -22299 -2547 35074 -29732 -11862 38316 -21201 -10297
547 -10297 17354 -6813 7463 -9758 -4400 28023 -20718 -14088 35432 -14356 -14504 17922 -2836
560 -2836 4184 -8617 -3818 24997 -19740 -14869 36550 -17741 -20084 29245 -10880 -7559 7220
573 7220 -9614 13320 -7447 -17554 26950 -9886 -21283 26496 -10556 -11231 12786 -10345 6273
586 6273 -2595 -14043 22319 -8455 -20427 30076 -11204 -18639 25354 -10191 -7518 11098 -9144
599 -9144 7306 675 -14365 20316 -5948 -16752 24198 -7064 -10770 13199 -4979 3217 1214
612 1214 -9657 19593 -6594 -17631 30949 -8586 -20063 25903 -4713 -11007 12822 -6774
624 -6774 4839 4318 -17310 19805 1476 -23250 20349 3321 -16308 9768 555 -1495 1509
637 1509 -10726 15457 -2083 -20089 23404 -3296 -19498 20214 -3492 -11432 12651 -10728
649 -10728 4275 7838 -21881 16245 5180 -24636 17514 3070 -19679 12484 -1577 -6476
661 -6476 5487 -11883 11353 -261 -20050 21595 -706 -22932 19371 222 -14724 12383
673 12383 -7432 2399 6349 -17564 16275 4767 -24672 18077 9451 -21863 9777 6374 -3976
686 -3976 741 -8315 17249 -157 -23452 22057 8125 -25195 13825 7500 -11215 7116 -7285
699 -7285 7655 7178 -23519 14806 15231 -28772 7927 18996 -18426 35 5439 1199 1171 -14085
713 -14085 11157 9574 -22353 7989 13381 -18187 4634 3724 -5452 7532 -13432 3996 14432
726 14432 -22803 3113 19232 -22087 620 13467 -14500 4695 14 -6224 9363 -9138
738 -9138 -2074 11783 -13819 1906 10165 -14607 7714 2247 -9471 11076 -6136 -3076 12862
751 12862 -14099 2776 15555 -21328 6405 15015 -18688 6346 8420 -9164 5049 -2331 660
764 660 9351 -15002 5604 14675 -18151 4311 9886 -8681 3381 -1929 830 10165 -16848 4365
778 4365 20243 -24266 926 21187 -15732 -3032 9346 -4349 3367 -6305 -1195 15171 -16141
791 -16141 -4241 18628 -11996 -6076 8152 -2088 459 -6611 -652 14599 -17667 -4281 22963
804 22963 -17681 -6915 17890 -10288 -3321 5748 -7459 8200 -4976 -9095 17375 -9936 -9530
817 -9530 16335 -6375 -6357 7586 -3572 3378 -3039 -5009 15388 -11439 -6735 20146 -11860 -6313
831 -6313 16177 -9458 -1009 7903 -9450 8504 -1139 -9437 16564 -6778 -10509 17314 -4074
844 -4074 -8351 9324 -2705 2209 -1275 -4365 13345 -9697 -6319 18907 -9814 -9016 15250 -6520
858 -6520 -2485 5443 -8636 9191 -2460 -11863 15585 -3662 -14930 14407 -219 -11042 6661
871 6661 -2580 1626 -1001 -6908 10754 -4749 -9848 14328 -4459 -10555 11786 -4684 -2179 4631
885 4631 -9534 8056 1370 -12862 11714 840 -14214 12559 163 -10908 8775 -2359
897 -2359 -1303 2148 -5409 7228 -810 -9335 12964 -1984 -10986 13936 -3199 -4776 7379 -5770
911 -5770 4940 2228 -11535 13249 1709 -17201 16075 3223 -14251 9073 2459 -2349 353
924 353 -4093 8861 -538 -13384 14117 2335 -14624 9164 1356 -3979 2197 -5401 7457 1899
938 1899 -16582 13760 6660 -21792 10465 8219 -12776 1960 1470 671 1004 -9686 7139 5428
952 5428 -16543 7279 7276 -11847 1420 1782 546 1411 -9444 5953 8013 -16435 6268 9997
966 9997 -15211 4975 7193 -7008 3378 -1719 -1216 8105 -9389 755 10362 -11340 3250
979 3250 6548 -7964 3617 1495 -2816 5910 -5840 727 9006 -11376 4759 7786 -12374 6499
993 6499 6602 -10706 5122 2662 -5256 7017 -5817 226 8317 -10717 3758 8113 -11122 2487
1007 2487 6041 -6014 2508 -2956 2184 5894 -13517 5730 10197 -16171 2787 10553 -10758
1020 -10758 1055 2764 -3061 5429 -8833 624 10022 -13069 -1471 11892 -9316 -3371 5845
1033 5845 -2996 1506 -5281 1660 8486 -12811 828 13047 -11590 -2348 10373 -6316 874
1046 874 401 -2508 8045 -7512 -2241 12157 -8454 -4337 13006 -5932 -3648 5703 -1653 3605
1060 3605 -3757 -1036 9734 -7292 -2390 11966 -7921 -2908 10141 -5888 926 1240 -3364 7674
1074 7674 -5027 -4209 12227 -7146 -5812 13282 -6078 -4167 6175 -2197 2052 -3298 -2087 9701
1088 9701 -6819 -5177 13120 -6615 -5508 9438 -4072 -741 194 -3131 7003 -5294 -6994
1101 -6994 12777 -5846 -9280 11716 -3680 -5016 3913 -2150 2499 -2690 -5068 9976 -4134
1114 -4134 -8694 11602 -3197 -5928 6652 -2514 664 1171 -4552 7456 -927 -8012 11499 -1539
1128 -1539 -7820 10123 -1744 -3416 5157 -2406 1987 1555 -5334 7303 -1209 -6908 10245 -3262
1142 -3262 -5686 8249 -2374 -1918 3854 -3976 4746 20 -7167 10822 -2573 -8897 11283 -373
1156 -373 -7440 5817 25 -260 879 -4862 7885 -1878 -8708 11546 -774 -9889 7165 1560
1170 1560 -4392 597 -3632 5993 -1771 -10373 11041 410 -12413 8106 3102 -8087 2004
1183 2004 -128 2215 -304 -8451 9375 1978 -11981 8173 4481 -8741 3135 2248 -630 1728
1197 1728 -6363 7080 3666 -11390 7094 5939 -10113 3893 4553 -4737 2633 -1825 2214 3645
1211 3645 -8212 5092 4887 -9085 4198 4669 -6519 4013 658 -1571 4667 -5566 2968 5189
1225 5189 -8143 3975 5343 -9332 4343 4005 -6940 3717 -774 -951 3977 -5553 2450 4489
1239 4489 -8970 3945 5162 -9395 3362 2287 -3813 2401 -4353 2107 3841 -9720 3548
1252 3548 6852 -11336 2886 6599 -7317 1412 597 -115 3076 -6311 2061 6904 -10013 1636
1266 1636 8028 -8039 862 2893 -1155 2351 -4745 2017 7183 -9207 1315 9508 -9568 710
1280 710 6622 -4524 1227 -48 -383 4948 -5467 -375 8516 -7624 -789 7884 -5276 19
1294 19 2553 -1296 2865 -3494 -408 7306 -7729 -572 9216 -8575 -235 6797 -4676 -35 852
1309 852 -1936 4369 -4791 -2124 7756 -7240 -2311 7802 -5021 -2716 2669 -1434 1322 -3491
1323 -3491 -1254 7674 -7822 -2662 9785 -7220 -3478 6971 -3441 -1058 569 -2145 5805 -4675
1337 -4675 -4048 10054 -5192 -5043 7973 -2189 -3521 2397 -350 3061 -3583 -2599 9050 -5404
1351 -5404 -4592 8869 -3123 -3755 5119 -2320 1385 453 -4643 7041 -1766 -5720 8318 -1490 -5131
1366 -5131 6278 -1022 -2423 2961 -2338 2876 -792 -3648 6169 -2306 -3550 6364 -3137 -3175 5436
1381 5436 -3490 -118 2468 -4335 4096 -1082 -5249 6656 -1989 -6179 7035 -1799 -4980 3981
1395 3981 -1762 293 -861 -2805 5516 -2882 -5348 7844 -2310 -6288 6724 -1247 -1780 844
1409 844 -2642 5036 -1343 -6788 8185 401 -9123 6888 1962 -5398 1765 281 1906 -1193 -4755
1424 -4755 6871 355 -7808 6447 1690 -6088 3572 -272 1114 818 -4999 6219 2181 -9287
1438 -9287 7067 3792 -8528 4692 2369 -3278 1771 -1347 2046 1915 -5434 3840 3379 -6737
1452 -6737 3356 2024 -3969 2171 -1512 523 1947 -5047 3060 2963 -7953 4657 2620 -7434
1466 -7434 4760 948 -4400 3189 -1648 -956 2727 -4956 2174 2896 -6920 3621 2491 -5224 1803
1481 1803 664 -1181 905 -3606 2362 2774 -7264 4149 3437 -7738 3319 3381 -4532 1816 -255
1496 -255 18 3030 -5049 2556 5037 -7316 2619 4799 -4501 854 1145 73 2086 -4558 2791
1511 2791 4782 -7783 2726 5616 -6531 1191 3944 -3721 1784 -806 -1201 4564 -5082 -117
1525 -117 5842 -5502 -171 4888 -3211 -68 1309 -742 2014 -3698 1504 4417 -6725 2015 4735
1540 4735 -6348 1056 3414 -3828 1826 -663 -1858 3979 -4953 -761 5927 -5931 -1663 6119
1554 6119 -3983 -1532 2573 -1398 1244 -2915 494 4572 -5683 63 6239 -4925 -1008 4378
1568 4378 -2176 1126 -1296 222 5189 -5002 -1050 7706 -4604 -2980 6608 -2218 -1498 1473 -214
1583 -214 2877 -3051 -1302 6430 -4224 -3233 6523 -2830 -1835 3245 -1769 2272 -1131 -2255 6027
1598 6027 -2717 -3649 6805 -2237 -3433 5322 -1464 -293 1269 -1437 2554 -1511 -2750 4468 -2298
1613 -2298 -2767 4771 -2627 -1332 2655 -2875 1524 -608 -3272 4054 -1807 -3675 6325 -3173 -3594
1628 -3594 5828 -2833 -2250 3102 -1621 519 -133 -1747 4368 -2049 -3313 5920 -1849 -2752 3470 -556
1644 -556 183 -148 -1316 4379 -2330 -4081 7481 -1989 -4970 5927 -67 -2698 1851 -638 1891
1659 1891 -531 -3746 5912 -387 -5348 5590 670 -3701 1947 704 773 -271 -2881 5034 -241
1674 -241 -5736 5922 806 -5278 3552 896 -2115 1017 -2336 2630 1167 -5541 3967 1005 -5158
1689 -5158 3154 811 -3067 1490 -677 430 962 -3858 3288 699 -5394 4088 824 -4605 3216
1704 3216 44 -2429 2532 -2249 1057 1764 -4345 2866 1725 -5069 3048 1889 -3733 2020 323
1719 323 -208 825 -2694 3156 965 -4802 4023 1879 -4994 3065 1466 -2440 1671 -1436 1649
1734 1649 1868 -4804 3083 2734 -5745 2361 3647 -3835 1146 760 28 946 -3185 2627 2530 -5066 2145
1751 2145 3331 -4305 1382 1305 -1815 1538 -2445 806 2596 -4834 1060 3616 -5313 835 3050
1766 3050 -3549 1223 210 -399 1538 -2885 905 2628 -4407 1250 2981 -4448 1238 1581 -1856
1781 -1856 1514 -1405 279 2531 -4023 1030 3926 -4658 992 3662 -3447 762 951 -416 1007
1796 1007 -2535 858 3360 -4260 820 4575 -3922 64 2356 -1249 454 -1190 640 2937 -4099
1811 -4099 92 5482 -4326 -870 3757 -2070 -348 466 -20 1987 -3021 -496 4825 -4026 -1165
1826 -1165 4509 -2489 -1232 1534 -488 731 -1740 -1030 4009 -3300 -1899 4810 -2813 -1655 2671
1841 2671 -1740 -212 368 -1478 2409 -1755 -2193 3906 -2582 -1781 3534 -2071 -946 1610 -1502 1076
1857 1076 -618 -1910 3408 -2352 -1542 3777 -3020 -895 3440 -1974 -334 1368 -1483 2083 -1325
1872 -1325 -1475 4229 -2327 -1603 4205 -1807 -1708 3285 -1066 156 270 -1027 3380 -2061 -1820 4750
1888 4750 -1843 -2551 3768 -536 -949 445 -759 2219 -2107 -1689 4563 -2023 -2864 4015 -792 -2205
1904 -2205 2052 -906 1023 -552 -1895 3721 -1130 -3690 4073 56 -3341 2434 -150 -577 214
1919 214 -1720 2048 -741 -2995 3210 -364 -3531 2757 288 -1848 1176 -1092 1124 -49 -2551
1934 -2551 2689 -257 -3144 3265 142 -2767 2702 -641 -488 1043 -1550 1714 409 -2870 3153
1949 3153 313 -3860 3466 243 -2270 1877 -399 530 452 -1728 2419 293 -3349 2997 790 -3474
1965 -3474 2069 488 -910 185 -749 1944 243 -3254 2844 835 -4062 2650 774 -1977 1116
1980 1116 -404 814 417 -3007 2395 1595 -4619 2405 2068 -3406 1403 463 -1222 484 -1452 654
1996 654 1449 -3618 1404 1919 -3633 1189 1109 -1601 576 -494 191 1189 -2676 1766 1982 -3800 1810
2013 1810 1590 -2581 1565 421 -1200 1630 -1353 185 1939 -3146 1487 2017 -3674 1606 1770 -2238
2029 -2238 923 243 -423 1424 -2389 1051 1873 -3613 1605 2379 -2906 390 1752 -901 587 -1302
2045 -1302 1103 1736 -3631 1356 2388 -3166 446 2194 -1706 -280 -532 248 1552 -3463 1121 2994
2061 2994 -3921 -81 2800 -2813 -310 1273 -893 1276 -1906 -94 2827 -2957 -698 2936 -1811
2076 -1811 -1018 1772 -940 222 -540 -49 1949 -2519 -33 2684 -2204 -189 2220 -1782 926 973
2092 973 -1489 1906 -1143 -859 2663 -2191 -695 3196 -2141 -606 2402 -1573 317 432 -621 1592
2108 1592 -1292 -337 2536 -1921 -571 2875 -1885 -443 1500 -984 686 -987 -199 2405 -2083
2123 -2083 -894 3579 -2237 -1538 2455 -816 -280 -92 -247 1673 -1864 -992 3074 -1912 -1964 2943 -1412
2140 -1412 -1162 786 -522 1021 -1338 -1345 2779 -1423 -2690 3451 -1191 -1823 2038 -306 -172 -71 -628
2157 -628 1890 -903 -1771 3080 -813 -1758 2151 -544 -481 579 -734 1394 -681 -1792 2741 -616
2173 -616 -2356 3164 -801 -1680 2248 -647 -190 832 -959 1640 -100 -1880 2806 -478 -1762 2485
2189 2485 -431 -1205 660 -411 684 -498 -1504 2743 -866 -2445 2752 -846 -2403 1471 -284
2204 -284 -622 375 -1057 1596 -27 -2658 2389 23 -2862 1367 309 -1302 389 -297 968 -640
2220 -640 -2005 2636 -135 -2791 1800 429 -2006 1001 -356 -127 664 -1668 1740 439 -2561 1988
2236 1988 1126 -2388 980 686 -1131 578 -941 932 468 -2016 2225 804 -2288 1758 420 -1718
2252 -1718 1562 -332 -456 1183 -1251 1259 943 -2384 1562 1119 -2174 1182 1033 -1331 969 -322
2268 -322 228 157 -1645 1633 616 -2519 1443 1134 -2306 982 283 -467 288 -1339 1153 599 -2768
2285 -2768 1452 1809 -3064 782 1353 -1411 125 -177 606 232 -2037 1235 1336 -2660 652 1618 -1764
2302 -1764 355 -315 -83 797 -1598 949 1800 -2692 694 2327 -2215 207 1064 -612 346 -586 165
2319 165 1256 -1547 194 1848 -1852 248 1331 -1262 424 119 -224 1051 -1269 32 1828 -2228
2335 -2228 344 2200 -2111 535 922 -1141 900 -170 -250 1232 -1497 240 2001 -2179 281 1704
2351 1704 -1352 126 546 -389 295 -1028 -117 1728 -2406 128 2242 -2021 -363 1429 -1153 162
2367 162 -217 -38 1184 -1875 -186 2125 -2141 -418 1751 -744 -387 288 -204 959 -1204 -209 2202
2384 2202 -2064 -709 2241 -1221 -938 1200 -685 167 -194 -395 1907 -1211 -743 2522 -1205 -1114 1690
2401 1690 -328 -261 414 -293 1122 -663 -505 2141 -853 -577 1932 -826 -474 1371 -729 472 36
2418 36 -877 1738 -980 -1088 1765 -949 -1249 2121 -620 -655 809 -522 683 -442 -725 1795 -986
2435 -986 -1249 1895 -763 -918 1185 -638 138 -340 -691 1701 -971 -1439 2532 -970 -1821 2006 -126
2452 -126 -750 462 -296 931 -404 -1291 1974 -470 -1885 1779 -201 -1080 1116 -91 486 -91 -1221
2469 -1221 1484 -181 -1766 1921 381 -1490 1334 -107 -340 406 -725 850 -100 -1184 1543 -19
2485 -19 -1354 1481 -104 -725 823 -641 249 10 -1250 1541 171 -1538 1604 136 -1673 1430
2501 1430 -305 -767 564 -448 306 130 -1280 1457 53 -1921 1429 26 -1448 463 25 -147
2517 -147 0 -982 1261 11 -1884 1694 446 -1902 1310 416 -608 382 -448 694 408 -1753 1525
2534 1525 716 -2174 1187 641 -1155 137 -33 435 119 -1060 1324 699 -1862 810 800 -1267 487
2551 487 492 -215 291 -565 628 702 -1897 623 1081 -1527 393 868 -945 393 -103 -174 849 -1134
2569 -1134 661 885 -1580 657 842 -1393 499 192 -878 579 -722 3 525 -1694 621 1187
2585 1187 -1824 263 1166 -1155 -104 175 -147 495 -1009 658 687 -1608 315 1100 -1645 91 832
2602 832 -521 490 -753 350 881 -1598 830 1512 -1412 -152 1474 -1036 121 404 102 647
2618 647 -950 460 1501 -1503 -289 1397 -894 -24 873 -257 325 -634 453 1300 -1680 -196
2634 -196 1621 -1278 -93 1055 -938 515 -142 -276 726 -1012 -47 1557 -1279 -512 1413 -1200
2650 -1200 -273 694 -547 494 -527 -344 969 -1294 -292 1548 -1435 -324 1248 -868 -8 -52
2666 -52 -149 581 -720 -518 1602 -1059 -227 1466 -721 -481 889 -472 42 -279 -7 1369 -1332 -718
2684 -718 1784 -1207 -562 1156 -508 65 -61 -203 654 -625 -456 1836 -644 -969 1656 -452 -669
2701 -669 646 -327 406 -290 -430 1507 -799 -794 1713 -641 -576 903 -219 36 121 -618 899 -558
2719 -558 -1008 1456 -620 -1152 1259 -312 -518 508 -409 50 -198 -1052 1117 -486 -1167 1333 -359
2736 -359 -781 1075 -16 -246 155 -752 677 -391 -935 1479 -609 -1259 1397 -241 -757 845 -110
2753 -110 168 11 -820 1285 -184 -1171 1554 -321 -983 773 175 -458 44 -575 1008 -175 -1146 1629
2771 1629 -29 -1365 1095 210 -905 459 -272 451 28 -851 1405 138 -1652 945 602 -1144
2787 -1144 592 226 -95 216 -733 882 241 -1452 1056 374 -1272 780 68 -610 357 -404 215 383
2805 383 -1085 936 289 -1281 864 234 -1273 604 212 -204 561 -754 672 156 -929 863 392
2822 392 -1326 801 546 -928 564 -322 146 158 -1206 497 993 -1575 650 711 -1239 870 489
2839 489 -40 352 -418 701 284 -1139 696 665 -1338 608 376 -474 677 -17 297 248 -1410 814
2857 814 1008 -1682 338 1089 -818 254 48 -251 263 -504 417 963 -1396 264 851 -1404 182
2874 182 508 -389 -13 -391 13 551 -1204 297 1202 -1290 327 690 -918 2 362 -357 433 -516
2892 -516 -38 736 -949 131 1146 -846 24 752 -728 -50 -21 45 559 -1089 185 1173 -1456 221
2910 221 1023 -956 -41 462 -332 265 -499 30 761 -1392 81 1398 -885 -179 896 -238 65 -3
2928 -3 -51 712 -1303 84 1426 -1139 -476 1038 -642 -177 519 -278 500 -599 -164 1257 -1053 -680
2946 -680 1212 -581 -689 641 -443 -206 -115 -460 788 -747 -578 1222 -1018 -628 1071 -660 27
2963 27 383 -697 582 -603 -310 918 -578 -558 1214 -526 -422 672 -566 252 -353 -243 781
2980 781 -673 -353 1334 -646 -571 1113 -406 -133 395 -325 496 -280 -282 1161 -501 -916 1397 -316
2998 -316 -838 715 -257 156 -5 -174 617 -663 -771 1322 -448 -997 1077 -357 -352 6 -171 574 -271
3017 -271 -592 1299 -292 -1050 1116 -161 -826 752 -239 128 -112 -589 745 -216 -1084 1016 -121
3034 -121 -979 872 -20 -370 290 -211 590 32 -753 1072 -116 -1458 1030 49 -630 740 -123 -15
3052 -15 130 -424 399 -25 -1204 1144 -199 -962 840 144 -241 457 -139 282 200 -817 1112 -18
3070 -18 -992 1066 -7 -855 575 -66 19 124 -601 750 178 -971 1026 579 -920 494 543 -488
3088 -488 227 -254 398 -166 -1028 1033 277 -1386 775 535 -885 305 64 -103 107 -960 683 584
3106 584 -1540 549 523 -1251 31 185 -623 61 -392 337 268 -1071 564 715 -1306 474 621 -606
3124 -606 575 -166 -107 591 -825 407 613 -1265 487 994 -1155 511 373 -465 385 22 113 227
3142 227 -803 570 785 -1106 155 530 -829 229 275 32 251 -660 371 644 -1249 267 1066
3159 1066 -1332 236 434 -428 306 -456 242 346 -993 269 1043 -1190 -113 969 -695 56 -218
3176 -218 175 403 -1088 307 1031 -1153 -159 1270 -1127 -17 614 -363 232 -604 197 855 -759 -281
3194 -281 1114 -766 -116 719 -435 341 -14 -168 394 -630 -22 1252 -1117 -116 1285 -787 -73
3211 -73 535 -345 480 -54 -307 758 -584 -138 1237 -692 -109 1080 -383 -160 430 -65 309 -373
3229 -373 -194 948 -954 -321 1136 -685 -253 743 -271 69 -343 -467 777 -690 -487 1210 -820
3246 -820 -640 1033 -659 -284 349 -208 737 -542 -428 1158 -778 -815 1031 -481 -541 655 -247 105
3264 105 -309 -668 1181 -417 -732 1005 -372 -750 871 -121 -100 196 -375 516 -339 -471 1107 -518
3282 -518 -872 1067 -296 -565 471 -351 167 47 -781 819 -217 -715 1330 -110 -687 1155 -185
3299 -185 -388 395 -230 254 -104 -484 972 -223 -984 996 -224 -579 749 -205 130 112 -367 949
3317 949 -283 -1218 1028 -70 -1167 781 2 -356 33 -407 534 -87 -861 672 77 -1200 803
3334 803 281 -789 430 -210 270 -24 -649 1023 -10 -1283 968 256 -1038 639 -67 71 317
3351 317 -504 592 241 -1088 743 514 -1064 719 236 -553 401 26 318 65 -426 842 447 -747
3369 -747 807 431 -824 647 127 -26 602 -445 378 319 -1016 978 599 -1263 638 355 -709
3386 -709 223 -128 -29 63 -486 444 215 -1260 950 572 -886 420 147 -319 4 -351 479 575 -1276
3405 -1276 443 757 -1076 239 628 -748 -300 178 98 219 -1030 499 776 -1271 205 753 -664
3422 -664 164 221 -295 130 -372 296 881 -1210 90 805 -1041 69 731 -466 141 252 25 630 -684
3441 -684 222 992 -975 258 795 -562 131 178 -277 61 -449 187 590 -1004 76 794 -1146 99
3459 99 546 -541 259 57 -236 671 -610 -20 1103 -997 -71 890 -513 128 319 -479 36 -395 0
3478 0 453 -1127 39 956 -996 -393 888 -454 98 -217 -222 693 -619 -328 1073 -792 -374 910
3496 910 -566 -194 155 -323 456 -314 -221 831 -748 -509 981 -722 -596 746 -147 104 349 -306
3514 -306 663 -289 -395 1170 -446 -608 1042 -311 -299 290 -352 132 -365 -351 1034 -545 -438 1216
3532 1216 -532 -490 858 -258 144 14 -402 543 -337 -662 1124 -643 -816 918 -249 -476 337 -366
3550 -366 39 -114 -537 695 -155 -827 920 -82 -722 574 -141 -38 83 -252 657 -302 -836 1481
3568 1481 -119 -840 1008 72 -326 189 -254 371 -148 -721 938 -162 -912 885 20 -747 623 -68
3586 -68 84 126 -254 590 -91 -823 934 173 -752 524 -14 -382 357 -245 267 257 -604 618 -209 -689
3606 -689 452 -69 -567 338 -122 47 114 -407 524 -140 -806 761 291 -938 611 -14 -745 190 -67
3625 -67 -66 117 -576 802 250 -1253 558 418 -996 363 270 -2 415 -515 840 143 -949 668 253
3644 253 -1152 403 249 -587 242 -294 238 388 -712 593 705 -914 384 766 -760 276 225 -136
3662 -136 298 -779 339 429 -853 451 598 -936 125 247 -312 308 -392 83 570 -848 65 681
3680 681 -1058 259 672 -643 89 -126 20 215 -743 455 446 -940 484 767 -647 189 342 -383
3698 -383 176 -105 -28 371 -714 -91 692 -1100 1 975 -926 9 214 48 221 -455 101 494 -719
3717 -719 4 781 -739 -54 445 -381 106 -47 129 446 -818 32 1134 -594 86 877 -651 -44
3735 -44 336 -17 297 -389 -18 767 -947 59 1063 -466 -56 471 -281 217 -355 -214 680 -780 -184
3754 -184 1312 -653 -401 513 -340 186 407 -276 215 -257 -221 923 -710 -214 680 -555 -432 409 47
3773 47 33 -8 -281 605 -421 -269 956 -765 -461 980 -76 -178 321 -311 370 -140 -473 902 -736
3792 -736 -382 1032 -519 -473 572 -53 37 -104 -212 485 -515 -285 978 -555 -735 526 -132 -438
3810 -438 358 -121 751 -116 -482 992 -567 -538 993 -14 -624 623 -227 200 -156 -433 730 -524
3828 -524 -667 749 -197 -587 642 -34 -175 95 -359 447 -135 -448 676 -22 -725 811 33 -440 349
3847 349 -344 252 157 -240 562 -152 -734 712 -66 -886 507 -59 -397 173 -210 284 -245 -295 943 261
3867 261 -717 854 86 -555 367 13 23 -57 -465 669 162 -825 511 181 -883 571 295 -165 252
3886 252 -124 710 239 -430 922 207 -945 672 432 -566 452 210 65 261 -647 282 282 -882 491
3905 491 715 -861 313 61 -219 109 -238 79 180 -663 298 387 -883 204 318 -666 326 -125 38
3924 38 212 -668 304 480 -858 526 539 -884 280 108 -141 160 -124 139 367 -581 541 528 -799
3943 -799 688 312 -406 321 260 11 313 -499 253 507 -669 448 855 -882 15 233 -225 -4 -17
3962 -17 72 342 -676 341 530 -764 110 550 -274 168 171 -42 556 -531 315 731 -775 28 734 -575
3982 -575 126 319 -83 142 -245 100 425 -817 -208 600 -489 -202 530 -585 -61 27 -148 353 -764
4001 -764 135 590 -791 -74 921 -607 -254 397 -234 340 -165 -340 500 -544 21 816 -513 -106 511
4020 511 -523 -39 -19 41 477 -629 -21 568 -437 3 1044 -299 -251 251 -162 228 -94 -225 886
4039 886 -495 -185 943 -425 -369 741 -230 133 94 -167 404 -335 -507 1125 -337 -527 562 -187
4057 -187 -249 129 -101 215 -140 -254 774 -176 -606 691 -446 -437 777 1 -28 -114 -3 239 -377 -423 809
4078 809 -131 -313 746 -271 -564 277 -338 247 -253 -339 586 -40 -605 1135 -173 -571 548 5 -210
4097 -210 175 15 298 -103 -663 699 -192 -441 507 -27 -88 207 -82 124 -112 -218 678 -182 -503 870
4117 870 5 -504 270 73 -214 -28 -309 338 22 -607 537 28 -512 331 129 -524 338 146 183 7
4137 7 -699 510 163 -867 550 127 -592 296 -16 -93 302 -366 280 266 -829 566 94 -536 -40 105
4157 105 -383 155 -193 185 111 -495 535 75 -491 587 366 -635 263 190 -253 334 -317 362 246 -663
4177 -663 553 140 -581 236 420 -439 126 -84 277 380 -447 532 136 -708 199 750 -627 353 155
4196 155 -145 70 -185 110 380 -758 498 608 -466 84 399 -429 108 -144 -89 126 -667 371 370 -798
4216 -798 71 571 -567 80 21 -120 138 -383 -8 295 -736 0 493 -425 -20 386 -553 190 -95 -146
4236 -146 417 -425 20 591 -395 -74 637 -274 154 332 -112 145 -494 -58 310 -479 -25 754 -710 141
4256 141 513 -193 -31 51 -85 355 -289 138 452 -509 50 587 -379 78 139 67 184 -85 -58 645 -391
4277 -391 -90 898 -386 -104 674 -354 -414 116 -188 345 -405 -251 629 -456 -366 676 -228 -49 70
4296 70 173 -207 -280 -173 906 -457 -319 588 -479 -62 276 -246 -155 144 -418 666 -238 -333 542 -366
4316 -366 -378 483 -172 -225 241 -58 323 -78 -330 569 17 -162 735 -78 -478 501 -186 -155 -3 -373 493
4337 493 -271 -269 557 -50 -513 538 -35 -559 264 -44 212 2 -351 456 -41 -474 794 -181 -283 445
4357 445 -184 -54 -240 -462 306 -137 -390 706 -78 -485 328 -104 -246 71 60 159 -132 -76 497 -55 -535
4378 -535 273 177 -371 400 -233 -146 -338 -544 467 -130 -234 553 -18 -659 592 36 -79 69 -24 187
4398 187 57 -226 164 -152 -592 523 -53 -368 202 26 94 7 -343 204 241 -513 503 210 -724 439
4418 439 42 -377 75 -24 68 296 -431 218 308 -525 446 65 -195 92 187 -55 89 -255 264 371 -723
4439 -723 455 384 -599 320 63 -353 -266 -212 -177 303 -392 229 411 -830 103 294 -213 -85 258 116 307
4460 307 -161 300 164 -410 -83 342 -412 -47 501 -135 241 -61 -67 76 -310 160 294 -357 214 152 65
4481 65 289 41 -173 173 -307 219 499 -514 116 731 -388 -83 344 -347 153 73 -89 394 -536 144
4501 144 482 -436 288 589 -160 35 59 99 -49 -165 73 380 -693 151 366 -548 -249 418 -412 -79
4521 -79 -89 -283 327 -444 168 422 -411 16 384 -330 -269 6 -41 192 -280 66 611 -245 -163 721 -37 47
4543 47 410 -100 103 -180 -41 286 -369 9 573 -439 -117 329 -424 -99 56 -84 223 9 -338 424
4563 424 -139 -200 323 -348 -149 175 -227 82 -161 -70 192 -398 -212 293 -78 -263 266 -331 -87 115 -245
4584 -245 19 121 219 493 -146 -215 513 -359 -247 291 -15 176 -227 -17 300 -219 -329 513 -118 -446 363
4605 363 -153 2 -16 -169 72 -10 -346 357 -213 -395 534 -179 -437 -81 -117 121 58 -271 472 -1 -286
4626 -286 590 -74 -388 441 -259 -232 38 -369 259 193 -398 616 -94 -371 219 44 -198 253 -82 -66 98
4647 98 -101 254 -9 -72 470 -267 -409 400 184 -44 -12 49 286 15 -269 382 -20 -240 142 39 -124
4668 -124 288 -135 14 216 -101 323 90 -472 353 129 -229 283 119 -20 -38 -124 139 -99 -409 379 -27
4689 -27 -505 102 446 -147 110 94 171 162 -278 228 13 -368 362 430 -479 210 72 -41 131 -321 159 -10
4711 -10 -533 384 314 -102 28 292 -357 77 16 -98 163 -296 282 193 -109 226 77 -244 135 330 -241
4732 -241 -79 -152 185 9 -449 104 -163 -50 340 194 -213 210 111 14 104 -82 -62 370 -299 340 402 -265
4754 -265 -44 283 -165 93 35 -63 118 -265 -6 145 -321 137 355 -14 146 -158 327 167 -172 209 323
4775 323 -109 -202 428 -85 124 249 -93 -34 156 194 240 -172 -37 290 -94 -252 60 -166 24 133 -62
4796 -62 307 -318 -144 575 -380 -174 422 -309 -133 176 39 68 -51 -58 248 -353 -130 321 -470 -170 127
4817 127 -169 -67 123 -14 322 -157 -2 365 -218 -152 513 -367 -118 257 -90 -95 -270 -53 170 -336 -12
4838 -12 229 -116 -190 247 1 -265 235 -83 166 -151 -287 257 -161 -206 510 140 -72 46 -64 55 72
4859 72 30 322 -221 -65 536 -344 -138 338 0 169 55 -178 -69 -289 -237 268 -58 -187 182 -122 -173
4880 -173 105 -100 24 -115 -71 445 146 -213 222 -280 -97 64 -178 -89 -13 -141 148 75 -297 520 -62
4901 -62 -287 150 40 -85 11 -59 187 -121 -177 242 -37 -32 308 237 -517 230 -241 -46 -36 3 320 -69 -134
4924 -134 225 99 -89 346 -9 -80 -143 -68 -117 112 -18 343 151 -408 220 -51 -261 223 119 -199 -155 -91
4946 -91 271 -33 -267 208 38 -144 385 -173 -49 47 -215 104 77 11 117 42 -254 316 82 -37 230 -13
4968 -13 16 251 -234 -111 -67 -33 168 279 -194 223 259 -152 93 -93 -4 -145 -383 48 101 -273 223 190 -368
4991 -368 -115 -162 -73 -29 -418 -127 179 -111 195 293 -333 87 117 -33 -127 -92 147 284 -334 101 235 -300
5013 -300 87 146 -222 1 243 -75 228 -318 -177 171 -230 59 8 -141 52 219 -30 167 -94 72 50
5034 50 -351 213 -10 -204 -172 271 -180 -106 100 -265 116 -100 81 293 -363 203 182 -62 -56 -54 -171 158 -219
5057 -219 43 113 -100 112 150 -128 -121 413 -110 -116 242 78 27 -114 -191 195 -122 -67 254 -241 -39 195 -63
5080 -63 82 110 147 74 -15 74 -31 -172 -158 334 -122 -240 -179 41 -196 -199 -85 128 -288 -7 116 -168 32
5103 32 -57 -206 -61 -115 -141 116 -172 -191 311 -96 53 -10 -226 -59 -26 -122 -117 -127 60 196 38 57 356 -107
5127 -107 -13 144 -47 -138 -156 -126 64 -152 -177 255 -269 -250 230 9 -18 -8 81 122 13 -275 447 -53 -173
5150 -173 186 -3 103 9 34 -184 169 65 -93 185 -194 261 -178 -246 268 -92 -192 -80 -268 25 -8
5171 -8 -103 393 86 -126 176 178 -109 262 -56 5 -182 51 158 210 -324 430 274 -53 -6 -273 -93 -195 159
5194 159 34 103 -108 260 -96 -205 77 -90 -41 -23 -14 174 -5 -76 53 -101 326 160 53 -1 192 132 -165
5217 -165 86 -30 257 68 154 116 123 -178 -52 250 -262 67 16 -139 -179 -171 167 -17 -56 93 -18 -140 -142 -85
5241 -85 55 212 -71 184 13 -9 224 -10 -110 30 -67 -237 211 3 75 44 96 82 -134 -354 -90 169
5263 169 92 -137 44 -153 49 -79 149 297 -85 22 -94 -7 278 209 34 -74 -10 29 110 -176 87 -120
5285 -120 -113 120 4 -237 -16 103 -24 -34 -198 93 131 -173 344 107 -47 173 -79 -278 93 52 91 265
5307 265 14 274 -155 -275 35 236 -112 54 70 -51 70 51 89 -26 -188 172 -105 296 34 147 -252
5328 -252 155 94 -89 -14 31 -80 121 -318 -2 25 -10 -27 24 131 278 141 -162 -62 -12 119 74 -188 255
5351 255 220 -374 -126 216 4 94 -160 -14 127 128 195 54 119 -95 -47 51 222 28 -63 148 -146 57 160
5374 160 -141 -80 19 -13 7 80 52 2 -142 87 161 13 48 -150 -132 58 277 -131 38 -101 137 1 -34 127
5398 127 161 -50 -34 -3 -80 25 -109 56 -123 -181 -31 61 -66 -7 144 -138 108 -20 -105 56 -154 51 214
5421 214 -18 42 244 -324 -238 59 -224 0 29 -29 120 -112 -8 229 86 60 286 129 221 -15 -148 140
5443 140 51 27 104 -140 52 -1 -280 -123 325 -31 -260 227 12 -12 55 -84 92 41 -104 7 -96 -24 58
5466 58 91 -139 -74 146 -137 -307 -342 185 -70 85 272 -32 -126 233 69 151 -20 -240 90 133 -35 -197
5488 -197 -72 10 197 70 68 -61 -187 -8 65 -166 -101 -251 38 120 -90 37 27 15 173 200 1 -41 -45 183
5512 183 -119 -9 -247 80 -5 34 96 51 298 -321 87 87 228 -32 7 -86 -111 30 -146 128 4 121 236
5535 236 3 -35 -69 -186 111 94 -293 9 -96 46 299 140 -108 -243 55 -300 -94 170 -8 -100 27
5556 27 49 -38 60 29 -68 -18 192 64 -100 -59 5 -20 -7 164 355 -193 -140 220 94 -18 75 117 47 23 -120
5581 -120 107 -212 106 365 5 160 -219 2 -257 40 59 -178 -129 -103 -9 -67 49 223 -180 21 -10 268
5603 268 49 -36 -55 110 154 -114 72 72 -20 -8 -37 -410 -119 197 164 101 24 118 169 -87 31 -56 -112 161 -59
5628 -59 72 -142 -111 191 59 -58 73 132 17 167 -37 11 147 24 130 265 -71 8 -97 -138 193 25
5650 25 -113 153 183 8 98 -65 -137 140 -60 55 -159 -153 82 199 -263 -118 161 -24 166 -29 81 -52
5672 -52 -165 246 7 -108 179 -154 -104 -29 131 88 -176 -60 -74 11 -86 157 -142 -106 94 290 19 -261 -84
5695 -84 83 24 -132 -197 118 -34 5 157 208 -36 -127 220 -75 -144 193 115 98 0 -45 247 112 12 -216 340
5719 340 -100 14 329 -241 279 33 4 182 55 -129 59 24 259 -87 -123 47 -17 -152 28 73 -26 -9
5741 -9 153 20 149 -244 185 88 -97 171 -116 -60 58 76 -42 27 -436 -143 132 -152 -32 133 -129 -260
5763 -260 -111 -56 -15 -22 138 -29 -87 81 -23 38 105 241 62 229 -28 -29 109 -287 155 112 -166 -68 322 -49
5787 -49 -17 12 136 -31 -33 69 108 -194 -230 26 -315 -53 -150 -131 -381 39 236 -18 -50 123 -114 -60 -47 84
5811 84 151 -6 56 -46 51 -223 182 31 -108 -281 65 -188 -92 14 -126 44 -17 -27 236 -97 -269 -6
5833 -6 -82 144 5 48 122 107 123 31 -23 -73 -85 -132 -42 174 -89 -26 102 -92 89 82 -146 -205 -67 65 104 -301
5859 -301 -197 260 -174 95 -140 -117 -102 204 85 -29 -199 -223 126 -113 111 325 248 -37 190 25 29 -48
5881 -48 -159 124 11 176 -76 68 23 201 -120 89 -50 20 3 -106 -158 119 -37 110 180 20 96 -6
5903 -6 -194 141 -86 186 1 127 -29 -61 144 -36 15 188 27 -92 8 264 -160 9 91 47 41 246 299
5926 299 -205 287 -77 224 -102 -35 47 4 10 210 -10 -171 63 -157 -88 -216 116 224 -94 -135 51 -108
5948 -108 197 269 -112 -84 -288 -107 140 47 -108 160 -116 -196 83 255 -88 -1 179 -117 -58 120 244 179
5970 179 13 122 -35 -254 98 -222 -137 -112 -70 37 -177 22 102 -124 -306 -89 -49 40 195 59 6 -62 141
5993 141 68 15 -82 343 1 -94 -54 26 -91 30 -29 -20 -11 100 131 282 102 -145 -79 43 288 -317 12 187
6017 187 -135 -19 94 -90 54 48 -148 16 134 -120 32 -94 -70 128 -73 46 43 -282 -26 74 -20 -7
6039 -7 78 -31 11 -133 4 86 -100 262 125 -206 65 -77 110 -105 144 216 115 -107 10 224 -276 96
6061 96 -73 116 -167 134 82 30 -139 117 206 -124 89 117 -136 -57 179 -76 263 53 65 121 -121 -47 31
6084 31 -216 106 -135 -283 -28 -209 -139 186 -37 -98 33 -29 -116 60 -2 1 -178 121 255 -88 149 -60 40
6107 40 52 84 -129 -259 105 18 124 -12 -26 65 -150 -180 77 -148 33 187 -135 144 -7 138 42 4 -357
6130 -357 1 -68 14 433 107 208 181 -54 43 101 21 -135 -130 -207 212 72 -121 188 -13 -45 -5 -48 -332 -37
6154 -37 -252 -70 -271 153 416 -354 -198 -29 -85 100 22 -134 107 -124 158 250 50 -146 196 -9 -203
6175 -203 60 -130 111 65 -2 235 -106 -394 136 64 -221 195 4 -79 47 -144 386 -83 -20 311 38 -8
6197 -8 305 -165 17 -155 -172 108 170 48 304 -65 -141 177 -104 111 248 17 156 128 -82 129 -80 -65
6219 -65 158 -237 -58 140 -60 -346 11 4 65 -93 36 3 -58 -59 215 58 8 43 19 -196 -3 -84 -233 112
6243 112 -90 126 -212 -12 71 151 -76 -109 -8 -211 -161 -23 40 -77 -223 -6 -16 -130 31 208 65 12
6265 12 -31 198 130 -123 256 34 -103 234 86 -238 -83 43 -64 -30 -39 38 -230 -333 -98 120 -184 178
6287 178 273 116 126 -286 -16 71 -352 103 1 -355 351 -2 -205 64 -269 -50 71 -198 293 225 -9
6308 -9 323 76 -93 120 -27 -231 53 280 6 -98 -278 -61 94 -168 85 140 -89 182 -22 66 -139
6329 -139 -23 188 -45 -208 1 294 -171 271 -100 185 -37 -110 75 88 -286 -116 66 -247 -37 -119 -322
6350 -322 231 -217 41 -117 -105 120 87 -135 21 110 -319 5 100 -9 381 1 155 -225 -85 -198 -30
6371 -30 -87 -15 -3 23 19 -124 -18 181 -150 73 169 -143 -71 322 -105 -6 189 -152 103 130 115 19 -110 -95 361
6396 361 -360 -82 -69 -250 10 122 38 453 241 -3 316 -194 -44 116 -342 23 177 128 86 126 -253 259
6418 259 -217 -201 46 -340 -1 -105 -31 -4 93 -32 -245 -49 -74 131 -143 -160 85 -16 -211 247 -44 226
6440 226 48 -1 429 -68 -170 257 -4 102 269 -151 -18 -4 213 90 95 -181 191 -200 -119 -1 40 22
6462 22 253 -229 -20 -42 32 215 -1 -69 41 -56 -143 162 -1 78 -128 122 267 -12 24 152 -203 -182 -31
6485 -31 97 223 -52 -120 79 -164 -27 77 -170 -117 236 55 -247 53 48 104 -146 -19 87 -124 133 283
6507 283 -146 -52 246 -10 52 -2 -21 -110 -240 -194 -26 81 -173 287 -133 -157 21 28 70 -46 101 -25 -251
6530 -251 -368 297 -153 21 -120 -21 -113 139 53 160 -12 -300 113 24 -405 272 27 122 126 -17 -72 25 -89
6553 -89 -55 258 -245 196 -8 -153 143 238 -56 38 156 -66 44 -298 275 98 -109 86 -31 -22 98 20
6575 20 -58 16 -196 79 165 -205 229 44 -273 107 139 -160 207 -76 31 17 -346 15 124 -376 -29 222
6597 222 3 -33 151 -127 33 -184 -75 199 -179 32 289 -330 41 389 187 73 -26 65 156 -95 21
6618 21 61 -217 -14 323 -128 -221 92 -6 9 -200 88 -137 -427 -160 189 -150 103 342 96 73 46 272
6640 272 182 -232 -126 365 -249 -42 187 9 17 30 91 307 -304 60 493 -248 -236 185 6 31 -77 -93 -161
6663 -161 -161 -97 150 -142 -331 235 -40 -53 136 -417 103 19 -63 -155 63 -67 118 -246 -48 246 -125 -132 170
6686 170 120 259 115 112 -20 67 -242 194 10 38 153 47 27 -143 39 25 -187 -373 130 -109 -215 90
6708 90 25 -145 62 -127 -45 -62 139 147 -112 -219 281 88 -77 -106 67 -46 -104 -76 203 -63 -136 550 -301
6731 -301 -273 166 -59 -335 55 -140 43 25 -37 343 27 -66 313 36 -176 -50 -81 -15 -39 -83 113 -254 -146
6754 -146 551 40 -124 -35 85 -98 5 -88 104 148 -182 395 157 3 261 -284 57 80 -61 -59 -85 52
6776 52 320 -11 -64 288 -320 -178 34 114 -143 184 -236 -26 -63 -157 206 -2 -202 125 -20 -288 149 41
6798 41 -189 -13 -206 124 -74 -389 59 -125 -115 255 5 -245 139 79 54 -49 80 295 -74 -180 242
6819 242 307 -143 180 -102 -28 -121 -347 41 358 174 271 230 -270 157 -10 -209 1 18 74 52 -27 196 38
6842 38 -290 311 104 -77 64 58 -153 -415 140 -84 144 13 -78 136 -299 121 42 -246 139 -113 72 32
6864 32 -369 280 18 -215 235 108 -15 78 143 -233 -218 -168 63 382 -112 98 346 -106 39 171 -191 -10
6886 -10 -115 -98 281 -122 138 138 -479 51 126 -157 8 287 18 -1 40 174 145 47 -76 -34 -190 25 266
6909 266 -157 -242 55 168 35 -172 116 298 -115 -57 165 -37 11 -94 -202 -15 -160 -7 239 -358 -109
6930 -109 316 -195 -247 103 71 88 -30 -167 37 -81 -117 427 -244 -61 388 -49 -232 99 109 254 -134 -70
6952 -70 230 -113 -174 321 -210 -135 141 -180 -19 -72 -96 47 -25 18 173 -26 -42 193 -128 63 127 253 110
6975 110 77 42 27 -25 11 339 -36 -282 155 -242 181 71 263 171 -50 -86 49 83 -131 145 -156 131 -11
6998 -11 54 51 -15 202 282 -73 -267 155 218 -267 212 -122 27 120 108 179 -157 -97 158 -24 -84 62 141 27
7022 27 13 -12 49 16 49 145 -65 -116 208 -213 -185 85 -78 54 -64 -57 306 -187 58 69 19 -19 75 -23 172
7047 172 -89 65 61 232 -12 140 84 -379 303 -263 126 230 27 225 -38 -29 154 -159 -214 106 176 -38
7069 -38 -84 140 -351 66 186 27 -66 -329 446 -133 -164 -20 224 61 61 -65 -34 62 -19 125 71 -48 14 37
7093 37 -275 87 15 -152 88 114 -112 -145 -271 246 80 -123 158 20 -168 -158 -218 12 -38 -288 245 79
7115 79 51 1 101 -48 -77 275 -161 226 149 52 -159 -191 204 -229 -200 2 50 50 -62 13 51 -222 -24 -49 291
7140 291 -335 -12 156 -278 -126 160 -133 64 43 -367 156 -305 227 -227 -273 64 8 -257 154 18 75
7161 75 -253 -320 12 31 -115 124 234 -260 335 106 80 -57 119 -57 117 -242 301 393 -126 93 120 11
7183 11 28 121 54 74 -276 -25 52 -123 75 240 -115 3 -38 -62 -162 110 -103 45 -107 -130 193 -33 13
7206 13 275 -119 192 9 -173 -48 -209 -25 -7 -342 -117 247 -99 -83 55 57 -115 -80 46 207 -36 24
7228 24 327 -71 75 112 73 -196 66 49 46 -128 -28 267 -157 -311 162 -287 -104 202 -179 191 63 -166
7250 -166 186 56 34 137 -111 -56 247 -373 25 -110 8 -130 -5 9 61 -345 -173 253 -191 -96 190 334
7272 334 -135 176 36 337 -163 81 341 -189 -377 29 76 -34 222 -9 173 -130 30 211 -193 -217 95
7293 95 -75 -105 116 -49 -135 -124 -186 -61 -138 -244 6 16 145 110 -97 -132 158 -128 42 21 -237 110 -124
7316 -124 -259 151 -208 -152 106 13 -59 8 -314 87 -241 -173 126 343 -187 69 -170 -189 2 -104 44 17
7338 17 17 -42 51 -382 94 -86 -266 349 109 45 133 84 346 176 -327 41 320 -118 -64 125 4 128 25
7361 25 133 84 -72 101 17 -228 266 192 -62 47 -123 195 -72 182 370 270 -224 182 140 -138 -169 -66
7383 -66 58 214 -138 -50 108 -68 238 -7 -102 -19 -9 -260 -68 -26 -78 55 -378 -71 -112 -179 56 43 105 26
7407 26 183 129 110 181 209 -21 -33 155 328 -44 -28 150 -98 188 -250 46 122 -133 -140 116 -174 151 177 -132
7431 -132 10 288 4 7 88 66 112 -264 -31 180 -77 -6 -23 -60 32 -144 -43 -31 3 -70 381 -59 92 174
7455 174 -198 -153 30 -32 307 -79 88 68 2 8 127 -151 71 160 -78 -95 -36 5 207 147 -44 151 -140 236
7479 236 159 -243 -34 -13 -132 -85 59 -98 -1 47 -181 132 -193 51 -39 -140 58 84 -7 -150 -176 45 121
7502 121 -206 -264 -76 -190 -161 150 138 95 54 -271 3 -164 -258 49 -20 -141 92 151 96 62 93 -48 28 -210
7526 -210 332 -251 -311 191 -85 -41 138 -86 32 -55 44 284 6 -60 152 16 -200 18 87 -4 -42 104 -7
7549 -7 -411 20 164 -102 27 271 9 -201 -4 -61 8 -102 -84 410 -118 -229 83 -302 43 108 236 -47
7571 -47 43 81 73 218 55 301 -107 -483 78 81 116 24 -35 29 93 216 131 179 -135 88 -53 -260 -94 -123 -263
7596 -263 279 93 -148 -131 -171 204 34 -203 99 -97 -214 -88 -225 92 -218 -228 265 187 -250 112 -32
7617 -32 -308 20 108 -249 -29 -145 -4 290 -139 136 76 -231 41 -149 -290 21 189 34 -88 -4 371
7638 371 323 -145 -154 136 -14 -65 71 -194 109 -65 60 -180 -168 227 -222 -293 45 424 35 -26 142 -221
7660 -221 -65 -277 253 41 -352 209 60 -198 35 -29 -8 -155 -240 -72 179 -93 -38 -127 -184 -136 34 -160
7682 -160 106 28 105 -21 -242 252 208 96 -8 170 -203 5 150 -120 -24 -34 200 199 -164 364 -13 92
7704 92 8 86 -16 -67 -41 135 -99 -141 229 24 -232 80 114 -76 196 274 208 -50 -38 39 208 -147 -114 201
7728 201 53 -146 230 -105 104 -155 167 -42 -79 -26 -4 -213 128 311 -159 -88 -28 62 129 -197 -84 237
7750 237 -46 -26 -35 -120 -55 55 88 11 -54 -19 43 -163 -133 -165 155 -57 -3 32 -139 20 -163 -170 -199 -123 38 -175
7776 -175 178 65 -34 -99 50 165 -24 -8 40 114 -58 170 255 125 -128 -68 118 118 83 -151 43 -21 -44 190
7800 190 -274 -83 59 -114 -181 -137 122 69 103 21 15 58 -94 156 -159 11 175 108 -59 18 0 144 -137 58
7824 58 147 -43 43 72 -3 26 -13 37 1 -33 39 -51 -165 -119 306 -147 -105 -23 41 58 243 81 -27 -204 -130 217
7850 217 47 -76 177 311 -268 159 161 175 -65 -158 233 38 -115 64 46 -125 236 25 -113 48 -17 13
7872 13 -182 12 269 -182 -145 75 -72 -217 143 137 -162 52 -147 56 137 -292 4 14 -159 147 57 -192
7894 -192 175 -233 229 108 -129 195 53 -202 0 60 -190 83 44 -19 -296 57 291 144 -112 262 -35
7915 -35 -92 202 20 -1 25 -245 8 -15 -185 7 -17 14 107 -4 -177 -58 257 186 -64 24 -60 57 -353 -105
7939 -105 62 -198 299 -132 42 -156 -157 178 142 -154 242 77 -82 132 77 -124 73 -13 18 174 -195 36
7961 36 15 -51 96 53 8 -58 -49 -254 154 5 205 71 -195 120 288 -131 94 236 -262 -9 54 226 16
7984 16 53 -41 76 -261 22 79 64 -183 164 66 -107 170 -169 120 -290 97 84 -310 152 236 -110 -44 16
8007 16 -37 93 -236 -101 -27 -174 -90 214 -22 103 -31 24 6 148 83 90 -293 -130 144 -193 -4 177 -100
8030 -100 -31 -175 -76 112 -179 -35 108 -53 -167 426 -108 40 289 -117 -57 -216 77 169 -319 -272 -6 -45
8052 -45 -163 269 55 -167 137 -103 -169 -97 13 -62 -21 -85 4 68 -186 1 149 42 -12 46 145 54 -88 262
8076 262 44 -129 334 167 91 -200 -49 -142 -10 -4 246 -88 -127 11 60 6 119 80 78 22 -46 241 37 -55
8100 -55 54 17 -222 297 -170 -10 4 -138 295 199 -168 124 -57 -157 280 -36 -61 66 102 72 113 -108 81
8123 81 3 -217 286 -57 -193 214 -28 9 62 -22 -162 94 -304 131 -9 -22 218 107 -76 203 140 -233
8145 -233 -16 -203 54 94 -208 286 -36 -151 214 -263 -224 266 1 265 18 -124 58 -89 -3 68 -83
8166 -83 311 154 193 289 124 -65 296 -50 111 124 -67 -51 39 21 -138 -42 -27 -31 4 -28 87 30 -150 13 -50
8191e0
$$ Imaginary data points
##PAGE= N=2
##DATA TABLE= (X++(I..I)), XYDATA
0 0 0 0 0 0 0 0 0 0 -8 8 -8 8 -8 16 -16 24 -32 40 -48 56 -64 80 -93 109 -128 148 -171 200 -229 263 -300
31 -300 341 -386 437 -493 556 -621 696 -778 866 -963 1069 -1185 1312 -1450 1601 -1767 1947
48 1947 -2145 2363 -2600 2866 -3158 3487 -3854 4269 -4741 5285 -5920 6669 -7573 8685
62 8685 -10093 11938 -14462 18146 -24023 34836 -61146 253031 216777 -242697 201062 -15060
74 -15060 -14110 100919 -69167 102730 47985 -132633 169630 14539 -119720 107549 29948
85 29948 -48790 12681 -31516 73599 33144 -102774 98343 34748 -151758 122600 38557
96 38557 -110362 66952 -19136 -7307 64619 -78556 58354 48341 -96817 71936 8668
107 8668 -66565 61185 3155 -28187 3311 -15527 20606 18149 -45914 14513 16133 -59981
119 -59981 39868 36438 -73304 43289 32717 -70450 48685 1932 -16629 43498 -63918
130 -63918 32299 53094 -71232 43594 33384 -57340 37487 9980 -5860 28456 -38451 50191
142 50191 42792 -87180 46745 69420 -82403 36460 45111 -70714 52876 3235 -25699
153 -25699 61382 -71447 9426 91569 -93586 8751 72763 -57314 27445 1535 -10967
164 -10967 45969 -56818 33484 50416 -94797 36127 61095 -70727 24532 8875 -37825
175 -37825 53088 -32879 -17469 58306 -66479 906 76643 -78991 -5250 59782 -49338
186 -49338 14237 -1881 -20600 40839 -41965 1992 47798 -66981 14521 56981 -59748 10099
198 10099 22073 -23152 26463 -24215 -6404 48309 -48304 -9180 70614 -53191 -19045 60835
210 60835 -27014 -5896 8917 -7650 32140 -30200 -7801 63657 -52997 -11948 69935 -46628
222 -46628 -3793 28821 -23996 29080 -16521 -20179 68308 -40285 -38063 81966 -33080 -32500
234 -32500 49685 -20249 1720 13710 -20041 34842 -15329 -29366 60186 -32206 -27231 51795
246 51795 -29663 2497 16203 -35479 35498 -6884 -43039 54019 -28015 -34967 63383 -37686
258 -37686 -18769 44073 -36814 1680 21073 -36682 20309 -1928 -26203 43012 -28386 -19535
270 -19535 47009 -31681 -8659 26939 -31850 13347 8276 -26056 40165 -26611 -24232 64738
282 64738 -37983 -31024 54486 -22096 -15197 26634 -17560 17756 -6143 -22375 49494 -25325
294 -25325 -34111 55204 -9262 -28086 26921 -6070 10694 -3686 -27619 51020 -17665 -46847
306 -46847 65008 -5193 -47537 42407 42 -14317 12762 -24077 29604 116 -46012 49588
318 49588 5886 -49397 34461 9582 -22371 10485 -18238 20555 5018 -46632 43233 7548
330 7548 -54773 38266 7705 -39131 24771 -12256 -3859 21463 -40195 21484 20758 -48297 25191
343 25191 15074 -39151 21416 -555 -13893 21868 -25984 9779 19284 -38072 23644 12251
355 12251 -42380 30960 8633 -34410 31476 -8425 -12786 28367 -25750 6441 20290 -35445
367 -35445 22058 17760 -40325 25748 9749 -22551 20610 -10955 3832 15376 -28320 22715
379 22715 16280 -42734 30183 17181 -38683 25362 1128 -12561 22230 -23484 7095 26783
391 26783 -42249 17547 29994 -48209 17537 18792 -24675 13198 -10824 -68 19234 -33604
403 -33604 11787 25138 -43821 15947 19725 -32450 14864 -1360 -10966 18979 -22062 642
415 642 26716 -37967 8435 28816 -39996 10084 15298 -21856 12543 -7774 -4575 21395 -30972
428 -30972 6851 27403 -43245 13811 22774 -33142 12473 7297 -12246 16048 -16138 6
440 6 28432 -34098 3094 34628 -31054 -1828 24780 -12115 586 -1410 105 19373 -27478
453 -27478 4772 36046 -38299 879 33709 -22794 -1261 5648 -7318 20442 -22429 -6787
465 -6787 39844 -33749 -11367 40781 -22324 -15497 19258 -7027 3220 -6759 -10222 29392 -20775
478 -20775 -16927 36362 -19760 -16265 24726 -13628 149 4386 -16719 26258 -14729 -22392 37169
491 37169 -21594 -18480 30323 -18652 -6761 15295 -18309 12045 -1773 -20442 25120 -11263
503 -11263 -14849 26185 -17072 -7120 26133 -20016 1088 15066 -20060 17305 -992 -16787
515 -16787 30139 -12317 -14431 34884 -16194 -12299 27786 -13371 -488 6310 -6216 16474 -14789
528 -14789 -7274 29951 -19018 -15851 28217 -11240 -7981 8739 -8291 14727 -9178 -14760 33060
541 33060 -13675 -27622 39557 -6707 -26398 24911 -2985 -4016 850 -10777 21203 -7757
553 -7757 -25632 31678 -1530 -28912 20223 1595 -7617 -692 -8966 17857 -7412 -24877 30391
566 30391 -1554 -33779 27364 1790 -22070 12787 -5762 2736 3613 -19901 18990 6288 -28807
579 -28807 22497 5575 -22006 16957 -2584 -3569 7808 -13597 13983 5767 -25130 22595 6952
592 6952 -28192 23398 3540 -18164 15306 -2713 -1535 8726 -13437 11297 7263 -22547 18586
605 18586 5154 -20380 14392 1094 -5833 6350 -9126 9488 4872 -22777 21392 5972
617 5972 -29699 21360 7107 -21609 11994 110 -6837 8650 -14610 6811 11537 -26845 10975
630 10975 13448 -22100 5072 7269 -8421 2690 -7029 5222 7135 -22787 13796 9754 -25885
643 -25885 14091 7966 -19730 10633 -600 -7176 13172 -16524 3288 17052 -24612 7891
655 7891 15947 -22126 7044 9832 -12642 7419 -4105 1783 9832 -19189 12666 12523 -25674
668 -25674 12808 13535 -20210 9932 4041 -7101 11799 -12079 5315 15133 -23294 7765 19694
681 19694 -22758 2808 15515 -9746 1459 -3682 7139 7539 -23424 11894 17877 -26995 4496
694 4496 17721 -16549 2424 1027 -2905 10153 -18333 2334 21725 -25276 -5016 26101 -17031
707 -17031 -8807 12546 -3289 222 -9268 2791 14181 -18954 -2041 20058 -16172 -4638 12843
720 12843 -8763 3927 -4428 -4144 16772 -14798 -7390 24311 -14450 -10786 21152 -10810 -3363
733 -3363 9487 -8079 7152 -1102 -7372 12979 -6065 -6080 15570 -10312 -481 11735 -11516
746 -11516 7364 3086 -9160 12552 -5255 -6760 19307 -12906 -5754 22094 -15605 -3032 15975
759 15975 -10280 -42 4496 -4699 8176 -7866 -4123 18223 -14031 -5487 16377 -9665 -2194
772 -2194 3904 -4187 7564 -8938 -6082 21575 -16439 -11889 25600 -11506 -12255 13893 -3220
785 -3220 -2742 55 -5187 12080 -7644 -12226 19866 -5695 -13611 11855 -219 -3969 -912 -3400
799 -3400 11726 -7991 -12820 23401 -7812 -16845 20909 -3198 -11258 11042 -3775 1541 3742
812 3742 -11295 13732 940 -15719 16284 1210 -12166 9648 518 -2012 3132 -6209 11113
825 11113 -1734 -13414 19261 -2769 -14724 17402 -2213 -9698 11943 -6074 262 6723 -12164
838 -12164 10598 1995 -16220 13817 2914 -14628 8732 1424 -4648 2861 -6160 8176 -2225
851 -2225 -13039 16503 -2003 -16539 14333 217 -10730 8482 -5719 1348 4892 -14016 9873
864 9873 4511 -17960 10069 7238 -15310 5538 3246 -3903 3087 -6776 6112 2225 -12566 10460
878 10460 3634 -14788 10225 2696 -8669 7791 -5588 1783 7954 -12316 6226 8773 -14449
891 -14449 7547 8864 -13646 7123 4490 -5659 4802 -3017 2655 4097 -9738 7377 5182
904 5182 -14410 9907 4304 -11412 8053 -1865 -1890 6474 -10092 5248 8953 -17806 8060 11915
918 11915 -17895 4980 8120 -7102 660 -1677 3403 3320 -12892 7123 9078 -17267 5003 7917
932 7917 -9041 1967 -2094 1100 5249 -14296 4784 13425 -21041 2084 16021 -14705 -1842
945 -1842 6480 -2827 1206 -5999 1790 9756 -13758 956 14082 -11742 -1581 7779 -1426 1626
959 1626 -4692 1532 11217 -11620 -1106 15814 -12738 -1842 12797 -7702 -308 3739 -3880
972 -3880 6640 -3785 -5273 12424 -7209 -3873 10820 -7523 -702 6141 -4812 3135 -753
985 -753 -3848 9830 -6320 -2864 12097 -10069 2 11243 -10151 -265 7934 -7449 3575
998 3575 202 -5526 8890 -6863 -3488 10635 -9535 -3235 9517 -6658 -1530 1725 -3224 6317
1012 6317 -9174 -1811 13376 -12833 -4235 14734 -8730 -4903 8095 -4319 2959 -2283 -3688
1025 -3688 11836 -7396 -6259 14383 -4497 -7781 9383 -1386 -1459 104 -1925 9049 -7384
1038 -7384 -4969 14840 -6520 -8418 13110 -3143 -4247 5383 -3464 5503 -1745 -6276 11654 -3209
1052 -3209 -9225 12787 -1100 -8635 7739 -364 -409 418 -3548 8130 -2705 -7010 11132 -3057
1066 -3057 -8667 11101 -2974 -5208 5346 -4358 3876 -505 -8062 9495 -1057 -10916 11644
1079 11644 -790 -10509 7857 -722 -2209 351 -3675 6900 -1875 -9089 11239 -923 -11010
1092 -11010 10116 -422 -5288 3552 -3159 3874 -12 -8758 9855 1323 -12998 10350 2429
1105 2429 -9277 5674 383 -851 1172 -5032 6750 1704 -11104 9739 3412 -9945 7177
1118 7177 1001 -3229 3599 -3428 3269 3600 -9161 7284 4502 -11235 8205 3061 -7703 4940
1132 4940 10 -1859 3316 -4885 2693 3187 -8827 6919 1691 -9657 6858 1019 -6266 4080
1146 4080 -1764 -518 3474 -7891 5952 3400 -11968 7897 4040 -10851 4235 2962 -4405
1159 -4405 1728 -4038 3366 2789 -10426 7466 4176 -12482 4722 5697 -7026 705 -214 1861
1173 1861 2670 -10098 6674 6438 -13673 4533 8507 -9693 522 4159 -1137 2066 -6235 4749
1187 4749 6616 -11853 4006 9138 -9512 232 6353 -3027 1280 -3044 2057 6770 -10345 1782
1201 1782 10040 -9746 -364 8667 -5548 -123 1835 -1311 4634 -5981 169 7678 -8449 -297
1215 -297 7655 -7113 -31 4048 -4481 2881 -2805 -2105 6641 -6794 -1316 7836 -7843 -916 7719
1230 7719 -7658 336 3235 -4151 3351 -3153 -1613 5757 -6487 -938 8107 -8121 -851 6884
1244 6884 -5218 1054 -885 -1177 5076 -6511 -970 9577 -8886 -2505 10241 -6723 -1464 4203
1258 4203 -1956 2510 -3008 -1127 8398 -6097 -3212 10683 -6164 -3141 6796 -2498 1033 -1198
1272 -1198 -848 7152 -5445 -3663 11535 -6043 -4668 9665 -4041 -1893 3216 -2144 3250 -2235
1286 -2235 -4016 8141 -3886 -5799 8895 -3677 -4248 4352 -2106 346 -1020 -3265 6067 -3894
1300 -3894 -5450 10052 -5513 -5504 9008 -3413 -3462 3310 -2566 1723 -1166 -4744 7239 -2971 -6622
1315 -6622 8483 -2317 -5544 4790 -780 -824 -496 -2669 6436 -3141 -6749 10492 -2655 -7635
1329 -7635 7914 -663 -4248 3116 -1478 3071 -212 -6275 8614 -455 -8056 7947 1552 -5647
1343 -5647 3736 947 408 -216 -3953 7687 -615 -7678 8487 748 -6879 5453 431 -2448 2855
1358 2855 -4147 3425 2195 -8055 5794 2360 -7961 4845 2097 -5467 3134 -700 -510 1911
1372 1911 -4697 3742 855 -6203 5077 306 -5747 5012 -825 -3674 4207 -3520 784 2201
1386 2201 -6254 3973 1816 -7966 4932 2282 -7260 3973 847 -2499 1417 -2775 3473 568
1400 568 -6258 6320 2297 -8257 5506 2770 -4769 2696 -1376 2264 1634 -6799 5314 4780 -9494
1415 -9494 4082 6186 -7196 1318 2624 -101 287 -3593 4177 3424 -8283 3561 5708 -7596
1429 -7596 2170 2841 -2092 1891 -3519 2587 4638 -8392 2741 7800 -9050 899 5987 -5613
1443 -5613 819 778 -764 2392 -4349 344 5112 -6245 146 4693 -4933 830 1016 -2023 2272
1458 2272 -3331 158 4848 -6318 717 6494 -7461 1223 4720 -5519 1823 1211 -2507 3028
1472 3028 -2478 -863 5226 -5432 373 5601 -5299 579 3217 -2293 1057 -1101 351 4326
1486 4326 -5116 655 6662 -6678 293 6397 -4337 59 2760 -1534 2916 -2440 -680 6641
1500 6641 -5567 -1007 6858 -4038 -1622 3276 -942 952 -2088 -467 5860 -5664 -1408 7520
1514 7520 -5831 -2082 5933 -3483 -1158 1958 -2631 3220 -1936 -3291 6259 -3446 -3684 6034 -2236
1529 -2236 -2840 2782 -1592 787 -1440 -1651 4975 -4843 -1780 6424 -4892 -2110 5608 -3530 -753
1544 -753 2034 -2921 3395 -1609 -3024 6426 -2735 -4170 6857 -1627 -3875 4460 -557 4 -134
1559 -134 -658 4861 -2966 -2647 6864 -2628 -3855 5886 -1431 -916 1232 -1862 4101 -2038 -3863 7184
1575 7184 -1593 -6065 6805 -42 -4247 2758 -290 1022 -1174 -2957 5102 -1213 -5491 5994
1589 5994 127 -5175 4187 -654 -568 861 -3364 3849 -182 -5817 5323 1052 -6205 4521 394
1604 394 -3417 1974 -1553 769 263 -3699 3178 455 -4650 3841 -333 -3920 3629 -1751 -652
1619 -652 2084 -3216 2330 1265 -4976 4700 930 -6132 5543 193 -4234 4035 -115 -838 1262
1634 1262 -1815 2543 406 -4667 4855 729 -4939 3598 1185 -1329 816 -977 2412 411 -5047
1649 -5047 5471 1390 -7080 5403 2356 -4968 1753 972 -320 629 -3730 3419 2302 -6689 3774
1664 3774 3161 -5346 1263 1999 -1283 158 -2292 2400 2133 -6483 3282 3444 -6684 1992 2931 -3500
1680 -3500 646 -434 -26 2432 -4616 1354 3965 -5693 1533 3106 -3862 650 1077 -1269 1508
1695 1508 -2728 1058 3081 -5275 2013 3534 -5208 1667 2761 -3818 1880 336 -1041 3321 -3298
1710 -3298 570 4006 -4614 904 4214 -3813 621 2640 -1523 952 -1448 1090 2721 -4497 1723
1725 1723 3894 -5221 886 3874 -3592 891 455 -633 2577 -3815 500 4822 -5171 -435 5126
1740 5126 -3725 -1120 2523 -1378 750 -2091 258 3242 -4426 -433 4631 -4215 -948 3401 -2596
1755 -2596 598 -196 -930 3212 -3450 -1191 4895 -3956 -1808 4476 -3196 -935 1932 -1639 1345
1770 1345 -1368 -820 3316 -3101 -1214 4678 -3174 -707 3593 -2221 577 419 -1061 2801 -2010
1785 -2010 -1235 4742 -3157 -1530 5574 -2623 -1105 2842 -1130 602 -970 -726 3610 -2750 -1921 5192
1801 5192 -2774 -2138 3586 -1141 -823 199 -352 2307 -2089 -2062 5278 -2609 -3125 4834 -1305 -2254 1629
1818 1629 -556 1007 -1355 -1904 4304 -2139 -3772 4805 -1499 -3108 2469 -248 -85 -339 -1706 3005
1834 3005 -1224 -3537 4693 -822 -3380 3529 -407 -1795 1289 -1248 1285 40 -3213 3547 -128
1849 -128 -3579 3701 -284 -2480 2265 -911 -342 1024 -2007 2563 204 -3008 3791 -871 -2789
1864 -2789 3857 -762 -2137 2523 -744 600 690 -2553 3269 -386 -3469 4111 -192 -3382 3017
1879 3017 -53 -1662 1209 -1092 1993 -226 -3416 3947 -66 -3935 3289 517 -3024 1307 -412
1894 -412 676 -711 -2966 3513 7 -4411 3450 839 -3752 1557 462 -770 467 -2308 2656
1909 2656 713 -4306 2863 1969 -4458 1602 1375 -2252 921 -806 850 970 -3150 2275 1593 -3710
1925 -3710 1949 1912 -3005 939 177 -46 1251 -2037 1624 1517 -3332 1942 1702 -3467 2073 1195 -1888
1942 -1888 1314 -784 316 1703 -2577 1684 2051 -4052 1888 2239 -3350 1439 932 -899 812 -1647
1958 -1647 916 1515 -3600 1490 2241 -3905 1150 2029 -1763 413 -193 747 682 -3015 873 2380 -4019
1975 -4019 1117 2512 -3213 566 632 -335 899 -2223 675 2789 -4035 270 3421 -3871 16 2001
1991 2001 -1742 -32 -297 -81 1762 -2255 47 3434 -3073 -193 2554 -1901 265 668 -272 1410
2007 1410 -1585 -73 2866 -3143 -107 3244 -2814 521 1793 -1610 1001 1 -920 2234 -1894
2022 -1894 -372 3284 -3050 -174 3085 -2216 -512 1511 -1019 719 -1052 -338 2715 -2659 -368
2037 -368 3560 -2519 -998 2300 -1395 -575 122 -359 2049 -2510 -415 3169 -2924 -1375 2966 -1602
2053 -1602 -1072 808 -470 1185 -2036 -902 3703 -2937 -1933 3740 -1753 -1879 2367 -638 -80 -538
2069 -538 -1203 2749 -1525 -1989 3527 -641 -2279 2464 33 -484 619 -518 1562 -1189 -1110 2854
2085 2854 -1591 -1606 2960 -958 -1180 1773 -1412 933 240 -1543 2644 -620 -2210 3217 -521 -2029
2101 -2029 2918 -898 -1118 1548 -918 771 -371 -1326 2215 -861 -1968 2600 -925 -1717 2139 -655
2117 -655 -184 113 -995 1868 -999 -2152 3070 -708 -2787 2899 -315 -1684 941 -545 844 -801
2133 -801 -1677 2826 -334 -2957 2899 145 -2462 1286 -166 -147 -152 -1622 2170 190 -3257 2907 726
2150 726 -3061 2143 370 -1066 643 -574 891 124 -2008 2143 712 -2489 2028 503 -1649
2165 -1649 1081 -552 374 349 -1952 2095 987 -3015 2552 1076 -2898 2061 315 -1510 925 -660
2181 -660 416 732 -2167 1815 579 -2829 1808 476 -1865 835 101 -408 270 -1267 1444 782
2197 782 -2947 2304 871 -3154 1324 877 -1426 531 -489 328 734 -2669 1297 1480 -2914 916
2213 916 1593 -2041 278 420 11 469 -2008 1486 1264 -3302 1297 1930 -2167 441 981 -990 764
2230 764 -937 482 1793 -2331 871 2293 -2205 355 1773 -1096 150 120 -80 1183 -1663 675
2246 675 1540 -2334 768 1380 -2037 595 706 -1358 941 -701 -234 1396 -1974 374 1804 -2235
2262 -2235 142 2066 -1661 62 609 -436 549 -1297 371 1029 -2310 355 2102 -2287 406 1374
2278 1374 -1320 475 -690 58 1527 -2201 316 2630 -2318 -427 2389 -1316 -576 499 41 529
2294 529 -1558 376 2248 -2224 -577 2654 -1754 -447 1067 -261 695 -767 -178 2218 -2045 -655
2310 -655 3210 -1731 -853 2232 -766 -138 290 -71 1329 -1111 -695 1969 -1153 -846 2017 -874 -357
2327 -357 783 -756 793 -455 -585 2029 -1239 -1133 2431 -1456 -570 1591 -1300 -50 589 -841
2343 -841 819 -432 -1065 2100 -1285 -1046 2115 -1068 -871 1078 -630 17 -134 -345 1689 -1408 -1169
2360 -1169 2509 -1197 -1128 2197 -681 -779 810 -502 1024 -790 -1080 2392 -978 -1570 2398 -432
2376 -432 -1244 1177 -195 192 -238 -661 2101 -842 -1592 2246 -610 -1650 1505 -188 -719 411 -884
2393 -884 981 -301 -1619 2185 -52 -1870 1556 80 -977 720 -206 418 -348 -1326 1593 -651
2409 -651 -1792 1897 -278 -1376 1435 -315 -367 859 -1010 1161 278 -2063 1690 147 -2360 1662
2425 1662 332 -1581 947 -110 -77 212 -964 1043 -17 -1905 1774 463 -1908 1694 127 -532
2441 -532 709 -737 1147 -112 -1664 1879 350 -2620 1468 783 -1578 841 123 469 85 -1527
2457 -1527 1452 506 -2173 1115 1089 -1532 763 464 -366 247 -1066 966 606 -1885 1160 1304 -2037
2474 -2037 968 972 -1098 800 -269 1 633 -1364 745 841 -1940 783 769 -1500 919 0 -486 407
2492 407 -794 389 716 -1819 795 814 -2110 887 543 -1432 536 27 -76 444 -802 379 945
2509 945 -1738 804 1372 -1408 514 714 -303 93 -489 599 825 -1599 795 1163 -1940 480 1098
2526 1098 -1141 217 136 170 644 -1305 264 1777 -2202 329 1620 -1358 38 805 -359 83 -457
2543 -457 276 1464 -1720 67 1729 -1432 -180 1125 -434 166 -115 27 1201 -1487 -58 1399
2559 1399 -1761 -287 1268 -1166 -243 247 -770 610 -723 -544 1629 -1508 -264 1614 -1400 -170
2575 -170 1127 -1056 151 218 -252 913 -966 -251 1610 -1302 -241 1540 -897 -224 1090 -247
2591 -247 345 -429 54 1149 -1252 -295 1779 -1189 -550 1375 -431 -121 233 31 1207 -1146 -131
2608 -131 1846 -1142 -714 1895 -455 -567 812 -285 480 -460 -309 1569 -856 -1043 1736 -653 -963
2625 -963 1177 -454 88 -316 -322 1085 -952 -815 1838 -645 -896 1487 -448 -655 608 -552 638
2642 638 -326 -820 1389 -714 -969 1565 -469 -781 1187 -547 48 81 -588 966 -567 -1072 1380
2659 1380 -518 -1259 1392 -502 -546 516 -270 540 -23 -697 1384 -50 -1146 1696 -243 -821 1122
2676 1122 37 -261 -24 -167 1011 -170 -1321 1509 -109 -1287 1322 56 -821 468 -57 427
2692 427 140 -1109 1184 -140 -1784 1440 134 -1249 673 188 151 -81 -845 936 13 -1520 1264
2709 1264 41 -1388 806 115 -552 269 -594 423 67 -1093 1217 348 -1863 961 321 -996 710
2726 710 -425 -415 177 -951 531 327 -1332 1021 327 -1147 696 293 -793 437 -449 213 415
2743 415 -1068 1130 345 -1423 736 448 -1186 566 223 -548 193 -687 761 571 -1265 919 678
2760 678 -1574 801 434 -809 126 -209 314 228 -1515 1020 859 -1549 576 925 -1191 354 353 -350
2778 -350 375 -851 556 782 -1498 804 781 -1414 392 668 -733 298 -478 144 640 -1525 772
2795 772 731 -1407 141 810 -945 168 -146 -97 708 -932 314 814 -1451 172 957 -935 377
2812 377 617 -874 474 -134 155 597 -1043 430 1165 -1306 268 1009 -797 56 467 -181 517 -581
2830 -581 237 919 -1478 411 1234 -1142 -37 1070 -367 -73 -315 121 441 -895 15 1055 -1396
2847 -1396 -130 965 -1069 -65 -66 -24 151 -598 -108 1280 -1204 -276 1590 -1066 -232 486 -593 -156
2865 -156 -363 -275 703 -1058 -180 1419 -1024 -487 993 -574 -176 -55 -481 321 -522 -403 1424 -953
2883 -953 -337 1788 -888 -113 740 -230 395 0 -268 919 -653 -357 1420 -877 -254 893 -282
2900 -282 32 391 -273 550 -389 -438 1238 -883 -541 1488 -557 -501 857 -449 48 101 -478 757 -691
2919 -691 -700 1756 -655 -618 1088 -175 -536 262 -294 529 -583 -643 1349 -735 -870 1202 -275 -788
2937 -788 698 -431 133 -108 -973 1271 -745 -1155 1146 -229 -1007 924 -287 -213 398 -74 675 -630
2955 -630 -624 1268 -265 -853 1172 269 -479 900 -252 357 226 -696 964 10 -780 1191 -146 -890
2973 -890 937 -11 -418 453 -591 349 -53 -785 1124 -2 -1243 828 27 -733 601 -232 46 210
2991 210 -646 777 52 -1315 1038 64 -1355 730 378 -458 178 -197 425 -204 -838 1079 -42 -1409
3009 -1409 948 271 -1168 420 -68 336 -328 -810 914 212 -1447 890 316 -1115 694 163 -457
3026 -457 167 -176 280 182 -1132 819 726 -1206 721 378 -548 395 19 260 496 -882 499 627 -1305
3045 -1305 807 763 -1112 610 208 -465 180 -428 49 525 -1021 391 898 -1139 394 244 -534 261
3063 261 239 -99 242 -639 496 511 -1263 654 777 -1316 417 446 -529 267 -456 10 288 -1133 496
3082 496 889 -1354 157 928 -706 -168 23 -85 193 -840 455 779 -1374 443 898 -1110 -73
3099 -73 488 -404 186 -743 253 885 -1301 155 1184 -943 -279 983 -288 -50 -105 -94 328 -785 133
3118 133 994 -1110 36 944 -566 179 493 -306 562 -246 118 1033 -1024 -110 1057 -877 -30 964
3136 964 -756 302 213 -191 366 -572 -37 925 -1047 -423 1044 -786 -133 373 -693 203 -190 58
3154 58 906 -1008 -414 1026 -849 -575 950 -532 -9 340 -127 505 -752 -43 979 -676 -557 1257
3172 1257 -463 -624 468 -107 522 -487 -459 938 -793 -540 1163 -331 -676 898 -146 -52 22 -379
3190 -379 910 -298 -538 1202 -255 -714 1109 -324 -366 347 -184 541 -105 -224 967 -295 -586 1115
3208 1115 -200 -702 1223 -586 75 344 -431 613 -214 -547 1048 -332 -709 1095 -295 -639 527
3225 527 -325 160 -221 -453 807 -563 -754 1176 -264 -729 904 -113 -274 98 -507 763 -285
3242 -285 -876 1528 -171 -1067 985 361 -659 392 -42 328 39 -671 1186 -275 -1055 1015 153
3259 153 -1015 420 117 -7 50 -369 775 199 -1043 1040 30 -1190 802 214 -458 401 46 155
3277 155 71 -691 869 145 -884 820 347 -684 350 25 -73 503 -635 429 180 -1037 855 231
3295 231 -1145 784 252 -785 328 -184 135 115 -687 806 109 -1045 556 364 -1035 295 97
3312 97 -200 56 -644 483 97 -955 578 545 -1315 612 473 -736 353 -22 126 420 -896 637
3330 637 534 -944 280 906 -869 -77 254 27 129 -824 391 502 -1327 451 958 -1280 286
3347 286 610 -661 456 -140 236 590 -972 318 883 -1182 165 508 -825 93 202 -82 339 -459
3365 -459 512 748 -761 245 799 -1081 178 499 -435 143 -235 -271 397 -841 -179 735 -1262 79
3383 79 872 -674 -102 344 -336 169 -429 -251 660 -1239 44 802 -1091 -13 846 -498 178 -103
3401 -103 29 340 -632 -118 1076 -869 -189 1085 -442 -433 274 -132 136 -505 -237 938 -1134 -341 941
3420 941 -545 -385 312 -201 228 -18 6 907 -471 -258 1335 -733 -311 808 -421 -239 -30 -321
3438 -321 304 -395 -349 1056 -507 -452 967 -482 -255 649 -237 104 -57 -406 615 -526 -198 1070
3456 1070 -864 -585 883 -494 -533 430 -421 246 -198 -245 868 -461 -610 933 -264 -767 921 -15
3474 -15 -12 -130 -239 747 -344 -577 1005 -376 -1009 1081 7 -464 351 -75 626 -315 -300 1235 -615
3493 -615 -818 1166 -236 -848 654 -260 161 13 -331 715 -267 -860 945 235 -1096 925 -179
3510 -179 -197 359 -367 343 27 -598 680 314 -1138 956 217 -891 568 -289 -86 -66 -345 521 -11
3529 -11 -814 859 -271 -887 801 -135 -225 585 -457 343 45 -1079 946 79 -1307 938 310 -879
3547 -879 610 71 -53 190 -285 580 227 -806 986 461 -909 774 138 -441 85 -234 481 -39
3565 -39 -671 915 367 -1198 969 315 -728 319 395 -31 209 -624 356 338 -1296 504 505 -972 302
3584 302 380 -227 210 -409 73 223 -985 626 579 -1190 168 456 -588 213 186 -62 458 -556 -49
3603 -49 379 -899 341 440 -857 23 341 -196 120 -216 -176 432 -844 400 605 -1060 431 484 -800
3622 -800 244 46 -354 435 -768 264 638 -861 289 881 -1068 16 532 -458 189 -137 145 639
3640 639 -508 487 719 -830 182 837 -463 -24 206 -124 624 -692 268 822 -949 -36 1029 -668
3658 -668 -279 354 -346 20 -368 110 594 -751 -11 877 -670 -244 650 -577 38 -196 -152 372 -529
3677 -529 -248 906 -1074 -376 1097 -674 -9 609 -370 252 -146 -230 486 -657 -282 904 -687 -585
3695 -585 752 -480 -97 158 -160 263 -450 -327 1050 -498 -288 1201 -751 -413 880 37 66 107
3713 107 46 650 -531 -428 914 -370 -327 866 -249 -185 62 -79 439 -543 -158 1239 -568 -682 842
3732 842 -308 -475 380 -121 -27 -223 -328 722 -371 -442 937 -352 -621 584 -203 -57 -152 -213 415
3751 415 -274 -647 859 -191 -653 771 -513 -297 369 -36 251 174 -617 487 -171 -593 911 140
3769 140 -511 510 -98 -124 238 -319 465 -150 -762 811 -459 -825 893 -86 -335 417 34 90 221
3788 221 -602 811 -275 -635 1165 232 -708 619 128 -327 318 -73 453 -115 -791 811 14 -743
3806 -743 851 266 -541 400 20 24 119 -660 480 247 -1112 500 163 -1135 280 171 -417 262 -351
3825 -351 307 92 -911 481 500 -821 608 527 -683 123 -296 231 317 -532 612 127 -844 582 422
3844 422 -781 312 144 -300 380 -190 249 316 -529 674 523 -862 431 336 -690 124 -125 61 392
3863 392 -603 430 605 -1011 557 667 -1092 254 444 -54 -75 -202 311 389 -665 299 564 -916
3881 -916 39 263 -277 289 -197 244 64 -559 260 371 -1057 -3 662 -784 -88 319 2 -31 -235
3900 -235 -94 229 -590 -21 759 -716 -56 364 -492 47 -319 -201 267 -840 -35 819 -878 -251 658
3919 658 -388 -8 301 173 398 -246 -176 439 -321 -64 699 -582 124 478 -88 -95 118 88 551 -335 69
3940 69 790 -834 -218 825 -505 -61 276 -195 339 -317 -251 762 -637 -115 696 -680 -240 406 -89
3959 -89 -114 -9 -264 401 -430 -72 737 -627 -187 916 -174 -286 548 -38 367 -431 -315 812 -663
3978 -663 -554 879 -618 -421 590 -329 -253 78 -387 453 -237 -211 711 -351 -571 565 -65 -313 199
3997 199 -138 173 -365 -249 739 -452 -499 708 -467 -583 633 227 107 291 -396 457 -297 -564 910
4016 910 -341 -415 790 -234 -348 265 -281 260 43 -329 917 -422 -455 810 -21 -706 837 3
4034 3 -109 -180 -95 455 -270 -379 576 157 -805 548 -151 -285 119 -100 241 -192 -499 654 -206 -676 601
4055 601 -17 -626 715 -109 -234 194 -429 335 103 -686 533 257 -728 431 270 -186 -20 -169 256
4074 256 24 -376 418 246 -670 447 85 -718 359 93 49 366 -440 330 151 -461 893 188 -760
4093 -760 291 280 -362 279 -20 -6 225 -580 497 112 -605 502 310 -530 115 195 -170 56 -418 434
4113 434 249 -495 737 107 -912 402 -52 -370 9 -57 37 61 -487 565 347 -721 612 289 -413
4132 -413 67 270 -18 254 -297 265 437 -937 529 499 -634 173 328 -434 237 -177 191 429 -557
4151 -557 123 425 -800 370 593 -320 188 289 -137 10 -510 192 601 -747 372 742 -376 41
4169 41 521 -430 -30 -156 12 129 -435 87 587 -672 -212 898 -380 -99 338 96 244 -202 128
4188 128 351 -725 -132 657 -504 -268 726 -191 135 -328 -368 319 -515 -266 517 -533 -306 700 -340
4207 -340 -172 330 80 -8 -417 -139 753 -343 -472 962 -397 -270 352 -245 4 -12 -102 535 -355 -197
4227 -197 619 -311 -361 554 -164 -139 57 -54 119 -305 -81 620 -388 -177 843 -485 -207 490 -275 353
4247 353 -273 -242 357 -227 -356 698 -110 -390 750 -322 -101 401 95 144 -135 -142 694 -497 -160 549
4267 549 -247 -290 256 -326 57 194 -349 506 -257 -505 481 -315 -570 458 -84 -463 96 -243 230 -249
4287 -249 -490 454 -105 -552 840 -49 -556 253 -60 -42 -58 -237 786 -23 -448 549 25 -435 601 167
4307 167 -274 54 -209 211 127 -502 375 320 -499 499 20 -96 359 -218 -77 -3 -347 319 -31 -514 510
4328 510 95 -395 425 8 -403 -8 -1 54 190 -549 488 186 -672 481 291 -521 50 87 -104 138 -457
4349 -457 199 -36 -637 265 162 -503 274 89 -277 -72 -264 350 318 -541 337 271 -426 291 241 -377 212
4370 212 59 56 43 -539 536 226 -797 583 387 -532 137 43 -323 231 -322 205 296 -504 264 405 -541
4391 -541 241 374 -441 330 18 37 106 -131 362 176 -627 335 291 -547 184 90 -418 -13 154 45 108 -202
4413 -202 205 153 -487 50 499 -564 -127 146 94 36 -435 333 525 -523 -114 300 -665 110 342 -259
4433 -259 89 -198 69 174 -519 340 592 -663 88 307 -382 273 151 244 278 -264 -101 507 -464 -170
4453 -170 772 -525 -93 246 -125 -250 -222 293 490 -349 -51 548 -481 43 410 -222 186 171 -215 214
4473 214 -498 -128 613 -101 -172 465 -263 32 407 -190 119 -133 -85 479 -461 -23 497 -327 -98 305 -264
4494 -264 -327 -19 -114 232 -116 -167 249 -508 -322 379 -381 -122 312 75 -12 -273 -74 107 -333 -134 545
4515 545 -178 -300 360 -37 -19 164 -47 336 -173 -23 377 -61 -478 502 -66 -395 226 -51 250 -8
4535 -8 -124 302 -28 -402 405 -66 -179 347 -17 -7 115 47 444 -158 -296 630 -114 -485 186 49 -111
4556 -111 448 58 176 -4 -445 138 -61 -373 368 -102 -412 162 -74 -123 138 -159 40 -78 -262 493
4576 493 86 -346 133 94 -383 245 -401 176 92 -98 109 -138 -279 267 102 -564 -180 -42 -203 -137 -269
4597 -269 439 -108 -369 602 96 -495 298 -51 38 360 13 16 -22 -441 50 212 -534 148 -36 -217 231
4618 231 48 -157 106 -315 194 170 -467 280 408 -382 402 -77 -193 228 5 -46 209 -111 105 349 -593
4639 -593 371 103 -362 71 60 -126 86 149 111 112 -237 272 121 -512 -57 184 -318 -71 11 -22 78 -537
4661 -537 45 82 -550 330 235 -355 -47 451 -213 -97 20 143 343 -303 171 286 -278 195 152 -258 -261 -91
4683 -91 75 257 -349 266 389 -465 57 390 -218 41 361 -155 193 -104 30 398 -330 -33 412 -262
4703 -262 88 386 -216 -24 13 -409 352 -386 14 495 -689 -163 325 -315 -45 297 -182 -32 -213 -204 175
4724 175 -272 -115 383 -245 62 151 -163 -227 -191 -63 158 -343 51 196 -428 -373 330 -460 88 323 -89
4745 -89 100 -160 154 281 -214 -354 394 -234 -78 239 56 -147 -97 109 123 -288 83 335 -177 -256 359
4766 359 -97 -32 155 49 -40 -159 -23 323 -261 -40 286 66 -143 374 -178 -21 -189 -5 266 -40 124
4787 124 173 -125 -92 279 46 26 -3 -32 160 -210 -114 484 -239 -289 265 -75 14 138 -22 -149 -81 97 161
4810 161 -252 -195 325 -79 -446 320 -167 72 267 -120 16 27 -262 336 10 -96 559 11 -152 262 0
4831 0 -81 102 25 344 -77 -212 364 167 -318 161 77 -208 161 -195 -121 55 -255 456 50 -285 268 -344
4853 -344 -219 224 43 -47 38 -258 35 -39 -43 385 -190 -440 34 63 -104 190 -27 163 37 -108 248 91
4875 91 -433 278 -147 -295 279 -252 -114 165 -275 31 -103 -201 58 -98 -291 81 204 -204 29 -152 57
4896 57 206 76 390 -190 -527 189 64 -279 136 -195 17 73 -223 85 80 -348 187 247 -170 229 -86 -46
4918 -46 -210 182 138 222 -347 273 74 -326 243 114 -190 234 -35 -245 -68 -187 9 93 -369 92 357
4939 357 -270 192 219 -190 -79 -51 24 219 -157 191 237 -205 203 212 3 324 -195 82 -30 -86 41 217
4961 217 -274 120 305 -277 132 189 -41 26 170 -129 40 171 -27 356 -356 166 170 55 319 125 -99
4982 -99 193 -59 71 302 -295 -66 179 -183 -13 312 -265 -119 -124 20 221 -128 -39 -16 -12 -21 286 -107 50
5005 50 -27 -258 257 -274 43 240 -347 -268 217 -234 -47 -129 42 -147 93 -121 40 -269 78 263 -278
5026 -278 -383 156 -324 -36 16 -148 151 -233 42 280 -63 -22 346 -72 27 139 -110 -50 -30 -75 81 -154
5048 -154 -148 90 -166 -129 260 -145 -223 -99 -37 215 -136 -98 390 -296 -204 236 -145 86 96 -126 -307 148 175
5071 175 -30 157 13 319 -40 102 45 148 125 2 -67 -20 -158 -204 379 211 27 441 3 -41 -33 -74 -44
5094 -44 -72 -54 262 16 -84 65 -61 -100 153 -85 -182 58 -100 186 -35 36 128 -77 -168 133 -272 -195 146
5117 146 133 -101 -225 -138 264 100 -326 -2 174 -124 96 26 -55 -76 126 -117 75 -173 247 107 -328 355
5139 355 161 59 413 179 108 59 -98 57 -212 -250 169 -79 -11 37 -131 -64 -52 264 128 17 -221 224
5161 224 -115 -263 135 86 -217 48 188 13 74 -97 -74 -137 -258 199 34 -52 123 -224 -147 -58 -45 150 -58
5184 -58 -288 -82 83 -174 259 205 -102 136 94 -106 119 27 157 162 -12 147 83 -192 -21 225 -31 -12 0
5207 0 168 -201 -140 204 -7 10 -56 28 -131 29 -24 53 -177 -291 -233 38 -45 225 328 -169 -48 231 123
5230 123 184 -160 57 -24 -332 204 175 -20 285 22 -171 110 75 -98 -354 -192 -123 -3 -296 -66 137 70
5252 70 -33 84 147 -253 141 -80 10 -279 -12 297 -88 -60 -19 -48 -86 -45 35 25 58 61 193 -13 -94 5 -282
5277 -282 113 120 -28 101 -79 17 146 -150 -92 356 -218 56 -15 113 -10 -213 62 -48 -112 -35 127 -180
5299 -180 -100 184 -39 -27 82 -186 4 151 151 81 -142 -10 68 -99 -329 121 -145 -55 63 -99 101 88 -84
5322 -84 -13 -118 -22 223 -99 -81 14 72 -106 -109 -58 -16 -111 129 56 -66 172 -172 -60 -26 -11 8 242 -263 -128
5347 -128 -156 2 103 145 -261 -244 86 26 95 132 -14 231 -116 -115 199 -82 149 168 -26 -126 205 -325 92
5370 92 -12 92 -45 -289 66 54 -104 169 -10 -393 211 25 -49 231 -137 -240 6 -58 -26 7 -12 -41 1
5393 1 131 149 -160 111 129 17 -45 262 -26 166 349 102 -27 -3 -166 89 58 -172 97 -122 -291 60
5415 60 -48 -37 56 -150 31 -52 -129 183 123 -160 -48 -93 -230 -78 213 -78 -35 -29 156 -84 124 379 -191
5438 -191 -14 -51 114 -217 -66 2 15 -253 -133 170 -128 -53 43 -226 -65 -196 -215 82 87 -92 49 8 -27
5461 -27 168 -38 74 -87 144 -35 83 -64 30 -176 -172 -66 37 -159 143 -5 -81 -99 46 252 171 96 -110
5484 -110 36 9 311 -23 111 118 -69 39 -181 -91 84 -53 147 306 -301 -128 40 164 125 -19 -138 -123
5506 -123 139 -97 181 -55 -146 65 138 37 -29 -130 -50 -19 -2 110 -19 -171 -8 -297 -171 153 -141 34
5528 34 71 -70 -83 -144 -101 341 -271 -105 -6 130 -261 94 117 -175 40 -206 33 -85 -249 149 46 54 157
5551 157 56 -103 177 19 88 48 74 364 -19 -249 -91 -89 -171 -253 -174 158 190 -78 167 -97 -253 60 -107
5574 -107 -194 -49 244 -106 138 -42 455 -38 126 -43 -54 -200 -249 -142 -152 43 261 145 -21 85 61 221
5596 221 -10 330 66 -253 -54 191 124 108 179 107 150 83 293 282 -34 150 316 -178 -327 293 -352 29
5618 29 4 -12 -226 -44 164 -201 -216 186 83 -92 44 -56 7 -171 66 95 245 55 -128 -113 -110 -231 -18
5641 -18 265 157 -65 43 -6 -41 68 -7 -85 -61 -71 -91 -127 93 -158 -98 -57 -100 -66 -145 -23 105 52 135 -98
5666 -98 17 80 -25 121 83 -27 260 61 -209 -101 102 -143 -44 56 84 177 124 -53 406 -139 -19 240
5688 240 -196 107 36 -2 -9 -32 -79 -62 -64 -86 45 23 -65 254 -65 -180 -77 -49 164 -20 216 127 -214 -64 103
5713 103 -224 40 -296 32 249 -92 185 246 -327 21 229 -246 64 -81 47 305 -154 -30 22 -71 -212
5734 -212 -56 -271 -163 -101 -143 -32 -103 347 205 -103 -182 -28 16 33 -98 -134 -80 50 125 268 -98 206 17
5757 17 -128 -84 212 -65 126 118 -90 -150 -191 111 87 -18 16 152 -188 69 -19 -166 -17 191 19 100 -69
5780 -69 -12 63 111 -183 208 -314 -70 144 -299 51 -67 -209 81 5 -60 64 -177 -104 70 148 144 29 81 67
5804 67 140 -136 -9 -8 -102 22 -234 -240 83 58 128 -78 80 295 -162 -2 -93 -196 -336 -152 15 100 -21 -89
5828 -89 -13 126 -117 29 310 -210 103 -26 -84 -16 132 75 2 -142 188 177 -59 116 -153 -187 86 123 -138
5851 -138 -202 -15 -58 -107 70 51 86 -76 159 130 84 90 42 -119 51 104 -259 -162 -129 185 -56 -261 99 228
5875 228 -135 -110 45 40 62 -211 86 25 -140 172 78 93 -161 162 -83 101 63 135 163 -140 112 -264 109
5898 109 -75 149 99 -153 14 -88 -99 40 256 -201 -76 53 -60 -107 -226 -193 -76 28 -42 209 75 -252
5920 -252 395 114 -263 35 -21 -103 39 -126 -64 43 -122 176 197 -203 190 82 -316 123 36 -70 -198 97
5942 97 104 142 -154 310 -9 -23 166 316 -24 -99 35 -130 362 -294 167 307 -321 53 154 39 -25 39 120
5965 120 -149 31 -42 112 -49 9 150 -59 -30 37 -88 65 154 -124 38 -350 91 60 -272 224 -4 81
5987 81 10 -100 -172 110 -25 108 96 -87 140 185 -395 65 247 -22 240 -179 194 -142 -278 158 32 -273
6009 -273 -86 -31 -307 -103 141 -19 -63 21 121 41 -312 24 197 -228 168 29 2 -203 27 -2 -110 -42
6031 -42 298 185 136 157 158 -201 108 244 -69 163 84 -60 220 -232 -144 -26 -279 -117 -74 -12 7 -199 -177 3
6055 3 -21 -170 59 -243 -270 89 83 66 -243 130 -51 -195 -118 -108 -303 -39 18 -288 -105 76 34 64 -61 21
6079 21 4 -130 67 254 -139 63 394 -209 -76 58 -292 196 -53 -256 375 118 -7 182 -372 -113 157
6100 157 76 10 -47 -100 127 -114 -178 231 -46 -10 55 -102 -88 -140 31 -130 73 -36 63 -67 -27 148 51 165
6124 165 -94 -46 116 -14 -160 104 -60 -272 10 36 79 189 -105 64 65 73 -105 -89 5 153 -58 -188 207
6147 207 40 -18 56 90 -197 123 40 134 42 -35 245 46 -113 308 -65 17 98 -12 16 21 13 202 -78 -209 192
6172 192 190 -140 111 51 67 104 -239 171 -124 -53 190 54 -400 170 131 -280 119 142 143 59 -23 55 -100 -165 31
6197 31 1 -9 2 -60 137 -46 -85 318 44 -103 208 123 -17 255 132 -99 87 -110 -60 134 -175 202 58
6220 58 -216 2 226 -122 -45 -61 5 -14 -117 112 165 -26 96 287 -100 96 22 -11 56 -117 84 33 56 231
6244 231 144 -210 -40 -52 -132 -40 -31 22 -89 -177 321 -22 -132 -147 133 -205 27 170 12 -34 7 93 86 -24 -96
6269 -96 -130 -295 69 -56 -274 16 120 57 34 164 197 12 -351 -25 116 -29 68 182 -135 -100 -53 -47 53
6292 53 -267 43 403 -194 -112 173 -12 135 -114 -8 111 -168 83 187 -156 -216 11 -183 -15 103 -245
6313 -245 -169 298 257 141 -286 206 199 -279 255 50 113 -60 -205 -38 -71 -149 -7 69 -92 30 269 -52 -97
6336 -97 -15 14 -34 4 -126 241 -29 -158 136 -144 -258 85 57 191 -76 172 -263 -111 4 119 -317 -146
6358 -146 319 1 -77 215 355 53 -165 33 281 259 -7 272 -201 93 264 -101 -16 -9 -331 144 -110 -31
6380 -31 174 -130 -190 81 -86 -163 356 109 102 210 -130 149 -195 -421 113 -215 -212 -110 110 -95 12 57 77
6403 77 -245 -179 6 -24 -221 62 173 -100 115 -144 122 8 -11 120 -85 112 332 142 -148 -22 51 -26
6425 -26 101 -141 184 60 -132 183 -186 -138 139 5 -92 -91 100 -75 118 -97 114 122 -188 276 -190 -152 67
6448 67 -9 -122 -62 -55 50 -229 -159 -101 -185 -219 238 269 -126 443 0 -79 9 -145 -3 -62 35 83 289 -232 -67
6473 -67 162 -74 151 -214 152 -127 -152 32 -10 11 48 50 -81 -62 -112 3 -171 -116 116 -117 -303 -10 49 -103
6497 -103 157 -50 -31 113 -328 -146 68 -32 -7 184 -111 208 155 -91 158 -153 35 -5 -205 159 -91
6518 -91 -365 59 86 -175 201 209 -43 46 -151 169 -74 -313 205 -70 -104 326 106 -116 -161 31 44 37 6 20
6542 20 196 -280 -136 -167 5 39 186 66 63 -344 231 351 -290 -169 164 -48 -46 225 -68 0 102 -37 -69
6565 -69 87 29 92 -370 173 140 197 41 -11 -146 79 75 54 304 -99 -212 171 -253 -214 3 -32 -28 -42 -179 -8
6590 -8 -73 28 144 -267 -19 134 26 -96 -67 10 -181 -114 -314 107 -328 -72 124 82 -33 95 68 -27 -5
6613 -5 -16 2 -137 -93 -40 -418 121 347 -219 98 171 -87 148 181 37 151 -271 171 177 -268 -34 65 -310 -133
6637 -133 -52 -57 185 25 59 173 -28 8 199 -23 15 183 -189 94 -23 145 138 -191 22 144 -150 -83 194
6660 194 -48 35 -44 161 7 -11 214 317 189 -148 -16 -92 -102 323 34 -151 -293 -185 123 4 -119 231
6682 231 73 85 148 -101 -94 98 -182 38 -169 46 313 208 -238 108 -20 34 -71 -46 253 -31 -119 175
6704 175 -179 -201 10 96 -183 265 -131 -139 -229 -297 -13 -204 -71 328 145 -274 37 -130 -144 45 214 -111
6726 -111 197 -291 261 82 -312 230 125 -210 82 125 35 -265 -61 0 95 -199 106 -32 -33 39 5 68 -141
6749 -141 95 -22 245 -257 73 60 -123 209 29 140 250 -63 -153 149 -215 18 -178 -47 323 90 -388
6770 -388 100 189 -71 -71 -33 87 2 -69 376 56 -212 -6 -11 -189 33 99 11 30 -285 226 171 -167 -8 186
6794 186 -339 158 124 -404 -51 -105 78 -42 -219 16 88 -308 245 413 -142 38 94 -114 73 -245 247
6815 247 283 -308 97 35 -157 180 -75 20 -69 -174 209 46 -199 -78 276 -311 -1 69 14 69 221 56
6837 56 154 -157 124 222 -314 46 8 -242 -16 -174 -3 69 5 76 314 -257 -191 330 -81 -67 262 -85 -32
6860 -32 27 -71 33 -179 223 215 -146 -24 177 -331 -119 -48 -50 -236 149 1 -6 -146 23 38 -195 131 111 2
6884 2 52 -111 -17 -171 -228 45 144 -320 18 257 -40 -121 287 0 52 -50 -213 16 -123 -167 178 -335 -157
6907 -157 372 61 -213 221 69 167 -154 81 128 -54 -291 295 -116 31 173 95 -175 -21 -24 388 -166 -448
6929 -448 264 -183 -23 138 33 36 -88 -204 155 159 -62 216 -104 39 -147 132 136 -226 -36 -72 37 -43 327
6952 327 -8 -72 256 156 -321 152 -2 24 -51 44 -248 35 85 244 -188 22 338 12 -311 214 -55 62
6974 62 -39 -16 95 103 -124 16 226 -18 383 160 -269 50 -22 20 -294 -202 373 -29 -306 26 69 -19 -15 -181
6998 -181 163 21 5 50 166 -122 189 -255 -293 -34 217 -136 -44 87 139 70 154 184 119 -288 268 114 -313
7021 -313 191 -33 243 -79 9 272 103 -112 283 276 -38 -45 100 168 -134 54 41 -98 -119 67 215 -581 146
7044 146 117 -16 94 -275 -120 -71 -68 51 361 -293 118 124 -169 307 68 -25 -136 26 160 -122 -22 -99 219
7067 219 -379 69 76 -128 48 43 209 69 -421 -166 57 98 72 15 -69 -151 33 -42 -119 -77 -208 69 -65 216
7091 216 -132 -118 163 237 141 15 32 -251 67 -269 248 147 -30 -100 27 -133 -81 -59 292 -6 -49 69 159
7114 159 -73 25 256 -135 -16 -40 -259 54 98 -61 -79 26 -219 -9 -283 -60 20 -315 -42 97 37 64
7136 64 -46 -143 11 -99 26 240 -5 -112 49 -136 -119 -108 -95 80 -35 -26 9 120 -64 -200 -101 -382 -111
7159 -111 -219 -208 -15 -35 19 -127 -41 313 -120 -180 547 4 46 109 98 364 -242 27 97 -66 -256 -56 -109
7182 -109 -19 121 88 135 129 -4 114 -163 -118 -6 -137 163 -24 -105 -165 114 72 180 -82 -226 18 -129 -202
7205 -202 64 20 -177 -139 34 -136 81 35 18 -126 45 186 39 -120 165 -58 -33 76 -93 46 -218 -174
7227 -174 319 158 -282 257 -134 6 19 10 173 141 -174 -28 -181 -53 207 164 -247 -41 -163 -45 163 37
7249 37 148 110 -241 42 182 -31 203 -87 22 107 10 -37 -43 -53 305 -36 50 -5 -11 -236 41 193 -171 -224
7273 -224 161 90 -74 -70 253 -42 -79 14 -25 -375 -87 -431 193 1 -53 199 9 -137 -37 288 -267 126
7295 126 38 31 129 23 -21 389 -52 202 -72 -384 -201 91 43 201 218 11 55 -177 184 -37 42 205 84
7318 84 -7 -78 16 14 141 -101 45 -30 -179 147 179 48 64 105 -416 -155 105 128 -201 -60 96 11 -235 21
7342 21 86 -93 161 97 76 75 -30 140 33 -208 205 -43 -330 -91 89 -219 145 -177 -159 103 -139 7
7364 7 -1 -114 27 164 -134 -14 120 -64 -48 156 -234 304 -81 -196 97 -28 62 -126 -32 234 -48 134
7386 134 210 -274 58 62 -266 -31 358 -237 -104 -86 -57 188 -161 95 -86 -153 -66 -9 -137 -164 29 99 -25
7409 -25 -137 54 -36 -176 -143 462 -333 33 211 -199 94 -97 43 69 -119 105 180 -189 45 -26 -42 8 159
7432 159 -188 -18 -54 135 56 -76 -272 98 -271 176 298 -41 -201 -35 -178 89 22 8 -31 -239 79 108
7454 108 85 -246 143 -117 -45 116 7 255 60 -89 443 -137 54 299 -106 -49 174 -117 -43 -253 -165 33
7476 33 136 75 288 122 29 168 -146 -107 27 73 235 -75 220 202 66 -178 6 103 -116 -84 -126 193 -46
7499 -46 -58 72 -15 -210 108 -56 -21 204 -150 -172 -47 -307 -101 -88 -83 243 70 -162 46 -31 -75 169 124 145
7523 145 23 -89 322 113 -139 126 -256 -160 20 18 114 102 222 104 87 -158 -39 335 -210 -100 -30 -132
7545 -132 -67 123 50 -168 -256 -48 286 -1 -67 -14 -228 -93 89 -205 -10 3 272 78 131 -17 170 -449
7567 -449 125 -124 -32 323 -119 -99 40 -62 97 -97 -231 302 143 -191 -56 49 -105 125 -2 90 171
7588 171 -192 70 85 -38 -30 -109 -267 48 21 -17 13 -18 -35 36 -73 9 139 28 167 -125 -296 -198 -22 -63
7612 -63 194 -207 52 510 -206 -269 24 99 -55 -102 -48 -118 170 122 101 -62 -82 51 -196 -271 51 -98 126
7635 126 10 -172 166 -238 -33 162 -43 85 -108 -39 163 252 -290 29 -82 -88 82 44 -272 315 -86 59
7657 59 141 119 283 136 -66 124 22 -23 176 -354 -86 -17 -52 -121 23 -11 154 -25 43 88 -307 176 116 -142
7681 -142 -116 220 -182 30 22 203 -128 -252 198 206 58 -70 5 -180 78 -76 122 56 -85 -17 74 -203 -221
7704 -221 182 119 -251 66 152 74 116 -81 323 -17 25 220 -127 -99 54 -117 118 -2 -161 120 -317 95
7726 95 173 -27 40 182 -48 -284 -105 -230 64 -113 -12 68 -276 -63 -3 25 -40 115 -157 182 18 -196
7748 -196 333 -76 20 131 -246 117 116 73 231 175 44 -39 -71 -17 315 223 -296 341 256 -55 -34 91 -73 -107
7772 -107 -62 65 138 -151 244 -153 -125 46 86 -84 223 -28 181 -13 -40 205 -36 63 -12 -67 -134 153 -171
7795 -171 -28 177 -152 115 -205 -175 235 -57 64 100 64 -152 -25 23 -51 6 -283 73 -135 -353 130 112
7817 112 -47 -52 107 -13 -41 -193 270 -250 -380 170 249 -112 76 172 9 -30 97 218 216 -21 191 -222 -244
7840 -244 39 -127 -40 -287 68 -117 -39 -106 191 174 -12 8 242 -38 -112 -7 -219 28 109 274 92 -115
7862 -115 58 100 -111 172 293 -3 -178 176 -88 -90 -81 144 31 -175 19 59 -218 -147 -42 87 -253 -236 117
7885 117 -45 -61 -74 89 -198 -209 224 -305 197 42 -134 -76 -303 41 -42 -261 -204 128 5 139 168 100 -59
7908 -59 26 2 -43 -128 -8 5 -85 68 33 97 -12 -182 -75 -4 47 -41 119 -319 153 156 -57 -268 236 28 0
7933 0 -147 104 129 14 22 35 -78 -114 -44 130 -231 -115 -64 77 22 92 34 -37 -41 158 -30 3 70 0 173 206
7959 206 -96 92 -127 -252 160 28 -200 2 66 -244 -1 -169 148 -194 -129 64 -98 -42 196 -55 258
7980 258 40 -194 -137 38 -36 235 -55 -124 52 88 -157 176 -50 23 92 323 53 -48 -170 120 -276 -163
8002 -163 -46 -24 -99 74 -211 69 -62 -170 137 104 -45 133 64 51 154 -183 -167 -95 73 266 -172 -49
8024 -49 113 109 34 -29 110 12 37 109 232 147 -137 200 -28 -249 93 113 -92 59 232 61 -6 74 115 -12
8048 -12 -27 -14 35 -285 60 -28 -233 65 -5 100 -60 -28 -12 130 -118 -145 80 -83 238 -62 -183 -25 -112
8071 -112 295 171 -201 292 85 -298 101 70 -137 177 -40 113 137 -114 107 62 1 95 121 -77 8 58 212
8094 212 80 31 30 155 -23 46 -159 -60 -56 -73 18 127 -22 201 92 -38 12 -22 -180 116 -106 -385 95 -38
8118 -38 -73 47 -155 -8 87 -254 213 130 17 44 95 252 73 172 164 -138 -219 40 202 -225 -235 44 -148 93
8142 93 149 -15 22 -231 77 -156 -10 -39 -80 -242 261 181 38 134 -54 -4 58 -189 55 255 -247 -137 3
8165 3 -132 90 201 -155 -83 15 -89 66 -112 387 257 -39 69 181 62 -56 71 -83 -102 -350 -18 199
8187 199 -205 -112 156 -40
8191d0
##END NTUPLES=NMR FID
##END=
