##TITLE=1H_SA_sl.OH.8
 CDCl3, 8 sc, 
 4.9.2020
##JCAMPDX= 6.0         $$ Bruker NMR JCAMP-DX V2.0
##DATA TYPE= NMR FID
##DATA CLASS= NTUPLES
##ORIGIN= UXNMR, Bruker Analytische Messtechnik GmbH
##OWNER= root
$$ XWIN-NMR		Version 3.5
$$ Fri Sep  4 09:49:33 2020 Russian Standard Time (UT+4h)  she@DPX200
##.OBSERVE FREQUENCY= 200.1315066352
##.OBSERVE NUCLEUS= ^1H
##.DELAY= (6, 6)
##.ACQUISITION MODE= SIMULTANEOUS
##.ACQUISITION SCHEME= undefined
##.AVERAGES= 8
##.DIGITISER RES= 18
##SPECTROMETER/DATA SYSTEM= spect
##.PULSE SEQUENCE= zg30
##.SOLVENT NAME= CDCl3
##.SHIFT REFERENCE= (INTERNAL, CDCl3, 0, 15.7039)
##AUDIT TRAIL= $$ (NUMBER, WHEN, WHO, WHERE, WHAT)
$$ ##TITLE= Audit trail, XWIN-NMR		Version 3.5
$$ ##JCAMPDX= 5.01
$$ ##ORIGIN= Bruker BioSpin GmbH
$$ ##OWNER= she
$$ F:/spectra/data/she/nmr/H-F/1/audita.txt
$$ ##AUDIT TRAIL=  $$ (NUMBER, WHEN, WHO, WHERE, WHAT)
(   1,<2020-09-04 09:47:50.14 +0400>,<she>,<DPX200>,
      <created by zg, POWCHK disabled, PULCHK disabled
       configuration hash MD5:
       00 E9 B6 7A A2 85 ED C7 34 08 36 98 17 FE 4E 26
       data hash MD5: 16K
       2F E6 18 A7 E4 71 C7 BB DB BB CC 13 3F 5C F1 CD>)
$$ ##END=
$$ 
$$ hash MD5
$$ B0 77 78 49 A6 BF 40 6B 59 FC 19 49 8F 8B A0 63
##$RELAX= 
##$RELAX= 
##$RELAX= 
##$RELAX= 
##$RELAX= 
##$RELAX= 
$$ Bruker specific parameters
$$ --------------------------
##$DU= <F:/spectra>
##$EXPNO= 1
##$NAME= <H-F>
##$PROCNO= 1
##$TYPE= <nmr>
##$USER= <she>
##$AMP= (0..31)
100 100 100 100 100 100 100 100 100 100 100 100 100 100 100 100 100 100 
100 100 100 100 100 100 100 100 100 100 100 100 100 100 
##$AQSEQ= 0
##$AQ_mod= 1
##$AUNM= <au_zg>
##$AUTOPOS= <>
##$BF1= 200.13
##$BF2= 200.13
##$BF3= 200.13
##$BF4= 200.13
##$BF5= 200.13
##$BF6= 200.13
##$BF7= 200.13
##$BF8= 200.13
##$BYTORDA= 1
##$CFDGTYP= 0
##$CFRGTYP= 5
##$CHEMSTR= <none>
##$CNST= (0..31)
1 1 145 1 1 1 1 1 1 1 1 1 1 1 1 1 1 1 1 1 1 1 1 1 1 1 1 1 1 1 1 1 
##$CPDPRG= <>
##$CPDPRG1= <>
##$CPDPRG2= <>
##$CPDPRG3= <>
##$CPDPRG4= <mlev>
##$CPDPRG5= <mlev>
##$CPDPRG6= <mlev>
##$CPDPRG7= <mlev>
##$CPDPRG8= <mlev>
##$CPDPRGB= <>
##$CPDPRGT= <>
##$D= (0..31)
0 1.2 0 0 0 0 0 0 0 0.06 0 0.03 0 0 0 0 0.0002 0 0 0 0 0 0 0 0 0 0 0 0 
0 0 0 
##$DATE= 1599198469
##$DBL= (0..7)
120 120 120 120 120 120 120 120 
##$DBP= (0..7)
150 150 150 150 150 150 150 150 
##$DBP07= 0
##$DBPNAM0= <>
##$DBPNAM1= <>
##$DBPNAM2= <>
##$DBPNAM3= <>
##$DBPNAM4= <>
##$DBPNAM5= <>
##$DBPNAM6= <>
##$DBPNAM7= <>
##$DBPOAL= (0..7)
0.5 0.5 0.5 0.5 0.5 0.5 0.5 0.5 
##$DBPOFFS= (0..7)
0 0 0 0 0 0 0 0 
##$DE= 6
##$DECBNUC= <off>
##$DECIM= 32
##$DECNUC= <off>
##$DECSTAT= 4
##$DIGMOD= 1
##$DIGTYP= 9
##$DL= (0..7)
0 120 120 120 120 120 120 120 
##$DP= (0..7)
150 150 150 150 150 150 150 150 
##$DP07= 0
##$DPNAME0= <>
##$DPNAME1= <>
##$DPNAME2= <>
##$DPNAME3= <>
##$DPNAME4= <>
##$DPNAME5= <>
##$DPNAME6= <>
##$DPNAME7= <>
##$DPOAL= (0..7)
0.5 0.5 0.5 0.5 0.5 0.5 0.5 0.5 
##$DPOFFS= (0..7)
0 0 0 0 0 0 0 0 
##$DQDMODE= 0
##$DR= 18
##$DS= 0
##$DSLIST= <SSSSSSSSSSSSSSS>
$$ [...]
##$SUBNAM2= <"">
##$SUBNAM3= <"">
##$SUBNAM4= <"">
##$SUBNAM5= <"">
##$SUBNAM6= <"">
##$SUBNAM7= <"">
##$SUBNAM8= <"">
##$SUBNAM9= <"">
##$SW= 16.880792210976
##$SWIBOX= (0..15)
0 0 2 0 0 0 0 0 0 0 0 0 0 0 0 0 
##$SW_h= 3378.37837837838
##$TD= 16384
##$TD0= 1
##$TE= 0
##$TE2= 300
##$TE3= 300
##$TEG= 300
##$TL= (0..7)
0 120 120 120 120 120 120 120 
##$TP= (0..7)
150 150 150 150 150 150 150 150 
##$TP07= 0
##$TPNAME0= <>
##$TPNAME1= <>
##$TPNAME2= <>
##$TPNAME3= <>
##$TPNAME4= <>
##$TPNAME5= <>
##$TPNAME6= <>
##$TPNAME7= <>
##$TPOAL= (0..7)
0.5 0.5 0.5 0.5 0.5 0.5 0.5 0.5 
##$TPOFFS= (0..7)
0 0 0 0 0 0 0 0 
##$TUNHIN= 0
##$TUNHOUT= 0
##$TUNXOUT= 0
##$USERA1= <user>
##$USERA2= <user>
##$USERA3= <user>
##$USERA4= <user>
##$USERA5= <user>
##$V9= 5
##$VALIST= <valist>
##$VCLIST= <CCCCCCCCCCCCCCC>
##$VD= 0
##$VDLIST= <DDDDDDDDDDDDDDD>
##$VPLIST= <PPPPPPPPPPPPPPP>
##$VTLIST= <TTTTTTTTTTTTTTT>
##$WBST= 1024
##$WBSW= 4
##$XGAIN= (0..3)
0 0 0 0 
##$XL= 0
##$YL= 0
##$YMAX_a= 359857
##$YMIN_a= -351279
##$ZGOPTNS= <>
##$ZL1= 120
##$ZL2= 120
##$ZL3= 120
##$ZL4= 120
##$ABSF1= 10
##$ABSF2= 0
##$ABSG= 5
##$ABSL= 3
##$ALPHA= 0
##$AQORDER= 0
##$ASSFAC= 0
##$ASSFACI= 0
##$ASSFACX= 0
##$ASSWID= 0
##$AUNMP= <proc_1d>
##$AZFE= 0.1
##$AZFW= 0.1
##$BCFW= 1
##$BC_mod= 2
##$BYTORDP= 1
##$COROFFS= 0
##$CY= 11.3945322036743
##$DATMOD= 1
##$DC= 2
##$DFILT= <>
##$DTYPP= 0
##$F1P= 16.9975609425685
##$F2P= -3.02152046262296
##$FCOR= 0.5
##$FTSIZE= 0
##$FT_mod= 4
##$GAMMA= 1
##$GB= 0.15
##$INTBC= 1
##$INTSCL= 1
##$ISEN= 128
##$LB= 0.24
##$LEV0= 0
##$LPBIN= 0
##$MAXI= 10000
##$MC2= 0
##$MEAN= 0
##$ME_mod= 0
##$MI= 1.114404
##$NCOEF= 0
##$NC_proc= 0
##$NLEV= 6
##$NOISF1= 3.799351
##$NOISF2= 2.8
##$NSP= 1
##$NTH_PI= 0
##$NZP= 0
##$OFFSET= 15.70392
##$PC= 1
##$PHC0= -9988.1
##$PHC1= 32.20089
##$PH_mod= 1
##$PKNL= yes
##$PPARMOD= 0
##$PSCAL= 0
##$PSIGN= 0
##$REVERSE= no
##$SF= 200.130013532006
##$SI= 16384
##$SIGF1= 3
##$SIGF2= 2
##$SINO= 400
##$SIOLD= 16384
##$SREGLST= <1H.CDCl3>
##$SSB= 0
##$STSI= 0
##$STSR= 0
##$SW_p= 3612.71676300578
##$SYMM= 0
##$S_DEV= 0
##$TDeff= 0
##$TDoff= 0
##$TI= <>
##$TILT= no
##$TM1= 0
##$TM2= 0
##$TOPLEV= 0
##$USERP1= <user>
##$USERP2= <user>
##$USERP3= <user>
##$USERP4= <user>
##$USERP5= <user>
##$WDW= 1
##$XDIM= 8192
##$YMAX_p= 0
##$YMIN_p= 0
$$ End of Bruker specific parameters
$$ ---------------------------------
##NTUPLES= NMR FID
##VAR_NAME=  TIME,          FID/REAL,        FID/IMAG
##SYMBOL=    X,             R,               I
##VAR_TYPE=  INDEPENDENT,   DEPENDENT,       DEPENDENT
##VAR_FORM=  AFFN,          ASDF,            ASDF
##VAR_DIM=   8192,          8192,            8192
##UNITS=     SECONDS,       ARBITRARY UNITS, ARBITRARY UNITS
##FACTOR=    0.000296,      1,               1
##FIRST=     0,             0,               0
##LAST=      2.424536,      0,               0
##MIN=       0,             -351279,         0
##MAX=       2.424536,      359857,          0
$$ Real data points
##PAGE= N=1
##DATA TABLE= (X++(R..R)), XYDATA
0 0 0 0 0 0 0 0 0 0 0 0 0 0 4 -8 8 -8 14 -16 16 -24 24 -32 40 -48 56 -64 76 -88 102 -118 136 -156 178 -203
34 -203 229 -259 291 -329 369 -411 459 -512 570 -630 698 -773 854 -943 1041 -1146 1264 -1390
52 -1390 1530 -1686 1860 -2054 2270 -2516 2795 -3119 3498 -3948 4491 -5161 6011 -7122 8638
67 8638 -10776 13793 -28927 359857 17046 -239911 50598 -56355 146249 44076 -317269
78 -317269 107848 257481 -213788 -63894 80325 9627 93817 -128094 -126787 277307 -10899
89 -10899 -248003 123784 81060 -45931 13285 -121685 83241 180491 -215111 -69654 220255
100 220255 -45818 -62450 3496 -40030 150967 -25776 -220727 162751 117257 -181464 16040
111 16040 26205 10918 89596 -169233 -25718 235000 -109778 -133920 121551 4286 19558
122 19558 -26776 -132865 155554 83059 -215469 26926 127000 -56144 -5902 -55923 -7453
133 -7453 160574 -101393 -135412 161390 25604 -99094 18809 -22335 57157 50054 -160560
144 -160560 37583 151555 -111708 -57227 72490 -1432 42732 -54461 -93931 159594 23767
155 23767 -160014 57811 63395 -24845 11922 -81432 31558 133875 -121303 -62314 124589
166 124589 -11285 -31677 -6324 -31522 94532 8819 -132665 71839 82408 -75894 -7828
177 -7828 9463 17607 56323 -76482 -42034 120392 -18179 -77230 40043 11401 14960 -209
189 -209 -72489 46954 70809 -90448 -11212 61742 -25444 2472 -17836 -21545 73171 -27879
201 -27879 -78507 73143 19124 -52467 12754 -15397 26419 31526 -81286 8979 79290 -48872
213 -48872 -29734 26808 -2002 30768 -31390 -49189 71065 15825 -69093 15407 24348 -6139
225 -6139 6837 -39538 12213 57273 -46716 -33119 51326 3220 -17327 -600 -15585 40767
237 40767 10276 -60754 26204 44277 -32988 -5611 7718 1001 33840 -32647 -25293 59198
249 59198 -7778 -35037 19937 1775 7502 6469 -39568 25479 33246 -45768 -670 24910 -7489
262 -7489 3206 -13488 -8493 38031 -14940 -35254 29995 9094 -14812 -2285 -9739 12361 15977
275 15977 -32693 -3713 31760 -16913 -13633 6344 -2563 9097 -7438 -24152 22213 10464
287 10464 -32775 7110 8707 -6547 5452 -16293 -1090 26343 -19451 -17171 25797 -3758
299 -3758 -4240 345 -11851 19840 4849 -26208 11197 16077 -14091 2347 -2253 1446 14590
312 14590 -14883 -5956 19566 -2190 -11736 7470 1683 4490 940 -12387 10292 11731 -12458
325 -12458 -3193 13244 -1737 222 -1222 -4389 14617 -2054 -13102 10770 5950 -9832 3005
338 3005 -2680 972 9641 -15926 -498 13446 -9915 -5844 4460 -2994 4527 -4452 -13417 13058
352 13058 -60 -11930 2443 745 -175 50 -8451 719 9495 -9276 -5044 5630 492 -2625
366 -2625 -4444 -900 4738 697 -10976 1470 6958 -4617 -3819 482 1502 2958 -3175 -6552 10159
381 10159 1572 -7836 3776 1569 2395 1027 -5639 4276 9886 -7722 -655 6921 -243 3894 -3786
396 -3786 433 9696 -880 -6157 5458 3800 132 -134 -3897 6784 2390 -6309 -454 5398 942
411 942 -3477 -907 1727 4151 -2914 -3127 2772 3893 -3903 -3173 4100 -628 264 -4289 -1310 5788
427 5788 -3441 -7219 3697 1730 -3791 -513 -4848 4527 1156 -9609 1438 3958 -3310 -2406 -1869
442 -1869 -199 5127 -6481 -3945 7497 -570 -3163 -1237 2660 4480 -1385 -5976 5231 6112 -4213
457 -4213 -2604 2150 5838 -571 -3733 -669 6552 2643 -6838 1658 6008 949 -2253 -74 2539
472 2539 6165 -3905 -3161 10071 -860 -2701 1052 1257 5812 -1017 -7423 7022 6390 -7334 689
487 689 715 3180 2446 -8446 365 8727 -3899 -7259 3527 567 895 -5011 -4730 7270 700 -9366
503 -9366 -1738 7438 -955 -5007 -4773 2629 7040 -6290 -8267 5382 6508 -7106 -3597 798 3863
518 3863 2239 -10839 125 9697 -3254 -7421 2432 899 3849 -4081 -7387 10525 1510 -7745
532 -7745 1920 3920 1314 201 -5288 5045 9068 -9334 -1259 8505 2025 -1676 -3560 1093 10389
547 10389 -482 -11225 7136 7252 -2851 -2472 -903 5192 4766 -7632 -4427 12345 -1227 -7960
561 -7960 2592 2223 2288 -1164 -8043 4939 9821 -12167 -2115 7762 -2495 805 -4758 -3437 10153
576 10153 -3505 -12424 8383 2200 -7089 166 -3512 3988 1964 -11553 -190 11176 -6483
589 -6483 -7448 2628 1726 3576 -7300 -6976 10027 4517 -11839 -1975 7763 2285 -2564 -8333 3844
604 3844 11154 -4965 -9838 7199 6232 -2552 -2973 -4100 9772 4016 -12071 1973 8903 -2697
618 -2697 -1462 -1218 1316 9812 -7669 -4482 11478 -677 -4569 2235 493 4057 1272 -9298
632 -9298 6697 7184 -8183 -484 3719 318 1171 -3524 -2967 8709 -3074 -9023 6215 1922 -4310
647 -4310 -1436 -1353 1327 4094 -9011 -2456 9933 -5455 -5702 2804 30 1252 -1729 -8587 7225
662 7225 4517 -11717 2035 4001 -1802 -373 -4394 389 7828 -6803 -6821 8194 797 -3545 -2666
677 -2666 -187 6566 -242 -9075 2803 9163 -3593 -4416 288 6079 3873 -6501 -2739 8725
691 8725 3913 -6918 -219 4770 4810 -1965 -6194 4496 7996 -3951 -5686 4932 3060 1404 -3718
706 -3718 -2857 8065 -279 -6438 3211 3372 -2303 567 -2918 2551 4849 -7541 -370 5862 -2285
721 -2285 -2762 1029 -1024 2491 -2092 -6090 6230 726 -6362 -46 2280 -1009 -1161 -3599 -81
736 -81 5616 -5626 -4856 4226 1749 -3980 -2103 -683 3183 2370 -8244 1238 6294 -2936 -3004 846
752 846 1372 3042 -2478 -4775 7328 637 -4817 1949 1237 1726 49 -3850 2900 6134 -5108 -1293
768 -1293 4339 838 1184 -2646 393 5390 -660 -4733 4176 3368 -1545 -941 -830 4494 2580 -4369
784 -4369 -1674 6099 436 -3293 223 -121 3275 -1456 -4934 2965 3667 -5064 -1080 1378 -1453 2361
800 2361 -3803 -1899 4002 -2252 -3506 2718 -975 -1468 1019 -3907 2506 844 -4806 1263 1626 -2987
816 -2987 -634 128 -1253 2046 -2975 -1854 3610 -1029 -2466 568 1095 -622 160 -2472 1902 3577
832 3577 -3349 -1544 3032 1744 -448 145 -1260 3650 1474 -3476 2895 2459 -809 240 276 871
848 871 3896 -1781 -1790 3862 -743 657 982 -756 782 979 -1740 2116 1008 -2781 1540 224 -246
865 -246 467 -863 -266 1154 -829 -1532 1841 -426 -965 -668 -377 460 -87 -2052 -1264 1996 -2210 -1118
883 -1118 10 -791 199 -1177 -2235 987 599 -3239 707 -633 -612 362 -2317 349 1713 -1404 -1736
900 -1736 1697 -799 943 -316 -1843 2283 59 -568 658 509 -168 929 -477 694 1846 -1389
916 -1389 262 934 1095 62 952 609 395 1179 -587 1968 1099 -595 270 1530 294 1292 167
933 167 -1712 3120 -121 -764 1250 -282 -381 853 -1235 -94 2008 -2821 419 740 -1818 420
949 420 -636 -1146 982 -989 -2729 2179 -583 -1233 476 -1493 821 267 -1937 -1065 1523 -1831
965 -1831 -875 178 -1238 938 -472 -1914 109 933 -2524 711 693 -1970 1161 -1166 232 2334
981 2334 -1561 -2126 3620 -238 -936 1596 -2180 2741 1289 -2679 1831 2737 -2188 1090 483 -654
997 -654 3886 -2180 -1476 4176 -185 -1258 1797 -636 659 1844 -3361 2172 2740 -3285 50 1907
1013 1907 -364 320 -256 -2473 4427 55 -4744 2630 836 -1883 325 -1894 -765 4055 -4391
1028 -4391 -1749 4101 -3154 -1010 899 -2498 1408 268 -5537 3160 1622 -5067 1816 -28 -1155
1043 -1155 1555 -3052 -1482 5479 -3256 -3599 3823 -1287 514 491 -3214 2774 2600 -5073 989 3770
1059 3770 -3244 1303 80 -872 4163 -1954 -3747 5612 839 -4299 3430 -827 1104 2931 -4962
1074 -4962 1713 5969 -4438 -1358 4515 -1789 2641 -579 -3711 6109 389 -5465 3599 1938 -2994
1089 -2994 2643 -2844 37 4863 -5656 -1423 5109 -2480 -2138 1624 -2756 2649 199 -6616 3913
1104 3913 2216 -5306 328 1173 -1618 2278 -3200 -2578 6343 -3300 -4119 4146 -558 -1934 1645 -4005
1120 -4005 2562 3583 -7535 1462 4642 -3568 88 300 -1498 5276 -2321 -5428 7352 25 -4327
1135 -4327 2657 -729 1654 3037 -5288 789 6890 -4397 -484 3550 -1492 2706 77 -3177 4809
1150 4809 1330 -6193 4305 2334 -2991 2219 -1777 251 4783 -4200 -2891 7030 -2194 -2748 2630
1165 2630 -2396 2462 722 -6050 3405 4222 -6505 723 2235 -2124 2470 -3681 -2357 6048 -2214
1180 -2214 -5322 4086 -288 -1907 787 -4261 2566 2663 -6273 -39 4235 -3244 -1275 24 -1933
1195 -1933 4055 -2409 -4619 5179 886 -4438 1347 576 -279 2417 -5220 738 5886 -4444 -1984
1210 -1984 3953 -432 786 -231 -3652 6534 1188 -6875 3679 3498 -1650 930 -1911 432 6241
1225 6241 -4591 -2965 6331 -643 -1467 1055 -1097 3073 1792 -5710 2797 4621 -4127 255 842
1240 842 -520 2219 -2120 -3345 5018 -353 -4453 2948 101 -925 660 -2595 829 2949 -4865
1255 -4865 -827 4174 -2566 -598 -126 -1392 2693 -1297 -4231 3599 887 -4203 1397 -315 647
1270 647 1103 -4070 673 4192 -2961 -2497 2465 -392 1011 -1395 -2427 4568 1040 -4073 1216 2499
1286 2499 -799 676 -1675 707 4284 -2477 -2165 3878 962 -1536 1119 -672 2410 1430 -4157
1301 -4157 2159 3368 -2291 -421 1669 -201 2337 -1579 -2290 5064 -210 -3161 1578 1060 -148
1316 -148 236 -2817 1232 3854 -3705 -933 2522 -139 -270 -1085 -1356 2632 32 -3942 1462 560
1332 560 -1338 -97 -1105 -34 1401 -2096 -1346 3117 -1385 -1505 1054 -679 141 23 -1972 1092
1348 1092 1117 -3088 1012 1234 -995 753 -965 -165 2380 -1193 -1737 2614 -166 -866 710 -686
1364 -686 2048 449 -2309 1253 2557 -1354 -388 657 331 1963 -1327 -860 2626 816 -1552 392
1380 392 875 689 793 -1877 1200 1924 -1249 -670 1421 -51 -273 140 -1302 2138 113 -2313 905
1397 905 1003 -987 -56 -380 -300 1909 -1991 -1182 1960 -520 -1053 36 -435 478 373 -2435 662 686
1415 686 -1592 7 -38 -165 62 -697 -930 1342 -975 -1267 1111 191 -523 180 -285 357 1070 -1654
1433 -1654 -117 1659 -504 88 -12 112 1044 246 -1179 1670 941 -1064 1057 299 436 668 -769
1450 -769 341 1732 -1224 -499 1452 -291 690 -238 -451 1746 287 -1562 350 1589 -588 155
1466 155 -690 483 1210 -1209 -479 1086 178 -1327 472 -366 248 142 -1791 526 739 -1450 -617
1483 -617 939 -764 109 -1139 -1148 1672 -952 -1750 544 535 -1048 20 -1063 506 1376 -2141 -212
1500 -212 1169 -425 -190 74 -214 1503 -112 -1718 1717 211 -878 151 415 357 587 -1038 -47
1517 -47 2043 -710 -422 627 407 385 175 -650 1217 1282 -1740 742 1016 -260 349 -154 341 1310 -993
1536 -993 -923 2130 -43 -715 591 -241 892 216 -1542 638 1975 -1540 -469 459 -125 868 -1201
1553 -1201 -681 1395 -196 -1875 158 49 -487 -90 -1211 454 722 -1452 -1249 988 -356 -803 58
1570 58 -777 959 -414 -1495 890 720 -1317 -83 301 -60 937 -1470 -99 1807 -672 -854 1079
1587 1079 299 40 259 -957 1625 826 -1616 635 1369 53 -130 315 195 1910 -722 -670 1600
1604 1600 402 -853 -2 299 664 455 -1599 742 1780 -1028 -655 474 453 107 -180 -852 1675
1621 1675 -7 -1934 795 663 -222 -669 -577 308 1262 -1609 -942 1319 -493 -692 -835 -47 802 -495
1639 -495 -1821 998 733 -1493 -454 -121 436 243 -1267 -404 1477 -499 -1463 563 411 550 -671
1656 -671 -1047 1275 913 -1576 -114 1712 -107 -418 -230 536 1329 -519 -925 1366 844 -825 267
1673 267 114 1134 695 -1318 593 1573 -534 -1178 886 585 781 -733 -619 1661 8 -1109 124
1690 124 1197 116 -335 -655 673 1458 -1668 -574 817 465 -711 -716 116 919 -564 -1904 786
1707 786 773 -831 -1161 41 543 403 -1438 -859 1761 -533 -1075 -77 406 338 -482 -1286 959 1156 -1720
1726 -1720 -240 687 85 -48 -936 189 1281 -152 -1303 1266 838 -209 -245 21 1305 843 -925
1743 -925 -58 1661 -172 -593 122 642 885 -281 -608 1171 1228 -1100 171 686 280 705 -955 380
1761 380 1378 -417 -1013 1032 527 -208 131 -697 958 101 -1151 310 733 -523 -166 -204 -196 884 -1137
1780 -1137 -765 1160 -208 -1254 154 84 100 -296 -1210 881 465 -1360 -491 780 83 -145 -592 -458
1798 -458 1203 -497 -1233 608 500 -212 -319 -219 241 827 -1203 -283 1480 -482 -258 100 141 843
1816 843 99 -1368 1050 927 -795 315 451 530 419 -602 -178 1461 64 -812 757 383 115 -286
1834 -286 -152 613 756 -849 -54 837 -435 -167 -347 337 526 -519 -920 579 362 -804 64 -291
1852 -291 289 -8 -1129 -199 611 -430 -652 250 -439 478 -86 -932 454 -323 -870 38 220 -427 77
1871 77 -689 212 502 -864 43 356 -240 -502 270 -300 569 -31 -764 500 384 -429 -15 427 13 141
1891 141 -55 91 1192 -260 -359 554 222 42 344 -251 345 635 -946 266 838 115 292 -65 -219
1910 -219 859 -203 -728 677 153 -298 169 -435 192 14 -522 -351 512 -692 21 106 -433 63 -157
1929 -157 -204 292 149 -1091 189 -3 -311 -216 -508 -4 122 -530 -685 306 -391 -268 139 -474 503 -21
1949 -21 -510 -61 292 -612 278 306 -521 633 -631 -17 449 -233 -229 542 -290 7 555 -665 617 396
1969 396 -485 279 580 -89 336 427 -210 698 -82 -47 789 286 -444 124 181 111 785 -674 172 954 -166
1990 -166 -69 141 191 33 192 -600 792 -115 -779 300 135 -118 -137 -546 -230 340 -533 -489 347 -427 -268
2011 -268 -123 -151 107 189 -957 65 102 -787 36 -165 -54 61 -428 -503 764 -103 -547 482 -173 -43
2031 -43 -100 -189 249 650 -710 -104 652 -274 576 8 -273 1011 110 -346 764 301 -393 589 -158 576
2051 576 465 -476 257 463 -42 -150 477 140 636 -251 -359 846 217 -605 446 483 -378 499 -353 -53
2071 -53 651 -312 -347 653 -81 -456 223 -336 430 -48 -1089 164 137 -497 -95 102 -365 324 -289 -630
2091 -630 977 -663 -658 -11 -84 -403 18 -857 99 567 -1061 111 377 -293 -42 -379 84 421 -490 -712
2111 -712 1044 329 -308 206 -6 451 508 -455 -66 1240 -260 -340 405 93 340 -143 -500 809 749 -955
2131 -955 428 733 131 484 -384 231 715 -269 -637 816 -152 -130 212 -433 691 150 -786 126 555
2150 555 -523 -128 142 -439 637 -619 -565 395 -160 -1052 89 61 -244 40 -1139 246 575 -822
2168 -822 -475 737 -184 -294 -282 -954 952 10 -1102 228 523 -363 54 -233 64 724 -852 -133 1129
2187 1129 -84 -138 117 -112 247 255 -613 851 590 -508 309 367 103 207 -157 -218 1239 -254 -427 928
2207 928 183 115 -298 -50 461 544 -735 20 917 -405 138 2 -65 534 -168 -993 608 422 -944 286
2227 286 -200 338 11 -866 128 546 -631 -805 335 -442 164 -795 -308 351 -142 -669 65 422 -204
2246 -204 10 -559 -83 508 -706 -506 603 -253 -656 267 -220 325 346 -457 228 421 -299 -264 366 -11
2266 -11 461 2 -53 811 -100 -270 411 262 84 208 -393 650 467 -572 230 290 -113 102 93 -19 396
2287 396 52 -327 619 349 -1 -2 -173 77 166 -307 -104 637 -259 -2 192 73 -190 -258 -602 125 290
2308 290 -917 366 41 -263 -114 -343 -134 589 -552 -696 497 -395 -396 -22 -77 91 138 -497 -164 333
2328 333 -628 170 84 -114 408 -233 94 258 89 -178 461 -2 270 199 -177 404 -124 -157 -71 559 -111
2349 -111 189 -26 -81 334 49 77 479 349 -51 133 -112 99 589 -39 180 196 -176 -258 184 -116 -152 121
2371 121 -432 411 47 -271 118 -111 67 -27 -41 -256 271 -238 -72 147 -294 34 -93 48 -152 223 -93
2392 -93 -33 67 -113 148 67 -53 -84 4 -274 313 -184 -300 301 -142 42 -69 41 143 262 -264 100 309
2414 309 -178 204 59 277 -55 133 1 536 310 -67 171 50 209 -90 -38 22 143 -170 -124 540 -33
2435 -33 -62 38 -3 238 23 -258 -45 377 48 197 -149 148 279 -556 113 70 -286 -125 215 -47 95
2456 95 -479 -467 2 107 -198 -242 217 -326 77 -340 -210 24 -393 -430 178 -113 -57 114 -212 -76 376 -255
2478 -255 -83 136 -118 -131 291 -82 267 207 -295 663 96 -132 93 183 94 240 3 -146 528 -173 110
2499 110 209 88 157 132 -210 503 254 -438 246 61 179 106 -193 51 185 -92 -288 347 -99 -105 -136 -46 84
2522 84 43 -43 -128 70 -567 -126 109 -82 -84 -203 -67 126 -91 -466 75 -11 -127 -25 -620 227 201 -313 -302
2545 -302 186 -32 -212 -373 -255 359 -390 -171 270 134 -187 -20 -156 15 149 -310 254 191 58 20 151
2566 151 195 298 110 -309 389 295 -290 77 295 52 -13 53 -84 767 -60 132 231 131 87 56 25 103 497
2589 497 -436 95 402 -245 -142 149 -11 176 75 -267 526 -48 -352 169 -144 54 -12 -313 -223 194 -580
2610 -580 -253 59 -32 -64 -208 -146 292 -138 -601 107 314 -238 34 9 248 241 -59 -179 431 -210 -289 13
2632 13 -230 297 64 -245 568 690 -563 -209 269 -149 325 -287 -197 510 -15 -20 486 244 -252 104 -379
2653 -379 322 423 -441 340 350 280 -77 -75 87 543 -77 -459 625 90 -233 42 42 167 -36 -517 -92 589
2675 589 -439 -27 -161 -81 -40 -148 -446 211 155 -660 305 93 -108 3 -229 -196 582 -506 -178 260 -285
2696 -285 -317 -110 -276 321 90 -103 157 40 -650 158 85 41 48 -417 -138 361 -46 -389 442 88 91 15 -270
2719 -270 124 291 -312 -196 282 -98 154 -71 5 362 -192 -96 346 13 -185 189 45 14 345 -600 261
2740 261 268 -24 -17 166 -33 -24 -120 -422 353 -47 -382 28 126 -117 -232 -40 -259 559 -379 -332 32 61 -187
2763 -187 -64 -85 46 87 -563 -18 217 -455 -89 -250 -116 249 -5 -142 489 -15 -58 197 -78 177 -177
2784 -177 194 181 185 -420 173 256 -132 313 74 -116 410 13 -312 190 370 -239 182 2 86 218 -117 136
2806 136 482 59 9 336 -118 -5 2 -10 202 557 -535 154 155 -207 56 -153 59 380 -46 -301 412 111
2828 111 -88 52 -159 119 -96 -292 -18 168 -97 73 98 -305 106 -291 -73 214 -236 -255 148 205 -221
2849 -221 94 -366 -120 242 -490 -342 163 82 -136 198 -57 250 89 -390 272 -106 -152 167 -14 135 35
2870 35 -227 7 291 -175 84 210 329 20 -38 28 180 196 -333 248 5 -90 -278 -178 -159 348 106 -209
2892 -209 125 -44 -28 -39 -29 133 45 -196 -138 -138 -350 106 -28 169 -81 -44 -224 104 -209 -256 324 -208 -256
2915 -256 -286 -199 92 -137 35 -105 22 93 -148 -122 4 3 -13 -68 380 343 -393 99 240 167 137 -52 389 95
2939 95 47 -253 -49 440 277 15 -87 223 136 -87 -113 370 122 -138 244 -95 313 -92 -50 206 -35 -67
2961 -67 -148 34 -15 110 -142 -23 -43 -217 -7 -133 -115 177 -207 -276 333 63 -125 -98 -47 -80 -89 -107 -2 147
2985 147 -68 -138 -70 -241 -96 -333 19 -154 -81 -41 -173 42 -178 139 -38 -136 66 -169 185 120 -68 145
3007 145 63 -105 177 -105 17 137 -82 -109 49 173 -67 -188 -64 237 138 -7 -141 225 156 -10 357
3028 357 13 129 95 -114 54 327 -4 -28 233 -95 31 116 -106 -43 42 149 -133 330 -184 -195 -56 154
3050 154 210 47 -25 -267 52 -162 -2 -190 31 -43 -234 46 15 -44 59 -72 -10 -21 -41 -248 174 -267 -99
3073 -99 -41 179 -123 -31 -136 -141 233 -37 77 -175 105 70 35 196 119 -72 -300 67 -82 72 -81 -199 220
3096 220 235 -17 -89 213 -251 61 -3 165 248 59 -61 201 2 -97 220 -12 334 -4 -6 229 -15 250
3118 250 -106 149 -14 139 186 210 126 -36 -10 299 265 170 50 95 4 128 -155 -226 19 -81 -164 34 109 25
3142 25 -196 -144 -8 -17 -230 51 -37 -305 136 -18 -190 441 11 -341 74 118 168 68 -44 -147 164 206 -82
3165 -82 -34 -100 140 -24 83 -50 60 -272 -228 -114 -253 91 -37 184 -134 262 -80 280 82 80 252 -68
3187 -68 -77 -185 -210 225 281 -186 15 -4 57 76 -137 124 11 7 -406 66 -107 -13 131 -287 -74 -148 170 164 45
3212 45 -106 -13 249 -160 -66 -102 -85 -29 120 -176 -36 -135 -77 247 -99 180 67 -78 -7 -229 18 -204 323
3235 323 -39 180 -26 -163 56 19 -47 85 187 21 101 37 -48 178 -73 137 -12 63 108 -61 19 311 75
3258 75 144 -29 65 294 -228 126 -98 -11 -46 -80 228 22 -18 -58 43 21 12 228 -59 16 -68 -20 -237 -172 59
3283 59 -76 -77 145 66 -121 -102 -57 156 111 51 -104 -123 -86 -204 285 -244 129 12 -243 364 -356 233 -171
3306 -171 151 -71 223 1 -15 132 -198 155 103 -144 -203 56 27 -29 108 -202 34 -112 -347 154 197 106
3328 106 185 247 -31 -30 -93 75 -14 204 -165 7 -182 156 149 -264 -71 184 36 150 238 115 -3 52 -124
3351 -124 106 -180 -106 50 -99 -87 -7 8 -54 150 -387 -231 6 -51 125 -50 172 -146 60 -81 -53 -179
3373 -179 -110 -27 -79 118 -1 -141 -54 191 -208 -262 8 34 141 -51 -92 22 97 -58 155 178 -146 127 247
3396 247 -124 -34 22 20 461 32 159 -40 119 266 -28 225 -1 119 -50 -134 -136 -230 233 17 -201 180 -11
3419 -11 172 -32 45 308 31 -29 148 -66 -289 -108 219 -109 -158 135 -90 99 -3 12 94 -135 -185 -287
3441 -287 6 -154 -34 -249 -164 199 -41 -19 131 47 -212 -137 -154 39 -41 -42 118 -272 37 87 -171 64 -28
3464 -28 -117 -59 177 11 82 -31 56 114 -83 54 84 400 153 29 -58 202 219 112 -184 222 -114 56 109
3487 109 -54 -33 198 -152 64 130 9 -64 -165 54 116 -125 -50 27 162 -83 -234 225 -201 -112 -22 -166 211
3510 211 -162 -92 -141 -140 -166 -86 13 75 -45 -16 -175 -77 -8 -92 12 -47 -117 -178 70 -71 87 -250 57 80 -63
3535 -63 -227 -11 55 159 -250 71 50 -43 -352 126 43 -37 68 -11 110 -31 97 143 129 -79 213 118 -80
3558 -80 38 -49 -8 151 8 -184 37 -11 -101 -80 -76 38 -13 89 -32 278 -111 68 63 45 -109 91 -123 -277
3582 -277 -209 -230 -128 -84 -245 192 6 -106 30 30 236 12 5 -149 -305 -57 -105 -240 -120 42 -59 -121 -63
3605 -63 -153 -39 97 82 65 159 19 0 0 -49 -25 237 -161 1 -226 -174 -32 -10 86 -42 97 -33 -98 -42 -170
3630 -170 61 5 -165 80 101 -171 23 -83 288 122 179 -24 -152 -176 -19 10 -134 -103 -169 53 21 0 -280
3653 -280 27 -318 53 -99 -55 -184 -123 -26 37 25 33 79 -99 9 -145 -57 39 -79 2 100 247 -18 -151 91
3677 91 90 141 195 -167 27 133 -150 155 130 300 -95 -23 32 97 63 195 332 -30 -99 153 -61 -41 -121 2
3701 2 342 -10 -80 96 397 -105 22 -6 -28 265 -14 -114 -71 -54 85 194 -164 66 191 -84 -182 -8 33
3724 33 1 111 -129 31 -139 0 -40 75 -152 11 -323 177 105 -3 159 -9 -173 -257 -281 -63 249 -69
3746 -69 143 134 -77 313 -4 0 125 -36 -8 -32 193 137 133 400 132 -47 90 -69 48 7 -206 -18 209 64
3770 64 173 94 87 -143 -81 -235 68 -115 7 -31 -41 107 35 52 -46 252 -244 -108 111 108 -151 -328 33 76
3794 76 95 -21 -95 -33 -131 28 -144 304 98 38 103 -54 181 -104 -73 -112 171 -4 -56 123 19 -39 144 -129
3818 -129 -34 -6 -185 168 -59 -119 75 195 49 62 67 212 -19 -160 -65 -81 125 105 -138 191 -128 273 118
3841 118 -180 -195 -40 -212 115 208 168 -25 -108 375 143 -268 103 19 -197 2 128 -115 217 99 -381 123
3863 123 -40 162 212 69 193 177 141 -205 -35 21 -85 -86 77 -187 80 -32 83 62 -161 58 -159 228
3885 228 -67 -324 -31 -311 72 83 101 -70 55 134 -111 14 -154 -14 -60 -157 3 122 19 67 -107 -18
3907 -18 0 -163 193 100 -29 44 167 49 -193 -145 -78 30 91 -141 181 100 126 41 14 113 -95 131 -131 -140 20
3932 20 120 159 270 -173 -28 33 -104 119 -8 139 93 -28 -10 -47 64 -119 24 175 30 -101 160 141
3954 141 -108 60 -83 31 228 119 -11 -80 59 -66 -208 124 -15 -242 23 -83 -28 -164 -66 -117 52
3975 52 -134 -63 -11 -45 151 207 148 46 -4 -150 -97 -50 -270 114 163 152 7 -81 -27 -67 46 199 121 2 -37
4000 -37 85 -65 -11 122 -6 -51 -27 76 226 29 26 -115 1 135 -176 31 -206 52 134 -233 83 105 -241
4023 -241 164 104 -66 18 -186 -284 -61 -177 -90 -138 -121 -297 24 -52 -36 10 186 97 -69 -59 -255 -24 16 120
4047 120 138 155 -24 25 32 -128 24 14 78 -120 40 -101 -59 29 -182 76 93 63 121 -14 235 -5 144 -93
4071 -93 58 -130 97 56 24 252 -20 87 78 4 25 -72 -98 62 -125 167 65 -120 158 71 48 -58 -22 -88
4095 -88 220 -144 -110 -48 164 81 161 88 257 190 167 -197 29 32 -47 -124 -72 91 -330 347 -233 243 75 134 -160
4120 -160 -75 40 -236 105 -215 -141 -70 -2 -1 -75 -27 51 251 -26 306 47 89 -253 -108 176 -76 142 73 52
4144 52 -29 35 74 182 69 -89 -41 74 164 -87 -67 56 126 142 36 -42 85 288 76 107 207 -52 209 -147
4168 -147 -67 227 178 80 -208 187 81 -53 -259 -11 41 62 -205 159 -105 305 78 -49 100 -34 -93 104
4190 104 -66 -265 -109 61 139 -44 117 -57 -32 -217 34 10 -122 82 108 -105 108 -159 5 -28 42 202
4212 202 20 137 -86 147 30 84 127 15 75 -37 -36 -144 22 -88 88 -135 42 64 62 -207 49 96 110
4235 110 92 -22 -143 78 270 37 86 224 -99 -72 -149 -135 42 -11 106 -24 11 -32 -1 17 3 113 -28 106
4259 106 -95 -144 -22 -120 -209 92 99 129 -178 30 91 -94 29 30 20 -55 22 165 9 32 41 65 16 -11 -179 -279
4285 -279 133 0 -99 -4 0 -146 98 269 -92 139 171 -80 82 137 67 -85 207 197 -39 -117 116 -6 -157
4308 -157 -266 22 145 -121 -180 128 -154 198 367 -52 28 -93 -114 68 -90 -242 125 -216 59 -109 139
4329 139 103 79 -79 98 -131 133 -152 85 72 -122 249 -3 67 -258 139 46 140 -88 98 -6 76 47 -23
4352 -23 -264 -71 99 -93 -110 2 -12 -8 150 7 -27 -53 93 -50 42 47 84 -93 -161 75 44 282 -80 84
4376 84 112 106 31 -98 39 143 -33 12 -11 241 164 -243 -48 152 -167 42 98 71 16 103 99 -263 17 62 -9
4401 -9 -233 220 -121 -44 -93 -146 -121 -111 -205 310 51 -323 23 -111 -40 130 -14 102 65 -57 -13 133 67 -17
4425 -17 -95 63 -12 -43 -282 176 -35 21 -188 45 41 -73 -144 58 -98 -110 -62 -88 79 116 -13 -11 -130 134 288
4450 288 -171 -41 -42 -95 -85 -33 215 -65 11 -157 258 92 38 48 -199 -75 28 23 3 -51 -54 48 -119 -110 32
4475 32 -155 -144 29 106 -38 18 -310 25 60 122 177 -2 -95 -120 61 -120 -106 -78 14 85 -305 158 221 -20 -95
4500 -95 -160 127 -10 13 -198 -130 -124 -24 -126 -112 -164 3 -96 33 -97 -301 -219 -109 -67 160 -13 -181 59 133
4524 133 160 -105 125 -221 -224 93 107 104 -13 163 -16 161 -223 191 20 200 68 -17 -29 19 -116 -305 28
4547 28 -103 27 80 -258 -168 123 -176 -19 87 -130 -75 44 58 89 -160 -13 -155 -15 65 -123 -81 -22 150
4570 150 235 -114 28 -63 207 -176 157 188 40 123 -20 -214 127 124 -25 36 39 1 45 -11 -53 95 -361 -38
4594 -38 -137 -175 123 53 51 -135 15 45 161 173 -161 41 -47 -165 98 -35 -69 75 140 -239 55 -4 4 -40 -159
4619 -159 -131 149 -119 206 93 -126 51 -253 -111 133 348 -33 -20 -11 112 -109 -94 -64 -83 46 22 15 -240
4642 -240 -119 -83 60 7 -81 78 -40 -73 -5 -39 -60 58 272 -31 119 108 -126 -137 91 174 -43 -55 -215 -41
4666 -41 55 82 259 125 85 -210 -20 58 3 -67 128 -113 -41 73 -110 -79 -59 48 -125 98 97 378 -143 112
4690 112 185 13 182 113 334 -10 81 154 131 133 -84 -77 137 -36 -200 7 200 66 -39 98 26 -138 -121 -87
4714 -87 133 -122 28 -29 -193 -174 13 -58 -125 -94 90 -107 -140 239 -19 -44 -186 -73 -62 -41 -5 -223 -73 -150
4738 -150 -12 -125 -30 44 -50 -188 -131 -27 -169 163 59 106 -185 79 -128 -146 -340 -60 7 114 141 -19 -70
4761 -70 -43 103 -33 12 -45 -91 -109 184 4 -80 -32 -8 -63 -206 217 -60 12 74 25 -46 -62 -60 191 -86 27 -82
4787 -82 29 156 14 -223 12 70 84 285 -10 85 -8 -20 -96 -93 -123 148 173 -28 -47 -109 -96 112 43 50 -152 45
4813 45 -146 109 11 -199 52 7 -62 -144 -246 -94 147 125 -83 -129 146 102 -24 -49 -155 60 18 125 159 28
4837 28 66 105 -27 -3 39 -74 115 -99 30 60 97 190 -109 -82 -109 -60 68 298 -198 151 82 -25 174 -12
4861 -12 -253 11 18 -67 -173 -71 -133 -57 -230 -156 -11 -174 -156 -214 -69 68 -118 170 28 249 157 -39 182
4884 182 56 256 -35 128 183 -230 -33 -27 151 152 49 -34 -28 134 -215 123 75 268 -156 123 -38 203 -64
4907 -64 116 128 10 -120 -19 84 45 25 87 115 -133 -56 53 80 22 -42 53 -223 83 17 28 4 105 108 15 -84
4933 -84 108 31 -60 90 -93 -43 58 59 -102 -308 -123 -16 72 -223 -72 180 140 -189 -113 -201 198 42 65 69
4957 69 204 67 26 61 -94 261 22 92 -116 93 -109 219 143 -53 -89 -35 -340 -137 -21 36 138 -113 13
4980 13 -29 35 181 218 90 148 109 28 39 68 70 -101 30 -19 -49 -74 -94 -70 144 -216 21 -210 -253 -167 -108 -67 -4
5007 -4 181 78 36 67 -54 -46 253 169 32 7 107 -43 180 -43 -98 -121 -30 -66 -11 114 61 -94 -75 -109 89
5032 89 -50 281 -138 229 -73 -71 -114 33 -31 -110 5 -9 -18 64 46 25 327 -159 107 29 118 -51 106 65 96
5057 96 97 -428 -65 -28 -90 83 175 -125 -53 -74 -45 -81 -68 52 -310 -40 -183 249 121 -18 -78 25 -91 -288
5081 -288 -42 -157 -66 101 -80 140 -39 -183 135 -381 99 -8 -5 77 59 -42 -20 -99 -135 -60 -56 122 80 43
5105 43 2 -146 -70 34 48 -345 73 185 170 -109 -37 49 -5 181 -13 12 88 -113 -174 6 -113 87 11 -77
5129 -77 113 -39 -104 233 88 -220 87 227 -103 -175 65 -96 142 -213 79 -190 -93 -210 -200 15 -129 -174
5151 -174 -87 -158 57 135 139 228 -171 -120 68 -73 32 -82 -180 -60 -55 -59 13 130 0 89 12 79 31 267 -76 65
5177 65 94 10 111 -116 -110 -314 -154 66 153 -266 -60 -49 72 46 85 -250 23 92 -130 128 -56 76 -41
5200 -41 -30 -123 235 -140 -86 202 51 120 -234 13 -9 25 -273 -31 -30 -134 49 -87 39 -158 -205 -34 -32 -156
5224 -156 -42 -73 161 -66 65 -160 -104 -11 -87 -88 49 98 -198 -213 19 213 -221 22 166 -90 -90 -37 -72 -121
5248 -121 58 98 140 82 -32 -65 75 -112 87 -94 -133 -128 -32 -214 -55 226 236 -36 215 28 -21 8 166 102
5272 102 -111 245 57 67 -44 3 112 99 14 37 -49 -99 60 -39 -199 -114 63 43 97 6 -76 25 100 -46 -114
5297 -114 -4 137 23 -94 -89 -31 -20 -137 25 146 -380 41 -253 101 50 66 93 -103 48 -175 12 112
5319 112 -74 127 71 -95 -8 -149 -16 165 -138 -95 126 -106 -122 -272 144 -205 101 -129 -191 -179 -100 -194 90
5342 90 -136 70 147 61 -177 54 58 112 -32 151 -54 -203 -19 -388 -32 236 111 -201 136 -6 180 252
5364 252 -53 115 124 1 -66 -57 11 50 104 16 -123 151 -139 91 -124 137 33 -11 107 -210 -31 -82 4 278
5388 278 -132 157 -18 -216 -99 -84 59 -15 67 -32 -76 10 196 23 -5 1 179 70 108 153 157 113 -99 105 204
5413 204 225 72 -122 33 -64 -98 47 -226 -51 6 -103 -51 -46 -127 45 53 84 232 63 115 -17 -246 177 66
5437 66 46 138 10 254 -1 73 33 -39 -38 -212 130 -195 212 18 34 140 -43 -83 -203 55 -80 -203 166
5460 166 114 -199 120 98 -5 -42 243 74 -140 2 -14 -36 -112 -44 -41 -18 -180 -188 46 -151 15 43 154 -11
5484 -11 171 139 -260 -12 167 88 100 32 23 38 -49 271 99 -17 -13 85 -107 279 -129 224 -193 157 -86 198
5508 198 -41 59 40 -135 56 97 -65 11 -20 101 166 101 8 110 -66 -142 132 239 -153 15 -33 -180 359
5531 359 -104 59 -345 26 56 121 -109 113 -90 -61 -61 0 -25 89 -1 -204 109 -23 321 -51 -21 111 -21
5554 -21 50 72 116 167 62 60 83 -20 -107 165 80 -41 36 -80 -101 2 111 94 35 163 97 83 75 -72 252 -207
5580 -207 -125 29 -23 -20 -95 -165 53 -176 -60 12 32 -111 -43 313 -126 -109 -61 -77 -48 -196 -192 -37 147 -195 46
5605 46 99 43 -84 -199 79 -45 -117 124 90 -11 230 106 222 -48 283 17 -261 -108 -6 97 255 230
5627 230 -142 53 12 -149 -129 112 -150 -31 98 -48 60 209 13 303 -81 -179 -10 -124 21 -187 -69
5648 -69 53 97 -66 -62 -42 22 -53 -127 28 61 -67 -50 53 1 245 80 -5 87 5 -148 52 -20 -98 162 -121
5673 -121 12 239 88 -86 -53 168 -128 -197 -387 -37 8 -64 64 89 54 -141 118 -55 241 122 -58 8
5695 8 24 63 -166 83 99 -65 143 34 67 -204 158 25 -150 218 14 -159 17 10 -117 146 -83 -82 132
5718 132 1 -31 -12 129 159 131 -83 136 184 158 81 -78 4 185 -194 -73 9 56 -102 18 -40 -91 24 57
5742 57 -170 172 -113 189 -102 1 -85 -106 12 -156 104 31 -177 21 152 221 113 87 137 -115 153 -123
5764 -123 44 -61 -46 -1 -68 137 152 -123 -69 -16 -321 -48 177 -22 94 -87 -268 -113 107 215 -18 83
5786 83 54 -80 88 65 124 -55 154 -16 171 64 -65 -170 139 -98 -147 -31 -205 107 49 -26 95 95 212
5809 212 -23 67 192 36 -192 -86 -154 81 350 244 -225 327 210 14 -173 -46 123 -219 31 -78 -135
5830 -135 -182 75 78 47 17 -74 -91 -75 109 233 28 23 69 179 202 45 153 -108 44 -106 -202 7 137 -167
5854 -167 -31 159 -29 -39 -221 -18 29 -3 -268 195 -93 -73 -7 -62 67 -97 38 -98 53 8 -242 -134
5876 -134 0 -111 46 -81 29 -19 -202 3 -10 9 -36 -140 -8 83 16 -24 84 153 -3 -163 -111 -8 83
5899 83 -22 95 -43 54 36 60 -381 169 -124 -48 95 -118 -115 61 -11 -315 -4 37 -3 126 91 -45 35 -128
5923 -128 24 -269 -91 225 38 -24 -79 121 161 -316 186 122 -79 145 -108 -102 -14 -187 1 -163 29 73 265
5946 265 81 -158 -69 -3 -245 60 67 -157 162 49 -77 -96 8 319 -14 -309 -97 3 -126 165 45 -220
5968 -220 70 91 173 -16 85 -69 -44 -53 -169 -117 -5 154 74 64 -107 148 -224 -341 151 -99 -3 -152 81
5991 81 -144 433 150 -180 48 224 245 -61 37 -163 -170 175 140 182 -116 -155 146 14 -50 -99 -145 -35 -67 153
6015 153 -205 -158 -141 75 114 39 -74 83 -130 -72 -58 -4 88 108 111 -117 102 -125 27 78 257 -156 -2 65
6039 65 40 160 -180 -16 -31 156 97 26 8 133 226 -237 75 191 24 -156 -76 52 -55 -86 -149 224 -25
6062 -25 107 -69 -138 126 78 -35 160 -168 -42 22 44 -79 17 48 139 -63 20 78 -57 128 126 -123 162 63
6086 63 123 -31 56 241 -63 26 -154 -23 -64 -133 151 -60 -64 67 -91 -110 117 -137 35 17 -47 -215 -35 -154
6110 -154 131 -90 41 -139 95 -189 -3 48 -201 49 48 7 -97 91 -70 -204 195 -41 -65 198 -157 -5
6132 -5 31 108 -22 -56 83 209 -164 13 -1 60 97 -41 18 -36 94 -59 4 133 -74 145 -115 47 -72 -23
6156 -23 127 30 -53 46 120 30 -45 -5 196 -115 -62 -105 -106 205 172 -4 -24 71 -35 75 43 147 -61 32 160 274
6182 274 -35 -170 -6 -209 188 -101 189 33 29 -215 251 -27 -41 -95 158 -51 -58 -214 -4 94 207 71
6204 71 192 125 -207 -88 3 117 -151 113 -85 -80 7 161 125 -23 -27 251 -126 -25 -58 -38 160 113 -154 -83
6228 -83 27 -79 -317 -89 206 -56 40 -42 -100 59 -164 83 206 -119 -93 -17 -199 -53 55 -14 97 80 -20
6251 -20 130 125 40 -17 110 -210 8 43 -101 -139 -38 121 176 224 77 42 -6 -262 117 278 -70 -58 119 0
6275 0 99 -255 -115 160 -66 89 -133 -73 -60 251 19 -132 35 -28 -56 -10 -114 72 -93 114 122 72 199 46
6299 46 -56 -67 -140 -132 -112 -108 27 121 134 -181 62 -153 -6 171 184 -37 115 120 92 68 43 -197 183 34 53 -282
6325 -282 -5 -104 79 58 238 -112 -185 -53 177 177 -226 -239 19 -76 107 11 150 44 -119 31 103 33 -171
6348 -171 -24 171 -88 -164 115 29 34 -182 14 -59 48 -262 255 -32 36 -105 -92 150 183 122 111 35 -211 63
6372 63 125 39 8 175 119 -90 -94 136 -86 8 85 -43 84 91 226 12 -9 144 89 135 174 -105 33 98 165 -120
6398 -120 -116 -17 -74 -53 121 -244 -88 63 214 -7 -111 62 -4 -79 71 221 -91 258 -168 -125 -126 102 -63
6421 -63 200 57 378 149 156 -30 119 -2 -139 -177 -57 217 -166 -219 67 -203 -145 -199 -52 195 41 43 -35
6444 -35 -102 84 40 -55 300 101 103 108 209 59 -92 -114 -4 -55 -93 144 -65 -39 89 109 -175 -44 -11 -223 1
6469 1 -26 57 -145 -71 -16 -121 79 103 -123 109 -77 -115 -140 -3 -153 -30 54 173 -254 156 161 -118 94 -82
6493 -82 9 -115 98 279 -93 193 58 97 93 -108 58 -45 54 276 -158 -137 -387 95 -169 2 14 39 -158
6516 -158 -34 -69 -110 -36 -289 -258 85 -38 24 55 18 -255 156 -14 -155 -85 -145 155 83 -24 11 12 185 20
6540 20 38 216 -192 344 129 87 -57 98 -30 -165 57 63 -136 -275 -13 -55 139 -71 -58 -203 -73 -28 -223
6563 -223 -69 -175 -147 40 -140 -29 217 98 20 -18 179 61 -143 -97 51 141 -166 -41 -123 89 -175 -153
6585 -153 133 55 -128 12 96 -126 -92 89 -95 16 -96 -98 -104 -31 -108 -100 -26 -116 179 -139 31 -11 -78 165 47
6610 47 -20 115 108 25 -67 -141 -57 33 -124 227 5 37 -7 134 -77 -91 -74 -119 66 70 50 -152 82 -56 -53 -133 -280
6637 -280 136 79 11 89 79 133 39 -142 -7 -155 -125 25 -115 42 -20 -124 -82 180 30 14 -9 78 0 -17 -110
6662 -110 172 -49 -71 12 -72 -15 -128 37 76 132 57 43 20 -290 -228 -54 -288 64 -23 25 56 -51 45 -180 -25
6687 -25 -100 -28 26 -143 226 -96 24 2 -42 101 -23 -48 -9 67 -58 -80 -76 -57 -73 -60 50 42 -55 -5 196 -64
6713 -64 -262 47 66 -108 107 -360 -5 0 158 -65 -305 107 -143 -124 121 34 7 -126 5 -217 -75 314
6735 314 -25 102 106 141 26 55 25 156 62 21 -91 17 93 49 246 45 15 -253 123 -137 161 -46 19 83
6759 83 75 -61 -123 110 257 -23 62 113 -178 208 115 -111 -164 21 -30 -29 122 224 131 169 75 -86 -49 4 -220
6784 -220 175 -87 -51 -19 160 98 96 -224 13 -100 -75 151 -146 -73 -69 64 157 84 -171 3 -165 -166 -68 -42 -232
6809 -232 43 35 -18 210 -30 102 288 -124 145 -2 72 -46 76 -205 109 42 -72 -57 38 112 142 -56 127
6832 127 26 -22 258 -198 162 -45 -28 237 191 133 27 -17 -63 -177 -57 -76 -18 102 -151 80 144 37 -120
6855 -120 187 -44 -215 41 157 46 -76 -27 69 202 -117 -13 -53 65 -118 -215 -196 -187 185 -119 2 57 -27
6878 -27 87 -6 4 -138 106 -21 -232 -78 -76 62 75 19 151 130 -17 -134 132 90 110 57 93 99 31 96 45 337
6904 337 265 291 -53 44 -46 -121 52 -251 1 -127 80 -58 138 5 -91 197 -115 63 20 171 225 30 -33
6927 -33 -49 -88 123 -59 292 -109 108 -31 -17 -18 -27 44 62 -144 -101 26 -251 -163 221 127 -85 63 143 -88 246
6952 246 141 -89 191 -14 436 -183 -128 -135 -54 80 5 -18 158 32 25 -49 93 -12 -224 161 -25 -88 219
6975 219 -108 38 161 -42 27 -44 -114 -19 173 -96 -271 -48 227 -256 24 134 113 149 121 -167 46 -27 -15
6998 -15 112 27 -121 -132 134 12 -129 -200 -182 234 96 6 -292 -118 104 -36 32 188 60 141 -79 72 138
7021 138 -96 60 7 144 195 -137 -172 181 -147 -119 -240 18 -82 -158 -13 -155 -53 -68 87 -10 185 -41
7043 -41 -55 77 -87 104 123 7 52 302 -19 -51 49 -51 -57 -61 -52 105 52 -188 46 -63 28 -205 189 73
7067 73 -156 -70 -7 154 -299 13 -168 -42 -7 48 -51 -79 -27 -140 191 -76 84 -73 -52 95 77 106 39 -57
7091 -57 153 -42 103 9 -181 -90 -78 155 41 346 -91 -19 133 -79 23 38 27 -207 -71 44 -41 -8 19
7114 19 52 -22 25 125 -66 118 -143 -21 208 -82 -245 -71 -1 99 114 47 -30 75 24 -152 -26 184 108
7137 108 -233 60 -113 -30 144 201 -131 51 17 12 59 140 -68 114 168 192 61 167 121 1 32 41 -79 -278
7161 -278 -83 -187 -1 112 80 182 61 -68 20 -143 -66 -128 158 -9 -22 -92 202 237 -342 -141 -23 -84 26
7184 26 118 216 -57 -129 106 -8 31 175 76 -42 10 -75 15 291 -105 185 88 -136 22 -99 -58 -60 277 89
7208 89 -146 -184 -99 13 118 68 -99 62 -164 -30 74 26 -22 -58 -227 58 -137 -47 -17 -75 -19 -8 -65 -29 -77
7233 -77 -29 106 155 30 -4 113 -229 4 90 -73 -102 -44 -85 134 -173 -110 -319 -22 -32 14 -28 -38 -212 -92
7257 -92 85 236 -256 -93 -92 32 -48 29 120 -131 -85 -113 -162 140 -19 -70 21 -44 33 270 187 -381 120 332 32
7282 32 41 88 -4 -94 81 62 44 -155 278 100 156 10 84 -104 -97 81 -3 -14 20 0 -136 -258 89 258 -222
7307 -222 39 -201 125 -170 -27 -85 70 -78 30 237 -152 87 42 -139 -174 -195 20 -297 39 -117 14
7328 14 23 -178 102 -30 155 65 49 119 -93 232 -14 41 -56 -33 -96 -62 207 78 -25 192 209 139 133 -12 56
7353 56 -43 61 61 58 71 -55 292 -53 69 60 -153 -4 -101 35 68 29 -77 -131 55 -37 165 25 154 108 -10
7378 -10 -195 118 -91 -95 116 168 -143 -299 21 120 -53 -65 -80 -71 -150 122 -54 -234 190 160 44 12 19 -137 99
7403 99 -52 -179 94 117 -47 221 0 -9 46 132 -153 -76 61 -21 4 32 -209 114 40 -215 -96 -9 12 -30 -2
7428 -2 -47 -100 53 -42 -114 206 -101 -1 31 357 10 107 96 181 -13 69 6 -149 -94 177 -16 26 103 176 30
7453 30 62 36 11 -175 -5 113 135 -24 177 165 -72 38 -98 151 -227 -61 -21 -114 54 -204 -154 151 147 67
7477 67 -52 61 148 58 7 -78 309 -5 18 -2 3 -22 25 64 -9 -21 -103 -226 92 147 67 -70 -88 -134 -49 136 -5
7504 -5 31 164 -125 35 -19 152 -177 -68 -92 64 127 -204 60 99 -25 99 -63 -74 61 104 -64 -99 107
7527 107 126 -194 -114 -42 -53 43 16 388 5 -11 71 157 -12 128 -328 -271 60 20 -66 21 -90 12 146 -17
7551 -17 75 21 27 79 -72 -198 -227 -105 -45 -15 -124 -73 -22 -58 90 -54 173 269 69 148 -23 39 -95 42 200
7576 200 86 -62 -152 18 58 119 33 -26 192 41 -90 55 -118 -132 35 -32 -51 17 -25 29 -149 49 9 -59
7600 -59 -33 -115 -137 -100 -47 -82 -125 4 198 2 -3 38 176 198 -95 -156 -28 35 -54 168 3 52 222 5 -28 -71
7626 -71 75 -55 40 403 -62 105 -60 9 -18 178 149 -239 -109 89 126 -245 -117 66 -43 94 -98 102
7648 102 68 57 -28 -36 229 -245 128 -170 -244 -48 -89 -29 123 61 -36 -73 109 -21 -251 50 -79 -223 -132 -143
7672 -143 135 75 -188 -62 220 -44 -107 -48 -157 58 -66 -23 79 -195 -4 -101 -129 156 -1 16 325 157
7694 157 -128 256 -14 118 -14 69 -139 50 -45 -2 -55 125 -197 -173 -56 -84 85 -165 87 15 -52 -31 -121
7717 -121 -19 98 -86 -238 43 -116 -123 -72 -188 23 -185 57 302 -7 126 227 -133 239 247 77 -154 -64
7739 -64 -122 258 45 -171 38 -47 16 66 132 -135 81 -75 -68 199 76 74 266 -177 -56 99 380 -242 -94
7762 -94 -76 -228 -109 -87 -4 -109 125 125 100 -39 197 -201 -165 44 -127 -112 223 -141 145 -16 106 48 5 82
7786 82 -78 69 -154 53 -34 16 124 111 46 -70 39 -58 246 -69 90 63 -175 133 -63 169 25 32 73
7809 73 84 246 116 134 68 42 -236 -92 124 -41 56 110 -146 65 121 14 -175 137 14 69 39 -73 66
7832 66 45 -2 150 -110 -1 -297 82 17 -20 -41 5 109 37 87 -161 102 -9 255 214 23 2 18 -108 361
7856 361 54 -17 -14 -60 91 42 -89 50 -40 45 105 217 -144 1 146 -28 15 70 61 47 -121 -148 -13 -107 0
7881 0 72 90 172 164 -162 91 10 145 -77 -192 -178 12 93 -130 -123 -166 87 128 -22 -71 -96 -77 -30 -49 -233 68
7907 68 46 140 148 -123 -12 65 165 -66 -23 111 -78 -29 148 -164 85 9 -3 22 97 75 -47 -117 -85 76 44
7932 44 100 166 103 144 12 -86 52 -57 208 2 -119 164 72 161 51 151 65 -33 -18 98 67 -12 66 123 -49
7957 -49 8 105 1 156 -31 -70 -21 91 180 7 225 59 -88 256 -181 -73 169 239 5 -69 82 -117 84
7980 84 125 -194 102 52 75 -110 -47 -136 -29 244 201 51 -35 -5 127 34 108 -78 -75 108 63 55 -120 -14 39 230
8006 230 -62 -66 -164 150 1 115 -201 -106 190 -21 28 97 35 72 -87 98 -90 70 252 222 45 23 202
8029 202 130 78 -82 -18 54 17 33 -92 30 52 145 126 108 -48 22 -111 -50 142 -126 40 226 21 -16 1 -62
8054 -62 -39 54 275 239 -39 184 -26 -95 -105 57 -132 166 -137 -144 -125 -22 -15 -279 46 -62 44 -43 58 5
8078 5 69 -212 -49 -33 346 -25 -123 40 -103 -24 34 16 120 96 -7 76 -45 190 -147 -72 172 -68 21 72
8102 72 -38 200 143 112 -234 -122 205 225 -132 72 91 -82 129 47 -12 -112 -146 -194 58 238 127 227 -34
8125 -34 39 72 -127 30 153 192 -306 5 32 -78 35 17 80 159 -60 144 28 -130 27 -136 -49 -42 78 -18
8149 -18 -3 -150 -47 76 -37 -107 -150 223 69 48 -37 61 21 123 27 -246 -157 3 233 -16 40 12 -242 -66
8173 -66 -98 -77 22 -65 53 154 -165 20 -76 100 -275 169 198 120 96 161 177 -106
8191a06
$$ Imaginary data points
##PAGE= N=2
##DATA TABLE= (X++(I..I)), XYDATA
0 0 0 0 0 0 0 0 0 0 0 8 -8 8 -8 16 -16 24 -26 32 -40 48 -64 72 -88 104 -120 138 -161 186 -216 248 -282 321
32 321 -365 413 -465 524 -587 656 -734 817 -910 1011 -1120 1239 -1369 1513 -1668 1840 -2027
49 -2027 2232 -2458 2709 -2986 3298 -3642 4036 -4482 4996 -5595 6303 -7158 8207 -9538
63 -9538 11278 -13668 17154 -22724 33005 -58110 243876 181649 -351279 95780 70865 56715
75 56715 84587 -234652 22977 331621 -187600 -148234 169333 19703 17234 -43563 -132591
86 -132591 223134 73515 -282304 87884 176106 -107339 -6402 -40197 20250 173933 -154414
97 -154414 -139993 244692 69 -147823 49338 -5377 74039 29053 -205515 98911 186910
108 186910 -196888 -41222 114952 -30887 49068 -90238 -80476 221659 -48537 -202062
118 -202062 138324 58384 -61199 8248 -92139 90524 127556 -201844 -24783 186843
128 186843 -58483 -59706 13431 -19999 121224 -40308 -164337 147392 83263 -142814 14107
139 14107 38610 8636 56800 -114176 -12019 175025 -83013 -105246 109390 18466 -14101
150 -14101 -9907 -81986 114265 72778 -174518 29376 120181 -54157 -11755 -24149 -2614
161 -2614 124874 -78870 -107751 139632 17348 -83006 14954 -9913 47421 30998 -126392
172 -126392 31814 116219 -88065 -40173 46563 621 29060 -45400 -60747 105956 11504
183 11504 -109602 38669 39790 -19789 1827 -49897 17722 79511 -76142 -46148 83834
194 83834 -18407 -30253 9431 -23364 46793 -4 -87060 54247 51030 -74689 4802 16451
206 16451 -1448 31964 -58336 -15615 88889 -33433 -56965 47378 7530 3700 -7427 -46414
218 -46414 56431 37747 -74708 4569 51126 -15929 -2095 -15402 -1964 55329 -30876 -47597
230 -47597 54578 17150 -37663 4576 -2360 18869 19544 -55672 8935 57126 -33930 -23941 24834
243 24834 -2539 15784 -13634 -36580 50996 8176 -52511 18057 16300 -10481 6667 -27077
255 -27077 5505 40979 -42680 -18275 37308 -9983 -11484 -2706 -12050 25333 -2958 -43510 24673
268 24673 20296 -27162 -3835 44 4807 14552 -23807 -12988 35272 -8911 -23942 14473 2745
281 2745 1443 -595 -18846 14188 20550 -31284 -558 22934 -10488 1191 -4262 -5508 23658
294 23658 -8425 -24152 27225 6116 -16303 6744 -5680 11407 11526 -23920 4771 24336
306 24336 -14376 -4642 8771 -2677 11929 -7843 -10877 18775 2144 -16148 6361 6860 -3333
319 -3333 1512 -10520 4089 12647 -13079 -8501 13055 -612 -8381 1312 -5151 7686 1497 -16361
333 -16361 6603 9251 -12096 -1634 4137 -4208 7859 -9860 -7314 16108 -6900 -10538 7501
346 7501 -685 -1275 586 -11655 8929 6674 -15572 2235 5350 -2347 -44 -3899 -1025 10118
360 10118 -5161 -7650 9666 2063 -2357 -1246 2215 5543 2666 -6686 1049 11237 -2987 -3747
374 -3747 3656 3560 1813 -1267 -4646 7240 6046 -9804 2966 4860 -448 1023 -3890 1457 8903
389 8903 -5964 -6031 9100 -1221 -784 -1586 -2578 7677 -974 -8257 3256 5420 -3801 -940 -3115
404 -3115 3030 3047 -8070 -1664 4025 -173 -6247 -2008 654 1117 -3307 -5355 2348 1970 -3648 -4873
420 -4873 4388 26 -2211 -1190 -1870 5467 -1286 -6676 3233 5072 -4683 -222 -372 1727 5069 -7670
436 -7670 1144 7583 -2316 -2578 1888 1216 4111 -2171 -5097 8831 1383 -4816 579 3282 3807 -812
452 -812 -4003 4120 8153 -4168 -2439 4539 5264 -309 -3998 1146 5507 3080 -6957 78 6322
467 6322 -814 -4172 -685 1717 2410 -2916 -6393 7745 244 -7689 1378 517 1755 -1532 -7809
482 -7809 2672 7170 -9066 -2977 3741 -600 1428 -7019 -1758 8345 -2419 -9148 3878 2759
496 2759 -2582 -2378 -4424 5976 1752 -9067 -1952 8256 -371 -6401 -1318 2599 6545 -4325
510 -4325 -7419 6142 8368 -5852 -4176 5930 3347 2990 -6611 -291 12002 -954 -7805 4709
524 4709 4869 822 -570 -6457 8677 5646 -9270 1577 6044 95 -960 -2492 1684 8894 -7386
539 -7386 -5237 10136 1057 -4672 -2381 1060 6740 68 -11993 4027 9617 -6165 -4238 215
553 215 3483 2857 -6666 -5962 9878 616 -12129 1928 3498 -1931 -2407 -6451 1297 9153 -10289
568 -10289 -7400 10749 -2411 -3530 -899 -3340 7847 469 -12376 6507 8077 -9499 414
581 414 1460 1569 3628 -8098 -1160 12217 -3016 -9859 6290 4122 1056 -3565 -5425 9781
595 9781 6521 -10587 -3033 11249 1800 -3881 -4658 3051 11024 -4139 -9701 7281 9443 -4957
609 -4957 -2615 -182 6560 5962 -11132 -360 11467 -2492 -5255 1554 -243 5784 -4177 -9055
623 -9055 10600 825 -8849 1504 1536 -83 895 -7747 1332 9156 -9249 -3918 5606 -769 -1625
638 -1625 -1955 -3364 5906 44 -10512 5398 4552 -6436 -1736 1336 508 2384 -5256 -4812 10547
653 10547 -2484 -8724 4561 2212 -1127 9 -5166 3898 8201 -10665 -662 8759 -2078 -811
667 -811 -406 666 7234 -2233 -7453 9437 4076 -5859 -162 1811 5348 646 -7383 1661 10370
682 10370 -3196 -6552 3252 4859 2784 -6111 -2814 7806 3873 -7942 -1572 6325 2078 -2443
696 -2443 -5702 3685 7233 -4285 -7150 4869 3763 -2405 -2815 -3635 5920 1110 -8524 1024 4161
711 4161 -3818 -1857 -870 -952 4396 -6120 -3497 6472 -2093 -4662 1660 -2 114 57 -5669 4223
727 4223 3785 -7184 37 4180 -548 -1910 -977 14 5354 -2601 -5841 5629 3573 -4052 -1771
742 -1771 2284 2089 2532 -5651 -412 9099 -2315 -3933 3065 2765 1484 -551 -3847 5998 4237 -6239
758 -6239 2239 3432 146 325 -2446 1533 6040 -4009 -3846 5969 244 -870 -1711 -953 4118 -756
774 -756 -5649 2284 4137 -4109 -2089 -722 2122 1614 -5255 -3045 4895 1242 -5725 630 588 829
790 829 -782 -4872 2007 3855 -4349 -3040 3481 -1520 242 -1419 -3483 4197 -656 -4561 2233
805 2233 1364 -2565 1589 -1758 96 3311 -4262 1034 3722 -2137 -1071 2508 -434 1633 -33
820 -33 -2042 4482 577 -2329 1575 2713 -316 183 -83 982 4026 -2706 -1973 3561 1695 -1541
836 -1541 -161 -59 1886 2447 -3842 1283 3229 -1848 -775 779 167 2011 -803 -3944 3458 105
852 105 -2244 1260 -1121 -215 529 -1825 -234 1417 -3511 -1 716 -1998 69 -1444 -703 452
868 452 -631 -2429 1375 84 -2115 -137 -352 979 -358 -1076 -1256 2303 -548 -1950 1516 -277
884 -277 346 -223 -748 890 1766 -2019 249 2007 -1164 1342 -814 152 2355 -638 -1411 2309 914
901 914 -404 1453 -1169 2275 1282 -1082 896 1385 465 642 477 -15 2007 -855 -644 1598 349
918 349 -392 -320 625 -895 701 -817 72 884 -1758 -667 870 8 -583 25 -2438 1114 494 -2528
936 -2528 726 -472 -899 206 -340 -1343 1801 -2094 -901 2070 -1964 137 127 -1383 319 182
952 182 -2547 1288 961 -2358 609 -683 398 1102 -1086 -741 2175 -16 -1065 1885 -231 861
968 861 693 -970 760 2259 -968 102 2599 -1512 1336 744 -175 2552 -511 -1961 3327 1462
984 1462 -2357 1691 -780 849 2145 -3495 688 3342 -1928 -973 1936 -1398 2506 -586 -3271
999 -3271 3823 421 -2893 1119 491 -1358 1384 -2612 -540 3314 -3793 -1604 2470 -736 -1418 -58
1015 -58 -2593 1547 1293 -5434 1251 2312 -2957 -636 67 -1536 2834 -2009 -3949 4988 -1365 -2835
1031 -2835 2441 -927 83 1928 -3802 1303 4391 -5358 729 3072 -1935 1382 -739 -1649 4995
1046 4995 -114 -4956 4655 965 -1517 1913 -1813 1687 3925 -3447 -871 5884 -2387 -752 2393
1061 2393 -1492 3111 -7 -4117 3933 3111 -5794 1911 1963 -2028 2767 -3480 -1079 5829 -3456 -4423
1077 -4423 4958 -1228 -1443 1360 -4415 3468 2243 -6649 1425 3753 -4422 300 104 -2528 4287
1092 4287 -3603 -3900 5630 -1255 -4492 2450 -1125 -243 2274 -5832 1855 4550 -5402 -1078 3683
1107 3683 -1529 787 -64 -3595 5607 -182 -5911 4836 1838 -3118 1954 -1001 9 5213 -5258
1122 -5258 -889 7449 -2987 -1535 2634 -1207 2914 634 -6084 5775 3396 -6282 2126 1676 -797
1137 -797 2979 -3206 -1506 7176 -3018 -3940 4925 -1090 -46 1110 -3298 2650 2691 -6166 1340 4441
1153 4441 -4848 434 579 -1704 3267 -2346 -4922 5783 -118 -6008 3325 -1034 -551 2027 -5453
1168 -5453 699 5465 -5769 -2436 5040 -2953 251 -552 -3341 5313 -89 -6375 3638 2498 -3836
1183 -3836 1598 -1814 387 4303 -5046 -1210 6002 -1451 -2740 2507 -894 2391 614 -4638 4422
1198 4422 3236 -4715 870 3357 -1281 1959 -2323 -1012 6963 -2789 -3593 5108 728 -1564 1388
1213 1388 -2525 3330 3433 -7398 1804 5448 -3039 -1064 326 -946 4700 -1948 -5683 6073 786
1228 786 -4571 1332 -333 429 1871 -5248 -289 5716 -4354 -2147 2545 -1149 389 -883 -3268
1243 -3268 3314 1248 -5618 1612 1831 -3015 667 -1566 -292 2921 -3013 -2772 4932 -1369 -2663
1258 -2663 1829 -952 1663 262 -3663 2829 3399 -4498 876 2132 -811 1644 -2430 -71 4912
1273 4912 -1562 -3367 3316 908 -436 479 -1924 3617 1941 -4128 576 4149 -1074 -815 91 -223
1289 -223 4026 -1583 -3203 3503 1496 -2849 569 335 233 1675 -3766 258 4195 -2876 -2201 1999
1305 1999 -343 199 -497 -3255 3668 367 -4847 993 1617 -1306 -347 -1999 -659 3499 -3371 -2649
1321 -2649 2883 -595 -1320 -598 -828 1758 938 -3849 786 2526 -1902 67 190 -45 1264 -910
1337 -910 -1621 2994 234 -2292 1572 5 69 649 -983 676 2060 -2066 -33 2820 -1255 451
1353 451 130 -64 2114 -309 -2070 2493 1219 -1843 937 33 898 767 -2090 580 2727 -1191
1369 -1191 -1435 1299 -64 1001 -815 -1576 2234 725 -2270 -370 1293 -465 -102 -1535 -416 1987
1385 1987 -1609 -1771 1265 130 -1402 -6 -1224 712 797 -2633 190 1345 -1214 -693 130 -495
1401 -495 1174 -1086 -2040 2317 -163 -1367 315 284 122 593 -1597 245 1994 -1514 -122 830 71
1418 71 351 82 -325 1730 749 -1490 1236 738 -232 389 401 581 1087 -637 -520 2112 -101 -579 518
1437 518 49 732 -40 -954 612 1459 -1578 474 915 -505 328 -774 -126 1429 -787 -1648 1559
1454 1559 -141 -688 -12 -930 933 163 -1831 -238 1480 -1203 -749 -128 -349 955 -1158 -1268 812
1471 812 166 -1590 249 190 -533 362 -1342 11 1048 -1243 -856 1453 -124 -669 166 -1041 1461
1488 1461 -159 -1663 978 1165 -1061 -84 236 -85 1694 -1245 -176 2124 -81 -280 584 238 710
1505 710 544 -1379 1577 1184 -1062 63 620 607 186 -354 -552 1648 -169 -1310 1133 358 -122 -67
1523 -67 -452 246 1056 -1745 -352 1393 -960 -437 -123 -144 475 -472 -1691 1315 552 -2080 454 33
1541 33 -189 299 -1712 -241 1645 -1416 -1440 842 -360 71 -766 -957 1273 250 -1815 357 1010
1558 1010 -914 142 -766 144 1217 -822 -724 1336 634 -1062 863 -136 736 334 -1287 1086 1578
1575 1578 -1207 -280 1438 22 852 -226 -359 2178 -274 -1132 1175 674 -487 579 -536 681
1591 681 1176 -1559 341 1367 -111 -695 312 -11 756 -374 -1397 1229 515 -1005 -361 463 -20
1608 -20 24 -1251 -139 1633 -1304 -1493 563 530 -535 -620 -770 410 511 -2157 301 1125 -918 -742
1626 -742 -359 184 961 -1071 -1405 1789 63 -1191 -149 113 860 -197 -1295 885 1593 -1470 -402
1643 -402 682 473 699 -986 77 1620 310 -1324 855 1199 -88 -121 -422 1485 1225 -1051 -273
1660 -273 1860 229 -533 -10 73 1371 -245 -1131 978 933 -1227 -304 778 1 440 -1564 217 1566
1678 1566 -796 -1192 586 527 -359 -275 -1326 1425 86 -1801 -61 857 -377 -822 -628 364 994 -1669
1696 -1669 -1188 1041 323 -1017 -832 181 387 -299 -1791 325 1197 -1105 -686 339 810 -185 -781
1713 -781 -949 1648 101 -1480 549 681 396 -466 -865 708 1717 -1371 -507 1594 85 35 -378
1730 -378 64 1139 342 -1359 1127 1390 -738 -40 -224 1029 721 -995 -162 1778 221 -1343 553
1747 553 331 225 -547 -823 559 818 -1387 -819 1151 -438 -409 -932 -376 1062 -781 -1365 552 609
1765 609 -769 -156 -788 275 466 -1419 16 833 -616 -894 225 -375 404 -637 -1117 1165 34
1782 34 -1129 15 340 -12 96 -770 395 910 -1046 -368 726 380 -447 -191 -217 1278 258 -1582
1800 -1582 859 946 -271 -430 515 511 850 -471 -608 1953 -123 -925 439 492 350 104 -837 550 1535
1819 1535 -1257 -16 596 102 -55 -584 -196 826 74 -1281 748 178 -408 -387 -506 304 252 -937
1837 -937 -567 872 -575 -519 -240 -25 291 -921 -936 351 477 -1194 -487 271 172 25 -905 -353 702
1856 702 -288 -859 594 -91 49 58 -1033 999 307 -612 197 441 -177 176 226 -70 842 -436 -182 821
1876 821 83 -125 270 385 245 435 -613 693 582 -450 0 632 203 67 237 -348 855 -53 -737
1895 -737 793 395 -433 210 -96 -87 769 -959 -139 1291 -215 -428 -423 36 322 -313 -1212 428 186 -1136
1915 -1136 -76 -397 -233 -318 -383 -293 479 -164 -413 528 -529 53 -252 -384 -10 4 -876 -196 613 -456
1935 -456 10 -286 295 433 -90 -512 686 87 -474 476 -239 330 277 -515 252 888 -226 112 793 -234
1955 -234 624 -48 -65 785 109 -334 623 198 -221 841 -305 270 524 -403 95 567 -126 -272 396 -212
1975 -212 194 45 -567 303 73 -743 -246 517 -245 385 -513 -138 476 -639 -371 273 159 -338 -407 -444
1995 -444 -16 260 -1088 266 159 -338 -213 -221 -91 109 -362 -944 850 -215 -112 -20 -113 60 18 -547
2015 -547 192 772 -721 128 476 218 217 -52 -42 693 502 -600 745 337 -55 355 -26 194 710 -60
2035 -60 -392 1150 -319 -252 451 -281 582 84 -641 563 419 -609 345 375 -18 447 -601 -10 549
2054 549 -40 -543 442 -203 -110 162 -824 412 156 -862 -9 531 -541 -213 106 -539 625 -381 -595
2073 -595 564 -46 -789 29 -102 -232 578 -801 -15 723 -458 -367 462 -26 -12 -17 -601 657 160 -704
2093 -704 706 165 -105 241 -50 261 737 -1003 83 951 -110 78 532 33 498 216 -923 595
2111 595 681 -695 120 410 240 215 -272 -265 1001 7 -841 442 170 54 -51 -245 293 495 -1051 -25
2131 -25 627 -430 235 -235 -202 799 -358 -818 711 220 -786 445 -604 111 60 -1113 -227 759
2149 759 -578 -524 605 -364 341 -403 -748 921 159 -1020 -112 243 -312 286 -413 -80 605 -613 -441
2168 -441 730 290 -526 135 -390 639 322 -878 405 708 -346 113 442 -165 735 -271 -375 1184
2186 1184 -88 -386 266 324 79 492 -465 136 1009 -858 172 571 225 -106 -30 -186 740 195 -868
2205 -868 616 2 -310 -211 -232 5 558 -855 -454 798 -561 -268 91 -91 476 -149 -630 185 423
2224 423 -946 -145 167 -54 -131 -579 -113 701 -419 -879 574 57 -194 -107 -297 605 171 -872 208
2243 208 796 -361 -85 192 60 534 -364 -128 683 212 -475 290 327 103 299 -477 121 802 -252 -395
2263 -395 656 246 -213 -54 -440 784 64 -506 78 280 -261 12 -147 -47 661 -758 -106 536 -236
2282 -236 -143 0 -245 -59 121 -887 224 92 -353 -196 -124 -206 104 -224 -392 451 -453 -315 406 -108
2302 -108 -107 -115 -153 107 520 -493 52 398 -279 40 -263 -23 111 -117 -341 673 -53 -529 410 -191 462
2323 462 199 -247 94 611 -42 71 249 43 427 183 -256 449 111 -480 217 209 -117 414 25 133 413
2344 413 -293 -13 359 210 -183 168 19 105 -101 -230 192 250 -298 -428 75 -194 217 -105 -232 271 -234
2365 -234 -137 -144 -300 -434 46 -198 79 240 -713 234 44 -32 -328 -140 -374 -3 -160 -537 287 -270 17
2386 17 33 -95 42 23 28 -61 366 -190 127 -18 -264 -36 186 -144 111 328 -62 440 360 -139 -102 202 204
2409 204 167 12 -110 558 -281 176 323 121 331 -9 59 88 432 -272 181 130 -266 0 -309 228 -72
2430 -72 -105 -269 365 -171 -331 -255 -343 80 -144 -137 -81 285 -353 -182 -96 -164 -128 -167 -133 -34 176 -343 -174 -46
2454 -46 -68 191 -406 167 237 -167 62 266 -119 17 64 -151 357 -144 -308 308 225 -202 -16 52 -127 410
2476 410 -90 -276 369 -88 113 408 334 -65 320 -174 325 240 -14 305 193 -283 120 231 -180 381 -269
2497 -269 -105 253 -22 -160 105 -222 147 278 -580 -95 226 -90 158 -212 -47 -73 -221 -371 175 16
2517 16 -496 24 -263 -154 -33 -394 -16 188 6 -321 -35 -230 173 -35 -164 195 -238 -295 308 251 -498
2538 -498 158 -96 79 51 -248 -132 211 -48 -240 348 75 135 88 -358 459 262 -249 90 315 -118 258
2559 258 -298 -59 770 163 -120 250 101 -113 334 -145 135 45 -284 241 34 185 -145 60 -115 198
2579 198 0 -204 -61 8 -102 -234 102 259 89 -324 -405 464 -375 -166 96 -289 58 64 -459 64 219
2600 219 -749 170 33 1 -65 -197 166 381 -462 -399 673 282 -436 283 33 337 59 -196 168 471 -540
2621 -540 82 270 189 212 -515 -122 409 162 -499 342 63 -49 177 -81 181 303 -474 -282 644 97 -185
2642 -185 -123 -54 660 -210 -472 318 506 -452 104 -134 123 466 -893 392 373 -221 -274 -7 -55 -44 -311
2663 -311 -709 101 -49 -510 -147 -157 -168 4 -271 -331 391 -391 -529 145 -86 -132 -15 -351 256 -32 -610
2684 -610 -50 279 -450 151 -35 -132 429 -140 -227 331 173 -290 114 13 50 33 68 128 364 -210 -120 396
2706 396 -9 103 -177 -15 411 234 -459 468 336 -241 179 -413 18 197 -272 -85 460 105 -93 15
2726 15 -115 -66 18 -372 243 347 -533 -94 186 -482 -7 -420 -100 243 -391 -347 -68 68 -211 68 -471
2747 -471 -37 -27 -565 8 356 -304 11 -62 -266 339 -132 -141 24 139 -405 -89 -4 240 179 -165 203 314
2769 314 -232 -61 167 -73 50 138 -7 260 152 -237 155 222 -298 141 -147 18 512 -355 171 334 -414
2790 -414 -53 99 -25 108 193 -114 180 218 -264 135 -84 -137 81 -203 -116 156 -187 -418 303 -308 -173
2811 -173 107 40 16 -72 -199 -198 -26 -441 -71 -97 -183 90 -211 -265 96 -153 -349 223 55 -3 -121 -245 251
2834 251 70 -198 -79 375 -95 56 122 -93 217 25 -259 263 117 32 54 -3 54 58 -214 145 316 166
2856 166 -235 325 132 279 183 37 288 311 -177 -220 230 -35 162 -135 -65 361 -105 -200 275 -49 -142 151
2878 151 -11 -22 392 -489 95 320 -156 -119 -283 -41 -28 -88 -302 165 -193 -62 -164 45 132 -21 -287 26
2900 26 183 -341 -94 -30 -224 -96 -33 -192 134 82 -265 231 138 -139 -22 -252 -24 102 110 190 433 142 -147
2923 -147 488 11 99 323 35 188 101 -193 -110 252 -133 170 -62 -37 324 -120 -322 137 236 -74 206 114
2945 114 -59 279 -82 111 251 -41 43 -16 -114 -133 -93 -92 133 -129 -138 37 185 -471 -1 -190 -171 276 -84
2968 -84 -218 -120 2 -74 -106 -171 -87 100 -262 52 -219 81 -33 -165 -233 -87 -142 -50 86 204 261 230 74 -16
2992 -16 91 -254 97 259 -27 54 -83 113 134 39 145 45 46 -29 304 -145 -56 168 -29 90 73 -63 -60 102
3016 102 -87 97 60 78 126 -140 -39 -205 161 -17 28 189 178 12 -89 -173 -100 -136 -300 163 93 -96 -57
3039 -57 -159 108 -148 57 -197 78 -181 -42 -250 -188 391 -130 -157 172 67 91 55 -225 144 200 -267 318
3061 318 280 -53 -48 -64 45 124 -111 -271 115 109 47 -237 38 126 224 -55 -39 206 -90 93 150 -81 -74 -56 355
3086 355 59 227 0 50 249 -203 22 -53 20 -16 72 289 82 -119 -209 50 -149 -81 -5 -5 -69 116 -135 77
3110 77 38 -227 -151 -147 -98 -8 -34 -149 -8 -2 -106 -25 -196 119 175 -114 83 190 -158 -195 115 -154 110 355
3134 355 32 -7 167 -107 119 24 -94 192 -75 235 192 -56 -143 297 -230 -13 148 -95 179 -52 77
3155 77 29 103 -71 276 63 -27 -6 -44 63 185 -45 -7 64 32 -53 -107 -2 148 410 -100 -339 -168 180 149
3179 149 272 -71 357 109 -307 -190 -170 -102 -75 -19 29 -106 -22 -21 163 -40 -50 34 -147 -120 -126 -387 -41 -14 -302
3204 -302 164 120 6 66 -88 -126 176 65 17 31 -174 -19 98 -118 107 -183 80 8 224 -195 158 -42
3226 -42 164 121 -5 -158 116 152 46 210 225 -112 75 -174 27 243 -84 12 114 -22 126 165 -67 0
3248 0 -65 225 -19 24 170 -44 -79 95 70 -197 79 -49 14 -17 201 -24 -15 40 -238 39 -183 -284 -84 -130
3272 -130 76 -156 -16 16 104 51 80 -37 -17 171 24 13 2 0 -196 30 99 -68 -30 -23 -87 -66 -141 -199 -113 71
3298 71 -24 300 184 -49 -160 72 128 57 -56 126 162 -251 119 59 -122 -183 -4 159 62 -138 -78 -61 230
3321 230 155 -26 -1 -184 54 169 -92 144 -119 83 -252 -156 146 -132 -36 -101 -105 -184 41 -258 -83 76 -387
3344 -387 -102 -134 -273 -240 -85 -180 53 -255 -176 -13 176 252 -26 -233 -156 11 -157 -109 167 -275 -59 -63 45
3367 45 -108 -64 -252 -77 104 -101 58 -11 -54 -57 15 -135 56 18 -76 -131 188 30 97 179 42 188 36 -163
3391 -163 257 -113 89 332 -83 -91 83 200 -23 -159 -104 -133 -46 40 171 -257 -146 26 227 118 -133 -43
3413 -43 251 170 -95 126 -79 -178 -247 45 -260 5 -221 -43 -53 78 -116 14 -178 17 71 47 182 -102
3435 -102 -84 -42 162 -208 72 -17 84 124 -32 -88 63 68 -18 -91 22 -53 281 0 126 353 -192 204 55
3458 55 180 243 127 280 6 24 48 144 92 -35 180 -240 -94 -91 -22 -11 15 15 -155 202 -73 -120 -184 48 33
3483 33 84 23 -165 -85 22 211 -119 -182 96 193 -158 -139 -125 94 -63 57 193 -175 136 -215 98 -149 -16
3506 -16 -4 -103 237 -37 -76 -16 123 96 6 79 -231 209 -8 40 245 12 24 122 9 124 -177 125 240 87
3530 87 343 -40 90 26 -39 -26 66 -9 -64 -47 77 -67 164 58 255 -227 -346 -154 314 67 116 122 43 204
3554 204 -66 161 -12 133 -19 -136 -160 22 29 -204 -143 5 136 -75 47 -28 -75 -80 126 135 -156 -186 43 239
3578 239 -55 102 52 -184 124 -270 28 49 -26 193 -139 75 0 132 25 -70 -1 -11 244 -30 237 -62
3600 -62 213 176 52 82 -190 31 0 50 91 104 31 -205 161 -138 321 407 77 5 209 64 50 158 -22 -56
3624 -56 149 261 -39 20 -120 -299 -3 -3 -92 -86 -56 10 22 38 115 127 -278 136 13 -54 -103 -167 -18 -163 145
3649 145 -301 215 -128 178 -270 -59 50 -26 -91 -91 296 -52 65 62 0 -1 -51 -31 48 -220 -194 121 -198 115
3673 115 38 -7 -154 -138 11 55 -114 63 215 163 -157 10 -122 -154 -269 145 -192 128 -92 58 -30 -65 -21
3696 -21 -123 78 -70 62 90 33 -33 -36 28 -105 -116 -263 -52 2 -27 79 100 -172 80 2 37 103 -4 56 -77
3721 -77 -94 -55 111 2 -103 -59 64 -1 33 -92 -54 19 -4 6 151 32 -115 -47 -140 -151 104 154 -218 -285 32
3746 32 -175 -75 -112 104 -76 -2 130 -123 -82 -174 52 76 155 70 52 -109 170 161 -69 -59 24 25 152 -45 60
3771 60 111 155 -25 60 7 23 -40 89 -268 5 -201 39 337 14 -4 -117 155 -68 -44 66 -562 84 -132
3794 -132 -71 53 317 2 -44 37 -83 -179 66 302 -143 261 -302 -156 -77 -225 197 136 95 203 -192 -261 6
3817 6 -54 -39 249 -60 69 23 -43 268 218 76 -47 38 364 63 90 77 14 -74 240 -27 -11 188 61 -69
3841 -69 37 172 120 -179 91 90 -141 48 -174 163 -190 208 112 195 -199 -150 21 -115 -93 -265 -56 -39 -94
3864 -94 -232 85 -11 142 88 -168 134 -74 -148 142 -53 143 161 -44 -172 224 50 38 22 -74 35 -89 -123
3887 -123 85 35 -221 -42 139 32 104 193 43 -25 -225 -201 36 53 233 12 159 217 -123 -20 93 -63
3909 -63 148 141 -115 56 258 59 14 42 60 51 185 118 -82 -116 -288 84 245 -15 -80 -41 355 151 218 -73
3933 -73 61 -207 -217 116 116 -7 -52 -25 -63 -167 -83 -7 -48 20 -152 -149 -28 22 0 -102 76 77 -260 14 16 249
3959 249 -4 -142 -15 123 -49 15 263 -182 185 17 -118 -213 -17 -129 129 -60 -88 18 76 38 119 -170
3981 -170 -69 104 189 30 180 -155 -78 -14 191 222 139 151 234 400 -51 158 -87 69 193 -41 11 -172 -9
4004 -9 -88 60 102 -137 -72 140 -3 30 309 -436 -126 -161 53 -74 -178 55 -232 -12 50 -50 120 -88 -80
4027 -80 -105 -4 35 56 149 31 -8 -30 15 60 188 -22 272 144 97 160 -8 129 -6 -1 93 34 210 187 74
4052 74 -29 159 52 93 -106 87 -158 -194 -118 -16 167 74 57 113 61 -52 78 19 -112 142 209 89 -12
4075 -12 29 235 136 -82 32 -147 142 82 -81 148 6 208 -118 37 2 31 140 -76 -23 122 -35 45 -52
4098 -52 -45 8 169 -134 -75 -47 288 -200 -384 -212 -142 -175 -78 -87 -193 154 39 -175 -60 20 -40 125 70 -418 -105
4123 -105 -54 -88 118 -60 22 -59 -118 87 62 5 273 -17 -22 78 -147 -104 -87 172 -13 142 101 -238 38 -101
4147 -101 -201 -275 72 -16 -28 202 -74 -115 146 -5 93 -167 80 129 -176 -30 -49 136 41 -107 -205 242 97
4170 97 -112 -220 -159 -132 144 34 -116 10 95 -148 -62 94 23 125 -10 123 130 31 150 124 -72 -44 -72 -80 -78
4195 -78 12 -121 -154 37 -60 -152 -107 -65 -57 -141 -14 27 -73 78 -96 246 187 10 -47 69 -20 130 -54 80 -32
4220 -32 -99 28 82 163 -16 -119 -27 55 21 223 -170 -193 68 -4 -131 27 -98 -57 -86 71 153 -82 143 56
4244 56 317 -67 160 93 -25 11 -422 50 34 -110 49 100 65 115 260 -67 90 176 -172 -133 19 21 -189 162
4268 162 247 70 -224 -36 181 -29 -121 138 156 -47 4 172 88 -181 182 245 -212 10 -109 -30 67 54 22
4291 22 116 -145 -67 -76 -99 105 -29 103 4 100 -70 -110 79 282 89 -113 -66 -101 -191 -84 5 55 -25 -53 79
4316 79 -344 -18 -209 300 -89 198 -107 202 106 -12 -49 -55 -178 -201 -12 180 -89 -1 56 -18 -55 -213 -138 134
4340 134 -337 -110 -74 -113 -120 171 -132 -71 120 -56 -237 203 98 161 55 26 -162 -28 171 131 133 -45 -218
4363 -218 -39 108 -87 -206 -23 63 -4 185 -63 -37 -26 127 -55 -60 -94 38 101 23 18 31 -141 79 160 21
4387 21 -100 56 -10 215 -101 -123 93 1 -178 72 -17 -67 169 -34 213 -70 -53 71 -80 -186 -31 -111 12
4410 12 63 11 107 -30 305 -150 146 95 26 21 33 37 54 17 -148 6 41 -78 -38 -88 -9 193 153 58 -108 -129 -102
4437 -102 38 -289 63 -44 -105 -91 -44 122 -208 67 7 22 115 81 -7 22 2 152 -208 57 96 -128 81 -81
4461 -81 -249 -115 -110 10 76 153 -228 -40 -74 150 109 109 118 -72 -33 36 77 29 24 235 -63 -81 -105 91 27 -37 46
4488 46 25 -78 -32 94 114 -11 -104 301 323 -211 -137 -66 21 70 288 -201 162 213 27 61 -32 24 71 -128 67
4513 67 -64 100 81 15 303 -3 -13 -162 12 -4 195 -71 -76 -82 375 -8 -247 -47 2 99 -128 -6 -19 20
4537 20 -157 -64 -75 -146 -69 11 55 124 41 -167 73 -310 43 42 -164 -133 -33 -9 -24 117 108 -125 127 66 119 1
4563 1 -170 -42 -60 -66 173 -135 39 -33 52 -147 -24 -146 39 3 16 237 -197 60 -85 -171 -16 -14 -25 1 -15
4588 -15 32 120 -47 23 -76 -58 -238 110 88 95 -6 92 -296 -21 -38 -4 -57 -151 -143 62 -146 -115 -92 25 92 -85
4614 -85 33 -28 65 -38 100 9 176 -41 111 34 -92 -223 102 21 102 -47 73 24 67 -31 120 -26 22 98
4638 98 -13 3 -99 -115 -113 196 -197 -24 55 -132 -21 -25 -174 93 116 -123 -238 -16 -150 -144 143 169 61 -63
4662 -63 15 215 -169 -93 67 139 -24 19 14 -56 45 36 -173 -92 47 -151 148 -70 70 -96 85 56 28 -91
4686 -91 -43 -79 387 227 -86 179 -243 -199 64 -112 -85 214 165 -138 -115 177 -136 28 -173 -103 -14 196 4
4709 4 203 50 12 17 215 104 134 -35 -17 -91 235 5 -5 -130 -93 121 32 -22 5 54 -348 123 58 56 7 2 279
4736 279 174 -5 -62 139 -18 188 148 -45 80 203 79 33 -144 -108 328 141 208 -34 151 146 -5 -13 226
4759 226 -259 -283 -142 -341 132 138 129 19 -117 212 -178 -42 -2 -13 203 61 104 -169 -21 -16 33 185 140 148 170
4784 170 2 -185 -69 33 129 18 -101 66 142 40 126 163 -174 -121 -345 71 -63 -175 -91 149 -91 -64
4806 -64 215 34 181 -132 -178 65 -49 -48 100 164 -134 -48 -123 163 295 -318 31 -22 -280 -55 -25 54 -71
4829 -71 -267 182 20 -116 150 -113 17 280 -86 -96 63 171 195 56 -244 -79 66 29 30 257 97 -85
4851 -85 193 -112 48 100 76 67 115 184 61 60 49 -72 -87 39 -80 -62 -82 0 23 -102 205 -1 -71 99 -192
4876 -192 -81 -143 109 175 44 -46 45 -79 34 141 -75 71 46 -77 -74 132 195 263 115 -96 -73 37 10 83
4900 83 76 70 80 -112 -88 27 -193 -23 -263 1 23 104 -85 -345 196 -126 -227 -118 -171 -76 -67 -80 -76 125 183 34
4926 34 241 -166 -3 68 255 100 -74 29 -63 13 71 -317 -57 229 183 -25 -279 -34 -252 163 131 -33
4948 -33 75 299 41 148 3 39 259 40 35 -91 173 -207 257 -50 -100 -13 220 -20 62 -265 1 283
4970 283 2 -64 -36 64 -34 232 -263 109 -179 -2 -51 -217 6 -338 -61 -82 -257 -16 52 3 -117 83
4992 83 136 112 -196 20 -21 100 2 -166 -46 50 267 3 -166 122 -275 13 125 2 186 -147 39 -21
5014 -21 -124 -109 54 -74 125 -84 75 -121 -54 209 208 80 0 108 214 -127 -109 49 162 185 30 -151 -409
5037 -409 -73 -29 0 219 -120 67 171 103 -7 -115 165 264 -48 -237 -16 7 4 -32 -167 -52 -118 190 95
5060 95 46 64 71 10 147 -105 -97 86 -108 71 7 -197 -173 -191 -18 -77 -30 52 54 -189 -43 71 52 -135 -149 -159
5086 -159 -45 -68 -224 -55 -34 236 -137 28 -149 226 -70 82 12 163 34 -114 4 -62 -175 88 82 -33
5108 -33 54 -48 -94 176 9 -236 419 -33 20 16 -84 -42 -23 102 200 -101 -30 91 165 179 71 -204 357 135
5132 135 38 -69 -117 -254 -133 -64 50 -37 93 -24 90 -79 -52 37 162 207 -144 73 -67 -42 34 -38 7 9
5156 9 117 -168 -73 53 -228 -124 13 150 139 115 53 -179 -69 4 -47 152 -166 -233 42 216 168 -57 55
5179 55 -155 117 57 198 75 126 51 21 -134 -1 -140 -112 20 -57 130 -209 58 -49 31 -84 60 -38 11
5202 11 -29 -76 43 68 -75 -36 31 -67 -185 -157 -295 -131 -63 -192 106 250 92 -67 24 208 113 -295 -137 57
5226 57 -12 43 -151 162 -242 92 46 -185 -129 -50 -17 62 62 97 -111 62 -15 -182 77 -56 -203 190 -50 125
5250 125 -26 -133 60 8 -149 -40 -31 -38 53 89 -121 -98 -358 -273 93 -10 274 -43 56 -104 -119 -44 -107 47
5274 47 -68 -138 -145 -145 -214 -113 -45 149 -58 33 183 -333 40 39 -68 272 -85 140 -61 -85 1 166 -146 60
5298 60 80 -57 -66 31 84 11 -38 8 47 50 27 67 9 50 -40 78 95 -131 -120 -78 -85 -86 -72 12 131 30 9 -102 -134
5327 -134 -210 135 -121 -117 -207 -244 -253 26 -62 49 -26 -53 -91 -45 48 -28 -89 -74 -121 -211 -107 13 -43 216 149 107 237
5354 237 -274 80 101 73 145 69 -164 -317 -6 8 52 -39 -49 -132 -151 -170 -30 78 -213 -176 -55 -74 70 258
5378 258 -136 -38 -32 -34 -22 -134 -75 4 12 75 54 39 -53 -78 108 56 -42 0 -76 53 -63 187 -20 44 138 -114 -100
5405 -100 46 -13 3 25 31 -304 -96 -38 73 -278 -65 -72 204 -234 -12 49 -88 292 113 99 73 88 53 -62
5429 -62 -5 -28 -93 -22 175 -197 163 24 22 55 191 -172 96 -300 -123 5 79 59 -324 -103 -122 -1 40 159
5453 159 -17 160 -64 118 -43 128 -108 -94 -62 -96 -19 -47 -44 20 22 0 3 59 -134 382 60 -160 -67 -117 -60 38
5479 38 87 69 60 246 123 22 -225 22 -22 2 -55 31 -103 -46 54 102 96 -46 231 -9 -84 127 193 -86 -78 -49
5505 -49 69 -214 95 -61 64 134 -74 -128 195 -123 -226 147 -254 96 -167 9 49 -81 210 260 114 -64
5527 -64 -191 146 105 193 -31 -137 119 -109 112 -105 -155 -49 -170 32 -1 -93 -136 191 -94 119 94 53 38
5550 38 74 32 240 -80 102 174 25 112 46 -160 92 45 12 -97 -184 -130 7 -65 -81 16 13 -41 -98 148 -80 20
5576 20 247 235 127 185 -97 97 -111 -12 -64 -102 121 -165 5 193 -42 70 -31 -76 -215 -178 261 15 -11
5599 -11 46 68 138 82 -19 77 31 -51 19 154 61 40 -53 -239 -27 150 122 84 -11 -77 11 47 75 88 -123 222 120
5626 120 -116 14 157 -69 -84 61 14 -167 -149 -109 9 164 -29 -21 -4 276 101 57 39 13 -45 29 10 -53 249
5651 249 47 201 -22 -37 78 4 378 70 113 -167 -92 41 -30 -93 -252 -40 -102 -94 -138 91 -14 -97 -96 -199
5675 -199 -3 -30 229 99 -85 -2 -20 34 -44 -115 2 40 120 67 -5 10 -77 -12 30 61 105 120 100 -30 -125 -237
5701 -237 -261 -43 -375 39 -107 -52 -49 -353 -44 35 -55 -196 307 21 -127 74 -213 -98 -34 -73 154 1 -13
5724 -13 54 -48 -27 47 299 58 155 -11 73 298 24 -130 5 38 -164 76 -152 87 -88 24 -152 -254
5746 -254 185 -38 -102 -147 41 163 -225 313 185 -168 3 14 61 40 -61 -15 -89 97 87 43 68 -81 -225
5769 -225 -15 -113 -61 70 153 86 119 -214 118 -68 -102 -161 -29 -107 212 -259 -160 -64 76 157 5 -186 31 -88
5793 -88 -146 30 -164 -60 53 -64 133 11 24 50 46 -84 -120 201 -267 -285 -19 21 -95 9 -54 -58 -73 -30 -108
5818 -108 -132 97 79 -86 105 15 -345 80 -64 -85 46 53 -116 -90 -116 -66 7 -142 -59 30 -35 -44 -164 -68 73
5843 73 124 -70 262 59 -148 187 -224 123 -200 75 2 -5 -35 107 117 -83 -111 -74 -13 16 -2 -66 96 -122
5867 -122 -95 -132 -191 240 92 136 -21 33 -292 88 -107 -255 -23 146 -163 -170 66 24 -29 -123 30 -58 20 5
5891 5 -12 166 162 -85 -125 229 -158 -16 -79 172 9 -40 146 -105 15 -225 119 117 56 -87 -184 -4 161 -167
5915 -167 87 -53 -102 -165 -52 -24 190 -14 158 37 45 -43 155 24 93 -56 122 30 181 254 174 87 -76 -120
5939 -120 -52 82 37 181 72 -68 199 145 150 118 -39 58 -16 241 232 -5 -77 93 -127 25 -38 312 -149 -242
5963 -242 -80 -268 -192 -41 -61 -79 82 -80 -7 -18 82 -149 2 39 122 104 -72 35 -130 -114 65 -60 -90
5986 -90 193 -96 -195 4 -4 17 -104 132 -37 34 -123 -5 -76 69 105 5 -31 9 234 67 -59 -139 0 -52
6010 -52 92 276 4 -15 54 37 19 -11 -75 105 -71 163 91 44 -264 72 57 113 -98 122 51 -292 -108 -209
6034 -209 -31 148 -103 219 13 -109 65 -109 -50 39 44 -10 209 58 -64 89 260 56 -159 150 -34 -49
6056 -49 -34 133 -163 135 202 -68 55 -56 53 94 239 5 -84 -122 50 -277 104 23 76 -119 -49 137 73
6079 73 121 30 220 107 -24 194 29 -22 -84 12 -139 -187 -35 149 98 18 -87 6 -54 -219 87 -175 5 -62
6103 -62 -11 -164 4 86 -98 -9 -265 188 165 -4 61 -21 -55 -138 -59 146 184 149 137 -86 -263 -64 -59 -63 117 168
6129 168 -30 -60 174 -109 -249 -219 -59 -65 17 -25 -189 -69 -44 6 -330 -114 73 -112 140 -13 -33 -85 66
6152 66 211 -135 50 -78 60 -210 -76 91 175 91 -45 -99 -44 -2 53 172 -56 305 64 -306 105 -62
6174 -62 74 237 102 -20 -44 -44 -53 124 -38 -185 119 95 -54 25 -178 -254 -156 51 -256 -33 -178 -79 -98 -46
6198 -46 -336 -183 5 -119 201 -111 2 80 -59 -121 -25 -135 3 -149 77 85 -131 -246 70 76 -8 17 -70 116
6222 116 23 292 -48 24 -44 163 -53 201 -48 27 55 21 233 -79 192 -12 165 -20 117 -150 -134 53
6244 53 -55 52 299 -58 -214 33 282 -262 -166 61 -68 -100 -70 -79 95 -3 133 199 38 108 -51 15 -133
6267 -133 113 49 -62 -58 -73 35 -192 67 263 271 -89 -150 -209 108 13 -183 -136 -55 63 -159 -252 -62 -207 10
6291 10 232 -125 -28 211 294 -129 -152 297 150 -227 43 -206 -60 231 112 -26 170 -16 -51 83 -3 -236
6313 -236 87 -36 -72 -175 25 163 -79 66 144 116 22 -158 -103 -129 27 -139 9 -74 -98 -134 -191 90 127 -133
6337 -133 68 -79 -42 185 -6 192 -136 -149 -102 91 -146 30 -145 -11 3 65 315 16 63 65 349 43 -206
6360 -206 50 141 -62 -22 149 -256 75 216 -137 -71 85 -29 -27 -88 -127 137 52 249 -39 -101 -162 -186 -64 -186
6384 -186 233 71 187 -31 44 -54 -214 -210 1 4 -47 -138 40 38 59 89 -50 5 200 -212 -150 17 109 -39 -24
6409 -24 -47 238 -189 164 47 -29 148 278 77 -188 -62 -78 -118 -52 8 60 37 251 -198 -153 58 31 -177 -92
6433 -92 144 103 -31 -122 -76 -11 37 106 -55 121 -73 5 31 37 22 -50 46 214 88 74 253 68 128 104 46 -6
6459 -6 -188 111 106 -102 30 63 84 -243 -47 27 100 -144 68 97 -83 -100 13 -61 49 56 -18 -48 100 91 90 -21
6485 -21 -189 -100 80 165 32 -116 -62 -116 176 259 30 1 89 110 129 -59 69 -27 -31 201 -337 -39 -206 -66
6509 -66 -3 5 -85 158 122 89 151 96 -110 63 63 -35 -106 -181 137 -44 84 -244 -86 -71 55 172 159 -223 -8
6534 -8 -49 27 56 -76 169 -67 169 -94 5 -76 80 25 -89 -124 76 20 -109 17 -88 -69 88 194 127 6
6558 6 -52 78 -72 -71 -156 132 -48 46 -30 30 136 -91 -143 -163 -286 39 131 -31 30 -17 -17 -194 -143 24 9 -89
6584 -89 -308 101 92 -223 -125 -107 93 15 -154 154 337 18 35 45 -52 215 155 -93 161 104 -72 36 -30 17
6608 17 -136 3 -105 -201 19 -27 -80 129 203 23 9 31 -138 4 62 -84 -58 -22 -120 -202 158 125 -22 83
6632 83 173 -2 -292 311 -53 -46 -67 -110 12 209 -182 -83 -115 -34 -174 -52 103 -409 94 136 -21 -88 -118 306
6656 306 -28 273 14 130 120 206 -110 -72 15 -77 36 105 -17 -154 -6 123 -66 211 36 -37 286 19
6678 19 207 112 26 -96 25 -85 -38 -51 304 142 18 157 -41 -73 -61 18 10 331 118 -19 226 -153 195
6701 195 -159 99 24 -110 -53 -121 -35 -9 33 291 -100 184 160 -59 -30 87 -88 -76 26 105 -153 -6 -92 148
6725 148 188 -58 -73 -18 132 12 11 40 -55 154 101 170 48 -106 72 145 -120 26 243 -19 -97 -200 182 -1
6749 -1 142 -95 3 -121 -53 98 126 -25 -82 105 81 119 155 95 154 -60 16 -91 116 110 9 -143 -104 -114 -195 -183
6775 -183 -208 20 148 -70 49 47 -25 180 7 -118 115 -192 -6 121 -6 139 -19 -149 85 204 72
6796 72 -95 127 60 -24 -187 -143 116 82 176 -85 16 -22 -75 -58 -210 62 33 -175 -94 22 -146 324 173 53
6820 53 -35 -9 75 -116 110 87 -39 5 -93 -29 190 -157 -87 -149 66 -118 12 -240 -22 166 -20 -216 201
6843 201 188 24 -55 54 -239 91 -62 -53 -91 -159 18 10 -95 55 -229 6 44 20 167 2 194 87 -253
6866 -253 -62 -109 5 287 -50 -97 -73 -67 -93 -130 81 -87 -36 -58 195 -158 -159 -80 -72 -60 134 25 -196 -10 -99
6891 -99 93 -172 146 84 -303 5 107 75 178 -110 -91 57 143 172 85 -245 234 232 -40 -236 24 20 188 88
6915 88 150 69 62 -221 20 23 -108 -9 -127 69 -200 109 -20 146 -167 -30 21 -9 -51 178 66 -127 48 -177
6939 -177 -41 119 92 102 30 3 294 2 154 37 38 -67 -98 108 -265 202 152 143 -226 -244 -143 74 21 -146
6963 -146 -198 -29 110 -104 67 -75 -281 143 -91 -171 -33 271 -232 -62 -157 -179 284 74 -254 -179 -46 -122
6985 -122 -23 -63 139 40 -269 82 63 -114 -90 -261 -42 -129 37 190 6 97 -53 38 -24 242 12 32 -176
7008 -176 -119 14 -32 49 -140 219 -57 60 130 17 -203 -135 5 -29 91 73 73 -140 123 3 33 -92 146
7031 146 18 -24 189 -43 -115 -97 -110 108 -97 -64 -111 169 -194 50 18 -87 -7 -63 -44 -119 90 -252 15 116
7055 116 31 -53 18 -146 -71 -118 128 -23 -3 150 -16 -15 228 -36 268 171 106 211 -131 151 -43 -114 -86 127
7079 127 -56 -54 127 -197 -19 -297 -267 113 -17 -9 93 -10 28 79 65 7 -134 189 41 -27 13 62 -170 219
7103 219 -19 -91 30 -205 21 -84 87 -253 154 190 248 -70 -43 45 23 -93 3 23 -43 -70 41 -22 199 -43
7127 -43 260 275 -9 59 23 -198 -4 -52 -88 -179 -52 -17 74 115 341 172 -285 148 -3 -114 188 -123 118
7150 118 162 -207 164 -278 111 186 -144 21 -190 32 146 -76 -22 -98 -57 104 140 72 47 16 -84 -141 48
7173 48 -82 -71 -32 85 22 198 -11 118 86 -200 -215 24 -132 -137 -74 -158 -151 -94 91 -233 162 139 2 18 -88
7198 -88 -106 125 297 -306 -117 16 -163 -303 245 31 169 -7 -275 22 46 169 -32 50 -245 -249 16 -142
7220 -142 -113 102 160 85 -212 58 253 -3 -25 71 -299 126 -259 89 -19 -36 241 47 84 -267 2 175
7242 175 5 -105 120 -21 -25 110 65 -54 252 -126 -279 126 -260 -2 92 -138 -29 -81 -66 182 120 91 -156
7265 -156 -109 -271 94 76 -26 -126 -141 99 119 -41 191 205 129 92 93 -237 130 -159 66 -378 -24 -6 -57 121
7289 121 0 138 9 -18 124 139 39 107 -225 -10 222 75 -138 51 -37 78 131 -44 148 333 82 187
7311 187 18 181 29 297 -94 -72 95 41 -5 -60 -57 140 -82 -153 228 43 -6 -26 -133 -14 50 0 77 246
7335 246 -199 -165 301 51 -136 -32 -52 78 172 -7 7 98 26 -354 148 -35 152 -153 -182 -24 13 -125 -26
7358 -26 145 -158 144 -95 182 -71 37 -108 -35 126 75 101 96 -132 -107 -148 -72 -110 -154 -80 -95 -38 117 16 -109
7383 -109 20 206 -25 24 -115 29 50 -119 84 -154 36 -127 -148 -168 -181 12 17 -133 -89 10 49 -32 119 -33
7407 -33 138 67 102 -111 98 53 87 -127 -192 106 127 -125 22 107 -13 226 240 -38 46 -154 -15 139 13
7430 13 132 -148 40 -135 -2 96 181 219 -72 -25 38 33 -244 10 -80 -231 175 142 -33 163 -192 50 -102
7453 -102 332 124 236 -126 65 -63 142 -189 9 17 2 25 -124 214 -79 -101 -137 -128 154 -145 -17 150 83
7476 83 -145 -55 94 -76 -34 -58 -155 391 50 -54 -117 54 89 14 18 -8 -36 24 -83 -141 -55 128 122 -46 27 -100
7502 -100 -178 28 -91 186 61 65 155 -156 -131 -22 -34 -71 -99 66 140 7 -11 46 41 72 12 74 9 -50 -89 142
7528 142 -235 22 -142 -44 45 -149 -96 75 262 77 -31 13 -80 -122 12 45 30 -89 8 -254 -108 -69 44
7551 44 -83 111 236 -148 -173 52 72 21 -288 59 -172 -126 -124 9 119 -33 -134 -120 -73 18 -32 -226 -284 6
7575 6 -37 89 -128 264 71 -79 -79 -344 -106 86 180 -110 -162 49 -168 20 -48 31 39 -89 -238 -173 0 23
7599 23 338 192 168 -174 -107 -46 -74 -161 -81 -180 135 -149 -66 -33 -242 -108 128 159 192 132 -122 13 -55 -62 -49 -23
7625 -23 -46 37 -144 96 91 65 -52 5 -127 -169 46 67 199 -142 -157 -65 -79 39 35 -110 -139 -249 103 71 -35
7650 -35 -6 133 26 -62 -110 -150 94 -62 111 -9 -94 -68 67 47 68 30 -54 -197 -176 17 167 -117 -140 165
7674 165 -97 -90 60 -63 138 -27 57 -154 -138 278 45 123 -42 -16 -14 35 -106 -287 50 204 219 68 261
7697 261 174 -118 71 -264 78 -170 204 51 107 24 -123 5 145 -183 -20 -92 -48 77 -305 48 11 -188
7719 -188 7 95 -43 -11 2 -20 -42 -106 -54 186 -140 162 104 -61 -134 23 -42 194 15 -45 -137 46 -66 -38
7743 -38 202 -33 -233 26 -54 100 -50 262 273 -57 46 -34 63 -89 179 203 -16 -211 -46 -106 -8 -177 2
7766 2 -42 -217 -135 -114 -110 130 -158 -123 108 -51 13 -2 -16 68 -117 -56 -354 118 -50 -37 219 -166 28 140 188
7791 188 -7 -212 88 -19 59 124 -42 27 -46 60 70 -121 184 -14 -157 -107 121 117 74 -111 144 -125 72
7814 72 76 -185 -198 -54 11 -81 28 -134 -94 -174 -1 9 -57 -41 -71 -151 1 -55 62 -71 -105 58 42 144 -104
7839 -104 -117 -210 -76 -48 -130 119 -154 135 -185 55 144 -15 37 122 -182 -36 -250 33 -33 -83 130 -85 -79 -120
7863 -120 14 -111 47 123 -36 -77 90 -25 -25 -118 -3 282 20 -89 38 168 -64 -120 -108 21 30 26 -244 -103
7887 -103 -15 13 332 59 -53 77 -26 -22 233 -136 -109 -42 -57 55 4 -195 -6 -192 -25 -112 69 38 -37 -12
7911 -12 -56 -145 -290 86 28 199 -18 74 162 -173 -241 40 -57 -108 22 25 84 26 -143 -58 377 -235 -208 115 75
7936 75 253 85 -54 -15 -130 165 -88 -59 -106 5 167 -71 -50 260 -137 -50 149 7 167 -44 -7 -142
7958 -142 27 147 143 -308 -18 -125 96 -35 -32 -61 29 -78 -117 195 -52 -159 -89 129 76 -108 -80 189 -63
7981 -63 -41 -163 -186 -136 -307 97 -43 192 -11 188 -125 -290 -18 -7 68 76 -66 -217 47 -119 -109 46 -3
8004 -3 -52 -69 152 49 37 68 252 -32 100 100 -40 -146 -8 69 -112 19 52 27 46 -111 -160 205 -5 163
8028 163 -151 -22 110 -77 20 65 -123 -177 -295 2 147 41 -107 -127 188 -13 69 59 -179 104 11 186
8050 186 38 -225 -310 17 182 106 54 203 -61 90 63 -236 -17 -326 -88 -52 40 14 11 37 -39 193 185 -58
8074 -58 3 -52 191 130 141 -136 -143 19 -2 -33 -10 -346 131 168 -34 -12 -213 -213 34 -84 285 91 16 -135 -79
8099 -79 24 -52 -78 33 106 128 -28 -4 -140 -134 -102 32 20 53 175 44 327 72 -11 -102 -112 -207 -81 219 -155
8124 -155 -163 113 -121 -68 -11 139 -245 9 47 -119 210 107 241 -79 35 -47 -7 -85 27 -332 50 -196 -269
8147 -269 -103 -55 140 56 -184 -396 -63 322 -173 -170 -80 41 -46 98 -7 -115 -41 -60 -134 12 -110 -85 8 -116
8171 -116 -249 67 -12 -201 117 47 -106 64 192 264 -52 59 12 141 96 199 48 166 -49 99
8191I9
##END NTUPLES=NMR FID
##END=
