##TITLE=1H_SA_sl.OH.7
 CDCl3, 8 sc, 
 4.9.2020
##JCAMPDX= 6.0         $$ Bruker NMR JCAMP-DX V2.0
##DATA TYPE= NMR FID
##DATA CLASS= NTUPLES
##ORIGIN= UXNMR, Bruker Analytische Messtechnik GmbH
##OWNER= root
$$ XWIN-NMR		Version 3.5
$$ Fri Sep  4 09:55:24 2020 Russian Standard Time (UT+4h)  she@DPX200
##.OBSERVE FREQUENCY= 200.1315066352
##.OBSERVE NUCLEUS= ^1H
##.DELAY= (6, 6)
##.ACQUISITION MODE= SIMULTANEOUS
##.ACQUISITION SCHEME= undefined
##.AVERAGES= 8
##.DIGITISER RES= 18
##SPECTROMETER/DATA SYSTEM= spect
##.PULSE SEQUENCE= zg30
##.SOLVENT NAME= CDCl3
##.SHIFT REFERENCE= (INTERNAL, CDCl3, 0, 15.7039)
##AUDIT TRAIL= $$ (NUMBER, WHEN, WHO, WHERE, WHAT)
$$ ##TITLE= Audit trail, XWIN-NMR		Version 3.5
$$ ##JCAMPDX= 5.01
$$ ##ORIGIN= Bruker BioSpin GmbH
$$ ##OWNER= she
$$ F:/spectra/data/she/nmr/H-F/1/audita.txt
$$ ##AUDIT TRAIL=  $$ (NUMBER, WHEN, WHO, WHERE, WHAT)
(   1,<2020-09-04 09:54:13.73 +0400>,<she>,<DPX200>,
      <created by zg, POWCHK disabled, PULCHK disabled
       configuration hash MD5:
       00 E9 B6 7A A2 85 ED C7 34 08 36 98 17 FE 4E 26
       data hash MD5: 16K
       12 2A 7F BF 87 69 F6 9D F4 8E E7 B5 D3 4B 3A 43>)
$$ ##END=
$$ 
$$ hash MD5
$$ E9 C3 A4 B7 1B 47 E1 52 78 13 DD 85 32 DA 8D C2
##$RELAX= 
##$RELAX= 
##$RELAX= 
##$RELAX= 
##$RELAX= 
##$RELAX= 
$$ Bruker specific parameters
$$ --------------------------
##$DU= <F:/spectra>
##$EXPNO= 1
##$NAME= <H-F>
##$PROCNO= 1
##$TYPE= <nmr>
##$USER= <she>
##$AMP= (0..31)
100 100 100 100 100 100 100 100 100 100 100 100 100 100 100 100 100 100 
100 100 100 100 100 100 100 100 100 100 100 100 100 100 
##$AQSEQ= 0
##$AQ_mod= 1
##$AUNM= <au_zg>
##$AUTOPOS= <>
##$BF1= 200.13
##$BF2= 200.13
##$BF3= 200.13
##$BF4= 200.13
##$BF5= 200.13
##$BF6= 200.13
##$BF7= 200.13
##$BF8= 200.13
##$BYTORDA= 1
##$CFDGTYP= 0
##$CFRGTYP= 5
##$CHEMSTR= <none>
##$CNST= (0..31)
1 1 145 1 1 1 1 1 1 1 1 1 1 1 1 1 1 1 1 1 1 1 1 1 1 1 1 1 1 1 1 1 
##$CPDPRG= <>
##$CPDPRG1= <>
##$CPDPRG2= <>
##$CPDPRG3= <>
##$CPDPRG4= <mlev>
##$CPDPRG5= <mlev>
##$CPDPRG6= <mlev>
##$CPDPRG7= <mlev>
##$CPDPRG8= <mlev>
##$CPDPRGB= <>
##$CPDPRGT= <>
##$D= (0..31)
0 1.2 0 0 0 0 0 0 0 0.06 0 0.03 0 0 0 0 0.0002 0 0 0 0 0 0 0 0 0 0 0 0 
0 0 0 
##$DATE= 1599198853
##$DBL= (0..7)
120 120 120 120 120 120 120 120 
##$DBP= (0..7)
150 150 150 150 150 150 150 150 
##$DBP07= 0
##$DBPNAM0= <>
##$DBPNAM1= <>
##$DBPNAM2= <>
##$DBPNAM3= <>
##$DBPNAM4= <>
##$DBPNAM5= <>
##$DBPNAM6= <>
##$DBPNAM7= <>
##$DBPOAL= (0..7)
0.5 0.5 0.5 0.5 0.5 0.5 0.5 0.5 
##$DBPOFFS= (0..7)
0 0 0 0 0 0 0 0 
##$DE= 6
##$DECBNUC= <off>
##$DECIM= 32
##$DECNUC= <off>
##$DECSTAT= 4
##$DIGMOD= 1
##$DIGTYP= 9
##$DL= (0..7)
0 120 120 120 120 120 120 120 
##$DP= (0..7)
150 150 150 150 150 150 150 150 
##$DP07= 0
##$DPNAME0= <>
##$DPNAME1= <>
##$DPNAME2= <>
##$DPNAME3= <>
##$DPNAME4= <>
##$DPNAME5= <>
##$DPNAME6= <>
##$DPNAME7= <>
##$DPOAL= (0..7)
0.5 0.5 0.5 0.5 0.5 0.5 0.5 0.5 
##$DPOFFS= (0..7)
0 0 0 0 0 0 0 0 
##$DQDMODE= 0
##$DR= 18
##$DS= 0
##$DSLIST= <SSSSSSSSSSSSSSS>
$$ [...]
##$SUBNAM2= <"">
##$SUBNAM3= <"">
##$SUBNAM4= <"">
##$SUBNAM5= <"">
##$SUBNAM6= <"">
##$SUBNAM7= <"">
##$SUBNAM8= <"">
##$SUBNAM9= <"">
##$SW= 16.880792210976
##$SWIBOX= (0..15)
0 0 2 0 0 0 0 0 0 0 0 0 0 0 0 0 
##$SW_h= 3378.37837837838
##$TD= 16384
##$TD0= 1
##$TE= 0
##$TE2= 300
##$TE3= 300
##$TEG= 300
##$TL= (0..7)
0 120 120 120 120 120 120 120 
##$TP= (0..7)
150 150 150 150 150 150 150 150 
##$TP07= 0
##$TPNAME0= <>
##$TPNAME1= <>
##$TPNAME2= <>
##$TPNAME3= <>
##$TPNAME4= <>
##$TPNAME5= <>
##$TPNAME6= <>
##$TPNAME7= <>
##$TPOAL= (0..7)
0.5 0.5 0.5 0.5 0.5 0.5 0.5 0.5 
##$TPOFFS= (0..7)
0 0 0 0 0 0 0 0 
##$TUNHIN= 0
##$TUNHOUT= 0
##$TUNXOUT= 0
##$USERA1= <user>
##$USERA2= <user>
##$USERA3= <user>
##$USERA4= <user>
##$USERA5= <user>
##$V9= 5
##$VALIST= <valist>
##$VCLIST= <CCCCCCCCCCCCCCC>
##$VD= 0
##$VDLIST= <DDDDDDDDDDDDDDD>
##$VPLIST= <PPPPPPPPPPPPPPP>
##$VTLIST= <TTTTTTTTTTTTTTT>
##$WBST= 1024
##$WBSW= 4
##$XGAIN= (0..3)
0 0 0 0 
##$XL= 0
##$YL= 0
##$YMAX_a= 112503
##$YMIN_a= -68073
##$ZGOPTNS= <>
##$ZL1= 120
##$ZL2= 120
##$ZL3= 120
##$ZL4= 120
##$ABSF1= 10
##$ABSF2= 0
##$ABSG= 5
##$ABSL= 3
##$ALPHA= 0
##$AQORDER= 0
##$ASSFAC= 0
##$ASSFACI= 0
##$ASSFACX= 0
##$ASSWID= 0
##$AUNMP= <proc_1d>
##$AZFE= 0.1
##$AZFW= 0.1
##$BCFW= 1
##$BC_mod= 2
##$BYTORDP= 1
##$COROFFS= 0
##$CY= 11.3945322036743
##$DATMOD= 1
##$DC= 2
##$DFILT= <>
##$DTYPP= 0
##$F1P= 16.9975609425685
##$F2P= -3.02152046262296
##$FCOR= 0.5
##$FTSIZE= 0
##$FT_mod= 4
##$GAMMA= 1
##$GB= 0.15
##$INTBC= 1
##$INTSCL= 1
##$ISEN= 128
##$LB= 0.24
##$LEV0= 0
##$LPBIN= 0
##$MAXI= 10000
##$MC2= 0
##$MEAN= 0
##$ME_mod= 0
##$MI= 1.114404
##$NCOEF= 0
##$NC_proc= 0
##$NLEV= 6
##$NOISF1= 3.799351
##$NOISF2= 2.8
##$NSP= 1
##$NTH_PI= 0
##$NZP= 0
##$OFFSET= 15.70392
##$PC= 1
##$PHC0= -9973.966
##$PHC1= 11.8009
##$PH_mod= 1
##$PKNL= yes
##$PPARMOD= 0
##$PSCAL= 0
##$PSIGN= 0
##$REVERSE= no
##$SF= 200.130013532006
##$SI= 16384
##$SIGF1= 3
##$SIGF2= 2
##$SINO= 400
##$SIOLD= 16384
##$SREGLST= <1H.CDCl3>
##$SSB= 0
##$STSI= 0
##$STSR= 0
##$SW_p= 3612.71676300578
##$SYMM= 0
##$S_DEV= 0
##$TDeff= 0
##$TDoff= 0
##$TI= <>
##$TILT= no
##$TM1= 0
##$TM2= 0
##$TOPLEV= 0
##$USERP1= <user>
##$USERP2= <user>
##$USERP3= <user>
##$USERP4= <user>
##$USERP5= <user>
##$WDW= 1
##$XDIM= 8192
##$YMAX_p= 0
##$YMIN_p= 0
$$ End of Bruker specific parameters
$$ ---------------------------------
##NTUPLES= NMR FID
##VAR_NAME=  TIME,          FID/REAL,        FID/IMAG
##SYMBOL=    X,             R,               I
##VAR_TYPE=  INDEPENDENT,   DEPENDENT,       DEPENDENT
##VAR_FORM=  AFFN,          ASDF,            ASDF
##VAR_DIM=   8192,          8192,            8192
##UNITS=     SECONDS,       ARBITRARY UNITS, ARBITRARY UNITS
##FACTOR=    0.000296,      1,               1
##FIRST=     0,             0,               0
##LAST=      2.424536,      0,               0
##MIN=       0,             -68073,          0
##MAX=       2.424536,      112503,          0
$$ Real data points
##PAGE= N=1
##DATA TABLE= (X++(R..R)), XYDATA
$$ [...]
1880D4P64j263n95O12J446n67j294j7P95J432j694m36J80J369L28j345p01R33
$$ 44 808 -455 -1050 -438 1008 441 -853 -870 -75 1357 -337 -773 -593 776 1104 -241 -942 -9
1898iJ520q30o51j124J771N23r57q63m3J331l35n29o90P41N33j01o24m97J162
$$ -9 1511 681 30 -1094 677 1200 243 -620 -663 668 333 -196 -886 -145 388 287 -337 -834 328
1917C28mp3p21K84K35K0r1m15J72k69L10j39k35J10r0J93l81P42p73Q0O0O69m67
$$ 328 324 251 -470 -186 49 69 -22 -437 -265 -534 -224 -363 -598 -488 -578 -385 -766 -24 -797 -717 -657 12 -455
1940d55n30K44K68P26q06j74J41R26J79j093j93P19R35p92p27l02J094M47j079
$$ -455 -985 -741 -473 253 -553 -727 -586 340 519 -574 -767 -48 887 95 -632 -934 160 607 -472
1959d72p13L16J631l28j001n94J197J327r78r08kJ665k46p16p36N13J178o47q35
$$ -472 -1185 -869 762 434 -567 -1161 36 1363 385 -523 -525 1140 894 178 -558 -45 1133 486 -349
1978c49q39J674K49l52j028J82J133m45j09p22P13M18j23q43J02N25l98L7j05
$$ -349 -1188 486 735 383 -645 -463 670 225 116 -606 107 525 402 -441 -339 186 -212 -175 -280
1997b80L39k44K60o12N95K05m68K2j88R14o55m00J51P32m1r71K12j86J292n62
$$ -280 59 -185 75 -537 58 263 -205 -183 -371 543 -112 -512 -361 371 330 -641 -429 -615 677 115
2017A15o06o92J301P86j146j83k29J587l48o91o68Q82R35o97j012m85J961k13
$$ 115 -491 -1183 118 904 -242 -425 -654 933 585 -106 -774 108 1043 346 -666 -1151 810 597
2035E97m72j150M83J578j10r73o31J224L60j38j162m2J439K00j015j101J293N13
$$ 597 125 -1025 -542 1036 926 -47 -678 546 906 768 -394 -436 1003 1203 188 -913 380 893
2053H93j52j045l45R61K60J74j049M70J97L46l00k72J59j55K44m23L77n44l5j15
$$ 893 741 -304 -649 312 572 746 -303 167 364 710 410 138 297 142 386 -37 340 -204 -239 -354
2073c54K62K28o26L28n45J362p32m80K2Q48O04j388R3n09J482k08q23n93O88J163
$$ -354 -92 136 -490 -162 -707 655 -77 -557 -535 313 917 -471 -378 -887 595 387 -436 -1029 -341 822
2093H22j138l11m65J316M07o92q80Q3J591k68n80j354J486Q33m78j202l1J331
$$ 822 -316 -627 -1092 224 631 -61 -941 -858 733 465 -115 -1469 17 850 372 -830 -861 470
2111D70N29m96j390O62R79M82j139o06J202N69n20j069K42M49N23m03j055N27
$$ 470 999 503 -887 -225 754 1236 97 -509 693 1262 742 -327 -85 364 887 484 -571 -44
2129d4L67L70q42R4M31P5ln82L41K95j50n74N06P5k57k54o0O93l62k95m43Q53
$$ -44 323 693 -149 -55 376 451 448 -134 207 502 352 -222 284 359 102 -152 -212 481 119 -176 -619 234
2151B34J46n46m22R0J384p30o32k41Q08P00l49n33m65J202K12o78j190O45J374
$$ 234 380 -166 -588 -498 886 156 -476 -717 91 791 442 -91 -556 646 858 180 -1010 -365 1009
2170A009j16j239p15J195P49k22j710L11J306L94j106j167J173O04M93j361l42
$$ 1009 893 -346 -1061 134 883 661 -1049 -738 568 962 -144 -1311 -138 466 959 -402 -744
2187g44N98J046l11j125K77P44Q07r96o03M82N15L33j119O8K54Q16q15j35j13
$$ -744 -146 900 589 -536 -259 485 1292 296 -307 175 690 1023 -96 -28 226 1042 227 92 -21
2206b1M07K8k93L56l36L50m15K78J3l30J55l4K38k40M1n29J40N46n45k68m01J099
$$ -21 386 414 121 477 141 491 76 354 367 37 192 158 396 156 197 -332 -192 354 -191 -459 -860 239
2228B39j49k37o91K42P21J61n70q06J081O01l37j048j15J064Q93j054j259P90
$$ 239 90 -147 -838 -596 125 286 -284 -1090 -9 592 255 -793 -908 156 1049 -5 -1264 -474
2246d74J051O8q46m73P24N75Nj302N0O10O85o56l72J21L61M40r26j15K86N17J16
$$ -474 577 645 -201 -674 50 625 630 -672 -622 -12 673 17 -355 -234 127 567 -359 -474 -188 329 445
2267D45m13N3m12R13o17K14l41M25K0l1p5m50P64n11M57m12J18l83L08L62l70
$$ 445 32 85 -327 586 -31 183 -158 267 287 256 181 -269 495 -16 441 29 147 -236 72 434 64
2288F4l21l44J157Jm00q30M18R12l12k77r60J238K37k81q10k57R33L94m78q99
$$ 64 -257 -601 556 557 157 -673 -255 657 345 68 -892 346 583 302 -508 -765 168 562 84 -815
2308h15L78P30L96j119m42O19P85Nj446K24Q68K29l35r74N09O05O20j363J35K10
$$ -815 -437 293 689 -430 -872 -253 532 537 -909 -685 183 412 77 -897 -388 217 837 -526 -391 -181
2328a81O83l02m80L07J72L59p43K78k10K96J14n01M16k54K94l59K61j52N43o61
$$ -181 502 200 -280 27 199 558 -185 93 -117 179 293 -208 208 -46 248 -111 150 -2 541 -120
2348a20K96L74k19J10m68N23j10M4l00n1N18lj37p31L03M46J59q43j97N23K74
$$ -120 176 550 331 441 -27 496 386 430 130 79 597 594 457 -274 29 475 634 -209 -406 117 391
2369C91J06j275J75P90N25p60j205Q72Q45K30j295r1N58P93k82j390M15N58O68
$$ 391 497 -778 -603 187 712 -48 -1253 -381 464 694 -601 -692 -134 659 377 -1013 -598 -40 628
2388F28j213k10K23Q80K05j307K45L05Q02o38p05K18P05L08q72R6l43J057k79
$$ 628 -585 -795 -572 308 513 -794 -549 -244 558 -80 -785 -567 138 446 -426 -330 -673 384 105
2407A05m22KN36K39n70L0j31M41k65J10j07J52j76m2P2J36mm7p9J71J34l67k99
$$ 105 -317 -315 221 460 -110 -80 -211 230 -35 75 -32 120 -56 -98 -26 110 106 59 -20 151 285 -82 -381
2430c81M11L3L38n69oK24L67k08p69N16K31N16j233l7M14N03p1q55J20N22L08
$$ -381 30 63 401 -168 -174 50 417 209 -560 -44 187 703 -530 -567 -153 350 279 -576 -456 66 374
2451C74k01j020J25R74K81r00m66N71P95m58o26j06N51M34m86n07k36J145P8o14
$$ 374 173 -847 -722 252 533 -367 -833 -262 533 75 -551 -657 -106 328 -158 -665 -901 244 322 -292
2471b92l03K67P64m40j73k09M31O5o5k71j56N73j87J85m86J53K02j2j72J72J4
$$ -292 -595 -328 436 -4 -177 -386 45 110 45 -226 -382 191 4 189 -297 -144 58 46 -126 46 60
2492F0k38M91m91L76k87J49O4K71Nq14P67NL80p55N2k04N84J25p59J80K35L96
$$ 60 -178 313 -178 198 -89 60 124 395 400 -414 353 358 738 -17 35 -169 415 540 -219 -39 196 592
2514E92l75o76L02N69R5q04j47K06P21k97n47j67L12Q78p59l48j54Q71No55m06
$$ 592 217 -459 -157 412 507 -297 -444 -238 483 186 -361 -528 -216 662 -97 -445 -599 272 277 -378 -784
2535g84L77P88l03m05l29N86N47n66l56O7O62q8j25n92N51L15M2k94m15R22l80
$$ -784 -407 381 78 -327 -656 -70 477 -89 -445 -378 284 196 71 -521 30 345 387 93 -322 600 220
2556B20Q0m28K83j08nj97n7M83p00N88k63M92l76j11P6L10J02m84J52j24N58k22
$$ 220 300 -128 155 47 42 -155 -212 271 -429 159 -104 388 12 -99 -23 287 389 -95 57 -67 491 269
2578B69q80K54P49L98j051j70K11O78j4r12m4P14M43o08m29l2O34N88j002m13
$$ 269 -611 -357 392 790 -261 -431 -220 458 444 -468 -512 202 645 37 -392 -424 210 798 -204 -617
2598f17L76P80n75l61k22R99J82o28k74k41J009j78l83p33K86P52k61m54k40P06
$$ -617 -241 539 -36 -397 -619 380 562 -66 -340 -581 428 250 -133 -866 -580 172 -89 -543 -783 -77
2618g7R9k40o14O75N4M6q7l85Q11k20K0l84M44k8n4j2o8J83j25l0k84O29J58n30
$$ -77 22 -218 -832 -157 -103 -57 -144 -529 282 62 82 -302 142 114 60 48 -20 163 38 8 -276 353 511 -19
2642a9J19R7L48n26p5Q2L60J0o09K42j95O62l96m14J58M63K80n28m55P4J018l21
$$ -19 100 197 545 19 -56 26 386 396 -213 29 -166 496 100 -314 -156 307 587 59 -396 -322 696 375
2664C75p27k61O28O85o73l50j24P60L72p74m82K21O37J19n97k55M09M29r9p82
$$ 375 -352 -613 15 700 27 -323 -447 313 685 -89 -571 -350 287 406 -191 -446 -37 392 293 -489
2684d89N9N68K81l48n45L71Q3K43n79J36J66L35m26k81M27j28L44j19j70p7J15
$$ -489 -430 138 419 71 -474 -103 -20 223 -356 -220 -54 281 -145 -426 1 -127 217 98 -72 -149 -34
2705c4P0n0J15l4k21K63K18k04k15J27M3M38m84K0j9K99K29n67n7J13O73r8m94
$$ -34 36 -14 101 67 -154 109 327 123 -92 35 78 516 32 52 33 332 561 -6 -63 50 723 625 131
2728A31m98N32L53l50l67l7N40k0L12r82n2R27lk43p75Q69P6j65k58k21N90k4
$$ 131 -367 165 518 168 -199 -236 304 284 596 -386 -438 489 486 243 -532 337 413 248 -10 -231 359 335
2750C35k15n14M43J87K0l11l10J76J09K90n28P9l7K46k8pkr6L57j38K8j83L7Q
$$ 335 120 -394 49 236 256 -55 -365 -189 -80 210 -318 -239 -276 -30 -58 -65 -67 -163 194 56 84 -99 -62 -54
2774e4K00M25p64J19l0L94m1m27J44L4L64m85pj8K90K95k18n16J97P04m91j20
$$ -54 146 571 -193 -74 -104 290 249 -178 -34 0 364 -121 -128 -146 144 439 221 -295 -98 606 115 -5
2796el86Q41K32l96n40l3O96l9l56m40L97L83J00q90j38Q82j34J84q32K70M54
$$ -5 -391 450 682 286 -254 -287 409 370 14 -426 -29 354 454 -436 -574 308 174 358 -474 -204 250
2817B50K58q07m45R25Q0k74k20k5L44L2n0l31k2J98L01p10L44K19k5q8k39K72
$$ 250 508 -299 -744 181 261 -13 -233 -258 86 118 68 -263 -285 -87 214 -496 -152 67 42 -46 -285 -13
2839a3l14J67k38O42j57j49K45n53N92l47J18m26N05M1j69k72O8M37j5l50j12
$$ -13 -327 -160 -398 244 87 -62 183 -370 222 -125 -7 -433 72 113 -56 -328 -260 177 162 -188 -300
2860c00M36M10l20n09j74R44Ol77p78N05N07j56p1p23R79K02j20p71N7O89K85
$$ -300 136 546 226 -283 -457 487 493 116 -662 -157 350 194 123 -600 379 581 461 -310 -253 436 721
2881G21m32o72M78J70K54p15j23K16O84m67o95O31L1L32o12J19K2J79O4m38R9
$$ 721 289 -383 95 265 519 -196 -319 -103 581 114 -581 50 81 413 -199 -80 -58 121 185 -253 -154
2902a54J28K10j97j82J96k21M90l99N2k55L74j64K18m3m34J56Q9L35j81K3j45
$$ -154 -26 184 -13 -195 1 -220 270 -129 -77 -332 42 -122 96 53 -381 -225 -136 199 18 41 -104
2923a04j31M77j23m53oL24l4J18m23O8N13k3j4n01K89L06m3m61P0N39J59l37o04
$$ -104 -235 242 119 -334 -340 -16 -50 68 -355 -287 226 203 189 -312 -23 283 240 -221 -151 388 547 210 -394
2946c94M99Q9L71o97n4L6K45K39o04P4L62J15k86k07J48M12Qm77J18j12K06J05
$$ -394 105 194 565 -132 -186 -150 95 334 -270 -196 166 281 -5 -212 -64 348 356 -121 -3 -115 91 196
2968A96k86j05J39L46m29J1j05L54m30j5K34j50K1NK80J14O4l49j20J68J44J75
$$ 196 -90 -195 -56 290 -139 -128 -233 121 -309 -324 -90 -240 -219 -214 66 180 244 -105 -225 -57 87 262
2990B62l98J7J27Q5j60j6L06l60k60j93K53M37m0m52JL93J17J18n67J01M73R5
$$ 262 -136 -119 8 93 -67 -83 223 -137 -397 -590 -337 100 60 -392 -391 2 119 237 -330 -229 244 339
3012C39m64j08L69L01mp36J47K3P89k97p04M44J67L10m51j26Q9M32k66m92RL72
$$ 339 -125 -233 136 437 433 -303 -156 -133 656 359 -345 99 266 576 125 -1 88 520 254 -238 -229 143
3034A43J2k5k47k5K30P8j85o6j00M39m22J08q8J24K28k07l4j58N6J17Rr7K98m34
$$ 143 155 130 -117 -142 88 166 -19 -85 -185 254 -168 -60 -148 -24 204 -3 -37 -195 -139 -22 -13 -110 188 -246
3058b46R0lL55K5l44K30J41j62K4k97K57K0J38l19j2J99M76l67o37O01l3R3m34
$$ -246 -156 -159 196 221 -123 107 248 86 110 -187 70 90 228 -91 -103 96 572 205 -432 169 136 229 -205
3081b05j51J67L97j60l96K92K65N84r35j11K17M75j26o19J48J63N32n64J49m37
$$ -205 -356 -189 208 48 -348 -56 209 793 -142 -253 -36 439 313 -306 -158 5 537 -27 122 -315
3101c15P17J26n10Q7k16N80j76k47m79O79K29m53l8k3L99m06J84j79j86K61L6
$$ -315 402 528 18 105 -111 469 293 46 -433 246 475 22 -16 -39 360 -46 138 -41 -227 34 70
3122G0Mj81M17l49M0m5j29K04l14J21m0L54m07O9J37N3J87n30J90J68K40n98o5
$$ 70 74 -107 310 -39 1 -44 -173 31 -283 -162 -202 152 -255 -186 -49 4 191 -339 -149 19 259 -339 -404
3145d04K60M64p4n40J3L30M23n64l74K14M95R6l13k56L30L36n02k12KJ94L42j23
$$ -404 -144 320 246 -294 -281 49 472 -92 -466 -252 243 339 26 -230 100 436 -66 -278 -276 -82 260 137
3167A37k43n3N80r9l43pN9L04l02J18l41N14J03o6m15K5K00j4rj71J76k79J76
$$ 137 -106 -159 421 322 -21 -28 31 335 33 151 -190 324 427 361 -54 -29 171 157 148 -23 153 -126 50
3190E0J26j09J03l38J69j34L14m06J13K25p8j58k54K96J79M20o63J43R8Q5J34
$$ 50 176 67 170 -168 1 -133 181 -225 -112 113 35 -123 -377 -81 98 518 -145 -2 96 181 315
3211C15n19J71q5L30k08l62K90k1M50n78P1j27N96j37m33m3J79O41l18l06j09
$$ 315 -204 -33 -118 212 4 -358 -68 -89 361 -217 -146 -273 323 186 -247 -290 -111 530 212 -94 -203
3232b03P79k68l81J43j30N70m47p5k55K21N51m35j75k2L66l28M27m84K73j4K15
$$ -203 576 308 -73 70 -60 510 63 -12 -267 -46 505 70 -105 -127 239 -89 338 -146 127 113 328
3253C28n42j2M93k90J65j92K72j94L28j31m56N03k82K02j13P6J97l52R9o1mp4
$$ 328 -214 -226 267 -23 142 -50 222 28 356 225 -231 272 -10 192 79 155 352 0 99 38 34 -40
3275d0j71K57J92j98k07J75O2P8l46J1q3M14k00k48J28n9L28j57j82k40L39M94
$$ -40 -211 46 238 40 -167 8 70 148 -198 -187 -270 144 -56 -304 -176 -235 93 -64 -246 -486 -147 347
3297C47n70P7o2M44j26j69k74L23N29o11l85K00O56j38k06k92K4O12k47j84o8
$$ 347 -223 -146 -208 236 110 -59 -333 -10 519 -92 -477 -277 379 241 35 -257 -233 379 132 -52 -120
3318a20L75k30K95l81j0L71k46J07m38M53j68j71J48J49%j5j74K0K27l51l1J05
$$ -120 255 25 320 -61 -71 300 54 161 -277 176 8 -163 -15 134 134 119 -55 -35 192 -159 -190 -85
3340h5L0K63M5m82L02J27j85k64Q0K81n7j49r1J07L36l13M3l41M04L23o40O7k2
$$ -85 -55 208 253 -229 73 200 15 -249 -169 112 55 -94 -185 -78 258 -55 -12 -353 51 374 -266 -199 -221
3363b21L1K44j35k81L65K17j04nm96M34l1K0j28k0L22l56L08n02L43rJ08l60O8
$$ -221 -190 54 -81 -362 3 220 116 111 -385 49 18 38 -90 -110 212 -144 164 -338 5 -4 104 -256 -188
3386a88L32j42j3q8l8K85L5l32J45J06j92J01j74j16J81K28M3j00J63o2j47J56
$$ -188 144 2 -11 -99 -137 148 183 -149 -4 102 -90 11 -163 -279 -98 130 173 73 236 174 27 183
3408A83k0k06j79J78K61k02k63K66k59J83N3l8ON5L19k48j79j12L13j43n5k35
$$ 183 163 -43 -222 -44 217 15 -248 18 -241 -58 -5 -43 -37 18 337 89 -90 -202 111 -32 -87 -322
3430c22L26K91k46j00n30Q10j70j14k33j38M45n3k13l62M77K71p2l10J41k3J48
$$ -322 4 295 49 -51 -581 229 59 -55 -288 -426 19 -34 -247 -609 -132 139 67 -243 -102 -125 23
3451B3q7k63K81L10j29q8k30K30n1N2l5N1p9L17k64r3J06j93J98j72L53l87K04
$$ 23 -64 -327 -46 264 135 47 -183 47 -4 48 13 64 -15 302 38 -55 51 -142 56 -116 237 -150 54
3474E4k29J12K29l6j30k58M70k8m70K92M5J15j1m27p3N71j17k48j26L16J30j00
$$ 54 -175 -63 166 130 0 -258 212 184 -286 6 51 166 155 -272 -345 226 109 -139 -265 51 181 81
3496H1Nm80N55L4n07K40k33N13k04P6l20J98K20j64k81j77N13J81j12j72j20j3
$$ 81 86 -394 161 195 -312 -72 -305 208 4 80 -240 -42 178 14 -267 -444 69 250 138 -34 -154 -167
3518a67J72K8m28L84KK10m86P3J13M5K17k08o4J46R1J4j36j32K49J57n05L08j00
$$ -167 5 33 -395 -11 -9 201 -285 -212 -99 -54 163 -45 -109 37 128 142 6 -126 123 280 -225 83 -17
3541a7J67j75m3J88j37J53k04N13m55R7j45J98j40M0j3k00M60l65m7j39J19O4
$$ -17 150 -25 -68 120 -17 136 -68 445 -10 87 -58 140 0 40 27 -173 287 -78 -125 -264 -145 -81
3563h1K32k46o2L86j24k3m52L07K4Pl02J82k8K05J04l40k4J41K37j36l16J52K28
$$ -81 151 -95 -157 229 105 82 -370 -63 -39 -32 -334 -152 -180 25 129 -211 -235 -94 143 7 -309 -157 71
3586G1l3k63l8J76N0J94o06K86O7K78j28k73J05L7j65j64L09n9K94l53J56R2j92
$$ 71 38 -225 -263 -87 -37 157 -449 -163 -96 182 54 -219 -114 -77 -242 -406 -97 -156 138 -215 -59 33 -159
3609a59K62k5o8j67L5J6k8K86mn5k29L13j61n9M9k80L10jk27Q9K51l6q0m4q4Q4
$$ -159 103 78 10 -157 -122 -106 -134 152 148 93 -136 177 16 -43 6 -274 36 35 -192 -103 148 112 32 -12 -96 -12
3635a2P9J11l69J79J18O0k28j47J77J19K54m94m4J22K70n40L21r5J3K71m35O4
$$ -12 67 178 -191 -12 106 166 -62 -209 -32 87 341 -153 -197 -75 195 -345 -24 -119 -106 165 -270 -206
3657b06K58R1m3l23K62n0K63m95Q5M8L26k92k7j71R2N14m77L21m1Rn6mk6k5M1
$$ -206 52 143 100 -223 39 -11 252 -243 -158 -110 216 -76 -103 -274 -182 332 -145 176 135 144 88 84 58 33 74
3682G4k00K34L7J18q4k15K08n13M52j34J3J02k54p8L45J76k82J82l53L61K1j36
$$ 74 -126 108 145 263 179 -36 172 -341 111 -23 -10 92 -162 -240 105 281 -1 181 -172 189 210 74
3704G4Q6k75J75K76P5m66K89j05m1m2k76J29M02j26m40K62j68M26j87n05M57Q1
$$ 74 160 -115 60 336 411 -55 234 129 88 46 -230 -101 301 175 -265 -3 -171 255 68 -437 20 101
3726A01P3k78P4r4L70j94l05J13J10R4m3J11l31K65r0j26L01k04J84k64k4Q2J64
$$ 101 174 -104 -30 -124 246 52 -253 -140 -30 64 21 132 -199 66 -24 -150 151 -53 131 -133 -157 -75 89
3749H9j50K3j86M08k63l09L80k4L4r8J38J69k23L65m93q4J47J46k68q6M16k23
$$ 89 -61 -38 -224 184 -79 -388 -8 -32 2 -96 42 211 -12 353 -140 -224 -77 69 -199 -285 131 -92
3771i2L63k54N0j60M59k19j72M7L1L9Rk09rM91j61k05L0m15N82j09j25j7K40Q5
$$ -92 271 17 67 -93 366 147 -25 22 53 92 101 -108 -117 374 213 8 38 -377 205 96 -29 -46 194 279
3795B79l05j64J20K84j58j59p5M34p1k51q9j51M19k61Q4M7j22L07l58O6L7l2K78
$$ 279 -26 -190 -70 214 56 -103 -178 256 185 -66 -155 -306 113 -148 -64 -17 -139 168 -190 -124 -87 -119 159
3818A59k79L40l42J04k34N3J14k2L2MP8J54o6J3j36n0J94k50Q5Q9O4M5l84L57
$$ 159 -120 220 -122 -18 -252 -199 -85 -107 -75 -71 7 161 95 108 -28 -78 116 -134 -49 40 104 149 -235 122
3842A22j92L63k11k47j15M58J88n49L96J33j25k40l5P3J36K60l89j40n4N30n5
$$ 122 -70 293 82 -165 -280 178 366 -183 213 346 221 -19 -54 19 155 415 26 -114 -168 362 307
3863C07l73J5m1K80l6k67K06k61K25M8m04J01K17j71J44lk30M85l81J61j46K29
$$ 307 -66 -51 -92 188 152 -115 91 -170 55 103 -301 -200 17 -154 -10 -13 -243 242 -139 22 -124 105
3885A05n3Q3k79K95k16K52l50R1J60j88K40l96L67j49JJ31l5j60p6j1K08j85m5
$$ 105 52 135 -144 151 -65 187 -163 -72 88 -100 140 -256 111 -38 -37 94 59 -101 -177 -188 20 -165 -210
3908b10l4L85k00j7J68k02n2K15Q1m5l10K35J20M7k73J16m8N6k25J19K20J86k79
$$ -210 -244 141 -59 -76 92 -110 -162 53 134 89 -221 14 134 181 -92 24 -24 32 -193 -74 146 332 53
3931E3n6N9J79j37j49j84L37j22O6l8j28Q1M5O2k94P3K26qK24l16r7k04M27k4
$$ 53 -3 56 235 98 -51 -235 102 -20 46 8 -120 -39 6 68 -226 -153 73 65 289 -27 -124 -328 99 75
3955G5k77J01l2n2J74J40J7o2Jk39O2j24J27oO2m8k70M95p2k3r8j72M02N5j39
$$ 75 -202 -101 -133 -185 -11 129 146 84 85 -154 -92 -216 -89 -95 -33 -81 -351 144 72 49 -49 -221 181 236 97
3980I7j97J08Q9J53k33Mq4O3J29m02J05N4L41l3l17j31K88J13r7r3j11L47P9j31
$$ 97 -100 8 97 250 17 21 -63 0 129 -273 -168 -114 227 194 -123 -254 34 147 50 -43 -154 193 272 141
4004A41j01o6PNm6P7J91j59Q6l5l61K48J01L0j47k19K50n8L5Q5K5l02K26l6J22
$$ 141 40 -26 -19 -14 -60 17 208 49 135 100 -261 -13 88 118 -29 -248 2 -56 -21 64 89 -213 13 -23 99
4029I9N6j95l8j01J60j85M04j24qk37j77M42j23p6JJ63k3J55k41k27j06N29L0
$$ 99 155 -40 -78 -179 -19 -204 200 76 68 -169 -346 96 -27 -103 -102 61 38 193 -48 -275 -381 148 178
4052A78k63M3Q0N41m65l44OL79m2k6j37j20K76nk22K38J49k9k96J07l33M84j21
$$ 178 -85 -42 38 579 114 -230 -224 155 113 87 -50 -170 106 101 -121 117 266 237 -59 48 -285 199 78
4075G8R0l39K71J92l76Q6k44L50K34l18O2j98J9J39N4k11j06J77P4n7O0R8j32
$$ 78 168 -171 100 292 -84 2 -242 108 342 24 86 -112 -93 46 100 -111 -217 -40 34 -23 37 135 3
4098CJ68l74J60m4J18p9j06J52J58r4j42J58l8On0n8J39j67P2j52K37L5j54k51
$$ 3 171 -203 -43 -87 31 -48 -154 -2 156 62 -80 78 40 46 -4 -62 77 -90 -18 -170 67 102 -52 -303
4122c03J64J17KJ79j49J12k87J02l3M9L4p3J74j38J85K7j85l0r6J97K3J29k77
$$ -303 -139 -22 -20 159 10 122 -165 -63 -96 -47 -13 -86 88 -50 135 162 -23 -53 -149 48 71 200 -77
4145g7K90k30Q3j21m5L8J03K52l39p5M00k33k7k7o1J82pk34J34L3r2L23l07k6
$$ -77 213 -17 66 -55 -100 -62 41 293 -46 -121 279 46 19 -8 -69 113 106 -128 6 39 -53 270 -37 -63
4169f3o9j01J76L1O3q2R5k93J64q5j33K42J92l41K47j07j80L41L7k75o6J46J99
$$ -63 -132 -233 -57 -26 37 -45 50 -243 -79 -164 -297 -55 137 -204 43 -64 -244 97 134 -141 -207 -61 138
4192A38k54L3n6L05j02k94L9K27r1J52j36QJ79j14k2j90J1K96l3k01k16N60j78
$$ 138 -116 -83 -139 166 64 -230 -191 36 -55 97 -39 -31 148 34 12 -178 -167 129 96 -105 -321 239 61
4215F1l8o1k9K27j92K85m10J73P5K5j84n8l4J83R9p3j81q2L03j60j59M45j97J45
$$ 61 23 -38 -67 160 -32 253 -157 16 91 116 -68 -126 -160 23 122 49 -132 -214 89 -71 -230 215 18 163
4239A63j98m2j48M97k05j81J57N1j43R4J08L8j67k49K67Q5k99J4P7j8J61j6J02
$$ 163 -35 -77 -225 272 67 -114 43 94 -49 45 153 191 24 -225 42 127 -172 -158 -81 -99 62 46 148
4262A48l47J14K98l12j95K19J06K2L9k64K32J19l80l1J55K92j76k81K59J66Q0
$$ 148 -199 -85 213 -99 -294 -75 31 53 92 -172 60 179 -201 -232 -77 215 39 -242 17 183 263
4283B63l66r3K99j4j84R9N5k24J95Q7j20l05M82k2k5kj59K41j36j45J2n2J91j97
$$ 263 -103 -196 103 89 -95 4 59 -165 30 117 -3 -308 174 152 127 125 -34 207 71 -74 -62 -114 77 -120
4307a20L32k21k73M89l64M38m92J84J46k53K64l7j37k46L63j16J31R5j65p3J45
$$ -120 212 -9 -282 207 -157 281 -211 -27 119 -134 130 93 -44 -290 73 -43 88 183 18 -55 90
4328I0Kk67j30M18m01J61K61j58K33m66K1K27J12j94M5N3L63n39J10J0K4j27L02
$$ 90 92 -175 -305 113 -288 -127 134 -24 209 -257 -236 -9 103 -91 -46 7 370 -169 -59 -49 -25 -152 150
4351A50q3j90K58k36M22k29r0J38o8J17r8j09M87k17l57M27n97K21P8N0j76J24
$$ 150 67 -123 135 -101 321 92 2 140 72 189 91 -18 469 252 -105 322 -275 -54 24 74 -102 22
4373B2J06k82P1K88j81L0p4J97l61J42O1%K38j08q7j66R3kK32l02J22J5J62j93
$$ 22 128 -154 -83 205 24 54 -20 177 -184 -42 19 19 257 149 62 -104 -11 -13 219 -83 39 54 216 23
4397B3j13R2n9J31l50K29J72k61J53q9K19j29K39m37p9K71K24l44p5J90L60n50
$$ 23 -90 2 -57 74 -276 -47 125 -136 17 -72 147 18 257 -180 -259 12 236 -108 -183 7 367 -183
4419a83K3O9K09j90J33k28J19P5L34k76k99K70N9q5p8J2jK1Q4Om3J32N0k61m7
$$ -183 -160 -91 118 -72 61 -167 -48 27 361 85 -214 56 115 30 -48 -36 -37 -16 68 74 31 163 213 -48 -95
4444i5qJ03j11K32Jr2J08p4k0Q5P9k45j7K22j33q9J9K7j9K71j62J0r0j14l5J23
$$ -95 -103 0 -111 121 122 30 138 64 44 129 208 -37 -54 168 35 -54 -35 -8 -27 244 82 92 2 -112 -147 -24
4470b4P3j51L67k16r8K21n4l22J91r2J54p3J84l49N5J15l1k25K11kK26l81J64
$$ -24 49 -102 265 49 -49 172 118 -204 -13 -105 49 -24 160 -189 -134 -19 -50 -275 -64 -66 160 -221 -57
4493e7K13j02j22J32J9o0r7J4j04J13m9L12l86J17j39J79o4K38l67M1M16l04J54
$$ -57 156 54 -68 64 83 23 -74 -60 -164 -51 -100 212 -174 -57 -196 -17 -81 157 -210 -169 247 -57 97
4516I7m50M71j02O5k23L35k67J85Kk45K66j65M6J92l56J77j37K39k32Q0K6O2j10
$$ 97 -353 118 16 81 -142 193 -74 111 113 -132 134 -31 15 207 -149 28 -109 130 -102 -22 4 66 -44
4539d4K13l51QL03k02J07J72j87N2j58K08j01j9J41o9n1k57L3L69O8l34j0p5K33
$$ -44 169 -182 -174 129 -73 34 206 19 71 -87 121 20 1 142 73 22 -235 -202 167 235 -99 -109 -184 49
4563D9Kj58Mj53N95l07j32j57J38L30j59j01J2J49p6O4k74K47l5j1r9n4K00Q1
$$ 49 51 -107 -103 -256 339 32 -100 -257 -119 211 52 -49 -37 112 36 100 -174 73 38 27 -72 -126 74 155
4587A55l4l81K50K0J24o5Q9r7j69J61l9k19J40No3K01J11j9K8k90K1L00k17K9
$$ 155 121 -260 -10 10 134 69 158 61 -108 53 14 -205 -65 -60 -123 78 189 170 198 -92 -71 229 12 41
4611D1m8o4j45J82pJ98l04K11p4m5M65n60j4Q5R9J9K2l6m08P6J93P7j63M13N9
$$ 41 -7 -71 -216 -34 -41 157 -147 64 -10 -55 410 -150 -164 -79 20 39 61 25 -383 -307 -114 -37 -200 213 272
4636B72j55j8k13k7K43Qk94O5L07j75k41K41m1J05M7k67k34L79N0j83m1L83r6
$$ 272 117 99 -114 -141 102 110 -184 -119 188 13 -228 13 -28 77 124 -143 -377 2 52 -131 -172 211 115
4659A15K5ml24K41j89K24J33j52J13J57l22j72J99K36O2k22q0j38Q1n9l5K22j60
$$ 115 140 136 -188 53 -136 88 221 69 182 339 17 -155 44 280 342 120 40 -98 -17 -76 -111 111 -49
4682d9K07k4j21j09M9O5j34P8J79l04j13M12j91K32k02r2J75k60j6K61LP6k9j80
$$ -49 158 134 13 -96 -47 18 -116 -38 141 -163 -276 136 -55 177 -25 -117 58 -202 -218 43 46 122 93 -87
4706h7Q5K6k29K45J00l7p9Q9k3k18J08M0J3k1k74M09j79J68j44M0J96m22J86j13
$$ -87 -2 24 -205 40 140 103 24 113 90 -128 -20 20 33 12 -262 147 -32 136 -8 32 228 -194 -8 -121
4730a21J22j9o0l5N0O1J04k24j9J39R9k2j55n9R7n2P3J85Mj05O8j70K77l06kK47
$$ -121 1 -18 -78 -113 -63 -2 102 -122 -141 -2 97 75 -80 -139 -42 -94 -21 164 168 63 131 -39 238 -68 -70 177
4756A77k18p5j28J82j52O6J1L46l71K07J16j62N2j09p4R7K25k93k9L8Q5n5k7N2
$$ 177 -41 -116 -244 -62 -214 -148 -137 209 -162 45 161 -1 51 -58 -132 -35 190 -103 -132 -94 -9 -64 -91 -39
4780c9K64nj79j25K07j38L5J22k5j90J71k78K84k63J64J80l08P4q7J18mk94M06
$$ -39 225 220 41 -84 123 -15 20 142 117 -73 98 -180 104 -159 5 185 -123 -49 -136 -18 -22 -316 90
4803I0k2j73K11o4j83K94k3n8k84J73N9L4k0r5K09j64r2L15k86K15l32K64o6L47
$$ 90 68 -105 106 42 -141 153 130 72 -212 -39 20 54 34 -61 148 -16 -108 207 -79 136 -196 68 2 349
4827C49k64k03L5l8K75m37M92j51k2k28K13K50k17J24l23N07l63J34j78o6l2J9
$$ 349 85 -118 -83 -121 154 -283 209 58 36 -192 21 271 54 178 -145 362 -1 133 -45 -111 -143 -124
4849a24M6kK74l12M39l34r1K07q9K22k41J22j00J73j26O8j45j65J99N8n4k96M40
$$ -124 -78 -80 194 -118 321 -13 -104 103 14 236 -5 117 17 190 64 132 -13 -178 21 79 25 -271 169
4872A69k32p7J18L9j35O3J92j32j3K14j57J2K6j95j11L89q6k31K39j69K02j50
$$ 169 -63 -140 -22 17 -118 -55 137 5 -8 206 49 61 87 -108 -219 170 84 -147 92 -77 125 -25
4894b5J11jr1K09j43l64L52j16L2m5j8J39k5N2r5M9K0J25j28J7o5R8P4k48j61
$$ -25 86 85 -6 203 60 -304 48 -68 -36 -81 -99 40 15 67 -28 21 41 166 38 55 -10 88 162 -86 -247
4919b47L72j36j67K54J01j23l7k31M34l22K7J46k18pJ79M4k66L51k75P4P8p8j02
$$ -247 125 -11 -178 76 177 54 17 -214 220 -102 -75 71 -147 -154 25 69 -197 154 -121 -47 31 -47 -149
4942a49J03J79m9qk15J09M9j30R1k2k7k0R4J71j87j4L32l22n9L48l70j03M77j84
$$ -149 -46 133 84 76 -139 -30 19 -111 -20 -42 -69 -89 5 176 -11 -25 307 -15 -74 274 -96 -199 278 94
4966I4j60L18k71J70M3q7j34K34j60L4p7j38K11J72k81N5R6j34n3J68r4J38oj33
$$ 94 -66 252 -19 151 194 107 -27 207 47 81 4 -134 77 249 -32 23 119 -15 -68 100 6 144 138 5
4990Eo9M11l57k2j96L51m3Nr8q5n6m6M11j76P6j27J15j76J94o9j4N3j00J10j40
$$ 5 -64 347 -10 -32 -228 123 80 85 -13 -98 -154 -200 211 35 111 -16 99 -77 117 48 34 87 -13 97 -43
5015d3j32K67j71k1N8K43j97M5k67L81l92J98K16n2P5k52j39K83k10O8Q3p1M4
$$ -43 -175 92 -79 -100 -42 201 4 49 -218 163 -229 -31 185 133 208 -44 -183 100 -110 -42 41 -30 14
5038A4R8r0k56K66K22l93K27K7j27J34j28Q9r7J47j06J2p3KM5RjL6K95k64j06
$$ 14 112 22 -234 32 254 -139 88 115 -12 122 -6 83 -14 133 27 39 -34 -32 13 22 21 57 352 88 -18
5063a8k9M1j42L34j36j62Q1o8J89Rp8J05j96K9Q0J25L7j72L5q7N3q8%K8J3j23
$$ -18 -47 -6 -148 186 50 -112 -31 -99 90 99 21 126 -70 -41 39 164 201 29 64 -23 30 -58 -58 -30 -17 -140
5089a40n1L1K88j08k24O7N5oL1J2j7L03l74N5L41j44J57k74J8P4k02r4J86pp2
$$ -140 -191 -160 128 20 -204 -137 -82 -88 -57 -45 -62 241 -133 -78 263 119 276 2 20 94 -108 -202 -16 -23 -95
5114i5K28j68N8J19k77K69O8p7J8o8L6j03r7J43j18N4k8n3K37q3j36L32k09J09
$$ -95 133 -35 23 142 -135 134 202 125 143 75 111 8 -89 54 -64 -10 -38 -91 146 63 -73 259 50 159
5138A59r2j4j38k2J92k97K21j5q7nK44j66N2j34K67q0j97K11r9OJ29k06K19l90
$$ 159 67 53 -85 -107 85 -212 9 -6 -93 -98 146 -20 32 -102 165 85 -112 99 0 6 135 -71 148 -242
5162b42L7J89J45p8k10M00j66j97Q4j92L18R9k48QO6K65l01o9lK36j64l0k05J73
$$ -242 -205 -16 129 51 -159 241 75 -122 -38 -230 88 187 -61 -53 13 278 -23 -92 -95 141 -23 -53 -258 -85
5186h5N5j8L2j22J82K3lL2m44J55M05j09o8k9L1l06N3L77k34Q8j41J42k6Q3j24
$$ -85 -30 -48 -16 -138 44 67 64 96 -348 -193 212 103 35 6 37 -269 -216 161 -73 15 -126 16 -10 73 -51
5211e1J76r7k06K61jl9j14J7K06q8%l6j27j2j05J89k3RJ81l38L74j74K1k4J5k16
$$ -51 125 28 -178 83 82 43 -71 -54 152 64 64 28 -99 -111 -216 -27 -50 -41 140 -198 176 2 23 -1 14 -202
5237b02J58J75k96j65K74j30K21mJ16j48j34O1j00L21m02K09J27j87j3K17k60
$$ -202 -44 131 -165 -330 -56 -186 35 31 147 -1 -135 -74 -174 147 -255 -46 81 -106 -119 98 -162
5258a62L94j15K6k13N1m3J59k69J11J0l6Q2L0o4J86J31k62K4j48K90k17K7j30
$$ -162 232 117 143 -70 -19 -62 97 -172 -61 -51 -87 -5 25 -39 147 278 16 40 -108 182 -35 -8 -138
5281a38J44K64k74J75k10o2O9J13J6k19L9o3J61OMk11l4K79nJl6j92L01qj41Q6
$$ -138 6 270 -4 171 -39 -101 -32 81 97 -122 -83 -146 15 21 25 -186 -220 59 54 55 19 -173 128 120 -21 65
5307F5P5k33J50jj41n5K93l78K18M2k02J34O3j23L9Q8N2p7j80J00J57l7p2l0K14
$$ 65 140 -93 57 56 -85 -140 153 -225 -7 35 -167 -33 30 -93 -54 34 86 9 -171 -71 86 49 -23 -53 161
5332A61l06K50j74J34j36r2J39K14j76N8j42n7P8J40m9j6R5l6k58K69j98L76j51
$$ 161 -145 105 -69 65 -71 -163 -24 190 14 72 -70 -127 -49 91 42 26 121 85 -173 96 -102 274 123
5355A23m3lk5J42j93K28j16j39K15j90P1K7j04R3l12L02K71k81k25J85o1J0J3
$$ 123 80 77 52 194 1 229 113 -26 189 -1 70 97 -7 86 -226 76 347 66 -159 26 -35 -25 -12
5378a2n9oL8L2j48J6J00j45L84m15K99J36j91M7j4n2j4j24J69j03J1J64j39l17
$$ -12 -71 -77 -39 -7 -155 -139 -39 -184 200 -215 84 220 29 76 62 10 -4 -128 41 -62 -51 113 -26 -343
5402c43L52J63j61l00K41l3p1K40r3j80K34K3k36K00k92L13r6j8j1J64k80K65
$$ -343 9 172 11 -289 -48 -81 -152 88 -5 -185 49 72 -164 36 -256 57 -39 -57 -68 96 -184 81
5424H1L8nlr6J07p6k7J71l64J46Q5n1j1l4P4M1j79K55o2J7%L9j96J42j50O5m6
$$ 81 119 114 111 15 122 46 19 190 -174 -28 57 6 -5 -39 35 76 -103 152 90 107 107 146 -50 92 -58 7 -39
5451c9p8K2j19J54l66N17jj18j70K06K12k67M8j18J44J84N2p0j11jl17K26N0k05
$$ -39 -117 -95 -214 -60 -426 91 90 -28 -198 8 220 -47 1 -117 27 211 263 193 82 81 -236 -10 40 -165
5475a65J69j06k2J26k28J42q1n0M50j67p7j4j07k2K51r2q5J77j76K51j56l22P3
$$ -165 4 -102 -124 2 -226 -84 -165 -215 235 68 -9 -23 -130 -152 99 7 -78 99 -77 174 18 -304 -231
5498b31L72j96J21n8j2l42J81J57M2J48k80PJ2M08k18K32l94k29M02o0J92n04
$$ -231 141 -55 66 8 -4 -346 -165 -8 34 182 -98 -91 -79 329 111 343 -51 -280 122 62 254 -250
5520b50K19K31j99j19q9L45J05l95Q7p4K47j9Q1k40p7J82P6j80J83r5o9J0j89
$$ -250 -31 200 1 -118 -207 138 243 -152 -65 -139 108 89 170 -70 -147 35 111 -69 114 19 -50 -40 -229
5543b29K41LJ43j90m1q7J58J5p7K29j14K8l24L01k5j08K35j58O7O1m13K37N1o5
$$ -229 12 15 158 -32 -73 -160 -2 13 -64 165 51 79 -245 56 31 -77 158 0 67 128 -285 -48 3 -62
5567f2R2q0K81k02k71L79r1j73Q6L9k3J07J1j82p3Q3K99m65L39j25%O9n1o9K10
$$ -62 30 -50 231 29 -242 137 46 -127 -41 -2 -25 82 93 -89 -162 -79 220 -245 94 -31 -31 38 -13 -82 128
5592A28J3l08n8L38k2k21o9L55k34m7K56j69J1p3K38k87J74O5j3j01o4n7L7J40
$$ 128 141 -167 -225 113 91 -130 -199 156 -78 -125 131 -38 -27 -100 138 -149 25 90 77 -24 -88 -145 -108 32
5616C2N3nP0k44l7J09j55j57K46R9l7J17j29P5P0Q2k50J7J07j63L2L7k0J05R4
$$ 32 85 80 150 -94 -131 -22 -177 -334 -88 11 -26 91 -38 37 107 189 -61 -44 63 -100 -68 -31 -51 54 148
5641A48j14K0j18L0J31j37q6R3j75K88j56J71n3n6K0K1J28n2k26K46n6k79K95
$$ 148 34 54 -64 -34 97 -40 -126 -33 -208 80 -76 95 42 -14 6 27 155 103 -123 123 67 -212 83
5664H3l7K16k09j33qJ42qO3j55M4J53n5M7k78K81K39n15L21k76L5j7J08j30J15
$$ 83 46 262 53 -80 -88 54 46 109 -46 -2 151 96 143 -135 146 385 -130 191 -85 -50 -67 41 -89 26
5688B6k3J78l1j70R9j6J02k97J98k68K01J57j7q1j43O8J31R6M3p6k21Q6k0m7k05
$$ 26 3 181 150 -20 79 63 165 -132 66 -202 -1 156 139 58 -85 -17 114 210 253 177 -44 42 22 -25 -230
5713b30K98k9O7l94L38M5j29m4M80m16q0J17n0J45k13J7Q0O4m2oJ01k38J64m9
$$ -230 68 39 106 -288 50 95 -34 -78 402 -14 -94 23 -27 118 -95 -78 2 66 24 18 119 -119 45 -4
5737dM8M6o2j81L22k36L6L95k84j33j71M15l6k54L4K14nk35J77j21J32Qk38K99
$$ -4 44 90 28 -153 169 -67 -31 364 80 -53 -224 191 155 -99 -65 149 144 -91 86 -35 97 105 -133 166
5761A66j58m8k05K75j82J87p0R0j2J06n9J06j75j2m1K2L8n3j18oL01j21j49K10
$$ 166 8 -40 -245 30 -152 35 -35 55 43 149 90 196 21 9 -32 -10 28 -25 -143 -149 152 31 -118 92
5785I2l3P1r1J38l42K25j53J24J58k91J02j6O5J06k21N0l5q2J18l12M34k03L59
$$ 92 59 130 39 177 -165 60 -93 31 189 -102 0 -16 49 155 -66 -16 -51 -133 -15 -327 107 -96 263
5808B63l37Q8O3n2R6j76q3J20L9L8J20Jk76L08k81J94j26J36n4o4k04L3K59k68
$$ 263 -74 14 77 25 121 -55 -138 -18 21 59 179 180 -96 212 -69 125 -1 135 81 17 -187 -154 105 -163
5832a63L48r1l36K84j25j3K34m7l7l8J44k87P9O7l63K16N1K05K02l83K57o7k18
$$ -163 185 94 -242 42 -83 -96 138 91 54 16 160 -127 -48 19 -344 -128 -77 128 330 -53 204 137 -81
5855h1O7k2J29q6pm4P6j4p4J36r6n9J64P6k67L07m81L42Q5m06J61J13j78L25j51
$$ -81 -14 -36 93 7 0 -44 32 18 -56 80 -16 -75 89 165 -102 205 -276 66 151 -255 -94 19 -159 166 15
5880A5q1j16K82R6k17P5o9RRJ48l4j64J45k3m4J62j34n9J1R5p8R6j32lk09J54
$$ 15 -66 -182 100 196 -21 54 -15 -6 3 151 117 -47 98 75 31 193 59 0 11 106 28 124 -8 -11 -220 -66
5906f6o9L57k29j06J26J87j33m0K7N7k33K27RO7k89k2J18n1K4M9j79P9J57o5p5
$$ -66 -135 222 -7 -113 13 200 67 27 54 111 -122 105 114 181 -108 -130 -12 -63 -39 10 -169 -90 67 2 -73
5931g3K33k51K45l26J8J84J73j56r9K0J04N6M2k53P6K47l47p1l2J31N5P7k44J70
$$ -73 160 -91 154 -172 -154 30 203 47 -52 -32 72 128 170 -83 -7 240 -107 -178 -210 -79 -24 53 -191 -21
5955b1N0NLj69J07L23l67J3j26J93p3O3l2L3J5M7R6j73j53N1k4K35k46l3J33K07
$$ -21 29 34 37 -132 -25 298 -69 -56 -182 11 -62 1 -31 2 17 64 160 -13 -166 -115 -139 96 -150 -183 -50 157
5981A57j90l5R4q0m6K24m7j99M9o9L9M32j66j54m2j2L9K7J26j07L02l93K13k12
$$ 157 -33 -68 26 -54 -100 124 77 -122 -73 -142 -103 329 163 9 -33 -45 -6 21 147 40 342 -51 162 -50
6005e0j4O1K26k36l9j53J78p8L27k18j45J65l1J55m22N75l12j76K77R8k06M2l
$$ -50 -64 -3 223 -13 -52 -205 -27 -105 222 4 -141 24 -7 148 -274 301 -11 -187 90 188 -18 24 21
6028B1J67k64J51k42k3L65Nk30J23J15k10N1l09M74j67j24N3l8L34k09k90J21
$$ 21 188 -76 75 -167 -190 175 180 -50 73 188 -22 29 -280 194 27 -97 -44 -82 252 43 -247 -126
6050a26J21O0L2j22J21k55J17J74j00%k15J47K36m04K74Q1k13n5K36j87j95J81
$$ -126 -5 55 87 -35 86 -169 -52 122 22 22 -193 -46 190 -214 60 141 -72 -127 109 -78 -273 -92
6072i2n2K25j22j70M04k29J1K7m7j75J61P0j09J56l9R3j99P6l07O55j65l13K67
$$ -92 -144 81 -41 -211 193 -36 -25 2 -45 -220 -59 11 -98 58 19 112 -87 -11 -318 337 172 -141 126
6095A26N5k20RO0O8j64L0J87j58P8K75m2l68J16O4k84K30j33K73M4k19J76k50
$$ 126 181 -39 -30 30 98 -66 -36 151 -7 71 346 304 -64 52 116 -168 62 -71 202 246 27 203 -47
6118d7k1O3On5Q9J06pk82k2K00M2N4j17j69M8L4J82lo1kN8j62L42l96J79o0o1
$$ -47 -68 -5 1 -54 35 141 134 -148 -170 30 72 126 9 -160 -112 -78 104 101 40 38 96 -66 276 -120 59 -1 -62
6145f2J04j88K63k93K43N0j01j11j42K83j74MJ93j02j42K84m24K60K26p6p7M6
$$ -62 42 -146 117 -176 67 117 16 -95 -237 46 -128 -124 69 -33 -175 109 -315 -55 171 95 18 64
6167F4m5J09l48j3M44j73m8j9j69J14J24K2M6J34l21O2n3JR5k43L37j69O2q5O0
$$ 64 19 128 -220 -233 211 38 -10 -29 -198 -84 40 62 108 242 -79 -17 -70 -69 26 -217 120 -49 13 -72 -12
6192a2J50l93M00l5j13o8n6pJ80j04J29N8k41L41l23J34m6o6l2Pj68J86J59j38
$$ -12 138 -255 145 110 -3 -71 -127 -134 46 -58 71 129 -112 229 -94 40 -6 -72 -104 -97 -265 -79 80 -58
6216e8L0K5j47J98k64J92j37Q5J74J71l83k5K73j77J05l57M51k35J20m1p6l8J36
$$ -58 -28 -3 -150 48 -216 -24 -161 -76 98 269 -114 -139 134 -43 62 -295 156 -79 41 0 -76 -114 22
6239B2q5K15l89L16m2j40L0K3K05j26k9J3J21Q4k11j15K7P6j92K63l02M62k98
$$ 22 -63 152 -237 79 37 -103 -73 -50 155 29 0 13 134 218 7 -108 -81 -5 -197 66 -236 226 -72
6262g2K03k34J93j7O1K1k27J8L9J51J1j53PJ7J10K8Nk64q5K50K2q4p4K81k46K35
$$ -72 131 -103 90 73 134 155 -72 -54 -15 136 147 -6 1 18 128 156 161 -103 -188 62 84 0 -74 207 -39 196
6288A96l05P4K15k76J56r1J45j11o8j77J25M5J23m8L1j11J85p3l6o1N0L2k52M12
$$ 196 -109 -35 180 -96 60 -31 114 3 -65 -242 -117 -72 51 3 34 -77 108 35 -1 -62 -12 20 -232 180
6312A80k58K06qj90j88K03nj01J72J77j57k3rM3k9k6j30K03k17M4PK23l10R8R7
$$ 180 -78 128 120 -70 -258 -55 -60 -161 11 188 31 8 -1 42 13 -13 -143 60 -157 -113 -106 117 -193 -95 2
6337Bn0J57j84J10J70j56k22j51Q8J77l1m5J19J80j09j05J40n3O5k60Q2L41l30
$$ 2 -48 109 -75 35 205 49 -173 -324 -236 -59 -90 -135 -16 164 55 -50 90 37 102 -158 -76 265 -65
6360f5K93q0l2k13N3j8J33o1L29k56j13O3j54J23o0R6M6l2k50K70R5l02K21n6
$$ -65 228 148 116 -97 -44 -62 71 10 339 83 -30 33 -121 2 -58 38 84 52 -198 72 167 -135 86 30
6384C0l45L36J56l08J13k04L58N2j79n0K67N3j90j40j68K83j81K29k99J20J09
$$ 30 -315 21 177 -131 -18 -222 136 188 9 -41 226 279 89 -51 -219 64 -117 112 -187 -67 42
6405D2j17j38K4J50n1J01K38l45J01J05k38J0K65k34p5L01j17j09n7J25M2q8Q5
$$ 42 -75 -213 -189 -39 -90 11 249 -96 5 110 -128 -118 147 -87 -162 139 22 -87 -144 -19 23 -65 20
6428B0j46N9j70K73K31j73k98L71k77q2K41j2k00O9J47qp1j44K52l9j9K2k49J73
$$ 20 -126 -67 -237 36 267 94 -204 167 -110 -192 49 37 -163 -94 53 45 -26 -170 82 43 24 46 -203 -30
6452c0K02k04N5J11N3j70p9Q8k8j33L2K91lk92L39j27J6j53o1j59M05q6Olj19
$$ -30 172 -32 23 134 187 17 -62 26 -2 -135 -103 188 185 -107 232 105 121 -32 -93 -252 153 67 73 70 -49
6477d9R1j43K82k29K22j54j27o1J59J6j03J02j83L3JL55j86J96l54m2J89k3k16
$$ -49 42 -101 181 -48 174 20 -107 -168 -9 7 -96 6 -177 -144 -143 212 26 222 -132 -174 15 -8 -224
6500b24M7N20l76Pm6J33J42k45k63M72j29j9O3qp4l7J48j15M0J38L2j34m81L00
$$ -224 -177 343 -33 -26 -72 61 203 -42 -305 167 38 19 82 74 0 -37 111 -4 36 174 206 72 -409 -109
6524a09k4J80j52J96k26j09L53M6k68k7r1L1k6L17J1M5ql7j17r8L4j9K38O9j87
$$ -109 -133 47 -105 91 -135 -244 109 155 -113 -140 -231 -200 -226 91 102 147 139 102 -15 -113 -79 -98 140 209 22
6549B2q3P9rJ85m10J53m1K63n6l6j11K32n0j97q3J02m2j92L64q7j71J49J25m2
$$ 22 -61 18 9 194 -216 -63 -104 159 103 67 -44 188 138 -59 -142 -40 -82 -274 90 3 -168 -19 106 64
6573F4n3RJ63l61K02j0J28j27O1k07R7j43pK66j45J15q5j09j3K81k9J62j91l39
$$ 64 11 20 183 -178 24 14 142 15 76 -131 -34 -177 -184 82 -63 52 -33 -142 -155 126 97 259 68 -271
6597b71L38K31k55J79k52O7L9m3j50R5k9j65J67l5R1K2m7O0j63J16k26J98j43
$$ -271 67 298 43 222 -30 37 76 33 -117 -22 -51 -216 -49 -84 7 29 -18 42 -121 -5 -231 -33 -176
6620a76J35l8L8K20Mo7p8N8j11P3r4j6O6k30M06k14J62j24k92M53k66J41r7k6
$$ -176 -41 -79 -41 179 183 116 38 96 -15 58 -36 -52 14 -216 190 -24 138 14 -278 175 -91 50 -47 -73
6644g3Q2k09L5J76k74J39k0K19j44J08J58l9O3o9L5j48M3j11J72j43K8J57j77
$$ -73 9 -200 -165 11 -263 -124 -144 75 -69 39 197 158 221 152 187 39 82 -29 143 0 28 185 8
6667HO3Nj35J12k17K12R4n2j34j16N6J08p2J22j76K46K10j05k32J44l45Q9l9J8
$$ 8 71 76 -59 53 -164 48 142 90 -44 -160 -104 4 -68 54 -122 124 334 229 -3 141 -204 -115 -154 -136
6691a36R3Q2J42j4J4k11O8k24r2L28J01l90N4J84k7J66k69L04j09j02J04O5j79
$$ -136 -43 39 181 167 181 -30 38 -186 -278 50 151 -239 -185 -1 -28 138 -131 173 64 -38 66 131 -48
6714d8l84J15K60J27L1l13K36j85J72Pm2K4P6o2q8K62j42k41J92QJ92j13lr7j17
$$ -48 -432 -317 -57 70 101 -212 24 -161 11 18 -24 0 76 14 -74 188 46 -195 -3 5 197 84 81 -16 -133
6739a33r1J19j52K16K37j51P5O6l08lO0J00N2j1l5k14L11j15j07J03k5l2o2J0
$$ -133 -224 -105 -257 -41 196 45 120 186 -122 -125 -65 35 87 76 41 -173 138 23 -84 19 -6 -38 -100 -90
6763i0mLL75l00j67Q2j67J88P9J08r1k4Q0j50Q3qj25M5K35M3j15j42j27K86p5
$$ -90 -94 -91 284 -16 -183 -101 -268 -80 -1 107 16 -8 72 -78 5 -3 -128 -83 152 195 80 -62 -189 97 22
6788B2m7J30k47K36p0L1j12m0Q2J67k10o6J54P9k29J49j54K56l48L8L07k30K82
$$ 22 -25 105 -142 94 24 55 -57 -97 -15 152 -58 -124 30 109 -120 29 -125 131 -217 -179 128 -102 180
6811A80k54J27k64J18Q6p5P2N8j43K59m51M0J66KL8M3lk69L14j37R6q7J3N4j25
$$ 180 -74 53 -211 -93 -7 -82 -10 48 -95 164 -287 -247 -81 -79 -41 2 -1 -270 44 -93 3 -84 -71 -17 -142
6836a42l8K26r6J89j49K05Q3l14M4J78l90L51k09L6N7k23L31j39j39P8J15M1p9
$$ -142 -180 46 -50 139 -10 195 278 -36 8 186 -204 147 -62 -26 31 -192 139 0 -139 -61 54 95 16
6859A6rJ2kQ7k48j14N61pm30J19J6P2O1k5j77P6K45l80k5l9K00J11J22k91L9J57
$$ 16 7 19 17 104 -144 -258 303 296 -134 -15 1 73 134 109 -68 8 253 -127 -152 -191 9 120 242 -49 -10 147
6885A47m35L86j16Q3J9J09l43L7L2K67o7r1J60j33j5j73L05l94L41J07r0k25J8
$$ 147 -288 98 -18 65 84 193 -150 -113 -81 186 119 28 188 55 40 -133 172 -222 119 226 136 -89 -71
6908g1J95j33J62j72j86J81L09k27P0j03J8O1k09l4pJ78k00P7J16q3K44j91K0
$$ -71 124 -9 153 -19 -205 -24 285 58 128 25 43 104 -105 -139 -146 32 -168 -91 25 -58 186 -5 15
6931A5r7J57j43j66J28J81J65l07K2K26k90N9O6j6p6K85r0Ok00J61k58K44K8j63
$$ 15 -82 75 -68 -234 -106 75 240 -67 -45 181 -109 -50 16 0 -76 209 119 125 -75 86 -172 72 100 -63
6955f3J13j89J99j30Q0J39j96J0K17j13oo3O6j91N9J72m12J30J93p5K53j85j73
$$ -63 50 -139 60 -70 10 149 -47 -37 180 67 61 -2 64 -127 -68 104 -308 -178 15 -60 193 8 -165
6978a65K73nq7L9m0K4P1ol43K18k01L07n0l1j68K71k08J87k2J34n26K00K36j32
$$ -165 108 103 16 55 15 39 110 104 -239 -21 -222 85 35 4 -164 107 -101 86 64 198 -328 -128 108 -24
7002b4N0k03R0M9J42l36J38j1K58l34M7K02k74J74J3k6J23j25J34j24n0K34j90
$$ -24 26 -177 -87 -38 104 -232 -94 -105 153 -181 -134 68 -206 -32 -19 -45 78 -47 87 -37 -87 147 -43
7025d3K48j69j68K48Q4j90N8K12n7l23N7K88k70j2K49j02j46M8K3J42k67r7Q0
$$ -43 205 36 -132 116 200 10 68 280 223 -100 -43 245 -25 -37 212 110 -36 12 35 177 -90 -187 -107
7048a07j74R5M1J37o9k8J16N8j44J93k45O0J09J18q4m7O6Q6k98J24r9p4O6k23
$$ -107 -281 -186 -145 -8 -77 -105 11 69 -75 118 -127 -67 42 160 76 29 95 181 -117 7 -92 -166 -100 -323
7072c23L42k6j05J24j80K58k11K27j10j74J05J09R7L5k49J57J8j11k4R1n9j10
$$ -323 19 -7 -112 12 -168 90 -121 106 -4 -178 -73 36 133 168 -81 76 94 -17 -41 50 -9 -119
7094a19j9K64q9M0pl2J57q3r1j90K96j48l6j23J3J00J18j72l8J45j26k1J45L69
$$ -119 -138 126 37 77 70 38 195 112 21 -169 127 -21 -57 -180 -167 -67 51 -121 -159 -14 -140 -161 -16 353
7118C53l13o7k56K35k23N3J60L9J29k07J07J50j23l8j07N8O9j21K03l1j3j51J31
$$ 353 40 -27 -283 -48 -271 -218 -58 -19 110 -97 10 160 37 -1 -108 -50 19 -102 101 70 57 -94 37
7141C7M1k02q7L6J86l0J51J34l20q4o2J81M8M0q6J4j47j11L72r9R7j9mq1J5l9
$$ 37 78 -124 -211 -175 11 -19 132 266 -54 -138 -200 -19 29 69 -17 -3 -150 -261 111 12 109 90 86 5 20 -19
7167a9k0j02O5K82j71r9O6j86n7L02J11k12N4J5l33M88j23p2j15L14l42L01j20
$$ -19 -39 -141 -76 206 35 -64 2 -184 -241 61 172 -40 14 29 -304 184 61 -11 -126 188 -154 147 27
7190B7j00J96l80K92m9J11j92J96j51J16j93J21J63k34l8k13K38R8N9N9m37L41
$$ 27 -73 123 -257 35 -14 97 -95 101 -50 66 -127 -6 157 -77 -115 -328 -90 8 67 126 -311 30
7212C0J43j93k32Q6M16k17p4j4nL75j97j65R2k69K13M0L6J14l43K60m9j01o5K18
$$ 30 173 -20 -252 -166 250 33 -41 -55 -60 315 118 -47 45 -224 -11 29 65 179 -164 96 47 -54 -119 99
7236I9k74J69n0K07n4j94K10j36J01j50J28o1l6K98k17k59M87k72jo8K30l74J32
$$ 99 -175 -6 -56 151 97 -97 113 -23 78 -72 56 -5 -41 257 40 -219 268 -4 -5 -73 157 -217 -85
7259h5J19Q8r7P3Nm7n6M1j39M6Lj97R3NP6J18k57K58J08k87K36l84L39k35L6R0
$$ -85 34 122 25 98 103 56 0 41 -98 -52 -49 -246 -153 -148 -72 46 -211 47 155 -132 104 -280 59 -176 -140 -50
7285e0l2n5L5J89k52J26K20p3l3j53l78K89K2Q9K29k73J83R8o3k05J7O7ln0j1
$$ -50 -82 -137 -102 87 -165 -39 181 108 75 -78 -456 -167 -145 -56 173 -100 83 181 118 -87 -70 -3 -6 -56 -67
7310f7k21K50o6Q7J0pj49R5k9K6J2K5M9Q8k59P0P2l7Jq7J12m9OJ64j78M1Mq2R1
$$ -67 -288 -38 -104 -17 -7 -14 -163 -68 -97 -71 -59 -34 15 103 -156 -86 -14 -51 -50 -137 -25 -74 -68 96 -82 -41 -37 -119 -28
7339b8j37K93k45K98l39L41l66J70j26J89j43J68L8j03J66l58L55j42kr5J48J18
$$ -28 -165 128 -117 181 -158 183 -183 -13 -139 50 -93 75 113 10 176 -182 173 31 29 -66 82 200
7361B00k84M3J23q1j43N9K38j29l13L63J48l03j49K46j17J18Q4l44L25j19J26
$$ 200 -84 -41 82 1 -142 -83 155 26 -287 76 224 -79 -228 18 -99 19 103 -241 84 -35 91
7382I1o8j08J0o0K44j9j04r7K61j79R8J5l89J56K79j93K1R1j21P4m1m8m1R8j73
$$ 91 23 -85 -75 -135 109 90 -14 -111 150 -29 69 84 -305 -149 130 -63 -42 49 -72 2 -39 -87 -128 -30 -203
7407b03J76m6J10lj47p3L88p8m70K75J54j88k1J27J36j27J32j63R4j41K69j38
$$ -203 -27 -73 37 34 -113 -186 202 124 -346 -71 83 -105 -126 1 137 10 142 -21 73 -68 201 63
7429F3j89M4J0J39o7O5M4n5k63L58j15q2J78j39q5j03J75n7Jl9P1k54K18O0j28
$$ 63 -126 -82 -72 67 0 65 109 54 -209 149 34 -48 130 -9 -94 -197 -22 -79 -78 -117 -46 -300 -82 -22 -150
7454a50K28j3l27M58k73L30j70N5j19J44o6k87N21k06j38L9K84j77k19pJ61k87
$$ -150 78 65 -262 196 -77 253 83 138 19 163 97 -190 331 125 -13 26 310 133 -86 -93 68 -219
7476b19K89j41J04r0M8j0M6M0M7k54L3K68l25K17l0k7K3k7O9M9o3j00m1q9J97
$$ -219 70 -71 33 -57 -9 -19 27 67 114 -140 -107 161 -164 53 23 -4 19 -8 61 110 47 -53 -94 -183 14
7501A4L8J18k16L2j9l98K09K62J60j46j7j57J69j90J4J46J36k21Q7L9j26lR5N2
$$ 14 52 170 -46 -14 -33 -431 -222 40 200 54 37 -120 49 -141 -127 19 155 -66 21 60 -66 -69 26 78
7525G8o8J17k4J24j54m3M9nM7j80o2R6J64k9j19J7N0Q3j00q4J35j94L69l52nl2
$$ 78 10 127 103 227 73 30 79 74 121 -59 -121 -25 139 110 -9 8 58 141 41 -43 92 -102 267 -85 -90 -122
7551a22R4p9O6k04K98l4j17K24K05m48m6J28M1J4k64K29J00m7K44k45k4o5L9j16
$$ -122 -28 -107 -41 -245 53 19 -98 126 331 -117 -163 -35 6 20 -244 -15 85 38 282 37 13 -52 -13 -129
7575a29K56j28K14k90L93m68J51n8j28J30r8L01O2O5k75K01k59J75l22j2K10p9
$$ -129 127 -1 213 -77 316 -152 -1 -59 -187 -57 -155 146 208 273 -2 199 -60 115 -207 -219 -9 -88
7597h8J11or8K08k10N5o1L2K85j61j54J88j99J27k6J2k4l6P5j3k2q2L7l4J09o4
$$ -88 23 17 -81 127 -83 -28 -89 -57 228 67 -87 101 -98 29 3 15 -9 -45 30 17 -5 -87 -50 -84 25 -39
7623c9j06R4J96j24o3p8J4P2j33K81j11M5n1p4R8k33R6J2oqQ1j10J71rJ49k86
$$ -39 -145 -51 145 21 -42 -120 -106 -34 -167 114 3 48 -3 -77 21 -212 -116 -104 -110 -118 -37 -147 24 15 164 -122
7649a22J42j88K88K5k06J12J75j49J4j19K31q5j07J51l10j2O6o8K62l70L47m4
$$ -122 20 -168 120 145 -61 51 226 77 91 -28 203 118 11 162 -148 -160 -94 -162 100 -270 77 33
7671C3Rj63L33l65O7K8m8Q6P0m2n8P2j43P2lJ9Q6j32J65k81L84J2k63Q1n2j72
$$ 33 42 -121 212 -153 -86 -58 -106 -20 50 8 -50 22 -121 -49 -52 -33 53 -79 86 -195 189 201 -62 19 -33 -205
7697b05K03Qj9k04J21L7n4J19j88J44J33l79K86N1J27k29J00rk05J28K20j39r7
$$ -205 -2 6 -13 -217 -96 -59 -113 6 -182 -38 95 -284 2 53 180 -49 51 42 -163 -35 185 46 -51
7720e1JK44j42j47L2M6N1M4K5nj81K71m7K41k71j20j21j63J26qJ77k01Q9K10J3
$$ -51 -50 194 52 -95 -63 -17 34 78 103 98 -83 188 141 382 111 -9 -130 -293 -167 -175 2 -199 -110 100 113
7745A13K0k10k0J47J35k04Q2K17j58o9j17J42L06k96j22J69r7LM8o4K0Ko1j49
$$ 113 133 -77 -97 50 185 -19 63 280 122 53 -64 78 384 88 -34 135 38 41 89 25 45 47 -14 -163
7769a63J52P7j75O3P8J33r9j73O8p3R2J74M7j94j27J40M2K3R0o6j40j89M83k31
$$ -163 -11 66 -109 -46 32 165 66 -107 -39 -112 -20 154 201 7 -120 20 62 85 175 109 -31 -220 263 32
7793C2m7q5L7J32k61L40k34k0l4M1J19p3Q5j69J75k20J01R3J5O2k22n5K61K9j95
$$ 32 -15 -100 -63 69 -192 148 -86 -106 -140 -99 20 -53 32 -137 38 -182 -81 12 27 89 -133 -188 73 102 -93
7818i3R3M9j69J16J44R4r9j59R2P1j08q7L3j69K85o4k5r8K60j92Q6R7j64k03Q9
$$ -93 0 49 -120 -4 140 234 135 -24 68 139 31 -56 -23 -192 93 29 4 -94 166 -26 60 157 -7 -210 -121
7843a21k6J13l07L15k00K58M6l6j09l5N8J15j7N7j02j46R9K5M1j38K16n1R0k95
$$ -121 -147 -34 -341 -26 -226 32 78 42 -67 -102 -44 71 54 111 9 -137 -38 -13 28 -110 106 55 145 -150
7867a50J10n0J8L7P2n2Rj54j17L46j14P5m6J36q9j22j82J81J1j8J88P8k13J47
$$ -150 -40 -90 -72 -35 37 -15 -6 -160 -277 69 -45 30 -16 120 31 -91 -273 -92 -81 -99 89 167 -46 101
7891A01K11j04k89K55m72K37L6j9J59j55J02O8k10J88K1j80O6R8nj4j47j28J65
$$ 101 312 208 -81 174 -298 -61 -25 -44 115 -40 62 130 -80 108 129 -51 15 113 108 94 -53 -181 -16
7914a6K65p1k36Q6o5o5L11q9r0k01n1L94k76L84K3r1l80J00J80k11k13L92j91
$$ -16 249 178 -58 28 -37 -102 209 120 30 -171 -222 172 -104 280 303 212 -168 -68 112 -99 -312 80 -111
7937a11r6L27N9j38n9K0J1l1N3L3k23L77j05j12l15L95j60q2P5L3KR9j78p6J61
$$ -111 -207 120 179 41 -18 2 13 -18 35 68 -155 222 117 5 -310 85 -75 -157 -82 -49 -47 52 -126 -202 -41
7962d1O9j74N7J37j46L4R8j1O8J39o9j24K59j88L8k38k4J01M0R6j03O7K1m2P1
$$ -41 28 -146 -89 48 -98 -64 34 23 91 230 161 37 296 108 146 -92 -116 -15 25 121 18 85 106 64 135
7987A35k73J61j89n1J56L3j63K85m1r0k3J06j66Q0oJ89j25r5l4m5K29l9J74m41
$$ 135 -138 23 -166 -217 -61 -28 -191 94 53 -37 -60 46 -120 -40 -46 143 18 -77 -111 -156 73 34 208 -233
8011b33J55J74k1n2j51K82l7r5k15K6L52l41n5M7K18j40K3K7j80M34l50j03J42
$$ -233 -78 96 75 23 -128 154 117 22 -193 -167 185 -156 -211 -164 54 -86 -63 -36 -216 218 -132 -235 -93
8034i3K73L5o9k11k7o5K26J63n3r6k82K78l06J47O4N9j53J54K1j63K88j29k33
$$ -93 180 215 146 -65 -92 -157 69 232 179 83 -199 79 -227 -80 -16 43 -110 44 65 -98 190 61 -172
8057a72J48N7l71J83KK60l6j75j44N0K62K30l02p0L65k09k54K41O6k52L6K60j12
$$ -172 -24 33 -338 -155 -153 107 71 -104 -248 -198 64 294 -8 -78 287 78 -176 65 131 -121 -85 175 63
8080F3L5R5j09K1j18J1nj31K37j78j5j2J8J72M6P9j43R0M6o7n4J14j13j84K3J80
$$ 63 98 193 84 105 -13 -2 -7 -138 99 -79 -94 -106 -88 84 130 209 66 156 202 135 81 195 82 -102 -79 101
8106A01j35J20J27j10k08K59k67K0J89j45J14K7k20N3L35j67l23J92K42j53j68
$$ 101 -34 86 213 103 -105 154 -113 -93 96 -49 65 92 -128 -75 260 93 -230 -38 204 51 -117
8127a17M12m68J54jl2J56j21j10L60k76O8l8l07N28l07m1P3P9j75J57o2N1OJK01
$$ -117 295 -173 -19 -20 -52 104 -17 -127 233 -43 25 -13 -320 208 -99 -140 -67 12 -163 -6 -68 -17 -11 -10 191
8152A91n0j66j2J64k44J83m0K6j13j0J28j84O8r2J93O3j69K76l50o4M93k30pr5
$$ 191 141 -25 -37 127 -117 66 26 52 -61 -71 57 -127 -59 -151 42 105 -64 212 -138 -202 291 61 54 -41
8176d1L04k28j24O2j78J14l48L54k7Q6J20j15J12j04J28
$$ -41 263 35 -89 -27 -205 -91 -439 -85 -112 -26 94 -21 91 -13 115
8191A15
$$ Imaginary data points
##PAGE= N=2
##DATA TABLE= (X++(I..I)), XYDATA
0@%%%%%%%%%%%%%Qj6J6j6J6k4L2l5M3n1N9p2Q8j02J16j34J52j69J93k24K55k87
$$ 0 0 0 0 0 0 0 0 0 0 0 0 0 0 8 -8 8 -8 8 -16 16 -19 24 -27 32 -40 48 -54 62 -72 80 -89 104 -120 135 -152
35a52L21l60M05m53N04n61O24o92P66q49R39j035J141j258J386j526J681j852
$$ -152 169 -191 214 -239 265 -296 328 -364 402 -447 492 -543 598 -660 726 -800 881 -971
53i71K042k256K496k767L079l439L862m365M979n748O735q061R948j2863J8002
$$ -971 1071 -1185 1311 -1456 1623 -1816 2046 -2319 2660 -3088 3647 -4414 5534 -7329 10673
68A0673k9701J06245K5286j39856N9058P302L2003j8839p5827J046P3278j5394
$$ 10673 -19028 87217 112503 -27353 31705 39007 71010 52171 -23656 -22610 50668 35274
80C5274l1446l4598K4751N2995j2627m4445J029M2630l45j6362m501j5553K0046
$$ 35274 3828 -30770 -6019 46976 34349 -10096 -9067 33563 33218 16856 12355 -3198 16848
93A6848J9345k5815k7857L1880j237n126N282j4667R931O313o789P605n790j6922
$$ 16848 36193 10378 -17479 14401 13164 8038 13320 -1347 8584 14897 8108 15713 9923 -6999
107f999K6673j1324j6716K0916k1832N4J5039j142j0325n361J1104J4943o359
$$ -6999 19674 8350 -8366 12550 -9282 -9228 5811 4669 -5656 -11017 87 15030 8671
120H671j0201M035L07K1102p589k1235o554J4505K2577l0617k3280J6377J7867
$$ 8671 -1530 2505 2812 23914 16325 -4910 -11464 3041 25618 -4999 -28279 -11902 5965
133E965o176q546j8347J0356L7777j1394k1889m549K6241K1813j9764k5138J5006
$$ 5965 -211 -8757 -27104 -16748 21029 9635 -12254 -16803 9438 31251 11487 -13651 1355
146A355J9561k277o742k7682J1808K4711o091k1500j1201K3605J0004j3109j1404
$$ 1355 20916 18639 11897 -15785 -3977 20734 14643 -6857 -18058 5547 15551 2442 -8962
159h962K606O509J4803j0469j7467Q089N852J1646j5046j0243J0985K818n96J493
$$ -8962 -6356 153 14956 4487 -12980 -4891 961 12607 -2439 -12682 -1697 1121 525 2018
173B018q440n550J8812j021n835o839J211J2546p14l813q596N25Q786J0236j6173
$$ 2018 -6422 -11972 6840 5819 -16 -6855 -5644 6902 6188 2375 -6221 -5696 3090 13326 -2847
188b847j0084R652J0946L865j9300r09Q134J0856K556j6493p528J8532J1630j4627
$$ -2847 -12931 -3279 7667 11532 -7768 -8677 -543 10313 12869 -3624 -11152 7380 19010 4383
202D383q977l741J9691M115j7051n719R55J6497K970j5957r639J6649Q892l994
$$ 4383 -4594 -8335 11356 15471 -1580 -7299 -6344 10153 13123 -2834 -12473 4176 13068 9074
216I074j1077m097J7164J168l649j1125m32J2488K558j0911o766O875M014L948
$$ 9074 -2003 -6100 11064 12232 8583 -2542 -2974 9514 12072 1161 -5605 1270 5284 9232
230I232j1968Q28N199R63N071q177n39M191J904k829J777n423Q82K816l567N130
$$ 9232 -2736 -1908 3291 4254 9325 1148 609 4800 6704 3875 5652 229 1111 3927 360 5490
246E490j0261Q2N199J679k012o685n38P648O810j1429l325M5J3860K351j6057
$$ 5490 -4771 -4689 510 2189 177 -6508 -7046 602 7412 -4017 -7342 -7297 6563 8914 -7143
261g143j259O467J2089m566j3137l612J5986M953r817j0151j130K0176k139j2859
$$ -7143 -8402 -1935 10154 5588 -7549 -11161 4825 9778 -39 -10190 -11320 8856 6717 -6142
275f142p200P317J4205l510j4195l708J5500N105k341j5552K717J6268M0n696
$$ -6142 -13342 -6025 8180 4670 -9525 -13233 2267 7372 5031 -10521 -7804 8464 8504 2808
289B808j1816O923J0906kj2772k602O400P142j052j5374N130M594M694l662q785
$$ 2808 -9008 -2085 8821 8819 -3953 -6555 -155 6987 5935 -9439 -4309 285 4979 1317 -7468
304g468L825O124M82n413Q60k002P484l153k674L599m129M305j452J408j109k303
$$ -7468 -3643 2481 2963 -2450 -1590 -3592 3892 739 -1935 1664 -2465 1840 388 1796 687 -1616
320a616j678O019J79o248r88k388J1056l159q766k208N466R249m733j0459l22
$$ -1616 -3294 2725 2904 -3344 -4332 -6720 4336 1177 -7589 -9797 -4331 4918 185 -10274 -10596
335a0596J4798P49n468r992M826J6007n012r454o646J0218R917n632j5074J461
$$ -10596 4202 4951 -517 -10509 -5683 10324 5312 -4142 -10788 -570 9347 3715 -11359 -9898
349i898J1639L287n501j4794Q501J0808O26q864p194R955R268k079j1552J879
$$ -9898 1741 5028 -473 -15267 -6766 4042 4668 -4196 -11390 -1435 7833 5754 -5798 -3919
363c919O450Q281p256r857N883M698M263q806m846M659O857k561n054p97K462
$$ -3919 2531 10812 3556 -6301 -418 4280 8543 -263 -5109 -450 6407 3846 -1208 -2005 457
378D57O758o753Rj78R89K839l621k60m27M58j491L417l036l0j487J305O789n323
$$ 457 7215 462 471 293 1282 4121 500 240 -187 271 -1220 2197 -839 -869 -2356 -1051 5738 415
396D15k398p26O240L261m754p170L486Q052j893n445q603R585P044n073p623j629
$$ 415 -1983 -2709 3531 6792 2038 -5132 -1646 6406 4513 -932 -9535 50 7094 2021 -5602 -7231
412g231J0834M831o237r490O492P602L206r895q233J0908M840k105j0681k210
$$ -7231 3603 8434 2197 -7293 -801 6801 10007 112 -8121 2787 7627 5522 -5159 -7369
426g369Q224N295o821p077K680O819O274j1128k472N422N871Q61q218j594M019
$$ -7369 855 6150 -671 -7748 -5068 1751 8025 -3103 -5575 -153 5718 6579 -1639 -3233 786
441G86N337l972l820l138O935K554n982J007q89M776M24l89j075O65J101J447
$$ 786 6123 2151 -1669 -4807 2128 4682 -1300 -293 -1182 3594 4018 3629 2554 3219 4320 5767
457E767k37m732K311l749K329J205n162k886M53O422p92n066l645Q495K706j090
$$ 5767 5530 798 3109 -640 1689 2894 -2268 -5154 -4701 1721 929 -4137 -7782 713 3419 2329
473B329n222m699J1283K631o190r634L103J0209l16j1584l949R102N346J269j2811
$$ 2329 -2893 -7592 3691 6322 132 -9502 -6399 3810 3494 -8090 -12039 -2937 2409 3678 -9133
488i133m87J1893N306n858j1170N607J0810r6j1267j931M524P285k97j2260J201
$$ -9133 -9620 2273 7579 1721 -9449 -3842 6968 6872 -4395 -6326 -1802 5483 5186 -7074 -5873
503e873P226O649p171p603M781P701j499o524nq79P738l066n557JL606L626o067
$$ -5873 1353 8002 831 -6772 -1991 5710 4211 -2313 -2318 -3197 4541 1475 -4082 -4081 -475 3151 -2916
520b916j88L549K194l670K660M22r52K299k638K930q89J727l294j770N090J906
$$ -2916 -3104 445 2639 -1031 1629 2051 1099 3398 760 3690 2801 4528 1234 -536 4554 6460
536F460o190m175P479J053r29o161k8N786J759j175q309J810R533K597j1717k336
$$ 6460 270 -3905 3574 4627 3698 -2463 -2491 3295 5054 3879 -4430 -2620 6913 9510 -2207 -4543
552d543P861M672j986j0778J031N314O401n605j1666K927J2184R02j3095j887
$$ -4543 3318 7990 6004 -4774 -3743 1571 7972 2367 -9299 -6372 5812 6714 -6381 -8268
566h268O328R463m835q138P88O233R482q140r148M045J1835k244q485j961N030
$$ -8268 -1940 7523 2688 -5450 -4662 1571 11053 2913 -6235 -2190 9645 7401 -1084 -3045 1985
581A985O489m694l221l212N100M936m811n402K192N604l321j342j641K358j50
$$ 1985 8474 3780 559 -2653 2447 7383 2572 -2830 -638 4966 1645 303 -1338 1020 870
596H70M05J006m202J894J986k1j688K431k075k43K412M81n63n553M082J949k092
$$ 870 1275 2281 -1921 -27 1959 1938 250 2681 606 363 2775 3256 2693 -2860 1222 3171 1079
613A079j215k341P24L235J045o180p26L319O370m505o191M214L287K937m494l954
$$ 1079 -136 -2477 -1753 1482 2527 -3653 -4379 -1060 5310 805 -5386 -1172 2115 5052 558 -3396
629c396J056P365K63p699l361N618P143p445m696P23M973K187m616m421J577P507
$$ -3396 -2340 5025 5288 -2411 -5772 -154 6989 -456 -5152 -4429 544 2731 -1885 -6306 -4729 2778
645B778j245m432l765O970L090l925o39p63L141Q22l50k745N16J293J272j407
$$ 2778 1533 -2899 -6664 306 3396 -529 -1168 -1931 1210 2032 1682 -1063 -547 746 2018 611
661F11k855K757k258K109J650k331k115J000M594r34k650k085L910J470N65l666
$$ 611 -2244 513 -1745 364 2014 -317 -2432 -1432 3162 2228 -422 -2507 1403 2873 3438 -228
677b28l463N590K692j806o154J211M909K595n190l863K768L641L479q072l484
$$ -228 -3691 1899 4591 2785 -3369 -2158 2751 5346 156 -3707 -939 2702 6181 -1891 -5375
692e375M961N361j559p726m43N533M612n456l737q34P618K948q056k485K826P228
$$ -5375 -414 4947 3388 -4338 -4781 752 5364 -92 -3829 -4663 2955 5903 -2153 -4638 -1812 5416
708E416k695o258j441N797L028l510m238j207P664l90l450k786K284M271j728
$$ 5416 2721 -3537 -4978 819 3847 337 -3901 -5108 2556 2166 -1284 -4070 -1786 2485 757
723G57k265m78L506o04M67k349N93K454j975Q06j288J315j376j94Q09J495j509
$$ 757 -1508 -1986 1520 916 1383 -966 -373 2081 106 912 -376 939 -437 -631 178 1673 164
740A64k490K960J90K538m131r47L071K261l7n116M52L804L247n642k762J885M396
$$ 164 -2326 634 824 3362 -769 -1716 1355 3616 3579 -1537 -1085 2719 5966 324 -2438 -553 3843
757C843J238p778r29K987N833l011n708m68O494L294o005l244N63P984n86o003
$$ 3843 5081 -2697 -3626 -639 5194 2183 -3525 -3993 2501 5795 -210 -3454 -2891 5093 4507 -1496
773a496k608L758N571l459n404j757O940J476l744m588J412O901j144l213l463
$$ -1496 -4104 -346 5225 1766 -3638 -5395 1545 3021 -723 -5311 -3899 3002 1858 -1355 -4818
788d818L833L555j289l788o84M124L68p23l925K536J588L69q83k032K218K35O91
$$ -4818 -985 2570 1281 -2507 -3191 933 1301 578 -3347 -811 777 1146 263 -1769 449 684 1375
805A375j573Q75q93M09J89m73R32l292J066N47J735j461k092P69L032J454m173
$$ 1375 -198 677 -216 193 382 -91 841 -2451 -1385 -838 897 -564 -2656 -1887 1145 2599 -1574
822a574K0J257M843k015m458N29L046L265m240l773P28N650o47m176k691K557
$$ -1574 -1554 -297 4546 2531 -1927 -1398 1648 4913 673 -3100 -2372 3278 2631 -1545 -4236 -1679
838a679O269l468l374j223M881L064l303m132J167N544q10k744m609L801L234
$$ -1679 4590 1122 -2252 -3475 1406 4470 1167 -2965 -1798 3746 2936 192 -4417 -616 2618
853B618k019l038k218L983J296j185l861J519K096J291j922k909L234L11O92k257
$$ 2618 599 -2439 -4657 -674 622 -563 -4424 -2905 -809 482 -1440 -4349 -1115 -804 -112 -2369
869b369k77J764M30O2j454J082n18J894j173J072K01j083Q73K82J485j695j041
$$ -2369 -2646 -882 -452 -390 -1844 -762 -1280 614 -559 513 714 -369 504 786 2271 576 -465
886d65j03K752o44k526q89J002L957l124k600J53L967J704l672l000K035N865
$$ -465 -568 2184 1540 -986 -1875 -873 3084 -40 -2640 -2487 1480 3184 -488 -3488 -1453 4412
902D412j717l346k794M698L515l766l671p77N757L22l711l943L779L852j072l541
$$ 4412 2695 -651 -3445 1253 4768 1002 -2669 -3446 2311 2633 -1078 -5021 -1242 2610 1538 -2003
918b003k372O164J429j362l807N58M145J118l338k977L123Q57O33m108l43K164
$$ -2003 -4375 1789 3218 1856 -1951 -1393 2752 3870 532 -2445 678 1535 2168 -1940 -2283 -119
934a19O27O9l026J312R09J101j876n9J74K74M35j597J156j637L87j97P66P43j020
$$ -119 508 577 -2449 -1137 -228 873 -1003 -1062 -888 -614 -179 -1776 -620 -2257 -1870 -2067 -1301 -558 -1578
953a578m2J30L628j432k83j514K352K832k923j618o02L958o5k732l799L161L788
$$ -1578 -1620 -1490 2138 706 423 -1091 1261 4093 1170 -448 -1050 2908 2843 111 -3688 -527 3261
970C261j587l551j917O222J717k289l960R05N656K41l881m106M319K687o62o198
$$ 3261 1674 -1877 -3794 2428 4145 1856 -2104 -1199 4457 4698 817 -3289 1030 3717 3055 -3143
986c143m29N309R67k288m643K230L657J345m065k018K727K717J2m984P94K396
$$ -3143 -3572 1737 2704 416 -4227 -1997 1660 3005 -1060 -3078 -351 2366 2378 -2606 -1812 584
1002E84J372j766k309Q70J637J536l085K92P3K595j036j698J568l45O68j234O51
$$ 584 1956 190 -2119 -1249 388 1924 -1161 -869 -796 1799 763 -935 633 288 956 -278 373
1019C73n12P5p94p7Q53r89L9j892K863Q44j458j535Q73L426m21j712j942L256
$$ 373 -139 -64 -858 -935 -82 -1071 -1032 -2924 -61 783 -675 -2210 -1337 2089 1668 -44 -1986 1270
1037A270J782n66l417j286M834O11k436m378K616L631o6l949j796L779K693k17
$$ 1270 3052 2486 -931 -2217 2617 3228 792 -3586 -970 2661 2595 -1354 -3150 629 3322 3105
1053C105n703J008M253J941l274l927K449L111N00l946j634J572L903j219m127
$$ 3105 -2598 -1590 2663 4604 1330 -2597 -148 2963 3463 -483 -2117 -545 3358 2139 -1988
1068a988K18K033L215l230j744M07K321O74k274q63l29L436j512r57r86R88J236
$$ -1988 -1770 263 3478 248 -1496 -1089 1232 1906 -368 -1231 -1560 1876 364 -593 -1579 -591 645
1085F45l55L37j256M53N07J552j205p69J80J7J684j870p16p52J861J014j499k213
$$ 645 290 627 -629 -176 331 1883 678 -91 89 106 1790 -80 -796 -1548 313 1327 -172 -2385
1103b385J251L347j462p46k221K610K208n45k326j489L426J503j556l473J548
$$ -2385 -1134 2213 751 5 -2216 394 2602 2057 -269 -1758 1668 3171 1615 -1858 -310
1118c10K195R54k369k711K659J930Q97l855j114K407K474j483l203J066J222K304
$$ -310 1885 2839 470 -2241 418 2348 3245 -610 -1724 683 3157 1674 -1529 -463 759 3063
1134C063k831j460Q30K085Q67k765j46Q10J931j803m76j80M65R60j696P48j338
$$ 3063 232 -1228 -398 1687 2554 -211 -357 453 2384 581 105 -75 390 1350 -346 402 -936
1151i36Q67k63L08om38k51k77K503j401m24j626K059J578j880j520o06L076N18
$$ -936 -69 -332 -24 -30 -468 -719 -996 1507 106 -318 -1944 115 1693 -187 -1707 -2313 763 1281
1169A281j719l156K546L170j042k784j728M218J831j498l898O93L458J443l171
$$ 1281 -438 -3594 -1048 2122 1080 -1704 -3432 786 2617 1119 -2779 -2086 1372 2815 -356
1184c56l606K909K928P59m549r98L321K568q78m657R26L011K691l445k937J437
$$ -356 -3962 -1053 1875 2634 -1915 -2913 408 2976 2098 -2559 -1633 1378 4069 624 -2313 -876
1200h76L301M85m451k88J403L272j847k708m4K652J733l317p94O21K860j031k035
$$ -876 2425 2910 -1541 -1829 -426 2846 999 -1709 -1753 899 2632 -685 -1479 -858 2002 971 -1064
1217a064j3P10J638j708l09k62J421r98n14O52L37M87j964J586L40M44j618l25
$$ -1064 -1077 -367 1271 -437 -746 -1008 413 -585 -1099 -447 -110 377 -1587 -1 339 783 -835 -1160
1235a160J465M89p49k370J408J337J76k812q77K324J230m70l333J061K147J704
$$ -1160 305 794 45 -2325 -917 420 596 -2216 -3093 -769 461 -9 -3342 -2281 -134 1570
1251A570k448k020J868K627P12m183l67K172K532j719l584Q87K694J820l131j622
$$ 1570 -878 -2898 -1030 1597 2309 -1874 -2241 -69 2463 744 -2840 -1953 741 2561 -570 -2192
1267b192P06L583K09l182p13J752K803j587k515k46K877P29k273j342J81L187
$$ -2192 -1486 2097 2306 -876 -1589 163 2966 1379 -1136 -1382 1495 2224 -49 -1391 -1210 1977
1283A977j066j223j130J180J627q64j050o00J576l08n0j301O02Lj76M06r81M62
$$ 1977 911 -312 -1442 -262 1365 501 -549 -1149 427 119 69 -1232 -630 -627 -803 -397 -1378 -916
1301i16l64M24J50N65q46J39J140J92O03k168Q00J228M61j234j867J090J097M11
$$ -916 -1280 -856 -706 -141 -987 -848 292 484 1087 -1081 -281 947 1408 174 -1693 -603 494 905
1319I05k875k62J192J849n92k715Q12J879J545j979j597O38K636k13k345j022
$$ 905 -1970 -2232 -1040 809 217 -2498 -1686 193 1738 -241 -1838 -1200 1436 1223 -1122 -2144
1335b144J195K969j988j758m20K377J498k065j206M89K640k83r69j413J409J104
$$ -2144 -949 2020 32 -1726 -2146 231 1729 -336 -1542 -1053 1587 1304 335 -1078 331 1435
1351A435n18j146r31J784J91l18j102M76P87J84J61j330R97P1P1k34l33j22n33
$$ 1435 917 -229 -1160 624 815 497 -605 -129 658 842 1003 -327 670 741 812 578 245 123 -410
1370d10N21n30J57j708Q38K01L96o08j234R47J005P42j794l97J089J988q16k312
$$ -410 111 -419 -262 -1970 -1132 -931 -535 -1143 -2377 -1430 -425 317 -1477 -1874 -785 1203 387 -1925
1388a925O32J103J764k128j507N58K220M41k645n40J345K782j796j897o29K743
$$ -1925 -1293 -190 1574 -554 -2061 -1503 717 1158 -1487 -2027 -682 2100 304 -1593 -2222 521
1404E21J487k640j186K55K917j38k071j442J805K015j266j343j050K737L57o75
$$ 521 2008 -632 -1818 -1563 1354 1216 -855 -2297 -492 1523 257 -1086 -2136 601 958 283
1420B83j234K48J804j85q90j170J193L31J4j140J76Q47k57K52p96P02k26M37P1
$$ 283 -951 -703 1101 916 26 -1144 49 380 394 -746 -570 277 20 272 -524 178 -48 389 460
1439D60Q0L02q36M57L34M62j110o80O86M37N5j809M2N72J710j440j146L0J617
$$ 460 540 842 6 463 797 1259 149 -531 155 592 647 -1162 -1120 -548 1162 -278 -1424 -1394 223
1458B23J134k403p90N97K710o57k414l47J903J905j822k059j85L272N34k142j541
$$ 223 1357 -1046 -1836 -1239 1471 814 -1600 -1947 -44 1861 39 -2020 -2205 1067 1601 -541 -2082
1475b082J215K977j440k063r60K882R97j265k155K85K920m79j206j283J487J290
$$ -2082 -867 2110 670 -1393 -2353 529 1526 261 -1894 -1609 1311 832 -374 -1657 -170 1120
1491A120k37j478k60J577M21k97j964J079P89k79l09r10R79k24L41p55N39j47
$$ 1120 883 -595 -855 722 1143 846 -1118 -39 750 471 162 -748 231 7 348 -407 132 -15
1509a5M6J9k57O48j270P71k30N94l93p04j9Q95M88j169Q7m39J705p1j298o50N91
$$ -15 31 50 -207 441 -829 -58 -288 306 -87 -791 -810 85 573 -596 -509 -948 757 686 -612 -1262 -671
1530f71J839j122j526l65J716O53j435j412L59K951m29j470j528K051J920r08
$$ -671 1168 46 -1480 -1845 -129 524 -911 -2323 -1964 987 558 -912 -2440 -389 1531 623
1546F23j979n91K629M41r79k404J328J625j20j295j317J744J294n71j912N03J298
$$ 623 -1356 -1947 682 1123 144 -2260 -932 693 573 -722 -2039 -295 999 428 -1484 -981 317
1563C17R31o89j419O11O95L18j018j48J68O20P7n79J72l46R52l80o3L02n91O18
$$ 317 1248 559 -860 -249 446 764 -254 -402 -234 386 463 -116 56 -290 662 282 219 521 -70 548
1583E48RL32j098J51J59P14m29j021L5K42J419j163n15l58J456P43j166j321N88
$$ 548 557 889 -209 -58 101 815 386 -635 -600 -358 1061 -102 -617 -975 481 1224 58 -1263 -675
1602f75K031o02j270j114J634J281j017j478p03K260P03j247j865R58K023j87
$$ -675 1356 754 -516 -1630 4 1285 268 -1210 -1913 347 1050 -197 -2062 -1104 919 732
1618G32j274j494K114Q03q3k086J05J555N29r75j529J133R08P9j144m99J457j87
$$ 732 -542 -2036 78 881 798 -1288 -1183 372 901 -74 -1603 -470 438 517 -627 -1126 331 144
1636A44N1p31J19M56O14n80j18M79l27J76n25Q38o95n8m7K90O42p24o58M72J536
$$ 144 195 -536 -417 39 653 73 -45 434 107 283 -242 596 -99 -157 -204 86 728 4 -654 -182 1354
1657A354m99o31r90J613J320j593j200rK371m16j476j217J077J980q28j618j184
$$ 1354 855 224 -766 847 2167 574 -626 -635 1736 1320 -156 -1373 -296 1684 856 -762 -1946
1674a946K913N17j277j617J7K502K96j661j826K095J339k72k356n29K249Q25o21
$$ -1946 967 1484 207 -1410 -1393 1109 1405 -256 -2082 13 1352 1080 -1276 -1805 444 1269 648
1691F48k378M54K157O63j523j520J693J241J03k250m7R50J164q61j406N86O61
$$ 648 -1730 -1276 881 1544 21 -1499 194 1435 1538 -712 -759 191 1355 494 -912 -326 335
1708C35N65j242j28M51Q83m31m80L26O2M88q76N62j73l2l55j89R89o03m69p16
$$ 335 900 -342 -470 -19 864 433 -47 279 341 829 -47 515 342 310 -45 -234 755 152 -317 -1033
1728a033J518K96p15q90J62J540K0q52j255J469J378l89j995l48K053O21r71j927
$$ -1033 485 781 66 -824 -662 878 898 46 -1209 260 1638 1249 -746 -1094 959 1580 609 -1318
1746a318P82J457O51j856j267J512R98j36k304J07J476Q61j139j692O53J171N47
$$ -1318 -536 921 1572 -284 -1551 -39 959 823 -1481 -1374 102 963 -176 -1868 -1215 -44 503
1763E03j781n23Q72J291l05j517J25P90J172q96q30L8Q26P18r81k19j04J263r72
$$ 503 -1278 -1801 -929 362 57 -1460 -1335 -545 627 -269 -1099 -1061 -235 483 -498 -717 -821 442 -530
1782e30l1k72K49M99m05K17j85O11l45N90j60j70m2K12P61n54m32p98J065J11
$$ -530 -561 -833 -584 -85 -490 -273 -458 153 -192 398 238 68 26 238 999 445 13 -785 280 391
1802C91j65o48q02J290N02l62j835P25J582J00j137j071J309J126k3j759k71J309
$$ 391 226 -422 -1224 66 568 206 -1629 -904 678 778 -359 -1430 -121 1005 982 -777 -1048 261
1820B61J045j016j804J212Q89N87j297q34Q72J169j69j612L8P98J006j373o75
$$ 261 1306 290 -1514 -302 587 1174 -123 -957 -85 1084 915 -697 -659 139 1145 -228 -903
1837i03J09P88O21j256j42K7J253k24m69n87L27J146q39J44m64O73k77p8l0l22
$$ -903 -794 -6 615 -641 -783 -756 497 273 -196 -783 -456 690 -149 -5 -469 204 -73 -151 -181 -503
1857e03M25k97O95p21K61k0J69O29k63l36n49J056K56k5p35q6P02N47n17j340
$$ -503 -78 -375 320 -401 -140 -160 9 638 375 39 -510 546 802 777 42 -44 658 1205 688 -652
1877f52J256L59M15j714l21J016Q08m33j878P99Q88J023j505q97M95J085M54j747
$$ -652 604 963 1378 -336 -657 359 1167 734 -1144 -345 543 1566 61 -836 -341 744 1198 -549
1895e49o6P12J062j002q78K81P45Q91j730j25J24J342j61j218j28O23R10p63o29
$$ -549 -615 97 1159 157 -721 -440 305 1196 -534 -659 -535 807 646 -572 -700 -77 833 70 -559
1914e59k87J053L73p60l26o1P60m24o3j88L67P%P5l22M78n74O98l40K71l99j30
$$ -559 -846 207 580 -180 -506 -567 193 -231 -294 -482 -115 -108 -108 -33 -355 123 -451 247 -93 178 -221 -351
1936c51O15k81J69n59N03J74M21q79k31P60L87K1j305K15P88N61p00r46N56O01
$$ -351 264 -17 152 -407 96 270 691 -188 -419 341 728 749 -556 -341 447 1008 308 -638 -82 519
1956E19J039j909l19M16J437k13j830K48R66J061j267o50J06J161K10j358l93
$$ 519 1558 -351 -670 -254 1183 970 -860 -612 354 1415 148 -502 -396 765 975 -383 -776
1973g76N02J346j008q50l74J380M31q53n52J49J377o46l22m82O85M08n53j83l57
$$ -776 -274 1072 64 -786 -1160 220 651 -202 -754 -605 772 126 -196 -678 7 415 -138 -321 -678
1992f78O40p2j48k67M45K93n62K09j83M55m66J93j3N24o34k31M02L71L72j187
$$ -678 -38 -110 -258 -525 -80 213 -349 -140 -323 132 -334 -141 -154 370 -264 -495 -93 278 650 -537
2012e37K35M72O13l86n19J69J23R93j289k97M23P67J58j295k9O85R90j046o12
$$ -537 -302 170 783 397 -122 47 170 1163 -126 -423 0 767 925 -370 -399 286 1276 230 -382
2031c82j24J208P08j267o99K95J801m97j427j89Q95P03p50r88nJ718j38q20p87
$$ -382 -506 702 1410 143 -556 -261 1540 1043 -384 -573 322 1025 275 -713 -718 1000 862 42 -745
2050g45P98R99j012j30n02J398m43k08o43K39P06l79r6p64J054k65pJn3N5k37
$$ -745 53 1052 40 -90 -592 806 363 155 -488 -249 457 78 -18 -782 272 7 0 1 -52 3 -234
2071b34K54j10M10p80K30J51K95j96q86N66L31O89o83m86M12Q56j16q73j28L51
$$ -234 20 -90 320 -460 -230 -79 216 20 -866 -300 31 720 37 -449 -37 819 703 -170 -298 53
2091E3J115p15j003K94J179L01j490j24J02J459n51q86l82P68J363j358o17k08
$$ 53 1168 453 -550 -256 923 1224 -266 -390 -288 1171 620 -266 -648 120 1483 125 -492 -700
2109g00J544L36j161r01N67J290m18r91p28J225O40n23q52R6J116p6l72q56O90
$$ -700 844 1180 19 -882 -315 975 557 -434 -1162 63 703 180 -672 -576 540 464 92 -764 -74
2128g4L69l0p33O9M99k94Q8o77R36j28k22j33J29K29n12J92P4M94m27n45L39K34
$$ -74 295 265 -468 -399 100 -194 -106 -783 153 25 -197 -330 -201 28 -484 -292 -218 276 -151 -696 -357 -123
2150a23O61j327o4K61R31l56p80J18P20Q77j187l07R4J337j19q40o41O02J557
$$ -123 538 -789 -853 -592 339 -17 -797 -679 41 918 -269 -576 -482 855 736 -104 -745 -143 1414
2169A414r67o50n77J306M99p09n82j78J634k27q28q10J142P14l36j093m88J485
$$ 1414 447 -203 -780 526 1025 316 -266 -444 1190 963 135 -675 467 1181 845 -248 -736 749
2187G49M18m04j326L26M89M07p36p73R96K08L10j220J52O14J62m7q93P29k26K07
$$ 749 1167 763 -563 -237 252 659 -77 -850 146 354 664 -556 -404 210 372 325 -568 161 -65 142
2207A42l71N3L52l69K88k81J44l79N01j98N07j0n28j5K54O56j024J6k51N66M05
$$ 142 -229 -176 176 -193 95 -186 -42 -421 80 -118 389 379 -149 -164 90 746 -278 -262 -513 53 458
2228D58p38j81J95J057m57o56o01J066M96q02k34k94J292p7n59p00N67P24n1q26
$$ 458 -280 -461 -266 791 334 -322 -923 143 639 -163 -397 -691 601 524 -35 -735 -168 556 505 -321
2248c21n48J373J58l34q95K37Q69J42j26j142Q12L28J69p83J9K24J53J50p23J33
$$ -321 -869 504 662 328 -567 -330 539 681 555 -587 225 553 722 -61 -42 182 335 485 -238 -105
2268a05K51K69m90k07L19J67J18n95M23m61N43j72pj20n10N09k55O63o58m7l12
$$ -105 146 415 -75 -282 37 204 322 -273 150 -311 232 60 53 -67 -577 -68 -323 340 -318 -365 -677
2289f77O14J82n96jj84R82l22m70n08R83P40n79q10j47J187J1o32o55N51J009
$$ -677 -63 119 -477 -478 -662 320 -2 -472 -980 3 743 164 -646 -793 394 405 -227 -882 -331 678
2309F78k23p93n60R97L95k59j170M72J003J2n80r53R01M60N0p25j06O60M18p9
$$ 678 455 -338 -898 99 494 235 -935 -463 540 552 -28 -981 -80 380 430 -295 -401 259 677 598
2329E98j137N53L60K42p25rK73k4K46p22R2K17J54k06j61M25k18L10l95L05k47
$$ 598 -539 14 374 616 -109 -118 155 131 377 -345 -253 -36 118 -88 -249 176 -42 268 -127 178 -69
2350f9K76j26o0K68l33M1p51R39j6l75k02k9Q57m20l29m67R05J94m26p57J55Q92
$$ -69 207 81 21 289 -44 -3 -754 185 169 -206 -408 -437 420 0 -329 -796 109 303 -123 -880 -725 167
2372A67K62m84j104J173L01J60j080j71J080L90l56j069O63N97M78j159p46P68
$$ 167 429 -55 -1159 14 315 475 -605 -776 304 694 338 -731 -68 529 1007 -152 -898 -130
2390a30N36J18r06k53P60L53j66p61L09P32K19p03m46Q78k7Mq58L82K56N21p70
$$ -130 406 524 -382 -635 125 478 312 -449 -140 592 811 108 -338 540 513 517 -341 41 297 818 48
2411D8J07n3J52Ql82L48k21Q1j75L87k83n1J27j64K64j72R0m92K43K57J39m68
$$ 48 155 102 254 262 -120 228 7 88 -87 300 17 -34 93 -71 193 21 111 -381 -138 119 258 -210
2433b10j13O48k51o9m80M46J21l7l40m20N06K28k6p58Q5Q34j9l06p34M53P54L17
$$ -210 -323 325 74 5 -475 -29 92 55 -285 -705 -199 29 3 -755 -670 164 145 -161 -895 -442 312 629
2455F29j333R3O90K59j82r08L00P07L29r22n82N30N93K82q54l2M08N17l45m57
$$ 629 -704 -611 79 338 156 -752 -452 255 584 -338 -920 -390 203 485 -369 -401 7 524 179 -278
2475b78M06j69O00o00j14j25N56k65K6Q5j36L28m85L06m37K21k08M22J02k01Q5
$$ -278 128 -41 559 -41 -155 -280 276 11 37 122 -14 314 -171 135 -302 -81 -289 133 235 34 119
2496A19l86N24l76N3m35K46R3J50k62m87O97m4P4m65p4O52pj30o92N68R8J79n74
$$ 119 -267 257 -119 -66 -501 -255 -162 -12 -274 -761 -64 -108 -34 -499 -573 79 72 -58 -750 -182 -84 95 -479
2519d79k39P46J6K24r08M66K55L06n79n71O23M88J00j025K50j26R01l16p07J28
$$ -479 -718 28 44 268 -640 -174 81 387 -192 -763 -140 348 448 -577 -327 -453 448 132 -575 -447
2539d47N02L01o14j49J46Q12n10k81Q6L64M18o50L07n89M91N8J8j21m2J63m23
$$ -447 55 356 -258 -407 -261 551 41 -240 -154 210 628 -22 285 -304 187 245 263 142 100 263 -160
2560a60M54k30Q5k98K78K39q0q4m38N50J40J24o29j48N34k94J17q18M22M96j42
$$ -160 294 64 149 -149 129 368 288 204 -234 316 456 580 -49 -197 337 43 160 -658 -236 260 118
2581A18l21k85N89J22m7r98J43Q09L55o86n39K03M14M04q05j40N77Q53o54p32
$$ 118 -203 -488 101 223 176 -822 -679 130 485 -201 -740 -537 -123 281 -524 -664 -87 766 112 -620
2601f20O2O78O92j073m6N8N61J72r34J8j7Q94n22k95J13N05K6l53o9Q5M68n48
$$ -620 -558 120 812 -261 -307 -249 312 484 -450 -432 -449 445 -77 -372 -259 246 272 -81 -150 -65 403 -145
2623a45Q3l33O38J67k70j05k15O17n38k1p8M87k24j44Q1J99J4m72J05k2P35l45
$$ -145 -62 -395 243 410 140 35 -180 437 -101 -122 -200 287 63 -81 0 199 213 -259 -154 -176 559 214
2645B14o19N54J89J14o10k20L14P16n39n64K06L94Q3o07l30K48R46j27j139m6
$$ 214 -405 149 338 452 -158 -378 -64 652 113 -451 -245 149 232 -375 -705 -457 489 362 -777 -823
2665h23M18Q52m90n77p2P92L63q55m26M47N24j29l02n47O25N62l00p42K5Q17J95
$$ -823 -405 447 -43 -620 -692 100 463 -392 -818 -371 153 24 -278 -825 -200 362 62 -680 -655 162 357
2686C57m70m61N15L19K9k91l26N68j9p0m32L72J93l59J07j62M32n34M51k53K57
$$ 357 -113 -574 -59 260 289 -2 -328 240 221 151 -281 91 284 -75 32 -130 302 -232 219 -34 223
2707B23l62J5j5L76K44p54K71L2J84j05j81o0L17J80l73l55J91O06Q1j175K79
$$ 223 -139 -124 -139 237 481 -273 -2 30 214 109 -72 -132 185 365 -8 -363 -172 434 515 -660 -381
2728c81K28N27m53l85O1L70N18p60J7j35P09l5m97k92M93L44q7o06j4N48Lj95
$$ -381 -153 374 -79 -464 -403 -33 485 -275 -258 -393 316 281 -216 -508 -15 329 242 -364 -378 170 173 -22
2750b2m84K13M00k32j44j33L84qK43j71l93M86j72K93l32K24k86K63O8jj27p2
$$ -22 -506 -293 107 -125 -269 -402 -18 -26 217 46 -347 139 -33 260 -72 152 -134 129 197 196 69 -3
2772cL58j60J87m17J7O4J29L2n98O64N9J00l06l65K10L83R9n75j10L63N40n35
$$ -3 355 195 382 -35 -18 46 175 207 -391 273 332 432 126 -239 -29 354 453 -122 -232 131 671 136
2794A36n21K16K62N90q24k57K83N58J39q36j81L42N76m78k17m93Q50o0l04j31
$$ 136 -385 -169 93 683 -141 -398 -115 443 582 -254 -435 -93 483 5 -212 -705 145 85 -219 -350
2814c50n0L52l5J18o21N28L59k91k42j61N41k14P4n07M91j63L68k11m04O76k03
$$ -350 -400 -48 -83 35 -586 -58 301 10 -232 -393 148 -66 8 -499 -8 -171 197 -14 -418 258 55
2835E5j69k36M19J64k95J09K8J99l35J73l9K46k22k97K16m7M37n89l5J81O27j88
$$ 55 -114 -350 69 233 -62 47 75 274 -61 112 73 319 97 -200 16 -31 406 -183 -218 -37 590 402
2857D02m26RK69L67o52j39p8O73k08k34l18K07P63n28m04k05P24K76m21o71J66
$$ 402 -24 -15 254 621 -31 -170 -248 425 217 -17 -335 -128 635 107 -297 -502 222 498 77 -594 -428
2878d28N52L06k96o09M33L47j70k41m68N29J49k19m25L19M22j34j97k38N78j40
$$ -428 124 430 134 -475 -42 305 135 -106 -574 -45 104 -115 -540 -221 201 67 -130 -368 210 70
2898G0M1o93M67J83Nq6j50K04q0L71m16l4J43j7J66j12N7j26J19q6L15k52k69
$$ 70 111 -582 -115 68 73 -13 -163 41 -39 332 -84 -118 25 8 174 62 119 -7 112 26 341 89 -180
2921a80J52M5J58k00j49J49M05k36K5J3m11O15k43j16m21M29L91j75n08K51K56
$$ -180 -28 17 175 -25 -174 -25 380 144 169 182 -229 386 143 27 -394 35 426 251 -257 -6 250
2942B50J02j52n26J64N27M1l60m43P38L5j65o84L25M01k2k11m00L16k75O19n01
$$ 250 352 200 -326 -162 365 406 46 -397 341 376 211 -473 -148 253 231 20 -380 -64 -339 280 -221
2963b21j88N65Mp5m71P3L19m5m2j31k09L53L42m35m2J18J46k38J95Jk09K49mK49
$$ -221 -409 156 160 85 -386 -313 6 -39 -81 -212 -421 -68 274 -161 -203 -85 61 -177 18 19 -190 59 55 304
2987C04l47J31k85M00Lj07j25p5K59j42q1p4N1L27q2k32k82N18J15rn16o9O22
$$ 304 -43 88 -197 203 206 99 -26 -101 158 16 -65 -139 -88 239 157 -75 -357 161 276 267 -249 -318 304
3010C04P7j45p54P36J50o7m99k48M89M53l30m33J90K60K43q35oM20l39N22p51
$$ 304 381 236 -518 218 368 301 -198 -446 43 496 166 -267 -77 183 426 -409 -415 5 -334 188 -563
3031e63J97K75L91l97j08K39q3M80r00N22J80N8l76m77L80J3L97p71M91k12L44
$$ -563 -366 -91 300 -97 -205 34 -49 431 -469 53 233 291 -85 -562 -182 -169 228 -543 -52 -264 80
3052H0l71J49j63nK93k44J29o6K48m0j79J73q8K59n67L32J75K50o94K14J86K14
$$ 80 -291 -142 -305 -310 -17 -261 -132 -198 50 10 -169 4 -84 175 -392 -60 115 365 -329 -115 71 285
3074B85k28m20M35K98N1n49J02J98K19k10m49M25J42J40n54j68K85K62k37k81
$$ 285 57 -363 72 370 421 -128 -26 172 391 181 -268 157 299 439 -115 -283 2 264 27 -254
3094b54L1M45K21j04o21J93K00J55lm26N5J09J69o22K16LM59m40J58k6N4k7l09
$$ -254 -223 222 443 339 -282 -89 111 266 263 -163 -108 1 170 -452 -236 -233 226 -214 -56 -82 -28 -55 -364
3117c64M07k29O6l1K04j48Lr7j25L12k68L48l22L6K92Q8l13j07M37k18q6j66L79
$$ -364 43 -186 -120 -151 53 -95 -92 -189 -314 -2 -270 78 -244 -208 84 172 -141 -248 189 -29 -115 -281 98
3140I8R3k38j09n10Q59p5p0l49P7L53L8k22k24K53L62L5p62K08J82K23l5p37M40
$$ 98 191 -47 -156 -666 193 118 48 -301 -224 129 167 -55 -279 -26 336 371 -391 -183 -1 222 187 -550 -110
3163a10Q6L06l38k77pL90L13m93J90q0N06l89k73K23K56k13j69k49M0N15k82m6
$$ -110 -24 282 -56 -333 -340 50 363 -130 60 -20 486 97 -176 47 303 90 -79 -328 -288 227 -55 -101
3185a01j63O0J43k19K70l13M61l62P0J40k31n8j70L22k58J64K15n9L39k91m0n12
$$ -101 -264 -204 -61 -280 -10 -323 138 -224 -154 -14 -245 -303 -473 -151 -409 -245 -30 -89 250 -41 -81 -593
3207e93N19j5kl03q5O82j00l25j41L26J71O4l66P3J09J61O6o28N3M67M06m69j03
$$ -593 -74 -89 -91 -394 -479 203 103 -222 -363 -37 134 198 -168 -95 14 175 241 -387 -334 133 539 70 -33
3230c3j00N80n1l80j16J96L52m3o30K05J49P5r2k36L9K17M9m52L38j5J21m72J70
$$ -33 -133 447 396 16 -100 96 448 405 -225 -20 129 204 112 -124 -85 132 181 -271 67 52 173 -299 -129
3253a29k24P14l46j49J7k5J94j31J85m19L38j25m2K44o3j64j52K81J42J88m26
$$ -129 -353 361 15 -134 -117 -142 52 -79 106 -313 25 -100 -142 102 39 -125 -277 4 146 334 -92
3274i2r6K64r2J00k60K45P6n2k30k25K45L89Q1p67J94K67M72m58m17L53R4J32
$$ -92 -188 76 -16 84 -176 69 145 93 -137 -362 -117 272 353 -414 -220 47 519 61 -356 -3 91 223
3296B23m11J27J24L54j07o52K10J43J39j54j55NL38nn30K01J31K49o3o7j08P0
$$ 223 -188 -61 63 417 310 -342 -132 11 150 -4 -159 -154 184 179 -351 -150 -19 230 167 100 -8 62
3318F2oj16O6j36L88k73j5L8j44K68k47K64l31L36k12j60J76k3O2j5r7jJ49j47
$$ 62 56 -60 6 -130 258 -15 -30 8 -136 132 -115 149 -182 154 -58 -218 -42 -65 -3 -18 -115 -116 33 -114
3342a14J1Q2K24m93P1J71J53R3l68k46K65K45J87l76j29O6Q16q17j80M98M5l4
$$ -114 -103 -21 203 -290 -219 -48 105 198 -170 -416 -151 94 281 -95 -224 -158 658 -159 -339 159 204 170
3364A70p15L18Q7K83J00l06p3K19Lj92j81J50O66l99j41r0J24K52J55n17j45M26
$$ 170 -545 -227 -140 143 243 -63 -136 83 86 -106 -287 -137 529 130 -11 -101 23 275 430 -87 -232 194
3386A94j98L2Q8j03J60l4o1m56P14m42r0L05m33L18k40L44q2l5k06L00k63OK54
$$ 194 -4 28 116 13 173 139 78 -378 336 -106 -196 109 -324 -6 -246 98 16 -19 -225 75 -188 -182 72
3409G2l24K49k5J29l31K00O7q2M0l31L63L1K65n96r6J76PL46l66j40J97L35j92
$$ 72 -252 -3 -28 101 -230 -30 37 -45 -5 -336 27 58 323 -273 -369 -193 -186 160 -206 -346 -149 186 -6
3432fL4k96K20L10m55M4j99M58l56m5qPL73j25j51N7M12j26J1k24J6J60J38k17
$$ -6 28 -268 -48 262 -193 -149 -348 110 -246 -291 -299 -292 81 -44 -195 -138 274 148 159 -65 -49 111 249 32
3456C2l35L13O2J26l57K54J20l56P2o9K84k12j47K65j38K85j85j68K18o3K1m0
$$ 32 -303 10 72 198 -159 95 215 -141 -69 -138 146 -66 -213 52 -86 199 14 -154 64 1 22 -18
3478a8oJ79j83j85K03J4O0p5k82R0K02j35k33J35J29K09j16k39K78r1K80m05n3
$$ -18 -24 155 -28 -213 -10 4 64 -11 -293 -203 -1 -136 -369 -234 -105 104 -12 -251 27 -64 216 -189 -242
3501b42o6M64p8l20K2J66K05k10R0j83M68k21o6j48p8J03R9k7l64K25K66l67N9
$$ -242 -308 156 78 -242 -220 -54 151 -59 31 -152 316 95 29 -119 -197 -94 5 -22 -386 -161 105 -262 -203
3524b03j24M26K40k21m36K56J85L4k92O7K08K77k76l08O0j0R2J56k3J26k76J88
$$ -203 -327 99 339 118 -318 -62 123 157 -135 -68 140 417 141 -167 -107 -117 -25 131 108 234 -42 146
3546A46k82J50J75k86N0N4L40k73j66M8j4J08j06r8O2J33J25k67j24K25k76K50
$$ 146 -136 14 189 -97 -47 7 347 74 -92 -44 -58 50 -56 -154 -92 41 166 -101 -225 0 -276 -26
3568b6m4j8M01k86p8k31K19M2j29l8n1L00k9P6n02K34R3L3p2l01L72K57M9l25
$$ -26 -70 -88 313 27 -51 -282 -63 -21 -150 -188 -239 61 32 108 -394 -160 -67 -34 -106 -407 -35 222 271 -54
3592e4P5J25J30k35j06J95J3P6l36j81L89j76K77l49M30l34L30j87M2J09l60K93
$$ -54 21 146 276 41 -65 130 143 219 -117 -298 91 -85 192 -157 273 -61 269 82 124 233 -127 166
3614A66N7k53O3M1j95J60lp6o5q2N9K15j4k99L51k26K7r4QJ61J8j28M7J10J41
$$ 166 223 -30 33 74 -121 39 36 -40 -105 -187 -128 87 73 -226 125 -101 -74 -168 -160 1 19 -109 -62 48 189
3639A89j30l52L5R7ppk3j6K75j65K5j45K40j91J83k72OP3K91j51J5p2J14K6k09
$$ 189 59 -293 -258 -161 -168 -175 -198 -214 61 -104 -79 -224 16 -175 8 -264 -258 -185 106 -45 -30 -102 12 38 -171
3664a71O3J51j38M9QM4pR2j47k39K74L9l5K5p8J31J42l40K96j95j89K95p4J72
$$ -171 -108 43 -95 -46 -38 6 -1 91 -56 -295 -21 18 -17 8 -70 61 203 -137 159 -36 -225 70 -4 168
3688A68j12K12l60J07Oq8K09k34J30Rj89j01L16q1Q2o7l88M02L4nm78m1N30J18
$$ 168 56 268 -92 15 21 -67 142 -92 38 47 -142 -243 73 -8 74 7 -381 21 55 50 -428 -469 61 179
3712A79k99j58K20L37l35k48K28M4J70k61k34L93P1m8j92j47M20k50L10n17M0
$$ 179 -120 -278 -58 279 -56 -304 -76 -32 138 -123 -357 36 107 59 -133 -280 140 -110 200 -317 -277
3733b77M64k0j97l16L64J9K00k80J05j7L1n9K4n6R1n2p8N3J05j47j25K20J11j98
$$ -277 187 167 -30 -346 18 37 237 -43 62 45 76 17 41 -15 76 24 -54 -1 104 -43 -168 52 163 -35
3757c5R8j15M9J42j40N3q7Q1Q8j11j37J43J35R0k71j31j4M33J5m89R3K13J1j77
$$ -35 63 -52 -3 139 -1 52 -35 46 134 23 -114 29 164 254 -17 -148 -162 271 286 -203 -110 103 114 -63
3781f3j87J85J17J73o82K39K34J1q7k39L82k9Rk92L7R4K67j54j42O3K13k44Q4
$$ -63 -250 -65 52 225 -457 -218 16 27 -60 -299 83 54 63 -229 -192 -98 169 15 -127 -64 149 -95 -11
3804a1k68J40J19R3l9k40J71J5K1J54l42J54J19j01K17k69J05J35j24k04J92m8
$$ -11 -279 -139 -20 73 34 -206 -35 -20 1 155 -187 -33 86 -15 202 -67 38 173 49 -155 37 -11
3826a1k39J56K08J68j57m5K5k5R6m09M17P6j23k30j3J39Q3o3j78K75j31K29m32
$$ -11 -250 -94 114 282 125 80 105 80 176 -233 184 260 137 -93 -106 33 116 53 -125 150 19 248 -184
3849a84J0L47O7j85j18n5K10O9m44K46J40K40k40l68K30k69M86j22j24n0J41k
$$ -184 -174 173 240 55 -63 -118 92 161 -283 -37 103 343 103 -265 -35 -304 182 60 -64 -114 27 25
3871B5l82N6LL12J50m52J31K92k1j44J69l13J85nJ10Q0l25O4O0l1K90r9k00K13
$$ 25 -357 -301 -298 14 164 -288 -157 135 114 -30 139 -174 11 6 116 196 -129 -65 -5 -36 254 155 -45 168
3895A68O0j78Q3j17O8O0j4m4j0R8J31l03l6j0J67J18j54j04K45M7l06o8J56j96
$$ 168 228 50 133 16 84 144 130 86 76 174 305 2 -34 -44 123 241 87 -17 228 275 -31 -99 57 -139
3919a39K38j25j88K43L43k14k29k46K32K06k28n2K67j28o5L25m77K60l1N4r8j78
$$ -139 99 -26 -214 29 372 158 -71 -317 -85 121 -107 -159 108 -20 -85 240 -237 23 -8 46 -52 -230
3941b30J56M48l36l0j32R6k03K33K69m29J98l40K21k29Q7N0K81o7j13J09k62K43
$$ -230 -74 374 38 8 -124 -28 -231 2 271 -158 40 -300 -79 -308 -221 -171 110 43 -70 39 -223 20
3963B0l43K04K93j76M6q4J10k3j25K11N7k26M4J0K14K6l70P2J29l25L34l02J89
$$ 20 -323 -119 174 -2 44 -40 70 47 -78 133 190 -36 8 18 232 258 -112 -40 89 -236 98 -204 -15
3986a5Q0P3l08J58p4K41j91n4J6J99K92o15N4K13K45l38k61L85q7K76j37l27j00
$$ -15 65 138 -170 -12 -86 155 -36 -90 -74 125 417 -198 -144 69 314 -24 -285 100 13 289 152 -175 -275
4009b75M17p6J08k89rM61n29K23r8J22j85K73m13J12K72o3k89J82k5J28j28mO
$$ -275 142 66 174 -115 -124 337 -192 31 -67 55 -130 143 -270 -158 114 51 -238 -56 -81 47 -81 -85 -79
4032g9M2J27k40O4K28k60PK84j62K03k60OO1Q7J9j39K13M3k91K9j45k2K67J38
$$ -79 -37 90 -150 -86 142 -118 -111 173 11 214 -46 -40 21 108 127 -12 201 244 -47 -18 -163 -185 82 220
4056B20k65n9J24R5l71K64J5J02R1j24r9l7L50m59j10L09j72L60l21P8J73j02
$$ 220 -45 -104 20 115 -256 8 23 125 216 92 -7 -44 306 -153 -263 46 -126 234 -87 -9 164 62
4078F2J23j45j11LK53k64n3o2J21q5R8Q3k38P8J88J85p01M04n3J94k01J53j63
$$ 62 185 40 -71 -68 185 -79 -132 -194 -73 -158 -60 23 -215 -137 51 236 -465 -61 -114 80 -121 32 -131
4101a31KJ93j8N3j36Q6l20J73J34r8j98R4J55k16KO7L4M12l87M5J09P8l7j00k1
$$ -131 -129 64 46 99 -37 49 -271 -98 36 -62 -260 -166 -11 -227 -225 -158 -124 288 -99 -54 55 133 96 -4 -25
4126b5R6j90Q3n0q9M02k62J79l35K07K58k58J2j17K49q0L1k65J53J84j59L7l15
$$ -25 71 -119 -36 -86 -175 227 -35 144 -191 16 274 16 28 -89 160 80 111 -154 -1 183 24 61 -254
4149b54M03j44j70M7K9J09K38l67p4L83j68m6j99L68j22q2k09K14j30RK90J00
$$ -254 149 5 -165 -118 -89 20 258 -109 -183 200 32 -14 -213 155 33 -49 -258 -44 -174 -165 125 225
4171B25m33M1j0L17j10mr5R2O3j79L65j85l45Q8K38j79K7l0J86r7m1j23Q3K92
$$ 225 -208 -167 -177 140 30 26 -69 23 86 -93 272 87 -258 -170 68 -111 -84 -114 72 -25 -66 -189 -106 186
4195A86r6L2k21K8J95l47K68K9K33%j08o4l75L76J69p1l64J27J02J38l37L4K64
$$ 186 90 122 -99 -71 124 -223 45 74 307 307 199 135 -240 136 305 234 -130 -3 99 237 -100 -66 198
4218A98j79J71l09O8Q6J3j39J66l26K78r1K8k16J98l6K09n3l8J15l0k26J8J37
$$ 198 19 190 -119 -51 35 48 -91 75 -251 27 -64 -36 -252 -54 -90 119 66 28 143 113 -113 -95 42
4241D2Rj04m3J2J37o8J05qL3L8j25j9K00k93j54K94K31l77P8k7L6R3k25Q9K9O9
$$ 42 51 -53 -96 -84 53 -15 90 82 115 153 28 9 209 -84 -238 56 287 -90 -12 -39 -3 90 -135 -46 -17 52
4267E2q0k95K22J24J5K09m20QL09n3J6l64L07q1N0j85J95kJ74j35P6k75K30J57
$$ 52 -28 -323 -101 23 38 247 -173 -165 144 91 107 -257 50 -31 19 -166 29 27 201 66 142 -133 97 254
4291B54mm23L3L49j96R2p5P3l0J66l68J18l4j31L41l79J47Q3j69J77q9j8L17l56
$$ 254 250 -173 -140 209 13 105 30 103 73 239 -129 -11 -45 -176 165 -214 -67 16 -153 24 -65 -83 234 -122
4315a22J72o8r7J26j29K95j94L1kR3qj0m51J48K44m5O5j59p5M7K05k4N5k94L86
$$ -122 50 -18 -115 11 -118 177 -17 14 12 105 97 87 -364 -216 28 -17 48 -111 -186 -139 66 42 97 -197 189
4340A89k10j30Q9J7Q0n3k66J70K19O9j33k83K64k8J50L3J01l40K19l08K33j71
$$ 189 -21 -151 -62 -45 35 -18 -284 -114 105 174 41 -242 22 -6 144 177 278 -62 157 -151 82 -89
4362h9L31j74p7j31K1K94m4j86Q4J77j59j19r9J98O1J94j77J90k95J53Lk36N1
$$ -89 242 68 -9 -140 -119 175 131 -55 29 206 47 -72 -171 27 88 282 105 295 0 153 156 -80 -29
4385b9O8j68j37L06m5K33k56J78j76k51O0J94K08k67J68m1l07L17p9k77K68pJ98
$$ -29 39 -129 -266 40 -5 228 -28 150 -26 -277 -217 -23 185 -82 86 45 -262 55 -24 -301 -33 -40 158
4408A58j24j50k9K73M3q9o8p7M07j92j59j62J40K56o6m1j60Q8L28l61O6p6k6Q6
$$ 158 34 -116 -145 128 171 82 14 -63 344 152 -7 -169 -29 227 161 120 -40 48 376 15 81 5 -21 65
4432F5K9J22j43R0n5k44J22K24n8j20Q5Q9M2k64R3K6j71J23J25l11Q8p9K00r2
$$ 65 94 216 73 163 108 -136 -14 210 152 32 117 206 248 -16 77 103 -68 55 180 -131 -43 -122 78 -14
4456a4j36K9p9J20L42j51k2k0m06Q9Q3J31j71K91mk52J81j64L56j38o0k25J81
$$ -14 -150 -121 -200 -80 262 111 89 69 -337 -248 -165 -34 -205 86 82 -170 11 -153 203 65 5 -220 -39
4479c9J40m4n0j33n1J38j59P2O9J03O7l6k11K6J35j11m9J8K43L5j42j20j32OM05
$$ -39 101 57 7 -126 -177 -39 -198 -126 -57 46 113 77 -134 -108 27 -84 -133 -115 128 163 21 -99 -231 -225 180
4504A80k29L6j19K94j90l9J56J07j40k35L16j52j87K25J56k66M77m12o2P6R3j05
$$ 180 -49 -13 -132 162 -28 -67 89 196 56 -179 137 -15 -202 23 179 -87 390 -22 -84 -8 85 -20
4526b0J1L3k70K42k59L21j6k72J25J93m42L02p8J83l33J04K78j95M4K50J6m21
$$ -20 -9 24 -246 -4 -263 58 42 -230 -105 88 -354 -52 -130 53 -280 -176 102 -93 -49 201 217 -204
4548b04L87n27K05O0P6l3j59N0J68P5j07n1J12p0K86l15J14j74M29j74Q8k44L33
$$ -204 183 -344 -139 -79 -3 -36 -195 -145 23 98 -9 -60 52 -18 268 -47 67 -107 322 148 236 -8 325
4571C25o0j71q2%R2j59J37J9k52NJ95j11J46l46L79m3k77J21J58Q8j64n1K58j31
$$ 325 265 94 12 12 104 -55 82 101 -151 -146 49 -62 84 -262 117 74 -203 -82 76 164 0 -51 207 76
4595G6O0j35n6P8q1q3R5K45l10j55J31K84k09j01L61p4M5O1n90M25k58Q5l3M4
$$ 76 136 1 -55 23 -58 -141 -46 199 -111 -266 -135 149 -60 -161 200 126 171 232 -358 67 -191 -106 -139 -95
4619i5QN0J6k51J99O8R3k34J00L8J74Rn17P1M68m4l7nk61J72J48p5j82K49m9m
$$ -95 -87 -37 -21 -272 -73 -5 88 -146 -46 -8 166 175 -342 -271 197 153 116 111 -150 22 170 95 -87 162 113 109
4645A09k00n9K83k72L9L28o23O47k67l7K63k13J13l3k24K53j15q3J02j5J01Ok06
$$ 109 -91 -150 133 -139 -100 228 -395 252 -15 -52 211 -2 111 78 -146 107 -8 -91 11 -4 97 103 -103
4668a03N5K01j39J14rq9j5J97k54L0L8J47m51L80Q1q1j40L9j32M5J00M2p4l7J99
$$ -103 -48 153 14 128 119 30 15 212 -42 -12 26 173 -278 102 183 102 -38 1 -131 -86 14 56 -18 -55 144
4693A44j9k36K85l93K10p7O8j24J05J99k87J02j32q7K95j84O7P2n5J52l6l5O2
$$ 144 125 -111 174 -219 -9 -86 -18 -142 -37 162 -125 -23 -155 -242 53 -131 -64 8 -47 105 69 34 96
4716I6k43K06J67k30J51j97J00j2J46j56o8j24K6K28P1j00j06J55M6k36M1jK10
$$ 96 -147 59 226 -4 147 -50 50 38 184 28 -40 -164 -138 90 161 61 -45 110 156 -80 -39 -40 170
4739A70n0j58k1L30k30k6o8M7J60j91J32K7r9J00k45J99k17M18l94j9n9M45k96
$$ 170 120 -38 -59 271 41 15 -53 -6 154 -37 95 122 23 123 -122 77 -140 278 -116 -135 -194 251 -45
4762d5o9L81J60j78p3q8l35L03k27R2J2j5o4O1J62Oj51L0o0K8l9K42o6j34j45
$$ -45 -114 267 427 249 176 88 -247 56 -171 -79 -67 -82 -146 -85 77 83 -68 -38 -98 -70 -109 133 67 -67 -212
4787b12L92l96O1J83p9%No8J3N4J25n1mJ85j44q4J2L9J03k93K48r6K01j49n9J83
$$ -212 180 -216 -155 28 -51 -51 -46 -114 -101 -47 78 27 23 208 64 -20 -8 31 134 -159 89 -7 194 45 -14 169
4813A69r1m5l6k3O8j08J31M0o4k4K8k7J09N9j98L76l54L5j51J21O9j82l6J34J34
$$ 169 78 33 -3 -26 42 -66 65 105 41 17 45 18 127 186 -12 364 10 45 -106 15 84 -98 -134 0 134
4838A34k01R1j4k5J43j81J41p5L5R4j42J3l0K21j86j37O7J35o1R6M7k09K69l9
$$ 134 -67 24 10 -15 128 -53 88 13 48 142 0 13 -17 204 18 -119 -52 83 22 118 165 -44 225 186
4862A86l1j06l6j14R4J45j59p6M39l71m1kJ00J61j83J48l64K14o9rM04k65r5P7
$$ 186 155 49 13 -101 -7 138 -21 -97 342 -29 -70 -72 28 189 6 154 -210 4 -65 -74 330 65 -30 47
4886D7l9Q9L3j31qr8L48k65K71j40j38O0l5k11K81j90J24p9m2J96j05q7J63P6
$$ 47 8 97 130 -1 -9 -107 241 -24 247 107 -31 29 -6 -217 64 -126 -2 -81 -123 73 -32 -119 44 120
4910A20L7r0q0J73j7j03k20J15K9l4l1l7J0J90Q0k07l7l2J78j70j01J40J20J79
$$ 120 157 67 -13 160 143 40 -180 -65 -36 -70 -101 -138 -128 62 142 -65 -102 -134 44 -126 -227 -87 33 212
4934B12j63k72P1Q8K03j95j19K09J60k99kO9K00k25J47j31K32k2q5j73L35l50
$$ 212 49 -223 -152 -64 139 -56 -175 34 194 -105 -107 -38 162 -63 84 -47 185 163 78 -95 240 -110
4956a10K84j75L2nj29K68p5J1r1k96J06JJ83j00K75j30j56O9K00k71Q1J09m3J00
$$ -110 174 -1 31 26 -103 165 90 101 10 -286 -180 -179 4 -96 179 49 -107 -38 162 -109 -28 81 38 138
4980A38k74P5J57mq1lL8n2K52j27k04l0J8L1J57NK0l01L02n0J49l43P7o8O0K37
$$ 138 -136 -61 96 92 11 8 46 -6 246 119 -85 -115 -97 -66 91 96 116 -185 117 67 216 -127 -50 -118 -58 179
5006A79n7j90o6J10j14N3r0M9J06Q4m4J11k01K8J48R9l33K53k25O7J90R6j48k31
$$ 179 122 -68 -134 -24 -138 -85 -175 -126 -20 64 20 131 -70 -42 106 205 -128 125 -100 -33 157 253 105 -126
5030a26J19nk51K93mj66J98k57K39j29J31O5k92J04N0N1K7j21J47J2o9N2l31L45
$$ -126 -7 -12 -263 30 26 -140 58 -199 40 -89 42 107 -185 -81 -31 20 47 -74 73 85 16 68 -263 82
5054H2O2l1k50J27j36L39j66k13J05PK95l37N1k0K01q1m8rk35K77j92J08J2J45
$$ 82 144 113 -137 -10 -146 193 27 -186 -81 -74 221 -116 -65 -85 116 35 -13 -22 -257 20 -172 -64 -52 93
5078I3j78J45J5J03k41j13J4K97k60J26j11R4R4k63r4J42N01n78K16p1J66m3k8
$$ 93 -85 60 75 178 -63 -176 -162 135 -125 1 -110 -16 78 -185 -279 -137 364 -214 2 -69 97 54 26
5101B6j41l7J27K36k5j74M0p8K08l21J02P2m3j09J43j04M0J96j15k26K0J80j05
$$ 26 -115 -152 -25 211 186 12 52 -26 182 -139 -37 35 -8 -117 26 -78 -38 158 43 -183 -163 17 -88
5124h8J87l21K70j67P4j57N5l5L27k18J59K3J18r1l32K32l21K74k64K47j41K52
$$ -88 99 -222 48 -119 -45 -202 -147 -182 145 -73 86 109 227 136 -196 36 -285 -11 -275 -28 -169 83
5146H3l01n7J77L1P1K1mP3l6m6j8KQ4m9j75K06L7q4J03J19m09P6j2P9k9o6P2j4
$$ 83 -218 -275 -98 -67 4 25 21 94 58 12 -6 -4 80 31 -144 62 99 15 118 237 -172 -96 -108 -29 -58 -124 -52 -66
5174f6M7J07k12O9o0p9K87k80K96j77k20J48K88k01k49J15J85k8J42j99J63K05
$$ -66 -19 88 -124 -55 -115 -194 93 -187 109 -68 -288 -140 148 -53 -302 -187 -2 -30 112 -87 76 281
5196B81l92K18KJ52q6j04j36J65M04l66j32q9j18L79l33L52m08K85r1J41l91K52
$$ 281 -111 107 109 261 175 71 -65 100 504 138 6 -83 -201 178 -155 197 -211 74 -17 124 -267 -15
5218a5n8M2o5j53M77k51Q3m1k3J05j65K6J56k20NK17j39J40J73k47m8j71L73k61
$$ -15 -73 -31 -96 -249 228 -23 60 19 -4 101 -64 -38 118 -102 -97 120 -19 121 294 47 -1 -172 201 -60
5242f0Q8J9J3j69L96k44j27K74k56%J28O7j0l01r6L18j36O8o8j63J94j19L06r1
$$ -60 28 47 60 -109 287 43 -84 190 -66 -66 62 129 119 -182 -278 40 -96 -28 -96 -259 -65 -184 122 31
5266C1o6J65j88L97n11K11J30l62K75qq9K45j19o9LpK38j79n0Q8l9j78j9J04J96
$$ 31 -35 130 -58 339 -172 39 169 -193 82 74 -15 230 111 42 45 38 276 97 47 135 96 -82 -101 3 199
5291A99l12m0K33k77K33J8j00o6K16j94L5j69K72j68J46j19J84Pj62O1n6J18l49
$$ 199 -113 -153 80 -197 36 54 -46 -112 104 -90 -55 -224 48 -120 26 -93 91 98 -64 -3 -59 59 -290
5314b90L80j23P9r4l5l19N24l54p9M24j43K9j14n2l8o0M06l14J81j38L02j54p8
$$ -290 90 -33 46 -48 -83 -402 122 -232 -311 113 -30 -1 -115 -167 -205 -265 141 -173 8 -130 172 18 -60
5337f0j0R4n1J15k20J42J6l7M7m74L10K80j70K8N5k47K06n9K9j49L5L15j94J24
$$ -60 -70 24 -27 88 -132 10 26 -11 36 -438 -128 152 -18 10 65 -182 24 -35 -6 -155 -120 195 1 125
5361A25k29Q7o0j57K77l1J12k50l1J3P9J4R3NJ98j33k77L3J10L10l82R1j17j14
$$ 125 -104 -17 -77 -234 43 12 124 -126 -157 -144 -65 -51 42 47 245 112 -165 -132 -22 288 -94 -3 -120 -234
5385b34L28J5L4j84j66M40l04j6O5N5k2L6j15K44k15L0m4R0r4K4K37m54K35K8
$$ -234 94 109 143 -41 -207 233 -71 -87 -22 33 11 47 -68 176 -39 -9 -53 37 -57 -33 204 -250 -15 13
5409A3j87K46r4k34K74j48N0p4K86j75J0QK22l06jL19k32P8qJ44j33k6O6p9qK25
$$ 13 -174 72 -22 -256 18 -130 -80 -154 132 -43 -33 -25 197 -109 -110 209 -23 55 47 191 58 32 98 19 11 236
5435B36k23j86L21j64o5R0j03J62Q5k54J28k67J73K60l71L08j60J54k79J06j85
$$ 236 13 -173 148 -16 -81 9 -94 68 153 -101 27 -240 -67 193 -178 130 -30 124 -155 -49 -234
5456b34R5J3Q7n8K21j05k68m8M41j09O9l8K1K60m05m3J18K47k48R6J34k97L6N1
$$ -234 -139 -126 -39 -97 124 19 -249 -297 144 35 104 66 87 347 -58 -101 17 264 16 112 246 -51 -15 36
5480C6K11n53K40j0N0L6KK3J91nl11K06L6j53J67J8k97J63jP5j71O7L23q3j08
$$ 36 247 -306 -66 -76 -26 10 12 35 226 221 -90 116 152 -1 166 184 -113 50 49 124 -47 20 343 260 152
5505A52j77j59L75p1j83Q2J8l86M58j85J99l44K31j67k9K32R2p0k51J60K40q2
$$ 152 -25 -184 191 120 -63 19 37 -349 109 -76 123 -221 10 -157 -186 46 138 68 -183 -23 217 135
5527A35j31N3j46j21J83j50K95j75K7P5k89K72j77P2K83j98J4R4j36J74j90Q4
$$ 135 4 57 -89 -210 -27 -177 118 -57 -30 45 -244 28 -149 -77 206 8 22 116 -20 154 -36 48
5549D8k19J13J4J53j36n0j71K58K02k75O0k41J80j4J33J04k77J05O6j89L02r7
$$ 48 -171 -58 -44 109 -27 -77 -248 10 212 -63 -3 -244 -64 -78 55 159 -118 -13 53 -136 166 69
5571F9j04j8q5J28r0J13m7J6J28r7J00k76L52k15Q8j6J73l18K73j76rN0j38N6
$$ 69 -35 -53 -138 -10 -100 13 -34 -18 110 13 113 -163 189 -26 62 46 219 -99 174 -2 -11 39 -99 -43
5595d3m3K64j96n9J20R7j52p8O9r9K04K5l10J89k35M81j88mpL1m3j86K70m88L40
$$ -43 -86 178 -18 -77 43 140 -12 -90 -21 -120 84 109 -201 -12 -247 234 46 42 35 66 23 -163 107 -381 -41
5620d1J44j42J50j77J66r6p1O3QQM1j07j95K73j8l5q2K43o1j22K16K3j61q8J47
$$ -41 103 -39 111 -66 100 4 -67 -4 4 12 53 -54 -249 24 6 -29 -111 132 71 -51 165 188 27 -61 86
5645H6p2K33l19l71L81N3J20k71O2M3K22k65K05j52O4J51l24K77j50O0J68r7k22
$$ 86 14 247 -72 -443 -62 -9 111 -160 -98 -55 167 -98 107 -45 19 170 -154 123 -27 33 201 104 -118
5668a18N3j7n5J10L1m5J52L1j95j1Jm5q0Q8L22k70P8p2m2L18j74j7K9k54j7J50
$$ -118 -65 -82 -137 -27 4 -41 111 142 -53 -64 -63 -108 -188 -100 222 -48 30 -42 -84 234 60 43 72 -182 -199 -49
5694d9M4Q1l15k5J80J14j7k03O00n03P5J02j15K9j1K25m32L63o5k54j2J44J15
$$ -49 -5 76 -239 -264 -84 30 13 -190 410 -93 -18 84 -31 -2 -13 212 -220 143 78 -176 -188 -44 71
5717G1l5j1J54L1k87M0R2j75J33O7j88K59l3j67N6k1J59j99K55j79k96K98j47
$$ 71 36 25 179 210 -77 -37 55 -120 13 80 -108 151 118 -49 7 -14 145 -54 201 22 -274 24 -123
5740a23J54K40m36L47k34n1K79j26l23L12k03J92l3m3J8K76m02m4L68k07j41K75
$$ -123 31 271 -165 182 -52 -103 176 50 -273 39 -164 28 -5 -48 -30 246 -156 -200 168 -39 -180 95
5762I5n3n9j36N1J8J29k38L22j06j82M5k2M0K12j76Q6Mj8K31o1l28L34m0k87L55
$$ 95 42 -17 -153 -102 -84 45 -193 129 23 -159 -114 -136 -96 116 -60 26 30 12 243 182 -146 188 148 -139 216
$$ [...]
8191A62
##END NTUPLES=NMR FID
##END=
