##TITLE=1H_SA_sl.OH_4
 CDCl3, 8 sc, 
 1.9.2020
##JCAMPDX= 6.0         $$ Bruker NMR JCAMP-DX V2.0
##DATA TYPE= NMR FID
##DATA CLASS= NTUPLES
##ORIGIN= UXNMR, Bruker Analytische Messtechnik GmbH
##OWNER= root
$$ XWIN-NMR		Version 3.5
$$ Tue Sep  1 11:44:29 2020 Russian Standard Time (UT+4h)  she@DPX200
##.OBSERVE FREQUENCY= 200.1315066352
##.OBSERVE NUCLEUS= ^1H
##.DELAY= (6, 6)
##.ACQUISITION MODE= SIMULTANEOUS
##.ACQUISITION SCHEME= undefined
##.AVERAGES= 8
##.DIGITISER RES= 18
##SPECTROMETER/DATA SYSTEM= spect
##.PULSE SEQUENCE= zg30
##.SOLVENT NAME= CDCl3
##.SHIFT REFERENCE= (INTERNAL, CDCl3, 0, 15.7039)
##AUDIT TRAIL= $$ (NUMBER, WHEN, WHO, WHERE, WHAT)
$$ ##TITLE= Audit trail, XWIN-NMR		Version 3.5
$$ ##JCAMPDX= 5.01
$$ ##ORIGIN= Bruker BioSpin GmbH
$$ ##OWNER= she
$$ F:/spectra/data/she/nmr/H-F/1/audita.txt
$$ ##AUDIT TRAIL=  $$ (NUMBER, WHEN, WHO, WHERE, WHAT)
(   1,<2020-09-01 11:43:05.89 +0400>,<she>,<DPX200>,
      <created by zg, POWCHK disabled, PULCHK disabled
       configuration hash MD5:
       00 E9 B6 7A A2 85 ED C7 34 08 36 98 17 FE 4E 26
       data hash MD5: 16K
       00 B4 61 88 14 1F 26 FD E7 97 53 04 B7 0A A8 7F>)
$$ ##END=
$$ 
$$ hash MD5
$$ CC 85 D8 CC 6F C8 72 99 01 C6 B7 C2 E7 C7 46 4B
##$RELAX= 
##$RELAX= 
##$RELAX= 
##$RELAX= 
##$RELAX= 
##$RELAX= 
$$ Bruker specific parameters
$$ --------------------------
##$DU= <F:/spectra>
##$EXPNO= 1
##$NAME= <H-F>
##$PROCNO= 1
##$TYPE= <nmr>
##$USER= <she>
##$AMP= (0..31)
100 100 100 100 100 100 100 100 100 100 100 100 100 100 100 100 100 100 
100 100 100 100 100 100 100 100 100 100 100 100 100 100 
##$AQSEQ= 0
##$AQ_mod= 1
##$AUNM= <au_zg>
##$AUTOPOS= <>
##$BF1= 200.13
##$BF2= 200.13
##$BF3= 200.13
##$BF4= 200.13
##$BF5= 200.13
##$BF6= 200.13
##$BF7= 200.13
##$BF8= 200.13
##$BYTORDA= 1
##$CFDGTYP= 0
##$CFRGTYP= 5
##$CHEMSTR= <none>
##$CNST= (0..31)
1 1 145 1 1 1 1 1 1 1 1 1 1 1 1 1 1 1 1 1 1 1 1 1 1 1 1 1 1 1 1 1 
##$CPDPRG= <>
##$CPDPRG1= <>
##$CPDPRG2= <>
##$CPDPRG3= <>
##$CPDPRG4= <mlev>
##$CPDPRG5= <mlev>
##$CPDPRG6= <mlev>
##$CPDPRG7= <mlev>
##$CPDPRG8= <mlev>
##$CPDPRGB= <>
##$CPDPRGT= <>
##$D= (0..31)
0 1.2 0 0 0 0 0 0 0 0.06 0 0.03 0 0 0 0 0.0002 0 0 0 0 0 0 0 0 0 0 0 0 
0 0 0 
##$DATE= 1598946185
##$DBL= (0..7)
120 120 120 120 120 120 120 120 
##$DBP= (0..7)
150 150 150 150 150 150 150 150 
##$DBP07= 0
##$DBPNAM0= <>
##$DBPNAM1= <>
##$DBPNAM2= <>
##$DBPNAM3= <>
##$DBPNAM4= <>
##$DBPNAM5= <>
##$DBPNAM6= <>
##$DBPNAM7= <>
##$DBPOAL= (0..7)
0.5 0.5 0.5 0.5 0.5 0.5 0.5 0.5 
##$DBPOFFS= (0..7)
0 0 0 0 0 0 0 0 
##$DE= 6
##$DECBNUC= <off>
##$DECIM= 32
##$DECNUC= <off>
##$DECSTAT= 4
##$DIGMOD= 1
##$DIGTYP= 9
##$DL= (0..7)
0 120 120 120 120 120 120 120 
##$DP= (0..7)
150 150 150 150 150 150 150 150 
##$DP07= 0
##$DPNAME0= <>
##$DPNAME1= <>
##$DPNAME2= <>
##$DPNAME3= <>
##$DPNAME4= <>
##$DPNAME5= <>
##$DPNAME6= <>
##$DPNAME7= <>
##$DPOAL= (0..7)
0.5 0.5 0.5 0.5 0.5 0.5 0.5 0.5 
##$DPOFFS= (0..7)
0 0 0 0 0 0 0 0 
##$DQDMODE= 0
##$DR= 18
##$DS= 0
##$DSLIST= <SSSSSSSSSSSSSSS>
$$ [...]
##$SUBNAM2= <"">
##$SUBNAM3= <"">
##$SUBNAM4= <"">
##$SUBNAM5= <"">
##$SUBNAM6= <"">
##$SUBNAM7= <"">
##$SUBNAM8= <"">
##$SUBNAM9= <"">
##$SW= 16.880792210976
##$SWIBOX= (0..15)
0 0 2 0 0 0 0 0 0 0 0 0 0 0 0 0 
##$SW_h= 3378.37837837838
##$TD= 16384
##$TD0= 1
##$TE= 0
##$TE2= 300
##$TE3= 300
##$TEG= 300
##$TL= (0..7)
0 120 120 120 120 120 120 120 
##$TP= (0..7)
150 150 150 150 150 150 150 150 
##$TP07= 0
##$TPNAME0= <>
##$TPNAME1= <>
##$TPNAME2= <>
##$TPNAME3= <>
##$TPNAME4= <>
##$TPNAME5= <>
##$TPNAME6= <>
##$TPNAME7= <>
##$TPOAL= (0..7)
0.5 0.5 0.5 0.5 0.5 0.5 0.5 0.5 
##$TPOFFS= (0..7)
0 0 0 0 0 0 0 0 
##$TUNHIN= 0
##$TUNHOUT= 0
##$TUNXOUT= 0
##$USERA1= <user>
##$USERA2= <user>
##$USERA3= <user>
##$USERA4= <user>
##$USERA5= <user>
##$V9= 5
##$VALIST= <valist>
##$VCLIST= <CCCCCCCCCCCCCCC>
##$VD= 0
##$VDLIST= <DDDDDDDDDDDDDDD>
##$VPLIST= <PPPPPPPPPPPPPPP>
##$VTLIST= <TTTTTTTTTTTTTTT>
##$WBST= 1024
##$WBSW= 4
##$XGAIN= (0..3)
0 0 0 0 
##$XL= 0
##$YL= 0
##$YMAX_a= 54766
##$YMIN_a= -33440
##$ZGOPTNS= <>
##$ZL1= 120
##$ZL2= 120
##$ZL3= 120
##$ZL4= 120
##$ABSF1= 10
##$ABSF2= 0
##$ABSG= 5
##$ABSL= 3
##$ALPHA= 0
##$AQORDER= 0
##$ASSFAC= 0
##$ASSFACI= 0
##$ASSFACX= 0
##$ASSWID= 0
##$AUNMP= <proc_1d>
##$AZFE= 0.1
##$AZFW= 0.1
##$BCFW= 1
##$BC_mod= 2
##$BYTORDP= 1
##$COROFFS= 0
##$CY= 11.3945322036743
##$DATMOD= 1
##$DC= 2
##$DFILT= <>
##$DTYPP= 0
##$F1P= 16.9975609425685
##$F2P= -3.02152046262296
##$FCOR= 0.5
##$FTSIZE= 0
##$FT_mod= 4
##$GAMMA= 1
##$GB= 0.15
##$INTBC= 1
##$INTSCL= 1
##$ISEN= 128
##$LB= 0.24
##$LEV0= 0
##$LPBIN= 0
##$MAXI= 10000
##$MC2= 0
##$MEAN= 0
##$ME_mod= 0
##$MI= 1.114404
##$NCOEF= 0
##$NC_proc= 0
##$NLEV= 6
##$NOISF1= 3.799351
##$NOISF2= 2.8
##$NSP= 1
##$NTH_PI= 0
##$NZP= 0
##$OFFSET= 15.70392
##$PC= 1
##$PHC0= -9978.116
##$PHC1= 15.60092
##$PH_mod= 1
##$PKNL= yes
##$PPARMOD= 0
##$PSCAL= 0
##$PSIGN= 0
##$REVERSE= no
##$SF= 200.130013532006
##$SI= 16384
##$SIGF1= 3
##$SIGF2= 2
##$SINO= 400
##$SIOLD= 16384
##$SREGLST= <1H.CDCl3>
##$SSB= 0
##$STSI= 0
##$STSR= 0
##$SW_p= 3612.71676300578
##$SYMM= 0
##$S_DEV= 0
##$TDeff= 0
##$TDoff= 0
##$TI= <>
##$TILT= no
##$TM1= 0
##$TM2= 0
##$TOPLEV= 0
##$USERP1= <user>
##$USERP2= <user>
##$USERP3= <user>
##$USERP4= <user>
##$USERP5= <user>
##$WDW= 1
##$XDIM= 8192
##$YMAX_p= 0
##$YMIN_p= 0
$$ End of Bruker specific parameters
$$ ---------------------------------
##NTUPLES= NMR FID
##VAR_NAME=  TIME,          FID/REAL,        FID/IMAG
##SYMBOL=    X,             R,               I
##VAR_TYPE=  INDEPENDENT,   DEPENDENT,       DEPENDENT
##VAR_FORM=  AFFN,          ASDF,            ASDF
##VAR_DIM=   8192,          8192,            8192
##UNITS=     SECONDS,       ARBITRARY UNITS, ARBITRARY UNITS
##FACTOR=    0.000296,      1,               1
##FIRST=     0,             0,               0
##LAST=      2.424536,      0,               0
##MIN=       0,             -33440,          0
##MAX=       2.424536,      54766,           0
$$ Real data points
##PAGE= N=1
##DATA TABLE= (X++(R..R)), XYDATA
0 0 0 0 0 0 0 0 0 0 0 0 0 0 0 0 0 0 0 0 0 -5 8 -8 8 -8 8 -12 16 -16 16 -23 24 -30 32 -38 41 -47 54 -60 68 -76
40 -76 84 -94 103 -115 130 -142 156 -173 192 -209 232 -256 282 -310 343 -378 418 -464 515 -577 646
61 646 -730 831 -958 1119 -1339 1648 -2137 3060 -12532 39683 -2530 -33016 -12619 -30205
75 -30205 7795 15769 -33440 -22204 13326 4916 4290 -19031 -8970 9114 7746 -3767 -6715
88 -6715 -2567 147 5294 -9491 -2212 1021 -1367 3943 -426 -2268 -641 3580 -4798 7052 -897
103 -897 -10083 1645 1441 -8284 -7087 -4665 -13681 8795 -5651 -20622 -356 -5718 -1666 -1581 -17633
118 -17633 -7018 11047 -12281 -8740 -9563 -14386 10128 -7953 -18221 -7617 -3483 -2658 -2785 -15940
132 -15940 -8260 9045 -5639 -3904 -7297 -6224 4605 2806 -12322 -7681 5294 -6152 636
145 636 -6625 -10838 2580 4960 -7628 -4773 2249 -5428 8397 -1388 -9564 3234 4267 -1688
159 -1688 -43 -3332 -5501 9780 -2166 -931 660 -2830 9992 2810 -1870 3013 2780 2525 12247
174 12247 -4547 -4252 8755 -2377 4557 -269 -7631 1174 8754 -4430 -5405 406 -2571 8840
188 8840 1108 -7597 -3240 7616 1185 -3274 -2965 -6789 6332 820 -7846 -8294 -848 2030 -150
203 -150 -6446 -8579 4038 -674 1362 -4804 -7348 4582 3245 -4115 -2696 -1434 -4797 9377 -3677
218 -3677 -8696 4151 -1294 1224 3157 -5228 -4535 10040 -362 -1778 1224 -3442 5401 3821 -1709
233 -1709 -3611 5428 3432 2455 -265 -2155 6394 4368 3619 -1652 1417 4422 6404 775 -1263 4266
249 4266 193 6549 531 -3900 2217 5076 -153 1596 531 -5777 8220 1766 -3834 1369 -248
264 -248 -238 4082 -2022 -7493 5092 -57 -777 -2151 -6484 117 2567 -1182 -6744 -1713 -1951 2595
280 2595 -3448 -6385 132 -711 1690 -3618 -5215 -2503 4705 -2183 -3603 -425 -4810 4166 1083
295 1083 -5187 -2716 3444 -1285 1096 626 -6768 5290 3831 -1119 -1043 1341 912 6347 2453 -4944
311 -4944 3605 2885 4828 416 -1651 1676 4797 3658 -768 208 580 8308 314 -1659 2112 1005
327 1005 4618 2376 -1825 -2053 6358 -912 -555 1528 -3348 1889 2072 -1760 -3473 2454 -2693 741
343 741 1914 -5413 -1247 224 -169 -2321 -1610 -5290 688 1253 -4479 -3063 -4004 2438 -153 -3603
359 -3603 -4241 29 1098 940 -3336 -7070 4905 852 -3314 -2515 -2825 635 4015 -3126 -7143 4216
375 4216 633 545 -628 -3107 1869 5111 588 -4042 3322 1781 3509 1154 -1385 1014 3643 3207
391 3207 -1146 2397 270 3433 1767 876 1847 -76 3796 1613 227 -329 2266 -1382 3592 2568
407 2568 -5422 2082 1639 360 1443 -608 -4037 4215 2941 -4254 462 -2880 1679 1948 -3228 -4579
423 -4579 965 2268 -1429 -2566 -4766 2115 1150 -434 -4662 -3026 3282 -204 -2080 -3438 272
438 272 688 1394 -3136 -4703 891 2598 -180 -4213 1144 -1866 2179 2680 -3898 799 3107 556
454 556 58 2319 -2645 3797 2986 -1213 3058 -293 1020 2941 3408 208 2650 1872 3196 3708 616
471 616 3942 779 4322 3697 -594 1317 4027 1019 -160 1556 -2370 2753 1320 -2161 -1967 1209
487 1209 2067 -3174 -83 -2130 956 2359 -2904 -4343 1742 470 -2164 481 -5360 1474 1622 -3673
503 -3673 -2144 -1391 -29 -384 -1176 -3466 407 -1453 687 -1633 -3423 2436 -1310 -863 367 -1134
519 -1134 -1746 3366 -1152 -1947 2773 -2921 1479 1725 -1554 -1566 1407 1135 218 212 -2545 797 2310 2985
537 2985 -3000 538 3370 772 3478 -1532 -564 3509 4252 897 -450 -537 2669 3413 -935 1393
553 1393 -2615 2877 3469 -3028 -146 52 440 2067 574 -5177 1542 560 -1490 202 -3881 -955
569 -955 695 -528 -4144 -1710 -1562 -60 -677 -3723 -1249 -1919 1430 -2197 -2789 -1028 -1287 29 -574
586 -574 -2787 -3064 1225 -1137 -367 -1894 -2025 826 -422 1605 -3140 -330 2831 409 47 636 -1763
603 -1763 1533 4428 -3428 933 1263 782 2545 -263 -1003 1764 3805 -42 868 361 2353 2161 325
620 325 1176 472 3750 1136 -240 400 3008 1310 1267 1603 -1393 3182 1520 83 -677 1386 449
637 449 -572 898 -2295 -951 397 106 -2663 112 -1892 -1781 2375 -2849 -1761 -1041 -871 -109 -6
654 -6 -2696 -1626 922 -1725 -856 -3130 268 -130 -742 -1203 -3153 -22 1410 -47 -3722 454 -174
671 -174 355 813 -2514 29 2124 2063 -1991 643 199 1587 2992 -957 -538 1276 3437 327 1321
688 1321 -58 329 3750 990 -251 354 2698 1026 1670 -390 252 2524 1707 1615 -1600 1943 1116
705 1116 917 962 -366 -327 1490 1536 -2103 958 -719 -120 1575 -525 -2429 -760 1236 -1685 23
722 23 -2310 -1607 1039 127 -2636 -3104 609 -860 465 -2594 -2417 -3 911 -1120 -3478 -163 -31
739 -31 887 -2072 -1683 -1167 1191 1123 -3206 -284 829 1075 -405 201 -1027 1282 2627 -1765 906
756 906 561 999 795 1804 -608 266 2455 39 1807 642 471 796 3063 1139 -578 1370 841
773 841 2781 411 153 -585 2366 2236 -1417 -631 651 2459 64 -328 -2047 976 2874 -1433 -1547
790 -1547 -227 975 -351 256 -3101 -629 1819 -1155 -1496 -1567 118 -898 921 -2141 -1976 53
806 53 -1114 -874 -2044 -565 -2350 -172 -1038 -1731 -1320 -1033 328 -957 238 -2129 17 1778 117
823 117 -996 -529 1006 269 1566 -2021 -674 1863 1391 -652 -790 1050 743 2973 -665 -661 2178
840 2178 2967 1099 32 1125 470 3488 230 -646 240 1697 1606 -901 229 -601 1589 820 -8
857 -8 -1623 995 1436 -861 392 -1714 -133 602 95 -2428 -825 230 -1275 471 -1884 -1305 -410
874 -410 591 -1329 -1276 2 -1701 512 -675 -2144 -2533 331 -671 -1265 -1095 -2709 485 392 -787
891 -787 -2401 -710 1304 633 -511 -1829 181 1049 1900 -2744 -1179 1484 476 930 -1266 -1130 1526
908 1526 3259 -1187 -487 1075 1382 2555 -486 -259 225 2854 386 -972 370 745 1278 803 620
925 620 -1450 2255 1026 529 745 -429 280 605 1310 -1291 -381 -432 155 -533 -1416 -1294 -1810 1333 -1658
944 -1658 -1962 -583 -677 -439 255 -1927 -2184 1748 -1466 -777 -1412 -1753 -189 -856 -1038 -2469 -420 -62
962 -62 -692 -1906 -442 -725 -173 956 -2892 -137 375 61 -232 -787 -804 171 1539 -971 -388 -135 2052
981 2052 461 452 383 -154 2665 661 -448 117 2322 -70 1132 15 -1174 3392 643 -449 -108
998 -108 1497 1491 1098 84 -236 1504 1047 1294 -2176 974 915 -688 1215 -1401 -1175 382 382 -1463 -382
1017 -382 -1583 -773 929 -844 -918 -2448 88 -309 -477 -1462 -2606 -408 886 -834 -3152 -252 -776
1034 -776 1071 -338 -3370 -458 1161 600 -1707 -1197 -989 1626 -10 -1550 -1007 37 2037 -1309
1050 -1309 -803 -248 217 1605 566 -1310 339 2616 -325 1307 -344 32 2127 920 757 -486
1066 -486 1236 692 1313 863 287 -62 1376 2151 -655 1074 -256 816 1811 102 -934 169 1394
1083 1394 -201 386 -1012 725 198 426 -854 -1472 1122 -505 -691 -861 -458 -655 902 -1454 -2161
1100 -2161 925 -1207 -457 -1140 -1472 -713 328 -741 -1661 -119 -863 62 -1163 -499 -1461 -223 863
1117 863 -1608 -167 -371 -129 286 588 -1455 -255 1177 -106 424 -437 540 257 1588 -116 -804
1134 -804 1303 1282 450 7 864 -41 2273 630 -990 1082 957 1306 39 185 -405 1901 1267 -474
1152 -474 -302 297 1589 -191 196 -964 251 1296 -234 -841 -379 493 -903 649 -1114 -690 -95
1169 -95 -161 -688 -1161 -94 -1383 284 -621 -1231 -1133 -696 -712 -972 -109 -2276 61 -8 -800 -1411 -814 -26
1189 -26 -474 295 -2015 -448 807 473 -1189 -997 495 -1 1090 -1501 -665 608 1400 -351 -803
1206 -803 1089 290 1978 9 -423 519 1983 390 -518 924 221 1378 225 -251 14 1626 382
1223 382 -72 775 -245 1016 474 715 -330 515 507 -341 636 -547 -435 -685 642 -662 -434 -531 -990
1242 -990 383 -650 -691 -1670 726 -649 -978 -560 -1268 77 -58 -545 -2188 -260 -83 -552 -713 -1625
1260 -1625 -303 -29 499 -1875 -564 -70 69 -268 -1351 -504 -95 1246 -1053 -433 237 484 747 -234
1278 -234 16 -98 2090 136 59 694 924 1086 542 509 -92 1824 740 195 351 852 573 560 874 -632
1298 -632 1023 569 327 269 228 353 -122 876 -490 273 -130 -102 -245 408 -341 -979 879 -471 -229 -768
1318 -768 -542 -343 599 -535 -2204 73 -164 -285 -1276 -1009 -1036 79 2 -2268 -391 141 18 -1198
1336 -1198 -846 -485 345 609 -1750 -495 2 543 -747 -663 -654 -300 761 -1011 -634 -238 1177 -365
1354 -365 355 348 -204 1380 347 311 216 1313 24 947 814 120 864 694 1174 -163 1096 323 381 1411
1374 1411 -121 31 323 895 -18 639 -525 -275 971 120 -269 -964 534 190 167 -966 -838 44
1392 44 621 -366 -2116 101 -877 153 -441 -1599 -868 325 -269 -1541 -482 -957 293 -333 -1051 -784
1410 -784 -175 679 -1037 -582 -375 -138 15 79 -919 -208 535 -1204 297 -201 -358 72 201 257 -127 302
1430 302 -152 720 405 878 -382 675 1241 -108 1023 123 404 1502 638 -558 994 1310 505 1111
1448 1111 -229 777 812 655 -180 117 1154 140 358 -24 432 -429 1038 -488 -598 1229 -500
1465 -500 -108 -62 9 -342 -104 -1010 -427 -147 -707 -389 -1322 270 -1025 -535 -56 -1222 -444 -156 -840 -478
1485 -478 379 -1496 79 241 -734 -55 -1014 21 -131 283 -751 -770 450 787 79 -923 413 -561
1503 -561 1171 8 -893 193 792 567 201 94 -412 1622 622 367 289 659 1374 92 896 -163
1521 -163 301 1080 428 -442 741 542 -247 1325 -645 98 482 330 96 -154 19 -280 663 -149 -378
1540 -378 -954 220 280 -413 26 -1562 108 481 -710 -1062 -351 -605 -216 112 -1722 -465 -304 185
1558 185 -965 -1012 -461 -455 401 -771 -783 -464 415 -748 -197 322 -500 738 -89 -404 -320 640 240 44
1578 44 234 141 860 398 437 -83 941 733 2 974 313 459 697 854 140 1037 353 267 1147 361 221
1599 221 -205 885 214 552 88 -109 844 415 -151 -770 439 -45 -145 -110 -829 201 350 -257 -1205
1618 -1205 226 -68 -159 -735 -891 -296 -401 134 -1456 -259 79 -213 -867 -690 -663 3 426 -1481 -396
1637 -396 -163 -270 -92 -324 -455 -300 589 -487 -145 -124 54 170 218 260 -780 806 469 251 288 486
1657 486 111 946 920 -237 728 565 632 759 589 409 563 1350 -150 364 394 917 349 758 -96 -90 939
1678 939 324 381 -138 565 -95 600 -49 -431 383 471 68 -604 -46 -325 241 78 -1170 -196 -79 288
1698 288 -924 -431 -607 -211 178 -815 -720 -111 468 -544 74 -567 -251 337 -443 -461 -159 458 -575 -81
1718 -81 -438 -404 373 -139 -350 -430 656 -456 448 535 -224 65 235 565 377 616 -88 595 874 388 268
1739 268 245 1151 647 903 -103 560 1082 915 183 -128 1016 459 649 -128 -100 673 929 -369 -422 627
1759 627 -91 571 -238 -622 -35 452 -180 -1090 127 -445 -293 -681 -424 -626 -110 0 -770 -188 -579 -333
1779 -333 -304 -58 -816 -311 -195 -772 346 -372 -363 -141 210 -378 -447 87 -120 337 -95 -274 -655 452 143
1800 143 -619 27 -171 730 391 -198 -480 600 870 -174 257 -183 690 759 648 -308 388 978 339 247
1820 247 -201 690 373 575 -366 54 916 286 -23 -211 398 -25 645 -628 -231 421 -123 -74 -514 45
1840 45 -609 264 -393 -830 -432 -125 -700 -493 235 -1113 -266 2 -458 -269 -506 -270 -606 265 -642 -732
1860 -732 -404 320 -119 -816 -79 -728 657 -67 -490 -18 733 340 -248 -222 -601 1043 89 -224 -327 639
1880 639 888 14 208 -261 668 840 439 -401 745 524 20 1087 -165 418 994 429 -95 439 215
1899 215 157 863 31 537 -180 594 152 -151 393 -618 270 391 -255 -612 321 -229 169 -68 -1070 -9
1919 -9 53 43 -583 -291 -264 -253 -175 -366 -450 -369 577 -749 -511 -174 -781 417 -223 -576 -172 603 -454 213
1941 213 -52 -51 216 -336 143 -329 807 -3 -117 248 116 22 226 374 -250 1072 432 154 677 -140
1961 -140 621 644 197 -77 378 663 631 342 160 473 -100 1427 -302 343 797 -12 428 513 -190 -217 701
1982 701 -69 231 41 -178 441 64 88 -609 263 -158 -183 -713 -35 -453 -8 327 -1358 -206 -229 -218 -155
2003 -155 -641 -430 -366 360 -495 -540 -470 271 -232 -222 -91 -960 500 -26 -379 -50 -307 -274 568 118 -501
2024 -501 283 -120 325 208 175 26 79 321 20 -242 -136 673 -89 632 5 116 877 -351 232 -66
2044 -66 383 54 438 -136 257 754 300 211 -473 525 -80 387 125 -356 145 597 22 -465 326 -793
2064 -793 268 -110 -728 -164 -256 -193 -733 -230 -585 -297 -151 -492 -331 -539 -49 -1018 11 -237 -808 -240
2084 -240 -300 -253 -587 4 -511 -3 -267 -384 -204 38 39 -277 229 -414 425 94 -198 -392 456 568 -167
2105 -167 379 102 483 757 218 -226 137 838 176 557 37 473 459 481 -57 -87 823 111 407 12 245
2126 245 112 421 -153 -253 694 -241 -97 18 188 -48 205 -263 -572 121 -212 -359 -372 120 -701 -322
2146 -322 -345 -742 3 -554 -426 -554 289 -287 -404 -498 -228 325 -499 -303 -497 552 -273 -556 179 -126
2166 -126 141 -172 -36 -601 521 215 -291 95 76 335 -5 242 -473 754 720 -10 61 237 645 -102
2186 -102 549 -183 497 692 232 181 136 467 66 714 124 526 382 299 58 60 326 -530 223 77 109 -6
2208 -6 1 -147 -36 404 -652 -44 -5 10 -301 -308 37 -394 310 -361 -520 -410 -192 -377 -495 -200 -656 373
2230 373 -564 -371 -387 213 -579 -475 -396 -597 327 -226 -154 -116 324 -13 -60 -72 -347 306 -46 46 -92 460
2252 460 194 24 352 28 268 270 255 -54 508 97 29 658 172 398 -103 538 -84 355 354 107 353 398
2274 398 367 235 447 -124 199 331 -349 74 254 199 -241 108 -119 -157 289 -219 -273 -186 350 -789 -134
2295 -134 -156 -415 -49 -192 -342 -183 331 -869 -26 -525 -298 -185 -360 -272 -534 29 -389 -218 -82 -143 -210
2316 -210 136 -24 -558 382 -166 0 382 5 75 242 317 103 243 172 350 136 194 455 180 627 -242
2337 -242 47 293 241 56 480 -26 -336 801 8 313 153 163 -59 402 115 -143 210 148 245 -92 -171
2358 -171 -303 32 634 -458 -40 -169 -62 -68 -130 -524 29 265 -286 -28 -690 141 -296 -120 -279 -461 -276
2379 -276 68 -287 -387 47 -835 362 -22 -710 -22 -199 180 -240 -80 -267 -9 289 12 32 125 377
2399 377 -231 402 12 13 698 300 112 166 419 93 657 -24 191 222 126 652 -37 629 191 473 293 67
2421 67 361 287 51 -83 584 -315 301 315 -60 436 35 -198 -55 2 -265 113 -78 19 -160 -128 209 -494
2443 -494 -120 -375 -365 -252 51 -175 -273 -159 -542 267 -470 -394 -243 -94 -24 -372 -207 -262 5 -107 35 -419
2465 -419 248 206 -443 171 -368 136 284 -257 -132 233 276 -14 193 -284 316 112 533 48 163 744 379
2486 379 160 319 241 -14 746 -71 411 556 -44 241 165 307 163 329 115 121 177 -145 55 -66 528 -406
2508 -406 -223 227 -200 131 -251 -571 -14 331 -481 -373 -46 -417 -37 -657 -607 -125 102 -222 -439 -270
2528 -270 56 64 -183 -84 -658 348 -110 -68 -218 -207 206 -7 -100 -660 123 19 -13 -237 -90 -74 -167 145 -130
2551 -130 157 42 77 6 483 225 6 576 -111 409 463 190 -59 253 453 -236 140 323 503 174 119
2572 119 -271 150 571 -291 239 226 378 50 137 -83 220 205 -516 -77 -216 238 -472 -410 -172 23 -237
2593 -237 -342 -320 -434 211 -552 -292 -42 -448 294 -91 -218 -460 -159 -352 -213 -275 -649 -207 -124 115 -312
2614 -312 163 -178 42 147 13 40 -6 135 100 213 -160 75 287 -128 -101 -97 309 214 347 167 83 352 357
2637 357 288 -168 529 250 293 27 45 204 373 307 -253 325 90 503 184 138 175 116 365 -175 -134 -138 148
2660 148 245 -93 -434 -273 300 -203 -196 -234 -272 -146 157 -230 -649 86 -240 -133 -422 -273 -341 -126 -125 -600 209
2683 209 -145 -95 34 -191 -10 22 279 -266 55 -151 -21 -431 298 -154 84 448 -114 314 393 155 113
2704 113 373 147 45 438 80 208 58 281 224 174 321 -80 289 215 316 221 215 -192 160 143 -359 303
2726 303 -26 146 -178 408 -86 -78 252 -154 131 -291 32 -156 -60 -50 -284 -31 -195 -181 -284 214 -644 97
2748 97 -274 -671 -360 -173 8 -86 49 -266 -173 -61 -301 -186 -303 63 -344 9 -122 -256 113 -149 39
2769 39 -172 142 87 69 -119 181 299 217 -30 -45 76 -108 469 -113 -21 142 171 169 216 348 234 518 385
2792 385 70 59 239 109 203 272 -337 315 98 224 13 118 147 -118 327 6 103 -173 91 -165 -89 -4
2814 -4 -349 359 -471 -185 -32 133 171 -403 -144 -425 -315 -266 -151 -472 -70 -334 -631 125 -211 -247 -14 -260
2836 -260 -457 245 121 1 13 -12 38 -222 307 -288 -35 436 -32 -83 137 255 61 325 -91 -149 486 120
2858 120 492 -1 278 70 570 68 504 175 -42 37 126 483 -209 253 99 111 348 291 -248 -19 480
2879 480 -436 -20 -35 -98 396 6 -83 -100 239 -190 -327 -78 74 -86 -70 -24 -332 -11 -442 -119 -69 -223
2901 -223 -57 -212 -236 -388 110 -442 -105 -246 -76 -104 -457 289 -25 -85 -9 48 -266 227 -42 -344 207 -112
2923 -112 182 -10 256 97 192 111 94 271 55 393 44 446 334 75 309 -241 425 87 220 -223 255
2944 255 -166 347 190 -58 299 114 43 -73 -71 216 414 192 -400 12 172 332 -427 -166 44 -85 165
2965 165 -157 -159 -19 4 -350 -104 -364 -45 65 -246 -181 -333 70 -111 -25 -132 -90 -28 61 14 -296 16 -205
2988 -205 -91 89 -414 35 -175 -77 -136 221 -124 -52 225 351 127 -254 500 -140 294 296 -320 137 357 -54
3010 -54 -245 176 129 389 -35 -81 7 19 286 -84 62 85 141 33 -75 -201 176 130 -87 74 -87 -24 -31 -176
3034 -176 84 -360 72 -326 -12 -67 -29 -166 113 -79 -308 82 -73 -29 -180 -157 -158 65 -25 -185 -321 -85
3056 -85 62 -269 133 -128 -111 -16 197 -262 -62 209 -166 143 -347 -221 125 -41 362 -221 -119 -141 384
3077 384 -32 -127 220 215 130 -95 191 46 374 453 -68 18 226 298 82 234 61 304 182 -222 79 182
3099 182 220 1 320 -169 141 106 80 163 -219 128 -125 108 -215 -161 -280 -121 -89 -37 -52 -419 132 -217 -120
3122 -120 -226 -348 -101 102 -93 -423 -109 34 -11 -255 -180 -115 -262 116 -174 -41 159 186 -10 -143 255
3143 255 -237 206 -2 179 106 174 53 -78 280 35 238 83 25 36 116 -69 63 302 79 388 251 233
3165 233 -75 80 -24 291 239 255 82 -5 180 -102 -10 88 -204 56 161 125 -114 244 -65 -30 -344 -136
3187 -136 125 -279 -61 -690 75 -358 -306 -168 -329 -3 -151 -207 -338 148 -239 -46 45 -424 1 -8 26 -235
3209 -235 -70 -34 -175 -108 -62 218 -219 448 -250 -10 -20 -49 8 61 166 -166 102 -164 66 -32 -29 242 211 312
3233 312 -118 168 200 101 236 92 -17 127 214 -341 60 -2 310 152 20 155 -49 375 56 38 216 22
3255 22 11 46 -130 -267 218 42 -68 58 -96 -255 -89 -280 -249 64 -343 -56 -180 -86 -127 -192 53 -118
3277 -118 -64 -314 -108 -106 -85 -173 -165 193 -161 102 -32 30 -181 74 42 25 259 -53 117 -123 204 196 205 -205 -173
3302 -173 21 -12 134 -48 212 -153 307 104 164 512 22 134 1 196 306 308 49 122 213 35 295 -97
3324 -97 309 -131 -213 150 21 165 -63 33 -227 -56 -320 -92 -80 -233 -132 -200 -121 -144 -75 -76 -48 -486 -83 -84
3348 -84 -339 -133 -455 -143 110 -12 48 -278 11 -69 -83 -258 -280 -46 12 -50 -196 279 -237 3 -172 -254 -56
3371 -56 406 -133 -234 141 -101 256 207 156 -68 -9 156 -66 355 174 197 180 267 -41 71 226 -31 270
3393 270 11 130 -31 239 40 90 144 -143 231 -16 26 -220 279 218 -94 136 -207 -71 9 -184 -269 -50
3415 -50 -124 -10 -40 -346 59 -333 -199 -1 -182 29 -215 -15 -81 172 -320 31 -408 -240 205 88 -71
3436 -71 -75 10 17 -159 -192 -248 247 215 35 -254 163 -139 227 120 -96 3 177 203 -126 270 -186 275 -103 -168
3460 -168 -28 -104 312 194 174 41 -31 346 236 152 -52 263 -364 242 -34 -38 -150 -202 -100 -348 115 -77
3482 -77 193 43 -22 -264 17 45 138 75 -383 111 -225 -98 -498 -302 -183 -146 10 -151 71 -120 -176 59
3504 59 -316 -50 -49 -122 -168 75 -52 156 -279 19 75 -180 66 -119 131 -71 251 -187 -84 -11 -135 145
3526 145 25 120 -60 247 35 55 128 -200 172 24 474 -108 -42 158 149 63 -137 54 -171 98 -38 84
3548 84 -80 -352 -121 -222 179 -62 1 -118 -17 -194 -121 164 -292 -110 -347 144 -187 -183 -153 -157 -130 -394 -98
3571 -98 -420 133 18 88 -51 -189 67 -287 239 -216 -118 -68 -68 -128 -35 -6 -143 116 -10 -40 -131 -214 81 68
3595 68 -16 -126 151 120 102 -24 25 104 19 317 5 -22 238 -131 176 308 31 57 203 -93 23 -83 104
3618 104 -21 227 146 -264 294 -127 -13 105 207 -57 19 318 -147 19 115 105 -8 -149 -80 237 63 -63
3640 -63 -140 12 135 -74 31 -237 -227 43 -52 -185 141 12 54 -225 -53 -141 -104 -249 -23 -219 170 -180
3662 -180 3 2 -111 -85 137 159 -148 -122 -51 249 184 102 6 201 130 -34 211 111 217 -65 113 -60 141
3685 141 -31 -148 37 196 322 15 15 -79 108 436 50 309 111 101 14 -81 -74 -100 23 28 -200 157 -130 -311
3709 -311 21 -34 22 -152 -234 -43 52 -164 26 3 122 -83 -117 -151 18 18 13 2 -5 228 -192 -75 -109 -31 -221
3734 -221 -24 -89 -127 6 -172 -36 -93 246 100 322 -72 86 104 162 69 -42 223 -208 -39 218 176 222 132
3757 132 83 131 403 83 190 32 -17 121 -139 122 58 -55 79 77 -159 -192 -87 -42 -30 -126 245 3 102 48
3781 48 -185 -22 -65 -371 -142 -139 -172 -127 141 -143 203 -51 67 -192 -61 5 -314 3 -165 -274 -230 -81 -293
3804 -293 -212 -125 264 -93 -228 143 -189 103 -65 82 -32 -91 -104 -35 98 -19 301 8 -142 -67 126 259
3826 259 204 357 139 165 -152 138 230 84 99 -26 112 220 360 109 117 -89 26 -160 -107 300 84 -138
3848 -138 6 38 364 -20 -157 -55 110 90 -37 -392 283 -112 -164 -150 -335 176 -120 -43 -111 -155 -301 -146
3870 -146 77 -312 -92 -36 -239 40 -139 -194 98 67 -138 98 -213 -46 -108 -393 -95 -317 -10 22 64 -95
3892 -95 -46 9 -203 100 -95 -5 -305 186 -224 64 88 -26 68 201 23 107 187 29 417 -225 181 38 180
3915 180 126 99 49 202 117 284 -222 0 -126 47 262 169 17 63 -15 237 100 -257 -115 -180 65 -113 37
3938 37 -183 -9 -66 -246 -59 -33 -56 -217 -120 -233 -23 -200 36 47 36 -1 -20 -326 -146 -29 -143 13 85
3961 85 278 102 -120 -21 62 -48 -112 -138 123 -284 -27 86 -94 -8 -39 93 -66 130 50 310 86 241 222
3984 222 -141 214 114 -76 154 271 -157 -157 33 -129 189 201 366 139 52 -50 -40 87 70 -130 -127 -55 -107
4007 -107 -59 -266 52 109 -39 55 -152 -120 -110 327 -241 -200 -119 -273 15 -183 30 -57 -25 -217 -338 71 284
4030 284 174 -334 119 -213 32 95 -93 -130 -266 4 57 -3 -149 265 -190 203 -15 -36 65 -284 161 109
4052 109 98 -18 272 201 -26 183 -49 343 -93 -124 104 283 197 3 27 -181 53 -71 74 87 -122 205
4074 205 -63 -120 -201 21 93 104 -137 -54 -126 -67 -4 -202 -238 -110 43 -332 -75 18 84 -49 -168 -192 -179 84
4098 84 -210 -134 1 -151 -192 53 -22 -205 -142 36 -33 41 69 -4 71 -38 -29 108 -20 123 -142 -172 176 168 95
4123 95 -193 195 -147 -126 149 -169 125 25 352 96 403 82 351 126 14 29 -133 175 136 174 -205 70
4145 70 -125 -136 36 -142 96 117 141 -99 31 -94 84 129 -144 -63 -18 178 139 -197 -306 -51 -46 -68 -40 -13
4169 -13 -105 159 -45 -116 -243 194 -55 -33 -60 120 179 32 -4 -1 -60 -48 50 -111 -68 -45 97 184 -25 -365 134
4194 134 186 -188 -13 -57 -13 93 -80 -137 16 51 -294 50 -22 67 135 3 -60 -87 486 247 60 -27 -3 -64
4218 -64 133 -224 -174 148 -92 -197 16 215 -49 -66 76 -122 118 76 66 -30 -151 -118 -316 13 -43 47 10
4241 10 6 -93 17 23 -179 189 -215 78 -53 -208 -47 -44 22 -209 -304 -294 -125 -180 -1 -77 83 14 -172 -4 6
4266 6 33 198 -140 71 10 47 -294 156 46 54 -31 -83 30 -116 -27 110 238 -256 50 -185 -42 124 -33
4289 -33 -3 105 147 59 136 72 213 225 48 248 -65 -61 -77 110 237 -113 174 259 -1 -419 50 -147 10 -215
4313 -215 -152 -114 -52 40 -99 -18 13 -30 47 -199 165 -5 -104 9 -35 -124 55 186 -186 -136 126 63 38 43 -230
4338 -230 -21 119 -17 -44 -70 232 22 426 234 164 -40 259 -73 -218 231 -38 235 149 50 135 -289 16
4360 16 71 244 69 -65 30 10 -73 -63 18 -47 153 -328 208 6 -36 169 145 -111 -213 117 -153 -203 250 216
4384 216 -120 -125 -27 176 163 -223 -74 -16 139 -56 -112 -129 -116 169 -113 -212 -300 110 -38 -263 18 75 -113 -15
4408 -15 30 -146 -147 175 -140 2 -1 101 -170 8 -234 -143 147 -3 -53 41 -111 -50 61 216 -33 131 162 248
4432 248 76 92 10 74 -101 -259 217 269 136 155 89 -5 -58 210 170 129 198 82 -106 -198 -50 -49 -214 107 98
4457 98 -75 45 -41 84 -46 -182 5 59 4 -230 -50 54 126 164 -197 189 -212 -188 185 226 -384 58 -27
4480 -27 -144 15 -50 92 101 177 -215 -46 -21 214 312 -116 -50 121 -11 -284 -23 233 288 -145 34 23 -56 297
4504 297 -277 282 91 114 -136 -13 121 -48 -109 -237 71 -148 62 282 146 144 -268 -23 -49 250 -92 180
4526 180 178 23 154 -117 -207 -103 -150 75 -59 78 -260 180 -76 139 -27 -302 -44 -132 -118 -7 52 -126
4548 -126 -29 -346 -166 -266 26 181 -125 -111 -14 -118 -267 -104 60 45 62 -85 234 166 306 -78 -187 118
4570 118 -66 132 -232 -83 -47 172 59 213 201 220 115 63 151 331 488 169 -16 91 162 281 72 -35
4592 -35 82 3 72 99 128 -36 -102 118 -57 53 -27 186 19 120 24 -2 -121 -69 -107 -144 -281 -47 -14 66 153
4617 153 -262 49 39 -10 -83 87 -129 -122 -8 42 -68 52 80 21 -135 -235 83 34 73 -97 26 103 74 -9
4641 -9 132 30 152 9 -21 -224 162 -14 28 -11 -271 137 94 76 211 8 46 -72 -78 -268 179 36 136
4664 136 -34 157 245 144 76 70 22 -83 169 146 141 120 -108 -150 -3 236 -29 -30 -67 -151 -119 110 -140 120 -277
4689 -277 -154 -117 14 94 5 -43 1 -36 73 -313 -30 -71 6 130 112 141 9 -89 -56 37 -209 -51 23 200 -41
4714 -41 91 16 230 43 -10 -17 159 88 130 -41 -239 -131 -207 3 178 42 291 195 12 82 -167 165 186 167
4738 167 -75 236 -177 120 44 -229 123 52 85 -58 -40 -196 -60 -60 -121 4 -107 -187 20 -177 -128 60 65 225
4762 225 27 -89 -54 -262 68 351 -27 -405 -61 -250 -65 -22 -199 -46 -45 -260 -117 -97 47 -72 -106 22
4784 22 -73 -55 -135 -188 -134 94 -2 -280 -160 191 2 -35 -30 -361 -12 -101 169 -53 -19 92 35 106 -137 -27 50
4809 50 -9 -50 -296 -33 249 196 -145 0 248 -22 108 -108 51 -99 169 167 -7 -39 -6 -79 44 140 -189
4832 -189 -19 -55 186 52 -19 -172 55 105 -148 102 -336 -63 -79 -175 -109 120 -49 -28 -225 -232 -113 -92 -86 -111
4856 -111 -221 -196 21 278 -87 28 156 193 1 -324 192 77 28 -106 155 -24 49 275 103 384 45
4877 45 224 -18 84 180 166 93 -22 -122 123 -46 -45 136 -24 -14 80 -371 10 111 -169 109 176 -74 127
4900 127 -147 42 5 -168 65 -291 -187 -41 59 52 482 244 -20 -12 -99 -54 -57 -182 188 113 -320 -48 226
4923 226 -201 -126 137 178 10 95 -3 -18 64 70 -26 -161 -154 359 -222 1 -105 218 -86 114 78 28 -54 -63 91
4948 91 -35 101 -37 193 191 99 82 16 150 -176 226 23 -39 52 88 -61 -72 31 -213 -134 -29 -139 91 43
4972 43 349 48 -114 71 12 -122 63 25 -59 -117 73 62 -55 10 -121 -39 -25 -282 -35 -28 -70 -114 -56 -22 254
4997 254 225 10 115 -59 -21 -42 28 34 98 23 -34 66 -70 61 101 -188 47 -66 18 -20 -109 38 49 -235 308
5022 308 5 73 64 79 73 -22 123 -104 170 142 -4 105 -121 -4 7 2 89 19 215 15 -200 -13 67 15 110
5047 110 111 44 -101 -9 18 75 -154 60 98 105 141 23 97 -12 -117 90 129 -248 253 -132 277 -23 46 69 132
5072 132 -212 -225 166 130 -315 -133 85 -91 18 -137 -10 -83 -147 138 195 -72 -168 332 50 47 144 -46 -41 -41
5096 -41 -32 -87 134 -62 -101 145 167 41 124 -50 -128 214 4 227 243 -69 29 70 142 50 142 52 -21 -120 -99 77
5122 77 -150 -17 196 -61 -237 75 -72 127 102 -59 -5 -168 46 24 82 -30 -148 -34 -196 44 -115 -73
5144 -73 216 67 -224 52 -177 -82 99 -270 53 -156 -187 -98 -58 -170 87 36 -179 123 -111 -159 62 -119
5166 -119 111 -231 -79 -59 153 133 -28 168 58 34 164 134 -107 9 -150 98 52 58 -69 72 188 132 35
5189 35 60 136 -77 26 466 -216 -2 50 151 38 -171 72 89 174 -211 -41 152 5 -23 -34 -140 -94 -114
5212 -114 -17 -329 -123 78 16 18 -164 -221 -212 -83 199 -166 105 -24 124 176 -108 85 -80 -22 -111 -137 44 131
5236 131 -291 18 -146 67 73 9 -28 172 -120 1 37 23 -201 -63 -22 203 278 -69 191 -179 -124 -19 71
5259 71 322 31 -66 3 114 120 -179 -59 60 191 138 71 37 68 -139 -172 -12 100 -97 171 -217 -51 -20 126
5283 126 -253 118 144 -37 5 -31 -85 1 62 12 -78 -92 -129 -118 -66 74 -67 -46 -138 96 119 224 89 70 -110
5308 -110 150 -145 11 137 -91 -192 -44 -25 -126 18 -101 13 39 288 61 115 -91 -166 111 -105 -197 -91
5330 -91 420 28 116 42 -341 -92 35 111 -11 -43 136 -69 -16 -18 48 244 121 -156 -219 8 0 76 -150 -58 -90
5355 -90 -36 -49 90 119 -28 157 -103 -201 129 -297 -94 -26 30 89 240 -134 -116 197 -11 235 26 -15 76 24
5379 24 -100 16 -59 228 -60 41 11 92 114 -210 -107 187 -244 175 234 -47 188 -246 -130 72 -202 68
5401 68 -11 184 145 -126 -128 -201 -110 -120 244 95 212 143 -177 79 -25 -11 132 178 -238 21 56 16 -4 56 -13
5426 -13 -16 263 -42 -189 -60 185 119 -73 30 -114 12 22 -97 -101 -104 60 -14 -162 2 54 -159 113 133 -89
5450 -89 -152 -127 122 -98 160 -9 3 -92 -82 -60 -181 -145 152 -173 -8 -30 -74 -162 16 129 140 150 250 -31
5474 -31 -23 29 17 -273 -158 -28 -118 -167 -32 192 224 130 -163 -15 40 98 120 -4 107 306 60 -211 50 -32
5498 -32 52 127 155 -113 -214 -78 41 -158 8 -127 -121 46 156 201 -172 -178 -227 0 92 85 -234 -81 115 107 52
5523 52 -38 6 140 -106 -52 -46 222 206 -22 54 -58 -72 -217 145 103 -21 120 72 321 -254 -90 71 -188 87
5547 87 -89 159 -76 -164 146 18 96 15 -116 -122 71 213 -104 140 -146 -77 94 -49 80 -109 85 36 28
5570 28 133 -107 9 -171 -22 39 23 -2 -110 -146 -38 20 285 35 -89 -1 -132 76 35 166 -77 -43 92
5593 92 -105 210 -137 -101 -116 1 55 -38 -24 166 -27 -184 -63 316 -66 128 -3 34 5 -51 32 -45 -102 69
5617 69 -52 -156 -83 -108 36 18 53 3 50 -145 155 -240 -74 -100 -56 139 151 -148 -165 34 293 195 14 -18
5641 -18 9 -72 82 93 219 -333 -117 -196 126 111 -56 12 -9 -83 175 -196 12 -5 224 -215 117 -167 -163 -34
5665 -34 -45 23 -4 114 23 42 -32 -293 39 76 70 66 -143 -122 -94 -80 61 120 59 -126 -50 -99 179 231 -224 83 -42
5692 -42 54 168 86 36 -64 65 -161 150 -66 -29 7 74 -7 -185 -45 -48 103 134 57 25 51 -341 -54 -178 -81
5717 -81 2 -151 20 -82 -326 -297 -54 70 -31 94 -96 -108 -17 69 -24 3 82 52 85 -35 -115 11 -34 -77 42
5742 42 -121 135 -27 -38 -88 113 -136 -108 -105 -43 -320 -1 -90 56 7 -187 52 -18 -2 -51 -179 196 144 -146
5766 -146 -11 111 197 -156 39 28 131 -206 80 89 139 56 -71 -70 -153 39 68 240 -13 80 -179 105 26 121
5790 121 22 4 -188 -246 -152 -228 -73 105 339 112 -19 126 -82 105 -31 225 -103 -187 8 17 289 -104 -72
5813 -72 -39 -50 -88 16 45 78 -110 60 69 -85 -26 -53 14 -40 -23 138 -22 -14 48 87 177 -104 112 92 191 131 203
5840 203 -135 53 295 -38 35 -78 -164 2 -171 8 -183 28 100 -23 42 75 -42 -137 -52 169 -187 29
5862 29 86 89 -48 -81 76 -40 1 -152 -32 144 59 -192 -52 -12 -155 15 158 -130 10 -160 -48 -54 -261
5885 -261 -65 -4 41 -52 -175 55 -227 16 228 11 8 -283 88 66 -110 88 -13 -102 -31 -88 83 -113 249
5908 249 -45 48 -117 60 -44 152 47 -138 -95 -76 205 113 -107 30 -43 81 -144 47 48 105 26 -316 -65
5931 -65 -190 -7 316 193 -100 102 114 13 54 60 80 119 244 21 -10 176 68 -75 -188 -241 -170 55 -47
5954 -47 -19 -11 89 20 -6 -131 -167 109 59 -152 -38 -279 -137 -175 37 -24 238 52 35 -20 123 -20 -20 47 -215
5979 -215 63 41 -258 122 45 22 213 -188 -188 99 -30 144 -68 73 362 -52 24 -132 -79 -70 199 33 -25
6002 -25 -209 196 275 -6 105 117 -91 49 59 122 -219 233 -15 -61 99 103 -11 -17 41 34 -9 21 134 -5 14
6027 14 62 -262 -142 134 -130 121 -77 129 94 -7 204 -41 -89 79 -76 -101 -41 -254 52 185 231 53
6049 53 -154 -232 -23 -113 -176 24 -53 37 73 126 -4 -96 411 -22 206 32 125 -98 -103 39 -142 -6 -117 60
6073 60 12 -107 -73 -47 -71 92 33 -120 61 -27 91 204 -18 25 -38 -4 49 81 -81 -3 34 -165 216 8 87
6098 87 -33 20 -37 -87 66 -60 -52 38 103 -249 -91 -28 23 83 89 -185 -112 90 -176 -17 128 -29 41 147 -113
6123 -113 -56 85 103 298 -182 -27 -39 -13 50 -130 111 176 44 -78 -14 -69 199 146 296 -125 -116 -61 127 42
6147 42 6 -34 -90 -18 -42 -195 128 143 11 182 -46 -14 -209 18 174 -129 144 -209 -71 -184 124 37 -152
6170 -152 -239 121 -43 145 132 -149 266 -59 -105 -14 59 -171 22 -199 -24 37 92 85 -115 236 79 125 30 -181
6194 -181 8 79 -164 40 44 -144 -17 3 26 43 -101 64 -225 -99 86 83 227 -185 -49 -235 74 -7 49
6217 49 -211 -190 150 -110 24 -91 -81 168 65 -81 22 198 169 65 113 321 -36 64 168 40 152 -179
6239 -179 218 -31 -130 295 139 -141 65 212 105 -50 13 203 7 75 -153 -71 35 -130 67 82 -70 -114
6261 -114 -189 114 84 37 113 124 146 131 -33 60 24 152 31 -218 -51 -203 293 -180 -48 -87 95 -35 -270
6284 -270 73 -68 40 -112 20 136 134 -88 -100 12 221 176 62 44 -9 16 26 89 -57 -83 -194 92 -124
6307 -124 -143 -2 243 19 175 -219 -78 -97 -74 124 -140 183 100 -170 14 -15 -295 65 -287 -62 32 102
6329 102 -96 31 -115 -38 -95 26 -83 -146 -150 -95 -145 43 -194 -97 -159 23 80 -125 -108 -28 -20 77 -31 47 -72
6354 -72 6 134 133 299 48 -129 208 46 106 48 -94 231 -57 38 76 34 -88 100 -108 109 5 -177 118
6377 118 25 51 170 -59 51 -144 -325 -321 -4 70 -68 38 23 166 61 -106 95 -48 151 -58 -71 -51 30
6400 30 -177 229 -148 144 151 43 57 124 110 67 179 -96 5 -71 57 17 -109 28 46 -111 -71 21 -190 -8
6424 -8 62 -86 100 -40 -319 86 -23 110 84 141 -139 75 45 -150 74 98 -26 163 -274 115 -221 -213 42
6447 42 77 182 41 48 -65 6 162 188 127 40 -80 6 86 -127 -242 -24 8 -65 85 50 -158 14 -22 -107 51
6472 51 -81 158 -195 -58 76 -22 -68 196 -165 -20 207 11 -61 -20 83 -192 -59 105 55 43 -19 2 62
6495 62 -40 -17 -74 -26 -120 -94 -66 -17 -31 109 -116 184 -217 101 0 -49 -220 21 192 -99 252 -124 -65 -245
6519 -245 1 66 133 108 52 99 -82 -69 -184 61 97 -117 9 30 80 -165 43 -106 0 73 -234 70 -68
6542 -68 21 3 -286 -60 89 245 138 60 -7 25 43 109 -119 186 -232 -9 13 75 235 89 65 23 143 -39
6566 -39 -199 63 185 204 44 -315 -123 -29 95 43 204 -332 -52 -14 -104 208 -23 191 -172 40 -21 61 77
6589 77 57 56 33 174 -108 -25 3 -58 26 4 198 -13 213 104 -104 141 -102 81 -32 52 76 17 -20 37 45 105
6615 105 -175 98 122 -225 115 -191 -183 -20 127 87 -107 141 0 92 80 49 42 -71 -159 110 -212 -77 -80 33
6639 33 -106 -131 -34 24 182 29 -201 -65 27 64 -189 -59 -30 33 -124 80 184 62 25 57 294 -50 209
6662 209 46 12 -56 -156 -184 -107 -7 135 122 5 -250 303 66 118 103 80 62 -250 -30 235 -15 201 83
6685 83 -201 -63 32 78 151 -86 23 -197 -129 16 24 109 -103 52 -9 -39 -257 34 168 88 103 -36 18 -194
6709 -194 -117 54 -177 -92 175 96 116 -112 6 37 130 50 -31 79 53 10 54 21 -211 70 20 -81 -75 131 -81
6734 -81 95 -35 6 -253 -92 -145 236 159 -91 -87 -21 -119 68 -66 35 179 223 -182 -89 -52 204 42 60 -38
6758 -38 154 106 92 282 9 114 121 44 -72 -278 110 46 -74 -18 5 22 -101 -41 -77 178 -7 170 260 -206
6782 -206 38 -25 -74 60 -123 174 -20 -249 -122 455 136 -24 132 83 111 -13 134 -41 -154 -205 -136 -43
6804 -43 197 -81 -10 -32 15 508 -345 -333 -256 -40 32 -272 -147 0 70 -5 -220 -78 -2 -72 -86 -41 -183 15
6828 15 297 103 -56 -95 285 -16 112 1 -8 40 -114 98 15 -94 256 218 -84 279 83 23 138 241 16
6851 16 -111 -48 -139 57 96 11 170 -23 -219 167 -81 -175 69 -115 82 134 6 135 -120 -41 -121 -23 -16 43
6875 43 -21 -20 -93 -116 163 -142 -22 -45 -52 79 194 56 -97 105 -7 -117 57 111 203 15 -45 -149 -20 69
6899 69 32 39 -166 -113 284 -4 -40 94 -239 195 -50 173 -133 203 -103 -116 195 92 -40 0 7 136 -274
6922 -274 -178 -65 47 132 158 -180 -144 -58 -76 -26 -51 -52 -116 -71 -38 95 191 28 -81 70 75 30 -107 -109 -167 -31 174
6949 174 104 -14 2 -1 43 -178 -4 72 87 36 -127 -78 52 -71 76 -40 5 -172 -72 82 110 55 -61 -35
6973 -35 93 -11 -151 72 -86 115 -112 -7 -78 -43 -119 151 55 -100 -212 -114 -195 -151 272 57 -94 -86 151
6996 151 -109 73 -60 1 -64 -5 -56 -27 133 25 29 40 153 -107 228 135 56 -109 -150 292 79 -91 -132 -315
7020 -315 -92 -37 33 -83 51 -42 -68 -144 -3 65 69 -54 -16 100 86 62 61 23 15 173 -4 200 -39 85 -44
7045 -44 -163 28 -26 -139 -10 156 -160 -292 -85 64 211 -119 63 43 41 118 -24 -6 -356 -31 9 64 -103
7068 -103 -128 -9 57 63 9 -140 122 -132 -63 -132 -139 70 -22 90 145 -71 -99 162 80 130 -160 -70 47 -56 77
7093 77 -198 161 -147 115 91 -148 133 116 47 -120 26 8 -146 62 -111 -183 -66 71 -189 -33 14 -183
7115 -183 246 47 -322 296 3 -192 65 91 67 -114 -1 121 129 158 -112 -62 184 -24 3 -32 84 30 -7
7138 -7 101 -131 -154 -50 -6 41 -53 38 62 -121 16 -69 -138 62 -161 -223 -57 146 293 -130 -145 89 -17 233
7162 233 -103 188 -27 -139 200 -28 77 -27 -26 -20 237 413 -114 -260 -312 128 -63 29 149 47 -153 -245
7184 -245 -63 121 193 -236 10 -185 85 19 -341 65 76 70 112 -55 36 -49 17 64 -9 215 -216 44 -124 4
7208 4 -109 -349 -18 341 85 -9 84 -71 -220 -195 -68 52 189 159 217 48 -241 66 53 -29 201 -170 -55
7231 -55 -132 -183 138 95 204 -27 -205 -64 -47 70 -42 211 -13 -132 13 -61 85 33 104 -49 -142 -73 -32 -108
7255 -108 36 77 -69 63 -448 -35 -115 188 38 104 177 238 152 54 20 -94 -149 27 163 125 117 -56 88 50
7279 50 -101 16 -119 -200 -84 -42 3 68 -102 -151 -77 30 375 -180 156 57 43 102 5 -48 -116 -74 -18 28 114 109
7305 109 -185 30 -26 74 -52 -30 -155 52 27 -225 -55 76 114 -285 143 153 -29 -27 -161 134 108 62 12
7328 12 -37 162 -135 -199 -32 -49 -103 71 38 169 -128 12 75 30 284 100 -160 124 -164 33 131 261 -54
7351 -54 -128 -37 -99 47 158 276 11 172 -142 -116 10 0 52 -108 85 187 -81 196 23 52 -68 -102 52
7374 52 39 -234 119 -7 -129 34 -139 14 -23 15 -113 87 -182 202 135 159 18 -214 74 -35 108 2
7396 2 -17 116 71 7 -285 -36 176 99 27 206 -76 -102 -146 -24 -4 48 -33 -187 228 -90 22 247 133 61
7420 61 16 -15 135 102 7 144 43 -123 13 119 -15 16 74 35 -282 132 13 -59 -17 -39 21 64 35 -110 -100
7445 -100 42 26 172 -80 -106 92 -85 -96 -144 -256 115 -50 -62 23 100 97 0 25 -146 -132 -50 28 -4 33 255
7470 255 -97 125 58 -108 127 189 15 -74 293 3 208 -18 182 59 -188 -77 -172 179 -175 -150 -93 28
7492 28 -83 205 113 -8 -37 101 -7 130 46 -199 -144 69 24 149 207 -18 -76 -503 11 -49 81 172 -121
7515 -121 -78 -151 73 315 33 -140 -198 -58 -64 72 -28 -231 158 -28 -17 -151 -80 139 44 -151 137 86 -110
7538 -110 20 -16 -15 142 -210 147 -14 -71 119 10 134 -91 378 148 17 169 -64 -143 -240 21 -63 -148 -25
7561 -25 27 -93 5 452 -325 52 66 34 155 -221 -8 231 -25 -39 -208 202 220 -1 -206 -58 -22 4 23
7584 23 126 154 15 -92 37 108 -64 98 15 -231 80 27 -103 71 90 -96 114 -27 -35 -41 -207 -151 125 168
7608 168 80 125 106 -4 -76 25 260 -55 67 -74 -164 29 -52 52 -66 88 -51 223 10 104 28 147 53
7631 53 -87 -356 -144 27 76 -91 -64 102 -188 162 -76 -251 65 61 -63 74 -37 -51 -232 141 103 -128
7653 -128 -168 -190 -93 186 -17 89 -228 30 -114 -104 189 -3 100 -185 -67 107 175 6 -88 37 29 -259 46
7676 46 8 -41 -46 -204 -33 171 198 38 21 85 40 -118 22 128 -113 -63 160 199 34 -148 82 31 75 -175
7700 -175 -91 -15 -230 32 -92 -127 -97 -40 -106 -164 208 -9 -125 117 -162 10 -68 188 -154 -74 99 -77 62
7723 62 -149 -135 -142 3 -115 221 78 183 165 -119 -98 -49 366 -133 23 93 3 5 -115 -6 -49 -59 243 -163
7747 -163 201 -107 100 48 108 -28 -3 -159 153 -37 49 238 -133 143 -19 71 -53 -186 -13 -27 -200 84
7769 84 72 96 74 -58 117 -105 -114 -122 -73 209 -6 180 40 -55 -65 197 -101 72 -121 -53 86 -92 78 0
7793 0 226 238 -199 57 94 -183 -134 16 81 86 132 5 -168 -124 -86 -148 -88 -187 128 14 -112 75 76 279 -118
7818 -118 17 -2 104 -95 138 201 63 -72 103 -162 -141 -56 68 -167 54 -20 -136 129 134 4 -42 8 125
7841 125 8 36 163 -40 43 25 9 -196 -171 -8 -251 135 0 70 -144 42 -132 -130 -31 -24 -89 203 21 -78
7865 -78 106 -275 -6 60 96 15 163 76 -153 191 256 -131 332 -195 -34 28 -205 63 -42 59 -17 6 175
7888 175 42 109 28 -95 -63 52 128 -84 -114 -101 -139 123 -15 21 246 192 63 -133 8 43 -17 -1 135 -45
7912 -45 -12 -149 155 -107 -85 -182 -21 -175 141 10 120 6 -74 -101 1 -113 102 127 -40 14 5 -7 89 27
7936 27 -102 -93 116 258 43 73 -27 130 -41 23 6 85 -143 -7 -7 -33 69 -9 115 -101 -61 -24 -58 20 -382
7961 -382 -18 187 136 124 -342 -99 -26 42 -65 -85 -166 -178 392 90 150 254 -224 0 -4 154 -117 -18 -10 185
7985 185 -22 53 -79 113 -89 91 38 -32 147 51 -17 -165 -84 -44 -108 -256 -117 -71 -26 -77 109 -265 36 22
8009 22 -27 245 72 121 81 -131 -98 -76 -140 -51 63 -29 221 118 -187 34 -183 -100 186 -51 102 -282 9
8032 9 79 88 175 -21 77 -106 51 34 -70 124 36 -167 39 -117 -26 -195 10 -22 -46 -211 -54 -50 -118 -89 200
8057 200 -57 -186 -119 66 112 183 116 -46 120 -47 -89 -75 220 -48 -137 -61 84 83 30 -119 -23 -41 -96 216 -205
8082 -205 -103 -43 -189 -41 -36 100 2 129 -166 37 33 -12 -75 -85 -157 -21 -117 -10 -57 -183 -8 -74 57 27 201
8107 201 -73 60 59 253 87 -161 178 216 100 44 -57 -93 305 137 -90 141 -75 -14 -268 106 26 83 39
8130 39 145 -105 75 157 6 -226 -136 -26 126 169 -129 -200 54 -92 -80 104 -163 100 -37 80 -111 212
8152 212 -115 -35 89 -36 -53 -177 -168 -2 -62 -24 -15 -16 87 142 -25 141 -42 85 -45 -71 205 134 255 -137
8176 -137 21 43 -22 84 28 169 49 205 110 27 42 128 103 12 6
8191F
$$ Imaginary data points
##PAGE= N=2
##DATA TABLE= (X++(I..I)), XYDATA
0 0 0 0 0 0 0 0 0 0 0 0 0 0 0 0 0 8 -8 8 -8 8 -16 16 -16 24 -24 31 -32 40 -45 49 -57 65 -74 85 -97 107 -121
37 -121 136 -152 169 -189 209 -230 255 -283 313 -345 381 -418 461 -508 560 -618 680 -752 834
56 834 -926 1032 -1153 1298 -1472 1687 -1957 2311 -2792 3493 -4614 6679 -11782 54766 52672
71 52672 -26235 23734 10941 27617 35855 -8630 -12950 36937 17445 5642 -4863 732 25082
84 25082 17834 4715 2460 11139 11965 12941 3157 1184 12644 2501 6145 1369 -623 639 5781
99 5781 -40 3882 6556 -7320 5649 8004 -1671 -3237 4707 -3493 5455 4817 -20803 2418 4117
114 4117 -4371 465 -10348 -4990 15219 -2996 -11433 5344 -4866 13251 4287 -15768 1630
127 1630 5964 1812 -1300 -7268 -5447 13735 -302 -6513 1627 4 10888 8512 -2609 -1287
141 -1287 16338 5773 3014 6125 -2825 10287 11190 -1021 -3140 9641 1617 6135 6476 -7281
155 -7281 7617 9998 1006 328 2988 -1956 8768 3155 -6707 3400 -3478 4799 1523 -7750 -689
170 -689 2181 -641 5134 -2078 -10170 9759 205 -1562 1961 -7509 384 6532 -4246 -10967 1493
185 1493 -2818 1819 -688 -11831 -4523 5183 1691 -8277 -1717 -3670 4394 3394 -8864 -4929 1603
200 1603 4638 -2175 -4669 -7077 4646 2553 -2752 -1234 -5860 6331 5955 -2935 -2508 4067 -301
215 -301 7424 3655 -8888 7599 4736 537 4170 -1100 -2167 10849 5343 -4998 5133 662
229 662 5634 6032 -933 -1322 5468 5902 -870 659 -2942 4928 3700 -799 -2846 -1696 3559 1789
245 1789 -917 -5324 2857 64 769 398 -6855 1371 3554 -1501 -4182 420 -6225 2930 3360 -9306
261 -9306 -617 -581 -2044 153 -1597 -8333 2818 3081 -5195 -845 -4776 1247 3466 -398 -5331 -299
277 -299 2514 1734 564 -5540 3402 2857 1814 -785 -2651 1533 6067 2105 -4092 3686 -49 4436
293 4436 4888 -3149 132 5900 3377 -419 4151 -3656 4511 7624 -1927 32 2500 3274 3615 3419
309 3419 -5459 2548 5292 1054 532 -3503 1723 2694 1442 -3732 -1505 -314 3242 -651 -7028 1354
325 1354 -431 833 -321 -3769 -3863 3184 -361 -5851 1244 -4309 -1239 688 -3658 -5191 370 -993
341 -993 -3645 1955 -5719 -2146 1606 -352 -2429 -1691 -1896 -28 3907 -4389 -1859 -677 2388 1929
357 1929 -3707 -1628 1417 3894 275 -316 -3485 6050 5820 -3140 953 1125 3953 4682 427 -5211
373 -5211 5453 5485 -1564 1387 -1457 2968 4767 861 -4112 2592 4022 494 1311 -2521 1231 2638
389 2638 2352 -2778 -108 823 -32 1409 -2506 449 -2066 803 189 -2634 -1878 -164 -1458 -1746 1541
406 1541 -7695 -1921 1378 -3790 -2440 -3125 -5206 -788 2127 -7778 -2571 -1429 -1943 1139 -4858 -4678
422 -4678 -256 2215 -3711 -3512 -3893 404 1734 -3566 -3208 -3192 3967 495 -2349 -1919 1538 3062 1296
439 1296 132 -2311 4068 4579 1533 -2834 1755 2745 654 4387 -3091 784 4418 752 -654 2556
455 2556 -96 1511 4902 -2546 1924 1105 -413 2031 941 -1379 -1027 952 -1014 1237 -2869 1
471 1 -145 -540 1719 -3599 -825 2149 299 -3033 651 -1905 -212 1508 -4656 -2077 -189 998
487 998 -4568 -2574 -910 -1440 1374 -3851 -4383 813 1977 -3857 -337 -2825 -726 3737 -4162 -1764
503 -1764 589 874 134 -397 -1523 1157 1926 209 1648 -1779 3754 2087 -840 2460 1142 76
519 76 3535 2660 -2424 4531 618 1126 4523 -501 695 2610 3474 585 1214 -560 1339 2866 1477
536 1477 -2006 -2275 3905 -890 184 -2030 -2750 2529 1321 -1395 -3308 -744 551 2000 -2866 -1554
552 -1554 -1682 -904 2667 -5235 -2704 -125 -1132 -645 -1120 -5369 -1045 2263 -3591 -610 -2822 -1619
568 -1619 899 -1206 -3611 -2374 68 -1090 206 -4420 -1195 -685 220 -401 -3050 1127 374 1322
584 1322 6 -627 -973 2933 1610 -660 1013 -861 2443 1015 1690 -923 -699 4693 1363 80
600 80 1226 614 1377 5422 -1410 -779 3941 4 2050 -392 -920 1380 2806 -1159 -1580 300 -476
617 -476 1018 -2411 -742 -883 943 -378 -3417 -804 198 -342 -2715 -188 -3232 -242 351 -3058
633 -3058 -1861 -919 194 -2543 -240 -2173 -1592 278 -582 -2246 -1342 -67 -2718 1903 -1950 -3055
649 -3055 585 -452 112 -151 -1187 -1339 2628 -332 -478 -444 1049 2917 -473 1081 -758 1765 3042
666 3042 838 -1801 1121 3240 11 2196 -1116 600 3400 2271 -1005 340 2531 1001 2916
681 2916 -852 -740 1934 3013 -227 -673 1167 -462 2854 230 -1626 -535 1520 478 -721 -473
697 -473 -1671 1706 -241 -285 -2479 -603 913 -1793 -492 -1959 -1310 -684 599 -3108 -1256 -161
713 -161 -1875 568 -1730 -2242 -1337 1432 -1673 -1432 -594 -2180 1812 48 -1894 -2378 1757 802 -393
730 -393 -1026 -1674 1831 1481 206 -2545 1104 2082 1154 -120 -682 2000 1878 2395 -1797 390 2975
747 2975 1431 1099 210 884 1305 3476 -990 495 2238 700 1420 912 471 -661 2793 -121 410
764 410 471 -426 625 1279 854 -2398 683 99 710 -389 -1419 -521 322 1263 -3323 -1743 -73 557
782 557 -1319 -2316 -1622 -1022 2099 -2616 -2603 -446 309 -919 -1397 -1949 -1559 2367 -1454 -2104 -1291 150
800 150 -71 163 -546 -1567 1918 207 95 -37 937 502 946 1565 -797 633 439 1746 -142 591
818 591 130 390 2929 588 -30 236 2841 1296 1731 358 -415 3616 1883 -203 -1107 1892 854
835 854 1575 -151 -2531 2091 1527 -208 -1641 883 236 1706 289 -2280 314 833 865 -2178 -1091
852 -1091 -553 66 84 -1814 -1898 -653 1312 -2585 -900 -987 -1209 736 -1043 -2020 -1747 874 -1618 -590
870 -590 -1235 -1887 202 -45 -456 -1732 937 -509 1107 984 -925 -100 1613 1768 -824 553 -762
887 -762 1646 2130 -211 -971 368 2631 735 395 -568 1765 2374 2045 -325 -1050 3995 1395 1002
904 1002 -250 -57 1841 2421 -713 -1719 2321 707 1961 -694 -870 637 1907 1044 -2203 240
920 240 195 576 -407 -626 -1840 12 935 -1701 -131 -1217 -236 85 544 -1243 -1111 486 -423 228
938 228 -1875 -691 -1698 472 -688 -3149 -505 -966 -515 -859 -1413 -2284 1625 397 -1706 534 -723
955 -723 1235 473 -13 -840 849 1205 224 -410 174 1406 112 2106 -553 483 2739 1058 1075 205
973 205 1279 1046 2294 -96 -13 1330 1468 1118 -814 936 13 1934 989 -1019 559 1922 512
990 512 -1005 707 -1539 1891 463 -2509 -460 213 581 -1106 -1235 -1393 343 -79 -240 -2031 -827
1007 -827 1838 -1541 54 -1124 -1494 611 129 -1574 -1183 -566 -1350 1407 -1079 -1281 -1524 301 1197
1024 1197 -920 -358 -1598 936 1753 -152 -2336 512 1324 385 830 -2569 537 2561 1273 -965
1040 -965 -95 1563 1795 1884 -1003 745 1305 2700 -47 -1576 1654 1033 1834 353 -549 -69 2863
1057 2863 -53 -233 823 -625 2125 715 3 -561 660 649 -181 112 -853 -416 -139 1285 -1956
1074 -1956 -534 -68 -878 750 -1536 -1539 -893 858 -1075 -885 -1168 -811 216 -1029 -867 -2515 328
1091 328 -97 -1655 -671 -469 -377 -141 -237 -2691 1183 -71 -883 -189 -871 210 672 254 -1456 631
1109 631 497 514 -146 -387 359 456 2152 -778 367 1205 573 1193 968 242 -238 2434 520 494 141
1128 141 822 965 898 949 -987 1142 1043 159 -378 336 277 889 769 -1936 527 605 292 -806 -820 -518
1148 -518 270 571 -1865 -782 -352 637 -781 -1018 -995 -775 748 -1234 -1690 -1235 517 -1082 -588 -706
1166 -706 -1552 464 -547 -723 -1102 108 -614 -228 354 -1295 -129 247 504 -591 634 -542 69
1183 69 1493 -504 -46 -20 1201 135 753 -585 2 2045 810 200 -180 1784 923 1185 -296 -318
1201 -318 1860 1461 258 -1248 1188 737 1088 150 -1066 829 1500 531 -1604 835 289 478 233
1218 233 -893 -224 309 656 -1480 -4 -609 -471 -244 -902 -712 -968 155 -1338 -63 -970 -985 -763
1236 -763 -175 -413 -1509 86 -1304 -177 -460 -1084 -1050 313 425 -1463 -103 -830 145 300 -107 -1309
1254 -1309 249 1493 -409 167 -521 869 1146 882 -469 -195 2040 289 914 -252 653 898 1231
1271 1231 -190 -579 1203 765 779 -82 230 17 1311 459 -949 715 654 838 -144 -19 -269 899
1289 899 1046 -912 388 1 263 -181 340 -954 -13 750 -767 -157 -637 -200 -739 208 -526 -731 -230
1308 -230 -1051 -554 -616 -660 -1869 76 -446 -1398 -580 -851 -94 -241 -485 -1867 84 499 -528 -533 -579 156
1328 156 39 540 -1589 -120 1078 191 -365 -416 825 403 1523 -588 173 1561 1222 488 267 1107
1346 1107 551 1359 68 5 789 1161 181 -795 595 -472 710 440 -489 246 631 416 -439 596
1364 596 -701 338 -64 -14 -547 -183 204 -933 485 -637 -794 -516 181 -729 -249 -300 -1130 486 -833
1383 -833 -1126 -1293 -237 -42 -1101 -1131 -1481 -275 -30 -657 -1940 -388 169 -570 40 -1631 -163 493
1401 493 101 -1544 -117 -148 180 254 -1170 -22 67 950 -177 -238 873 274 697 638 398 -80 1722
1420 1722 46 460 1119 -244 821 236 621 135 783 267 402 720 106 173 275 1183 -483 369 533
1439 533 -157 959 200 -745 -135 1083 -680 -51 -419 -258 472 -383 -524 -891 620 -366 -1041 -726 -128
1458 -128 -739 -194 -461 -1683 539 -697 -1140 -74 -599 -367 -463 -291 -980 453 -467 -206 -530 118 154
1477 154 -743 675 -818 127 309 -324 -78 671 -468 27 1488 -514 245 -16 423 973 740 367
1495 367 -112 1164 1077 548 -360 1014 454 940 952 -951 728 938 564 -147 153 -89 911 780 -972
1514 -972 116 -253 639 -561 -306 -62 -638 769 -103 -1053 -258 522 -914 269 -666 -1206 444 -492
1532 -492 -188 -1189 -754 -465 152 -276 -1107 -690 -283 226 -1110 -409 -1038 -407 774 -624 -849 -63 499
1551 499 -152 726 -918 -76 925 288 29 -432 691 359 1010 -163 -373 326 1158 275 -486 1210
1569 1210 277 1136 422 -407 642 867 647 130 659 3 745 207 27 7 675 612 -805 402 310 80
1589 80 156 129 -458 -147 328 -795 536 -607 -520 -324 -107 -133 -547 -186 -688 -31 -19 -629 -1262 -95 113
1610 113 -1110 -363 -1042 -139 -143 -689 -1031 -9 54 -618 -173 -986 294 134 2 -1079 -193 831 -125
1629 -125 -111 -305 208 321 733 -516 -179 1218 200 536 230 248 139 1070 442 -145 660 411 558 430
1649 430 839 -205 671 744 132 486 110 411 267 625 -568 367 685 -20 171 -124 102 -325 630 -275
1669 -275 -692 -42 -110 -260 -221 16 -739 502 -246 -961 -598 -337 -100 -560 -92 -1257 77 -93 -707 -895
1689 -895 -438 0 -233 339 -1050 -293 89 201 -570 -365 241 38 573 -774 -295 325 580 -64 -216
1708 -216 360 5 895 7 125 518 1018 556 279 659 -128 1019 638 530 246 855 479 208 1022 -200
1728 -200 484 373 662 67 305 269 -222 909 44 -215 7 744 -380 -163 -140 -710 794 -59 -823 -591
1748 -591 650 -217 -321 -489 -516 825 283 -557 -970 289 -89 -459 -197 -708 297 -123 -56 -947 103
1767 103 -12 -269 -8 -382 -105 9 164 -504 78 310 -21 205 -105 200 -64 671 -173 271 579 75
1787 75 357 401 473 26 827 390 702 639 130 283 598 1147 -286 342 522 754 855 392 -319 271 898
1808 898 -576 -12 -172 133 360 -250 -579 -97 998 -284 -522 -35 282 -87 -312 -858 -931 628 -409
1827 -409 -521 -683 -65 -22 -52 -271 -1072 216 -299 -217 -609 -197 161 -493 131 -839 25 -6 -256 -543 184
1848 184 -567 -620 479 -495 100 -243 121 40 503 -13 -156 411 687 414 -539 302 325 786 784 -821 200
1869 200 678 502 -12 45 -94 1006 603 -415 231 730 1034 -115 -12 174 222 552 -88 -346 -46 666
1889 666 -490 297 -440 -568 530 -574 -458 -344 -47 -399 -29 -504 -358 -352 -328 58 -975 -126 -1177
1908 -1177 -376 306 -563 -785 -211 6 -600 184 -1063 -135 264 -324 -250 -329 190 118 206 -342 -300 -222 547
1929 547 -34 -569 795 -3 264 378 -279 293 692 -94 146 566 38 602 159 744 188 551 764 -34
1949 -34 465 166 380 369 633 -299 524 602 -477 497 49 265 375 23 -246 -68 243 -23 -22 -660 49
1970 49 -360 568 -223 -864 257 -280 -39 -5 -345 -823 500 -563 -921 -91 -578 -13 -387 -308 -478 -218
1990 -218 131 -529 -544 -369 98 -217 492 -898 -308 575 -402 216 -123 -143 143 676 -221 -160 -151 430 495 -121
2012 -121 425 -138 874 485 -21 381 543 443 263 722 -383 729 606 256 273 -66 377 137 618
2031 618 5 18 432 740 -50 -103 168 -515 784 -45 -552 -40 232 -24 -259 -335 -528 428 -447 -256 -415
2052 -415 -333 -27 -782 -267 -924 -278 -49 -315 -798 -153 -338 -703 -18 -879 -252 -198 29 -607 81 0 -622
2073 -622 134 58 68 -144 479 -126 195 626 -633 404 147 136 132 739 -90 9 668 -413 262 333 773
2094 773 -111 382 520 314 545 235 121 333 937 -241 265 185 44 601 -59 -142 92 559 -67 -170
2114 -170 -396 94 231 -6 -20 -616 439 50 -233 -50 -500 16 -74 -309 -932 368 -481 -489 -238 -213 108
2135 108 -321 -280 -777 145 -247 -390 -249 -240 -156 -632 -14 -462 222 -208 -436 15 350 136 -440 466 -39
2156 -39 305 80 -90 -69 749 559 -303 345 602 458 246 15 16 524 875 -313 122 519 673 -83 -15
2177 -15 185 215 462 -289 71 123 288 -26 104 -24 -136 406 -170 -67 49 78 -428 -28 119 -162 -22
2198 -22 -380 6 -302 180 -586 -185 188 -374 18 -273 -65 -303 196 -517 -464 192 -352 -113 -536 2 -184
2219 -184 186 -219 -501 151 138 56 -361 100 -53 423 308 -414 77 346 474 -298 507 -126 494 638 -16
2240 -16 432 518 636 -90 512 31 692 686 297 277 296 586 -69 376 30 -56 155 329 236 178 327 -295 424
2263 424 -119 -80 9 -5 -150 -401 32 -478 -138 -33 -362 -586 -196 -201 -408 32 -592 -189 -163 -247 -430 -270
2285 -270 -76 -370 223 -573 -145 -257 345 -357 -331 279 -338 85 -91 -125 -179 258 49 -336 553 -391 437
2306 437 -76 189 -234 178 312 -258 343 171 302 123 484 -59 623 593 96 778 15 47 230 299 95
2327 95 224 345 64 327 -3 313 -394 591 -182 -458 305 -25 103 -82 -133 -501 451 -126 -367 110 -460
2348 -460 207 -237 -129 -596 -141 4 -306 -365 -423 -333 -498 347 -1058 -442 -404 -381 -102 -314 -563 -284 138
2369 138 -494 -78 -482 -125 95 -147 -6 -514 323 180 67 124 287 46 150 554 -597 451 291 67
2389 67 160 80 168 193 570 7 -111 289 553 115 324 116 -43 1021 123 114 77 164 166 549 230 -124 529
2412 529 -230 58 -46 -251 25 -151 26 -356 31 -223 -141 -679 269 -329 -415 254 -609 -212 -323 -439 -310
2433 -310 -71 -351 -520 -126 -371 36 -412 242 -194 -59 172 -488 -69 -130 161 -300 602 -187 349 89
2453 89 -467 231 154 459 -54 2 294 425 151 48 55 120 787 -338 437 376 148 340 120 -119 337 707
2475 707 67 120 200 298 368 25 2 -255 582 244 -232 98 -206 36 35 34 -625 368 -126 -54 -121 -240 -129 -466
2499 -466 -127 -378 -270 -428 -228 -152 12 -608 -797 259 -379 33 -263 -428 -22 164 -69 -622 74 -315
2519 -315 185 -307 -212 -59 432 312 -544 -76 238 269 7 7 -102 352 536 -106 108 184 403 193 151 -50
2541 -50 363 279 156 171 74 692 195 222 276 15 663 -92 139 157 239 -311 371 229 -86 177 -286 -79 -12
2564 -12 142 -282 260 112 -54 104 61 -71 -125 -62 -290 -388 15 -76 -488 -325 -171 -197 156 -483 -510 -45 -169
2587 -169 -254 -489 212 -8 367 -462 -462 -14 292 -170 -488 33 -257 165 -310 -34 3 256 311 -123 280 -236
2609 -236 355 142 235 82 -41 421 202 624 175 162 329 409 313 85 444 15 571 263 33 -185 323
2630 323 161 -179 66 -329 300 105 87 -280 -64 206 -133 156 -111 50 220 -81 -504 -269 82 -329
2650 -329 11 -341 -221 -143 128 -421 -327 26 -486 112 -137 -244 -263 125 -421 -263 99 -384 208 -316 -23
2671 -23 -310 -23 -91 -185 286 -283 164 4 256 -76 162 215 60 256 86 97 199 171 31 119 348 86
2693 86 114 93 231 174 656 10 -12 294 420 533 41 134 -24 318 161 111 156 -118 98 -5 55 -185 220
2716 220 195 -237 -189 -115 -39 -416 146 -208 -336 88 -175 -239 -312 -275 -404 -102 -305 -356 -189 -133 -345 -73 -41
2739 -41 -464 124 -113 -163 -158 -156 -114 266 148 -293 125 93 169 24 -246 238 72 304 -103 266 45 483 180
2762 180 329 -135 7 546 263 0 429 409 -94 -25 342 123 286 222 185 -6 296 173 -40 283 -10
2783 -10 -7 -114 296 -317 183 43 90 -82 -460 93 234 -75 -280 53 -266 -362 -217 -168 -203 -504 -28 -618
2805 -618 -149 -61 -211 -274 -117 -464 -376 111 -193 -15 134 -314 -106 -88 -26 -72 37 59 177 -171 -112 -115 -149 245
2829 245 -436 45 53 -34 248 -24 -1 233 392 -332 231 -17 553 330 162 134 -110 643 167 346 -5 299
2851 299 -24 98 188 19 541 -91 147 111 10 -151 -185 -109 -222 195 -345 91 74 83 -255 -509 404 -328
2873 -328 -347 -289 -378 -119 126 -536 -537 29 -205 137 -457 -169 -166 99 -49 -279 -182 54 -132 23 215 -391 55
2896 55 161 -476 222 -63 15 -115 247 -127 169 -52 -269 310 118 362 -31 266 504 -2 286 153 -2
2917 -2 411 253 50 493 224 134 129 106 522 255 304 -68 15 242 53 -233 22 0 -145 -66 -178 49 205
2940 205 -233 -368 288 87 -177 -38 -499 16 -21 84 -224 -486 152 -119 -218 -243 -101 -96 41 -416 -399 17
2962 17 -337 5 -231 -12 -125 -46 -99 -64 -75 -148 185 -104 80 -36 160 293 -112 119 -29 -364 5 409
2984 409 56 369 35 128 300 -7 312 -70 307 261 102 135 105 456 252 315 -276 357 245 -14 207 -50
3006 -50 293 -110 -76 -159 122 207 -59 158 -168 94 -175 207 -267 -236 101 -257 -198 179 -292 -223 71 -376
3028 -376 -209 38 -413 72 -353 20 108 -36 -213 -162 -105 38 -149 -73 22 -412 287 -43 -50 47 -133 -202 -100
3051 -100 99 -295 263 -74 84 123 167 17 -238 409 -20 -43 0 228 423 157 -23 58 387 226 153 -15
3073 -15 236 -40 146 215 -276 262 240 206 -183 8 20 -112 239 -289 -42 173 183 -139 -17 -168 -316 122
3095 122 -386 -64 -167 -111 -92 -166 59 -126 80 -510 -201 -106 21 -186 -58 250 -507 -83 -181 145 -38 11
3117 11 -64 31 0 -485 75 -84 172 15 94 -263 8 335 131 262 -144 256 92 109 210 98 152 260
3139 260 -10 201 309 122 275 73 -184 44 154 3 -179 184 230 151 228 -202 137 306 274 -37 -94 4
3161 4 73 78 -164 82 173 131 -422 184 -95 -143 6 109 -93 -266 134 -235 -95 -274 -188 -262 -22 53 -438 104
3185 104 -162 -71 2 29 -100 27 153 -30 -62 -44 -23 -211 90 -100 99 359 -192 177 -130 28 -151 -16
3207 -16 -165 0 374 -172 -9 -61 216 -31 204 -21 7 460 132 144 237 212 249 226 42 157 223 -93 16
3230 16 122 262 -276 -177 115 116 86 -185 -37 -118 -60 -298 -36 94 -20 73 -128 -220 -221 -1 -4 -64 -27 -243 -123
3255 -123 -64 -71 -264 -20 -26 -615 -121 -153 -63 -356 -107 -477 9 201 112 21 -161 291 -210 200 -69 -212 -135
3278 -135 121 143 101 507 -241 260 143 135 -28 54 219 -68 178 -122 323 96 308 161 -105 326 -13 58
3300 58 -59 158 300 -77 81 295 -93 -25 161 -470 163 50 104 -88 -138 -1 90 -162 -37 -62 -230 -43
3322 -43 -290 -7 5 -343 288 134 -293 -56 -22 -342 11 -78 -376 34 -149 -97 -298 -6 47 -45 -32 -213 -106
3345 -106 -54 321 -8 -17 -3 -145 270 -311 40 -96 320 12 207 -100 82 136 34 139 -169 610 9 13
3367 13 140 -121 29 429 149 -187 91 19 223 -73 36 381 178 298 -35 -33 -111 96 -14 -22 -3 -266 -55
3390 -55 -48 -120 278 76 -43 25 4 -100 152 -383 7 -192 -218 -123 -130 54 -460 -5 88 -276 86 -87 -155 2
3414 2 -10 -115 -54 -197 -14 166 78 -33 -120 69 -2 -53 -93 188 -8 78 -81 -30 395 -88 71 40 330 279
3438 279 209 -137 31 247 35 26 20 236 268 37 -61 27 -50 140 -66 -215 5 54 -122 175 -64 238 84
3461 84 125 145 50 -259 -186 -102 -37 159 -451 19 -108 -36 -64 -342 -172 -237 130 -154 -14 -341 -123 59 -117
3484 -117 -42 -192 122 -183 -171 -43 161 138 79 -235 -49 125 -125 234 -112 8 128 -71 -10 99 273 54
3506 54 210 -63 56 -43 -213 245 -49 344 336 48 222 176 272 56 227 -161 286 -111 149 165 -117 128
3528 128 18 113 -35 -26 12 137 -195 104 -19 -149 177 31 141 -172 -64 8 -195 23 -318 -210 -324 -15
3550 -15 -17 -192 5 -191 -58 -385 -145 -179 -296 -86 -64 -250 130 22 -322 51 -133 14 -36 -344 -107 166
3572 166 240 -212 -109 208 19 -98 118 9 67 -135 183 189 29 103 -206 190 248 -100 122 -168 167 175 98
3595 98 166 147 313 183 332 13 -45 -30 -62 -222 57 15 231 206 120 128 -321 66 -158 -238 -109 36 88 -48
3619 -48 -41 -178 -204 -49 -311 -128 15 -49 -200 5 -251 29 -317 -17 -61 -326 -113 -176 290 -99 -289 153
3641 153 146 228 54 -13 76 -117 8 115 -21 -67 110 44 51 -84 246 82 -6 -16 283 56 61 249 -33 199
3665 199 200 59 59 135 131 53 22 -91 -154 195 123 -109 -74 87 97 -113 16 85 37 393 -62 -271 -78 142 -149
3690 -149 -157 -146 -68 242 -234 -9 135 -174 -32 47 7 -254 -123 48 -64 80 11 -209 13 -32 -200 -21 91
3713 91 -207 82 361 -55 46 302 -149 -1 -177 -80 156 30 131 -126 286 92 13 -48 54 168 286
3734 286 264 -186 395 -92 133 66 113 25 128 7 163 311 326 -159 205 30 -95 202 12 -133 100 191
3756 191 113 127 -35 -121 -113 60 -22 37 -104 -17 67 -201 115 -292 -126 -185 -153 158 -281 -348 -211 -80 -466 1
3780 1 4 -158 -219 -44 -331 -200 -113 -53 -70 -244 -90 -30 64 56 -212 -3 90 102 -53 133 -94 98 175 -182 -10
3805 -10 237 388 40 66 108 -105 -26 67 149 26 242 -53 251 213 275 182 -128 -32 249 113 42 231 7 85
3829 85 -225 19 80 -224 133 148 169 103 -277 84 -140 71 -156 63 -4 -4 46 -87 -3 -18 -10 87 -127 -129 214
3854 214 -130 146 -317 154 22 -260 -42 -256 -113 240 -223 -163 -36 37 -229 159 -206 13 0 -170 66
3875 66 -86 301 -90 25 257 30 -52 39 353 71 513 -6 -135 74 313 23 162 362 45 266 -183
3896 -183 -43 -53 46 49 180 217 -159 23 -48 72 -45 112 -8 -110 -79 -167 -5 -110 -32 64 -173 112 -364
3919 -364 77 -42 -154 -182 28 -167 40 -103 -166 19 -216 39 -71 -22 -30 22 -4 -77 67 -74 -116 -155 -111 -75
3943 -75 -62 335 158 180 28 39 121 339 50 -79 257 -204 402 -59 53 -49 -3 49 206 -39 189 151 -73
3966 -73 175 -166 24 -90 62 201 107 -95 218 250 55 -72 33 421 -7 -1 23 59 167 -174 -255 -143 65
3989 65 -137 30 -22 -115 -148 -202 -122 -198 -176 -232 -269 107 -14 -267 -27 14 -54 -135 -346 -77 27 -129 -93 159 -111
4014 -111 -106 -385 227 -96 86 -86 -50 -41 230 188 205 -140 -127 297 26 -34 102 138 1 143 269 65 117 -54
4038 -54 318 108 -98 318 162 58 92 -67 -105 222 11 24 22 -108 102 74 169 -59 182 -223 -49 116 -151
4061 -151 66 174 5 -306 73 66 -165 -6 106 56 -57 53 -22 -64 191 100 193 -21 -66 -80 -87 -106 -64 23 -118
4086 -118 -82 85 -53 -163 194 -117 -56 38 -167 165 139 51 -24 68 120 94 -139 -110 -119 291 183 -98 -83 210
4110 210 179 80 -151 30 -20 137 -33 -20 154 104 -1 410 -155 105 152 -18 332 145 54 133 -117 61 -11
4133 -11 234 -49 72 -69 -76 37 157 101 -68 143 106 -37 28 -52 -123 144 -157 5 2 -77 125 -275 174 9
4157 9 -124 86 -59 73 -21 134 13 106 -53 19 72 18 -135 -95 -335 -151 -85 60 -27 159 238 139 -69 3
4181 3 24 -67 371 85 21 -146 174 -150 209 -14 -55 70 12 80 95 -70 30 -12 223 -195 201 10 -112
4204 -112 -45 -140 -331 49 3 -124 20 134 -169 -265 97 -189 78 -124 -70 66 -56 149 -153 -136 29 -99
4226 -99 152 15 -220 -238 -80 -406 -87 -215 -233 -32 -240 -18 258 65 -159 -138 19 63 -161 70 229 -182
4248 -182 285 16 159 138 110 -113 -74 -6 2 167 6 58 -150 445 -8 265 149 -103 34 180 -154 55
4270 55 134 279 -1 122 126 165 -24 62 -5 -352 -5 -202 216 -54 141 -27 127 57 79 -99 126 -102 -113
4293 -113 -153 -107 -67 -114 -107 -47 -154 207 75 11 -241 50 20 -72 -238 -240 -57 9 5 -278 256 52 65 55 -179 43
4319 43 -257 -33 -159 67 -271 -17 -179 28 87 -92 377 94 7 60 369 111 -18 128 50 138 -73 86
4341 86 198 65 -61 141 336 31 138 -65 185 103 264 -299 128 125 -38 -44 -204 138 15 -59 -102 -109 124
4364 124 144 -23 -302 91 20 8 46 -79 38 -84 -32 175 96 -294 -112 -90 -78 -87 4 -40 -77 22 -109 -87 42
4389 42 121 38 134 -112 96 122 123 -103 43 -253 -27 -6 153 11 36 150 201 101 162 172 -51 38 -23 83 372
4414 372 27 -86 -112 -19 29 75 12 175 -79 87 136 -84 55 -85 -101 80 11 -112 183 -45 80 198 167
4437 167 3 -246 104 92 -132 -72 -94 24 -253 37 -32 -236 -90 -53 155 -14 -91 -40 -286 -281 -110 -8 -125
4460 -125 189 -154 95 169 -164 87 30 73 19 -286 -89 -127 -39 145 0 -161 81 -35 286 121 158 254 94
4483 94 -74 90 352 149 128 139 184 57 58 160 197 127 34 -52 -23 -66 82 -34 112 43 34 40 60 337 -2 -117
4509 -117 -155 38 61 -79 -112 25 230 -40 32 215 44 -223 -68 -12 -37 36 73 -169 -303 -32 1 -47 -215
4532 -215 -180 49 -142 -91 53 -60 -46 -185 -109 173 -52 -93 72 -153 -139 -34 -48 -8 5 154 42 -124 -30
4555 -30 -36 62 83 122 -77 35 273 -15 36 -61 187 126 -68 304 23 -83 -98 177 207 141 189 93 -44 110 -69
4580 -69 71 67 -70 65 2 -150 87 -40 -71 -212 7 -281 -92 -170 -159 115 -263 -31 -153 -362 -254 -138
4602 -138 104 -139 216 177 -57 -77 175 34 111 74 -146 117 223 46 -62 14 111 17 120 50 -109 -68 35
4625 35 -181 -50 54 -107 120 15 -79 -91 108 44 -135 183 -130 63 44 229 304 -49 56 169 171 -77 143
4648 143 -52 112 75 130 -89 168 -9 157 91 -252 112 12 -74 -246 -45 26 -5 163 -130 14 -195 114
4670 114 101 -153 -198 -367 -173 -333 145 -74 -24 -219 -275 135 -187 -105 -38 -203 148 -10 8 -111 71 -11 228
4693 228 -169 73 -13 -79 131 153 -47 -50 -46 90 109 -105 72 -90 160 -3 25 -44 53 196 111 122 120 90 38 19
4719 19 69 -66 45 -207 36 -41 331 -49 -156 -30 38 109 -153 161 70 -279 125 71 -221 19 12 -100 -96 177
4743 177 -61 88 -40 23 25 93 37 -108 -131 -71 154 -144 87 -169 -30 22 29 -12 -52 -51 0 107 62 -103 -164 -222
4769 -222 -27 -39 66 -185 25 53 11 -204 60 -279 71 -176 77 332 -7 114 135 343 43 87 -220 328
4791 328 -140 -36 91 -20 22 73 41 112 402 -84 184 37 14 85 25 -26 128 -123 183 -133 168 71 147
4814 147 0 119 12 -2 -209 -106 99 -128 -95 154 -102 123 -177 -82 45 69 -214 -65 -6 7 -52 -124 41
4837 41 -252 -47 38 -144 27 -147 -179 -18 65 59 -82 -32 -54 119 115 331 -50 109 -6 85 388 -3 159 -78
4861 -78 253 -76 158 -134 143 -129 -71 -157 132 -13 -145 133 119 157 39 -32 80 -88 -95 13 18 151 22
4884 22 116 -88 -66 -68 -282 -151 40 43 150 36 33 -177 -158 114 87 -156 99 -85 70 -19 -64 -158 -50 -177 -269
4909 -269 -212 -144 -67 -102 84 -116 169 64 31 -101 193 -259 126 222 155 145 73 -16 8 196 116 86 -66 -30 -117
4934 -117 -52 93 -15 108 -104 42 -156 -2 190 -188 155 114 140 -3 26 274 -79 167 -112 66 -278
4955 -278 7 15 58 349 54 -59 -23 -52 -181 -91 -12 -82 -127 -149 113 58 -33 252 88 -64 -70 -300 -57 245 -211
4980 -211 53 115 -204 28 -91 -56 -35 139 39 91 50 26 226 -177 114 -23 144 201 -4 89 -25 -92 -237
5003 -237 173 2 335 320 49 -23 -314 17 108 32 56 105 71 117 -104 7 30 -39 200 -187 -103 44 -199 -176
5027 -176 -290 -170 -102 77 3 84 187 8 -96 -31 -112 -141 46 -106 -64 -114 43 -11 -184 -286 -106 -1 -104
5050 -104 -83 -276 44 -209 -61 97 -83 -153 -71 -204 -462 -101 252 -84 -74 -150 -148 89 84 12 -78 82 3 40
5074 40 -59 75 85 -93 13 46 384 233 -105 -51 36 145 -69 45 37 127 229 223 -34 -144 -44 -77 -72 20 84
5099 84 63 -14 14 -112 53 284 -187 -43 86 -128 -186 -110 161 242 -24 -62 -261 -85 -109 62 -33 -136 -230 20
5123 20 214 -60 -88 -62 42 33 137 -165 -116 7 49 -152 -103 -109 180 -32 86 -85 -63 -144 -44 -123 74 -80
5147 -80 -33 -196 -111 63 267 -120 11 93 -95 21 -55 19 173 17 311 -199 58 59 78 -33 -88 52 12 46
5171 46 -114 19 -103 55 103 -139 13 -248 -17 -81 -98 -68 -37 -117 34 85 -231 81 -22 -28 -89 66 87 75
5195 75 -34 -184 98 -46 248 77 118 -21 -228 -18 -260 -132 -101 -141 -136 -95 20 -163 29 6 -115 187 193
5218 193 -129 -115 173 44 101 -107 27 -61 -155 -57 45 236 -25 -207 91 -89 23 30 -74 -31 -182 -116 75
5241 75 -80 -48 113 -3 5 158 133 22 -94 157 -185 -214 83 38 199 -148 86 47 99 39 -136 35 -150
5264 -150 -69 -190 -268 30 42 -50 136 127 -155 44 -27 -30 100 -173 -59 -207 -244 256 11 -97 -135 -146 -56 142
5288 142 71 -95 -84 33 157 51 63 19 -100 -196 -83 103 -14 -118 39 -62 159 84 -62 -160 184 57
5310 57 127 -54 230 -41 206 -110 66 -213 6 -14 6 192 -172 -99 -54 15 49 104 -192 -11 28 61 64 -38
5334 -38 315 -76 -83 -65 122 -57 -141 152 -125 -9 -87 252 55 92 -89 34 132 266 4 -75 -145 168 -14
5357 -14 198 23 -39 91 184 53 62 -128 22 204 -23 -9 -164 -101 73 49 -222 145 -16 40 -151 -58 272
5380 272 -26 210 217 90 81 -225 172 71 -150 226 -72 -34 -5 36 217 -60 -43 -95 -147 -10 -227 164 20
5403 20 150 176 -34 56 193 20 -97 265 228 60 221 -126 -16 -89 -166 65 50 -247 -43 -24 -227 -93 -126
5426 -126 -87 114 -126 -151 -14 65 350 65 10 -103 196 -208 -139 -44 128 -125 19 56 -25 -69 59 94 83 186
5450 186 -125 -154 -175 -13 -79 31 -7 66 53 69 -78 358 -21 -129 97 93 205 -42 -161 167 -18 -19 107 -321
5474 -321 -32 -47 36 120 34 258 -12 -20 124 206 -70 -81 215 12 -205 -56 265 34 -269 -145 67 -162 -62
5497 -62 -72 -61 -174 -43 180 -145 177 -4 135 7 99 -89 -5 -124 -175 -85 13 -126 -28 -184 58 -30 -110 -176
5521 -176 56 -155 113 -19 224 116 21 -148 61 165 -17 188 -205 -90 301 36 -63 190 -153 -26 -2
5542 -2 -247 -13 -43 152 82 21 15 182 -86 -58 55 -111 110 130 -164 32 9 183 46 -138 128 40 -169 278
5566 278 -68 -278 187 109 61 -215 75 160 -157 91 15 421 92 -72 -102 18 162 -7 -289 -174 -70 -18
5588 -18 183 49 -181 -44 -198 -93 -195 -89 67 -157 -257 78 36 -61 -28 78 355 81 139 -8 176 -278
5610 -278 44 -257 -81 224 -320 67 73 134 282 -9 62 -145 -23 28 -105 -167 113 -3 220 179 15 105 135
5633 135 203 65 202 -32 75 -71 300 -146 317 -121 119 -30 225 -196 -69 -183 45 147 51 119 -78
5654 -78 185 142 -201 99 -177 -136 -17 16 104 119 -222 24 -88 -161 44 24 67 95 -123 -174 161 -119 213 -67
5678 -67 -247 97 -54 162 27 -147 109 82 -18 171 56 29 -11 33 -15 142 -88 146 -163 -217 -201 190 19
5701 19 86 -1 -207 160 -139 51 -79 -108 -109 -320 73 24 69 -21 60 -42 43 114 -145 50 38 -140 -191 10 -73
5726 -73 176 -134 -113 105 168 165 10 -5 -79 -9 197 -72 32 4 89 -97 -121 -226 117 14 101 -66 20 -98
5750 -98 -111 -81 -126 -212 67 -117 -108 231 -156 -90 14 183 7 28 -97 49 11 -239 -2 -125 278 136 -75
5773 -75 -273 -73 -346 -188 361 119 -36 -151 51 -37 -74 -69 -135 -166 0 -172 -19 -225 -36 -19 -255 -31 -146
5796 -146 -96 -185 0 63 13 63 54 55 -20 -212 10 -111 49 -156 -78 -15 -214 -73 -29 -130 -1 -74 157 -112 -90
5821 -90 -145 20 162 -57 88 -65 59 1 -75 116 -18 -80 26 -26 194 -6 113 25 34 -234 88 -48 10
5844 10 73 316 -188 -9 190 238 110 69 3 -146 87 -24 -140 -77 155 206 -93 143 187 30 103 -163 -115
5867 -115 -205 -197 23 -98 10 -196 23 -45 -34 24 86 -32 217 -65 34 95 -113 -1 -410 15 -73 -139 74 -125
5891 -125 140 117 -85 -177 -57 -180 -106 104 58 -82 64 142 -5 -202 215 183 -92 -84 -132 273 25 81 55 151
5915 151 -122 113 136 61 132 206 -6 -23 -54 189 -103 -96 56 135 91 -83 -38 82 78 -113 -150 -95 141 14 -30
5940 -30 -198 24 -61 131 4 171 46 -177 198 -50 -52 145 14 -56 42 3 -55 -171 137 -53 -129 -27 -72
5963 -72 -121 104 295 48 145 44 -98 -217 -267 79 -108 -69 28 55 -196 40 -51 30 120 102 133 42 -62 -50 142
5988 142 25 -1 -3 147 -15 37 -47 164 -156 -1 -134 37 -409 -69 2 -88 4 -101 45 -180 50 -127 -32
6011 -32 288 28 -153 62 -23 158 54 -145 50 40 119 37 -14 -16 -23 -46 -177 137 102 -56 30 114 17 -145 -92
6036 -92 154 327 -130 -76 -89 179 -113 149 29 173 0 59 52 -4 49 -132 112 -131 79 -270 -60 -116 124
6059 124 -120 25 78 -226 68 53 46 38 -205 178 91 -171 115 87 -106 55 -58 -7 11 -289 330 193 58
6082 58 -335 198 249 58 -101 -49 -124 92 347 -1 227 99 57 -169 149 -55 164 -24 -55 -152 104 52 -42
6105 -42 -35 160 -72 37 -232 -63 -59 49 214 13 203 86 -53 194 -204 107 133 -40 112 -206 -193 97
6127 97 116 -271 -144 69 26 -11 -36 28 161 -11 57 -134 -263 -75 -238 74 -15 -144 -17 -13 10 -63 131 64
6151 64 -37 -216 113 220 -61 290 151 48 -70 137 56 -25 -1 238 184 205 131 66 -238 -26 -76 157 -341
6174 -341 -92 -359 -105 -12 14 -53 32 -110 -114 -20 -222 59 -72 -120 -11 -33 -141 131 -144 -188 -20 60 158 239
6198 239 88 122 -83 202 202 31 39 74 91 56 142 167 137 24 78 26 15 -96 -46 -54 43 -154 21 -192 172 166 -31
6225 -31 202 52 28 113 141 325 -375 -117 -22 54 -100 -104 6 110 65 -197 33 -73 -25 127 -26 -93 6 94
6249 94 -134 -91 -166 -231 102 -125 -69 -156 120 21 -43 -258 83 105 -20 134 -75 -70 27 -39 -155 193 192 -74 -33
6274 -33 106 62 179 -127 -81 75 -101 229 -102 122 -168 149 149 -107 150 -39 -1 -111 78 -146 281 163
6296 163 -94 13 135 -107 -43 151 9 -8 -44 237 -37 30 -158 124 12 -65 -79 103 45 13 -16 226 -117
6319 -117 -47 25 148 168 -18 -68 -72 -41 -134 -169 -211 279 60 -263 -45 59 297 140 -118 135 -95 -259 76
6342 76 373 216 61 106 -136 -81 116 -24 10 102 21 -76 -106 73 -217 -33 -8 14 -81 7 -22 3 -86 -133 181
6367 181 -100 129 103 54 31 15 -115 -77 -35 -81 82 -56 130 71 19 138 -264 -147 -190 365 -71 87 119 51
6391 51 -142 146 -73 -54 88 -32 -6 -295 -85 -3 126 202 119 -65 -169 -90 129 -96 -186 67 -41 -76 -26
6414 -26 -71 -160 -89 -300 -44 117 -61 163 -144 -202 296 247 29 125 -25 -95 -148 -76 132 90 -123 -2 -19 81
6438 81 45 -119 -8 85 219 -156 -8 -73 -98 2 -46 -223 -58 83 9 -128 -61 -64 90 -165 -15 -135 -12
6461 -12 40 -80 16 -97 89 88 59 19 81 20 -18 -15 -56 51 82 23 -6 -74 135 18 -11 80 -276 -124 -17 -99 -59
6488 -59 1 155 147 -96 33 -130 -10 -122 27 -30 -53 26 -9 13 153 -194 23 7 100 8 -119 -29 65 -58 -86
6513 -86 -91 219 -6 63 -89 -97 -14 -32 244 18 173 40 111 280 198 -104 72 -169 -85 21 -108 -80 35 65
6537 65 -109 -77 -65 113 108 49 -116 171 121 19 144 -76 96 180 80 -98 65 -40 -205 7 102 -24 278
6560 278 227 -122 21 -132 -236 -99 176 43 -123 53 -90 115 19 -34 73 -52 211 -109 106 -153 -9
6581 -9 -83 -78 78 -15 53 111 23 340 -87 389 98 35 82 -393 -32 -99 -124 89 -145 -22 151 60 16 -136 93
6606 93 -10 -125 87 107 -114 -278 107 -40 13 56 208 -137 -83 47 134 18 54 -177 3 -34 -152 -42 158
6629 158 68 -200 160 70 -68 167 29 14 118 -43 -1 -36 6 199 67 77 55 55 -177 42 -1 -20 234 176
6653 176 -16 -295 175 -93 7 -6 -109 57 273 90 112 80 -23 154 -26 -82 52 96 180 -72 -202 -4
6675 -4 8 227 -196 -101 94 -11 -74 -90 66 -163 83 -31 6 -31 113 -55 75 149 -130 266 -155 16 40
6698 40 88 -47 -100 351 -56 123 -173 -89 -51 -7 153 300 -60 -181 -137 -1 -226 -248 -214 -113 -11 -75 -19 216
6722 216 171 -106 206 124 -24 -66 -109 -39 16 146 68 42 -46 59 173 -80 10 264 146 152 -48 11 75 52 70
6747 70 9 329 90 -16 89 -60 192 87 117 -3 -95 -26 -26 -62 -138 50 -214 -156 -118 11 -114 -34 37 -43 -144
6772 -144 55 36 36 -179 -95 42 72 122 23 51 -75 -53 -266 44 -166 -73 -195 -111 28 -161 43 43 284 49
6796 49 122 217 208 76 -386 -106 151 -202 -49 -19 88 123 148 -61 -292 268 238 -79 -10 -110 -226 172 -84
6819 -84 -36 16 -54 95 -9 -10 -116 6 16 -88 -89 43 145 69 101 -253 198 -77 -48 98 -78 89 -58 62
6843 62 -10 -144 80 45 29 -159 125 -20 106 135 -80 -175 -197 -308 -96 25 -134 158 -152 -82 71 107 -8
6866 -8 49 -158 -254 18 -161 -110 -259 -243 -29 -188 -83 38 9 -115 24 80 -78 -173 0 -207 139 -137 202
6889 202 -80 279 117 -133 -183 229 -358 52 31 28 54 -155 -26 29 -283 160 -213 -197 44 125 -80 99 -32
6912 -32 40 163 237 5 -49 19 -169 184 -65 4 0 -279 117 131 -40 29 59 -70 7 -29 -186 -50 29 9 -76
6937 -76 119 -26 17 -92 163 138 -259 95 -108 127 22 -79 135 237 75 -232 204 -153 -241 59 -16 31
6959 31 123 281 -45 -130 -79 -29 65 146 -50 -129 -56 132 2 -308 153 26 -40 91 5 -115 -36 -76 146 -1
6983 -1 96 -161 49 -39 -48 -41 -27 -54 68 131 -199 -151 -23 -4 -227 -246 263 -135 -118 280 -194 -27 17 79 -79 -121
7009 -121 -280 91 16 13 -117 -232 67 -116 -29 -37 132 84 90 89 2 -130 230 20 129 12 12 11 63 -10 23 18 -81
7036 -81 -31 -34 -3 -136 112 -66 75 -133 -128 29 153 29 49 213 153 -37 -109 16 -248 62 24 -21 164 -165
7060 -165 -169 30 -113 8 119 -69 -16 149 -43 -176 -80 -84 108 88 80 -38 -110 208 -87 -111 23 -3 -14 -42 78
7085 78 20 26 152 -114 137 119 22 41 113 -203 2 -100 -48 -424 134 47 16 23 -271 -153 -66 47 -312 32 72
7110 72 113 77 -211 135 116 31 126 -155 189 54 -6 -11 -68 -121 82 -91 -227 -52 -100 150 228 405 -113 125
7134 125 -15 38 -18 -42 133 -124 -212 -74 59 171 108 -93 -273 160 6 199 41 -78 -125 97 -101 70
7156 70 238 -144 110 118 39 -2 -71 144 90 -271 -219 -18 12 -115 133 -113 139 -73 2 94 -133 178 -50 -82
7180 -82 -25 -131 73 -87 -20 39 -33 126 154 159 -168 -126 121 179 93 -22 -48 -99 42 -86 -262 84 -154 -63 -45
7205 -45 320 -32 -103 -14 -201 138 74 -74 13 -33 76 136 -78 130 42 114 139 105 -262 -44 3 9 140 35 21
7230 21 97 -149 52 26 95 -115 105 -86 158 -102 -113 -95 -42 -77 88 7 40 -29 18 64 -114 -18 -103 221 -286
7255 -286 -20 61 -89 -4 -61 -212 -244 -189 120 91 -97 -11 -25 57 -68 -167 -12 84 -71 -147 -82 59 -24 -172 -143
7280 -143 -22 92 -79 95 -85 -48 -117 255 220 297 -179 92 -248 -162 224 -91 -97 -90 -28 -9 116 60 60 163 -14
7305 -14 80 10 167 69 36 -76 -137 58 -44 32 -163 -71 98 -63 -121 123 -80 6 36 -33 -62 -39 -138 87 -158
7330 -158 60 38 -188 27 -44 107 266 87 159 -43 -92 20 -147 -62 69 43 -210 168 -25 -8 121 -18
7352 -18 12 -151 -216 -109 45 99 -182 88 -71 -126 18 -65 -9 -192 256 -120 -72 -14 261 -65 -242 34 -60
7375 -60 -135 -37 -3 52 -1 81 123 3 43 230 130 -128 90 -107 22 -64 82 -92 -74 165 68 -15 -105 128 73
7400 73 -156 10 -147 141 -32 -155 119 16 254 -135 10 -4 96 57 -97 27 -188 53 -85 84 413
7421 413 15 -6 -67 176 -41 -47 -197 65 8 20 -190 100 178 30 66 89 183 -292 60 -209 188 128 173 -150
7445 -150 29 -45 197 92 53 45 -80 120 170 47 158 39 -80 48 -178 259 66 31 -94 153 -92 19
7467 19 15 69 78 -44 -68 181 -103 4 -85 -79 195 179 69 -60 164 114 97 137 9 184 -48 -27 -47 -114 -35 42
7493 42 352 -129 128 99 -134 -19 -102 -183 -39 -68 9 2 6 -145 114 63 -152 -34 -59 -93 -60 -2 102 173 -190
7518 -190 -46 -48 -161 -81 32 298 194 -55 -121 73 -101 112 81 -40 171 256 260 -107 -108 -43 131 15 -42 468
7542 468 -7 47 -41 -57 72 81 0 57 3 -132 136 -99 62 103 78 -72 137 -87 47 -299 72 60 -210 60
7566 60 259 135 -4 -31 -137 -168 69 24 -80 66 6 32 -106 -118 245 181 212 93 291 -25 -58 27 60 71
7590 71 48 144 -144 96 -72 -170 -97 -1 -105 -70 91 141 -35 -69 126 -121 -194 -5 -294 43 195 -49 -67 -24
7614 -24 84 -92 -69 16 -16 -31 -92 -56 -175 74 56 28 77 -41 26 189 110 -308 33 42 61 86 -174 21 41 -81
7640 -81 -61 -101 -100 -263 54 82 10 -145 -104 38 84 136 -178 -112 -95 -100 91 39 -108 -45 -151 94 238 118 120 66
7666 66 141 13 162 -72 144 -8 -56 125 30 23 235 -67 47 -45 122 -139 7 67 -89 47 100 -7 -44
7689 -44 97 24 -268 63 -194 -74 -9 61 146 99 3 -224 67 5 21 8 45 170 139 48 163 -76 -93 -100 47
7714 47 -132 69 -174 163 166 57 -103 2 154 -175 -92 30 77 -144 43 16 -156 66 30 -3 -40 1 -55 -41
7738 -41 222 26 122 62 197 287 -265 -127 135 7 -95 87 98 -42 -5 202 180 239 136 217 120 -141 -95 118
7762 118 6 -151 -20 106 42 -206 -52 23 166 182 -158 -49 46 -50 -8 -60 206 -9 -137 39 -234 -54
7784 -54 -10 98 346 111 165 -139 -80 2 95 21 51 -99 14 93 -17 -188 126 53 176 -84 -90 93 -206 -51
7808 -51 7 -48 39 84 -71 274 38 -69 47 4 15 128 71 64 97 168 -171 180 -134 336 -8 -126 108 -60
7832 -60 8 -2 101 21 119 -93 119 8 -289 -129 72 -93 102 8 131 -75 -80 82 -36 320 85 153 -206
7855 -206 13 -25 -164 -169 -41 -113 -141 141 31 -187 -156 32 -47 216 14 -152 -144 -104 59 -8 -128 34 -136 77
7879 77 -122 87 9 3 -20 10 -24 77 2 67 22 -227 -67 -5 137 22 28 -216 -154 -158 -80 67 20 -132 -38 -87 -177
7906 -177 22 197 106 6 93 132 -48 -120 88 25 36 -52 14 152 37 53 -128 -64 -134 404 105 -88 201 138
7930 138 71 162 -94 40 135 -146 -123 -140 36 279 -35 119 -162 -36 -72 95 -58 -43 0 48 13 -38 203 -86
7954 -86 -150 -85 63 -189 6 -25 40 27 -29 -28 122 -73 27 101 158 -30 -269 -30 35 124 -176 -87 -166 183 -55
7979 -55 -177 -6 159 79 -52 58 193 -149 155 -15 200 -137 -183 -314 -377 48 98 -19 27 195 18 -188
8001 -188 -58 169 28 -131 117 57 -265 1 -106 56 -226 74 -36 165 -94 -18 130 280 69 383 -276
8022 -276 -45 -93 84 -5 6 -110 133 -65 -58 -72 160 66 -92 -160 99 -50 34 174 -41 -3 32 -46 -64 339
8046 339 -144 -156 112 -8 65 1 31 -30 -19 -25 -134 -120 -144 103 20 -9 -100 23 -228 -138 -35 -9 -120 -115 53 152
8072 152 117 71 240 262 -49 -9 96 -128 27 125 -44 66 -86 -160 -180 -148 -27 -15 -137 70 228 170 99 69
8096 69 106 2 -17 162 -63 -80 55 58 -98 212 117 166 31 232 40 -208 -14 93 37 -100 8 34 -24 63
8120 63 -87 20 162 50 -24 -360 -157 -62 -61 -163 5 -6 103 47 5 32 -30 122 -154 44 -147 163 -91
8143 -91 61 52 219 -11 181 67 -149 13 384 20 -272 -58 -26 -127 140 47 75 -62 223 35 -128 58
8165 58 55 88 -120 162 58 200 110 66 -51 86 73 56 132 -141 150 -73 247 -127 86 257 -154 -42 -151
8188 -151 261 -68 55
8191E5
##END NTUPLES=NMR FID
##END=
