##TITLE=1H_SA_sl.OH_3
 CDCl3, 8 sc, 
 1.9.2020
##JCAMPDX= 6.0         $$ Bruker NMR JCAMP-DX V2.0
##DATA TYPE= NMR FID
##DATA CLASS= NTUPLES
##ORIGIN= UXNMR, Bruker Analytische Messtechnik GmbH
##OWNER= root
$$ XWIN-NMR		Version 3.5
$$ Tue Sep  1 11:23:33 2020 Russian Standard Time (UT+4h)  she@DPX200
##.OBSERVE FREQUENCY= 200.1315066352
##.OBSERVE NUCLEUS= ^1H
##.DELAY= (6, 6)
##.ACQUISITION MODE= SIMULTANEOUS
##.ACQUISITION SCHEME= undefined
##.AVERAGES= 8
##.DIGITISER RES= 18
##SPECTROMETER/DATA SYSTEM= spect
##.PULSE SEQUENCE= zg30
##.SOLVENT NAME= CDCl3
##.SHIFT REFERENCE= (INTERNAL, CDCl3, 0, 15.7039)
##AUDIT TRAIL= $$ (NUMBER, WHEN, WHO, WHERE, WHAT)
$$ ##TITLE= Audit trail, XWIN-NMR		Version 3.5
$$ ##JCAMPDX= 5.01
$$ ##ORIGIN= Bruker BioSpin GmbH
$$ ##OWNER= she
$$ F:/spectra/data/she/nmr/H-F/1/audita.txt
$$ ##AUDIT TRAIL=  $$ (NUMBER, WHEN, WHO, WHERE, WHAT)
(   1,<2020-09-01 11:22:20.34 +0400>,<she>,<DPX200>,
      <created by zg, POWCHK disabled, PULCHK disabled
       configuration hash MD5:
       00 E9 B6 7A A2 85 ED C7 34 08 36 98 17 FE 4E 26
       data hash MD5: 16K
       19 35 8D DD 1C C5 37 5B 45 00 1D 90 C7 53 24 A2>)
$$ ##END=
$$ 
$$ hash MD5
$$ B3 48 F9 EE BD CA A2 74 88 29 77 5B 8C A5 EF E6
##$RELAX= 
##$RELAX= 
##$RELAX= 
##$RELAX= 
##$RELAX= 
##$RELAX= 
$$ Bruker specific parameters
$$ --------------------------
##$DU= <F:/spectra>
##$EXPNO= 1
##$NAME= <H-F>
##$PROCNO= 1
##$TYPE= <nmr>
##$USER= <she>
##$AMP= (0..31)
100 100 100 100 100 100 100 100 100 100 100 100 100 100 100 100 100 100 
100 100 100 100 100 100 100 100 100 100 100 100 100 100 
##$AQSEQ= 0
##$AQ_mod= 1
##$AUNM= <au_zg>
##$AUTOPOS= <>
##$BF1= 200.13
##$BF2= 200.13
##$BF3= 200.13
##$BF4= 200.13
##$BF5= 200.13
##$BF6= 200.13
##$BF7= 200.13
##$BF8= 200.13
##$BYTORDA= 1
##$CFDGTYP= 0
##$CFRGTYP= 5
##$CHEMSTR= <none>
##$CNST= (0..31)
1 1 145 1 1 1 1 1 1 1 1 1 1 1 1 1 1 1 1 1 1 1 1 1 1 1 1 1 1 1 1 1 
##$CPDPRG= <>
##$CPDPRG1= <>
##$CPDPRG2= <>
##$CPDPRG3= <>
##$CPDPRG4= <mlev>
##$CPDPRG5= <mlev>
##$CPDPRG6= <mlev>
##$CPDPRG7= <mlev>
##$CPDPRG8= <mlev>
##$CPDPRGB= <>
##$CPDPRGT= <>
##$D= (0..31)
0 1.2 0 0 0 0 0 0 0 0.06 0 0.03 0 0 0 0 0.0002 0 0 0 0 0 0 0 0 0 0 0 0 
0 0 0 
##$DATE= 1598944939
##$DBL= (0..7)
120 120 120 120 120 120 120 120 
##$DBP= (0..7)
150 150 150 150 150 150 150 150 
##$DBP07= 0
##$DBPNAM0= <>
##$DBPNAM1= <>
##$DBPNAM2= <>
##$DBPNAM3= <>
##$DBPNAM4= <>
##$DBPNAM5= <>
##$DBPNAM6= <>
##$DBPNAM7= <>
##$DBPOAL= (0..7)
0.5 0.5 0.5 0.5 0.5 0.5 0.5 0.5 
##$DBPOFFS= (0..7)
0 0 0 0 0 0 0 0 
##$DE= 6
##$DECBNUC= <off>
##$DECIM= 32
##$DECNUC= <off>
##$DECSTAT= 4
##$DIGMOD= 1
##$DIGTYP= 9
##$DL= (0..7)
0 120 120 120 120 120 120 120 
##$DP= (0..7)
150 150 150 150 150 150 150 150 
##$DP07= 0
##$DPNAME0= <>
##$DPNAME1= <>
##$DPNAME2= <>
##$DPNAME3= <>
##$DPNAME4= <>
##$DPNAME5= <>
##$DPNAME6= <>
##$DPNAME7= <>
##$DPOAL= (0..7)
0.5 0.5 0.5 0.5 0.5 0.5 0.5 0.5 
##$DPOFFS= (0..7)
0 0 0 0 0 0 0 0 
##$DQDMODE= 0
##$DR= 18
##$DS= 0
##$DSLIST= <SSSSSSSSSSSSSSS>
$$ [...]
##$SUBNAM2= <"">
##$SUBNAM3= <"">
##$SUBNAM4= <"">
##$SUBNAM5= <"">
##$SUBNAM6= <"">
##$SUBNAM7= <"">
##$SUBNAM8= <"">
##$SUBNAM9= <"">
##$SW= 16.880792210976
##$SWIBOX= (0..15)
0 0 2 0 0 0 0 0 0 0 0 0 0 0 0 0 
##$SW_h= 3378.37837837838
##$TD= 16384
##$TD0= 1
##$TE= 0
##$TE2= 300
##$TE3= 300
##$TEG= 300
##$TL= (0..7)
0 120 120 120 120 120 120 120 
##$TP= (0..7)
150 150 150 150 150 150 150 150 
##$TP07= 0
##$TPNAME0= <>
##$TPNAME1= <>
##$TPNAME2= <>
##$TPNAME3= <>
##$TPNAME4= <>
##$TPNAME5= <>
##$TPNAME6= <>
##$TPNAME7= <>
##$TPOAL= (0..7)
0.5 0.5 0.5 0.5 0.5 0.5 0.5 0.5 
##$TPOFFS= (0..7)
0 0 0 0 0 0 0 0 
##$TUNHIN= 0
##$TUNHOUT= 0
##$TUNXOUT= 0
##$USERA1= <user>
##$USERA2= <user>
##$USERA3= <user>
##$USERA4= <user>
##$USERA5= <user>
##$V9= 5
##$VALIST= <valist>
##$VCLIST= <CCCCCCCCCCCCCCC>
##$VD= 0
##$VDLIST= <DDDDDDDDDDDDDDD>
##$VPLIST= <PPPPPPPPPPPPPPP>
##$VTLIST= <TTTTTTTTTTTTTTT>
##$WBST= 1024
##$WBSW= 4
##$XGAIN= (0..3)
0 0 0 0 
##$XL= 0
##$YL= 0
##$YMAX_a= 146311
##$YMIN_a= -112659
##$ZGOPTNS= <>
##$ZL1= 120
##$ZL2= 120
##$ZL3= 120
##$ZL4= 120
##$ABSF1= 10
##$ABSF2= 0
##$ABSG= 5
##$ABSL= 3
##$ALPHA= 0
##$AQORDER= 0
##$ASSFAC= 0
##$ASSFACI= 0
##$ASSFACX= 0
##$ASSWID= 0
##$AUNMP= <proc_1d>
##$AZFE= 0.1
##$AZFW= 0.1
##$BCFW= 1
##$BC_mod= 2
##$BYTORDP= 1
##$COROFFS= 0
##$CY= 11.3945322036743
##$DATMOD= 1
##$DC= 2
##$DFILT= <>
##$DTYPP= 0
##$F1P= 16.9975609425685
##$F2P= -3.02152046262296
##$FCOR= 0.5
##$FTSIZE= 0
##$FT_mod= 4
##$GAMMA= 1
##$GB= 0.15
##$INTBC= 1
##$INTSCL= 1
##$ISEN= 128
##$LB= 0.24
##$LEV0= 0
##$LPBIN= 0
##$MAXI= 10000
##$MC2= 0
##$MEAN= 0
##$ME_mod= 0
##$MI= 1.114404
##$NCOEF= 0
##$NC_proc= 0
##$NLEV= 6
##$NOISF1= 3.799351
##$NOISF2= 2.8
##$NSP= 1
##$NTH_PI= 0
##$NZP= 0
##$OFFSET= 15.70392
##$PC= 1
##$PHC0= -9972.674
##$PHC1= 8.60092
##$PH_mod= 1
##$PKNL= yes
##$PPARMOD= 0
##$PSCAL= 0
##$PSIGN= 0
##$REVERSE= no
##$SF= 200.130013532006
##$SI= 16384
##$SIGF1= 3
##$SIGF2= 2
##$SINO= 400
##$SIOLD= 16384
##$SREGLST= <1H.CDCl3>
##$SSB= 0
##$STSI= 0
##$STSR= 0
##$SW_p= 3612.71676300578
##$SYMM= 0
##$S_DEV= 0
##$TDeff= 0
##$TDoff= 0
##$TI= <>
##$TILT= no
##$TM1= 0
##$TM2= 0
##$TOPLEV= 0
##$USERP1= <user>
##$USERP2= <user>
##$USERP3= <user>
##$USERP4= <user>
##$USERP5= <user>
##$WDW= 1
##$XDIM= 8192
##$YMAX_p= 0
##$YMIN_p= 0
$$ End of Bruker specific parameters
$$ ---------------------------------
##NTUPLES= NMR FID
##VAR_NAME=  TIME,          FID/REAL,        FID/IMAG
##SYMBOL=    X,             R,               I
##VAR_TYPE=  INDEPENDENT,   DEPENDENT,       DEPENDENT
##VAR_FORM=  AFFN,          ASDF,            ASDF
##VAR_DIM=   8192,          8192,            8192
##UNITS=     SECONDS,       ARBITRARY UNITS, ARBITRARY UNITS
##FACTOR=    0.000296,      1,               1
##FIRST=     0,             0,               0
##LAST=      2.424536,      0,               0
##MIN=       0,             -112659,         0
##MAX=       2.424536,      146311,          0
$$ Real data points
##PAGE= N=1
##DATA TABLE= (X++(R..R)), XYDATA
0 0 0 0 0 0 0 0 0 0 0 0 0 0 0 0 0 0 8 -8 8 -8 8 -16 16 -16 24 -24 31 -32 40 -46 52 -60 68 -77 88 -100 111 -126
38 -126 141 -156 175 -195 215 -239 265 -294 324 -357 394 -435 480 -529 581 -640 707 -781 867
57 867 -961 1071 -1196 1348 -1527 1750 -2028 2392 -2895 3631 -4838 7311 -28454 75906 16241
72 16241 -102621 -59245 -61211 -28222 21315 -49339 -112659 -2521 55547 -19551 -65833 -15984
84 -15984 -14011 -2978 9423 -28315 -33387 5873 -3922 -52180 -25524 3655 -12548 -14981 -8250
97 -8250 -16922 -20222 -1523 -24406 -23039 -94 -12277 -25589 -10819 -31558 -53365 -14851 -13653
110 -13653 -13211 -13075 -44932 -38872 11584 10063 -48538 -40953 2340 17014 -4475 -44209 -75094
123 -75094 -21627 38598 -24818 -77271 -44949 4404 504 -29757 -53902 -34085 31681 34238
135 34238 -26649 -46493 13566 31108 -1546 -16215 -13568 8942 18991 -8975 -45931 -15747
147 -15747 15870 -271 -22533 -20779 -252 -1122 -6540 -21125 -14828 5640 6779 -8407 -14848
160 -14848 -9524 -10632 -470 -1879 2738 -1514 -6564 6803 13379 9244 -7239 1858 23143 30371
174 30371 4452 -16990 -5560 18441 25400 -12895 -25408 2039 27510 7076 -25794 -19880
186 -19880 16384 39099 6510 -19864 -6288 33756 29511 -10455 -17388 8684 34444 13288
198 13288 -22982 -25429 13345 23757 -3640 -20838 -10244 19865 13648 -7902 -16978 3563 21486
211 21486 11400 -4682 -5791 7945 7638 7493 -439 3705 8326 4508 7846 7183 5266 -1308 7401
226 7401 15108 13837 -801 -7498 6413 14002 9751 -13517 -9091 12935 17482 -4815 -19355 -1540
240 -1540 21010 20598 -11849 -14090 11676 30089 10353 -19262 -6258 22418 28605 -4295 -22204
253 -22204 -2580 26760 15668 -17163 -16829 6517 24920 2356 -19595 -11750 14476 17967 -5588
266 -5588 -15155 -3034 15448 5178 -6925 -9694 2005 9803 -403 -4835 -4519 2749 462 770
280 770 -935 -1198 -2913 -3452 4871 1104 -2942 -10230 -185 9645 2196 -11666 -12230 6742 11522
295 11522 -1152 -20615 -7567 13695 11898 -10040 -21759 3021 20332 8817 -17909 -13670
307 -13670 12842 23932 207 -22094 -3490 18454 17904 -12632 -20402 2786 19189 5917 -18867
320 -18867 -13600 7731 17500 -4553 -15786 -4388 11382 10721 -8474 -10018 -150 9973 1157
333 1157 -8055 -6585 1349 2221 -4588 -1059 -3906 -1094 -1360 976 2021 -2101 -5552 -4342 5882
348 5882 1709 -8859 -15643 -295 7366 -5789 -16306 -14011 6602 10120 -6436 -20284 -2616
361 -2616 18122 9757 -13039 -17379 8416 16596 627 -22604 -15771 9598 10138 -13245 -27511
374 -27511 -6788 11699 5360 -19688 -17442 6690 14833 1947 -15028 -4460 11794 13591 -4930
387 -4930 -11476 2863 13711 4692 -9216 -883 3916 7486 3912 -1611 613 6216 6142 -2400 1342
402 1342 709 -4157 -5823 3535 85 -13258 -9625 -3964 3723 687 -7662 -11808 6487 18334 407
417 407 -13287 -1147 20660 12503 -5021 -13620 -1410 15259 5185 -17056 -17346 10272 14055
430 14055 -5599 -19096 -2179 18672 12575 -3714 -9495 10748 21555 7457 -13083 -5380 16744
443 16744 15768 -4489 -16062 1339 10383 5866 -6028 -8946 3730 12246 5341 -9864 -4137 5481
457 5481 5259 -1403 678 -294 -6740 1546 4043 3095 1582 3565 4425 13510 18565 3422 -759 14252
473 14252 27482 10942 -594 2344 8509 12593 1413 -11689 -6885 14289 6311 -14284 -13842
486 -13842 5766 12321 -1790 -7308 -3046 13104 13113 -6717 -16871 3847 20087 2191 -14983
499 -14983 -12837 7398 9652 -3903 -14637 -6912 13494 12582 -5240 -13817 2483 10624 5214 -3194
513 -3194 -3633 2155 1293 1021 -4928 -1739 2425 2263 1483 5428 4784 -3834 378 6428 9621 1387 -5308
530 -5308 -3163 1674 631 -12925 -12977 -2786 3383 -7906 -15745 -10237 1756 6302 -8648 -9839
544 -9839 6405 17380 2628 -10970 -4013 11332 17519 240 -13841 -4833 16904 7866 -14394
557 -14394 -11929 4154 13456 4005 -10302 -14382 5541 11555 -5146 -12886 -1860 5645 -3440 -6969
571 -6969 -10904 -5837 2906 -423 -8415 -4171 3294 -3812 -3716 -220 1612 -616 -273 -822 -4238 -2507
587 -2507 -6878 -5002 317 555 -9420 -8776 1364 3054 -715 -8643 -1177 11926 13643 -3560 -11029
602 -11029 4389 15707 9363 -8491 -8863 4424 15158 136 -18282 -7227 11059 11413 -6178
615 -6178 -12181 -3355 10993 6904 -8719 -8722 6714 13582 -2573 -8934 -1876 7663 7576 -1145 -4910
630 -4910 3001 12171 2708 -4094 -890 8162 7814 1587 -1031 -2099 2534 2258 64 -2653 -443 -1325
646 -1325 -1236 2533 -1264 -3638 -4132 5075 7950 1691 -6114 -3989 7910 9725 -259 -10357 -44
661 -44 11111 7388 -7701 -12268 3484 12052 3757 -11569 -6897 7277 11538 -2597 -11877 622
675 622 12187 8975 -7436 -7301 5350 12580 3659 -7734 -2251 9204 11035 -3327 -6633 1890
689 1890 10227 6393 -3895 -2757 2851 8248 1629 -2410 -829 4446 3990 260 1330 -415 1521
704 1521 1488 3821 2547 -247 -1093 1159 6659 2961 -2899 -4252 6410 8401 -121 -6757 -2661 9148
720 9148 7031 -3306 -10120 847 10256 3372 -10005 -8446 6744 8898 -399 -11670 -3807 10236
734 10236 8701 -5613 -10347 3007 10940 4148 -9276 -6019 5464 8851 -422 -9765 -1515 6792
748 6792 5926 -4222 -4831 2250 6616 2490 -3669 -690 2367 4501 -528 -1871 -93 542 581 -91
764 -91 1965 -203 -265 765 5372 4046 -720 -211 3470 9405 3030 -4108 -2563 7048 7146 -3491 -8456
781 -8456 -2511 8332 2830 -7914 -10190 2690 10249 164 -10300 -6013 9294 8157 -4069
794 -4069 -11049 -651 9875 3933 -8027 -10672 4059 9165 170 -9726 -3359 7561 6242 -2090
808 -2090 -7605 1040 6108 3528 -5831 -6264 1044 2074 -2317 -6302 -2453 -1200 451 -1110 -1474 -477
824 -477 260 1650 1226 2901 -781 -2406 316 3873 208 -6933 -4760 818 3727 -4274 -8209 -3883
840 -3883 5804 6210 -4581 -6996 3432 12920 4061 -5665 -3431 8101 11538 -86 -8164 -2730
854 -2730 10941 7567 -6225 -8854 3302 9959 1344 -6688 -6465 5286 6122 -3216 -10525 -4200 4086
869 4086 -744 -8156 -9651 -1055 1305 -1820 -6009 -3233 2953 2519 554 -1608 2335 3617 2653 623
885 623 1201 685 -2226 -35 652 -254 -5034 -3537 806 2622 197 -5254 -2290 6110 8976 -2394
901 -2394 -6710 1798 8555 4408 -6468 -6458 988 8402 -70 -10727 -6117 6249 6364 -5263 -7341
916 -7341 -1022 7902 3396 -5949 -6505 4117 8963 -1741 -7307 -2002 7188 4673 -2132 -3993 3263
931 3263 10981 4531 -1125 155 7706 7669 2961 -1020 -286 3268 679 -1947 -4103 -2505 -4049 -2767
947 -2767 -1394 -3091 -4355 -4694 -740 2175 2274 -3878 -4217 3660 5602 -288 -6146 -712 4165 4800
963 4800 -2976 -7146 -464 7215 3169 -7084 -2558 5880 7752 -1099 -5969 346 7839 6800 -5285
978 -5285 -6255 3390 9553 99 -7384 -2528 6871 8711 -1390 -5052 -553 7962 5866 -2511 -4252
993 -4252 1594 5105 -889 -3774 -3896 -262 195 -795 -1766 -2160 443 -616 1005 2958 3714 -135 1849
1010 1849 5660 3451 1349 -963 2879 3959 2754 -2884 -3146 2761 2773 -3108 -5913 1391 4099 698
1026 698 -6431 -6067 3179 5746 -1887 -9737 -2509 5885 4233 -6698 -9523 485 7717 3996 -7877
1041 -7877 -6115 3217 7773 715 -6516 -2868 4077 5432 -3315 -5263 -1258 3018 495 -2831 -1918
1056 -1918 -454 1866 -1057 -1494 512 3118 644 -554 1837 1343 670 -215 1451 605 255 -740 -1325
1073 -1325 1051 -478 -3512 -3175 3534 1883 -3732 -4864 -696 4799 1823 -4274 -6585 3005 7564
1088 7564 109 -8469 -4304 5929 5516 -1525 -8403 -2484 6065 4727 -5396 -7725 1194 5109 375
1103 375 -7098 -4283 1373 3198 -2365 -6259 -1357 2536 766 -4878 -3317 1022 2467 -1375 -3769
1118 -3769 -692 896 1667 -1839 -1675 -561 997 541 -1160 -206 -1449 -786 -238 1866 -1038 -3422
1134 -3422 -1742 1359 3318 -1606 -4378 -2190 5109 3675 -3447 -5109 1057 7130 2071 -4049 -5002
1149 -5002 3674 6705 -550 -6687 -2520 5926 3498 -3186 -6565 1069 6024 1340 -5476 -4281 4107
1164 4107 4444 -1699 -6451 -1412 4151 2148 -4437 -5949 628 2678 279 -4669 -3116 922 2352
1179 2352 -445 -2981 -366 287 795 -1221 -812 -1679 -2065 -386 -251 -494 -3248 -2874 -1036 2327 -442
1196 -442 -4370 -2270 2229 3449 -2491 -4147 -1399 3990 2378 -4385 -5435 881 5204 -1644 -5995
1211 -5995 -3170 4268 4584 -2484 -5580 -774 7128 2626 -4575 -4609 3008 5446 -917 -5766 -3765 4299
1227 4299 3370 -2521 -5428 193 4460 1199 -1928 -2551 2485 3244 475 -2936 -868 664 -752 -1621
1243 -1621 -2972 -1414 -2329 -2366 -2399 -1333 -2070 -3581 -935 675 485 -3207 -2255 697 2421 -305 -4318
1260 -4318 -1570 2649 2773 -4290 -4692 419 4761 1545 -4720 -3108 2745 6106 -1585 -5661 -1382
1275 -1382 5037 2684 -4912 -6615 -665 4789 -609 -6336 -4985 2344 4027 -2386 -4793 -1161 4698
1290 4698 2772 -1928 -3363 1183 3582 -199 -2732 -2564 1391 397 -1580 -2598 -311 398 -353 731
1306 731 585 1670 108 771 1917 2080 290 -1595 1092 2071 523 -4093 -2412 1219 1680 -2095
1322 -2095 -6041 -1449 2318 1006 -5690 -5509 758 3100 -1979 -7716 -4554 1387 2418 -4517 -7621
1337 -7621 -1452 4682 1503 -5275 -3415 2677 6488 720 -3405 -1012 4572 4623 -2054 -3703 -107
1352 -107 3402 113 -3245 -3065 181 1661 -1020 -1906 -1019 1638 505 -675 -299 308 641 -704 230
1369 230 -444 -801 -1840 -529 470 -546 -2318 -2363 1723 2003 -636 -3705 -496 4159 2423 -2029 -4104
1386 -4104 1742 4616 1780 -4253 -3078 3977 5160 -194 -5074 247 5652 4043 -2390 -3514 1952
1401 1952 4630 1042 -5245 -3191 1759 2484 -3651 -6133 -1726 1540 -192 -4457 -3169 57 3337
1416 3337 -116 -2912 -852 2875 2756 -266 204 314 1764 1488 969 -76 49 1131 51 1963
1432 1963 1278 -604 -1198 2424 3763 383 -1357 -678 3324 2943 -102 -3399 -235 4705 2279 -2578
1448 -2578 -2599 2885 4053 561 -3034 -930 4292 3029 -1687 -4128 1455 4207 746 -4428 -2886
1463 -2886 2874 3396 -1009 -5086 -208 4247 3046 -2154 -2997 1383 4520 2301 -2725 -1193 1777
1478 1777 2361 -54 -1677 -1310 -266 928 -857 -1023 -945 -768 -1146 81 974 -1881 -1730 -349 1498
1495 1498 -33 -1266 -1737 623 3036 35 -2367 -877 3521 1645 -1628 -1620 1473 3596 276 -2641
1511 -2641 -1990 3762 3183 -2243 -3866 672 4647 1283 -3462 -3669 2609 4993 580 -4168 -1452 4269
1527 4269 3395 -689 -3581 183 3372 2484 -1492 -2246 1266 1987 617 -1752 -91 717 237 -623 -681
1544 -681 340 -105 -429 -769 730 169 -654 -399 713 1047 -706 -639 195 1797 -364 -1911 -454 1996
1562 1996 1510 -2712 -2434 597 3607 520 -3550 -1985 2498 4192 -1148 -3894 -753 4749 3247
1577 3247 -2178 -3521 557 4933 1138 -2850 -2492 2935 4009 24 -2288 -226 3538 2297 -729
1592 -729 -1498 1488 2725 231 -1393 -305 2056 1230 -556 -1204 998 1380 617 -98 126 1523 836
1609 836 586 145 643 51 -390 953 1145 56 -2453 -1007 1413 1956 -1585 -3381 312 3232 1751
1626 1751 -3378 -2596 1319 3768 173 -4456 -2483 2222 3024 -2534 -4064 -776 3708 1368 -3190
1641 -3190 -2518 1543 3946 88 -2370 -702 3427 2173 -1818 -2089 591 3061 184 -2208 -1894 1361
1657 1361 1695 -928 -1651 -553 2266 871 -196 -852 509 940 181 457 238 254 -604 674 1032 615
1675 615 -1085 -332 2460 2608 583 -1990 692 3367 2933 -778 -2244 1317 3266 1377 -3141 -2140
1691 -2140 2444 3620 -673 -3546 -113 3383 2689 -1956 -2393 1456 4217 734 -3655 -1682 2244
1706 2244 2735 -2065 -3448 -719 2086 817 -2680 -2060 1146 3355 389 -1074 -56 2609 2483 245
1722 245 337 1326 2686 961 996 901 1103 1522 1321 2049 1339 871 260 1944 2747 1032 -573 309 2462
1741 2462 1686 -610 -2396 275 2708 1599 -2005 -2044 2540 3696 868 -2317 521 4243 3559 -498
1757 -498 -2190 1771 3982 2031 -2499 -1449 2828 3541 -545 -2762 591 3420 2917 -1257 -1632 1621
1773 1621 3861 1447 -1891 -242 1903 2275 -740 -1802 -553 708 399 -1565 -1242 -593 245 -758
1789 -758 -607 -242 -310 -500 -393 749 -644 -1261 -1197 810 1438 -133 -1498 -399 2620 1649 -784 -1379
1807 -1379 2176 3780 1097 -1359 -459 2806 2456 -640 -3234 -64 2987 907 -3119 -3498 1371 2637
1823 2637 -430 -3543 -1156 2253 1921 -1284 -3249 243 2244 775 -2659 -2082 830 1211 -606 -2684
1839 -2684 -873 336 685 -1506 -1701 163 784 -265 -1181 -59 -296 -462 -652 -66 -402 -932 -641 -378
1857 -378 377 -890 -1607 -841 993 631 -1756 -2175 -468 1703 -679 -3187 -2521 835 1651 -2199 -3754
1874 -3754 -1771 2291 1108 -2096 -3201 717 3172 540 -2315 -1906 2429 2626 -221 -2695 -290
1889 -290 2784 985 -1793 -1991 1484 1663 -205 -2143 -850 1564 1373 -405 -2147 629 1316 183
1905 183 -979 -617 403 216 278 -610 -481 -321 153 389 599 -7 -1481 -350 848 1103 -1531 -1925
1923 -1925 29 1650 558 -2339 -1878 328 2494 -516 -2514 -1134 1959 1713 -1567 -2188 170 2864
1939 2864 232 -2078 -1741 1558 2282 -911 -2407 -483 2883 864 -2030 -2215 943 2473 203 -1918
1955 -1918 -1613 2044 2191 -181 -1746 161 2009 986 268 -504 385 761 938 465 280 374 -251 649
1973 649 685 695 -866 -845 963 1234 309 -1520 3 1111 1689 -758 -1133 650 1745 661 -1813 -652
1991 -652 1667 1881 -950 -1674 429 2292 879 -2440 -1233 1558 2776 -382 -2988 -870 2263 1701
2007 1701 -2094 -2560 -346 2690 1093 -2145 -1996 731 2385 -54 -1329 -781 1183 973 -232 -563
2023 -563 -19 809 13 -110 -27 504 -98 15 459 692 223 -573 367 803 797 -554 -367 946 844 -329
2043 -329 -925 649 1113 719 -1397 -726 1584 1395 -788 -2272 488 2416 1585 -1719 -2170 930 2955
2060 2955 392 -3025 -1469 1658 2463 -788 -2966 -737 1895 1581 -1668 -1778 214 1910 168 -1505
2076 -1505 -1050 525 1084 -1010 -1113 -612 641 -687 -1374 -875 -17 307 -989 -593 -612 309 -438 -231
2094 -231 196 -254 -283 -835 282 129 -250 -1063 263 1494 363 -1062 -1338 1582 2151 508 -1705 -194
2112 -194 2179 1826 -1074 -2641 281 2197 864 -2076 -2298 887 2357 -106 -2676 -559 1832 1473
2128 1473 -1082 -1948 523 1858 1123 -2006 -760 1280 1433 -778 -1183 363 1322 1059 -770 -722 714
2145 714 1727 -48 -633 254 247 406 -262 188 -215 -322 -314 2 509 -723 -836 -690 1282 621 -974 -1248
2165 -1248 345 1915 -257 -1623 -1412 1070 1482 -563 -2284 -642 2458 1236 -1151 -1594 1749 2861
2181 2861 890 -1172 -590 2690 2681 413 -1587 910 2726 1681 -980 -773 1475 1994 767 -1344
2197 -1344 -257 1601 1519 -440 -1210 834 919 612 -1049 -42 -32 424 83 -385 117 90 217 -2 811
2216 811 406 84 366 946 1169 -264 -437 391 1723 662 -885 -866 698 2085 -490 -1230 -437 2275
2234 2275 1591 -994 -1734 50 2348 320 -1582 -1250 1238 1432 -664 -2333 -870 1876 700 -1472
2250 -1472 -1787 640 1925 183 -1104 -850 1542 1408 218 -1276 346 1423 842 -188 -414 894
2266 894 908 828 -215 625 817 830 595 491 817 -148 98 579 917 -238 -1088 -86 575 593 -1238 -1108
2286 -1108 3 1369 -141 -1740 -927 738 1294 -982 -1753 -203 1506 294 -1803 -1453 532 1932
2302 1932 -472 -1837 -1213 1608 1279 -1366 -1887 -211 2016 241 -1544 -1632 641 1425 -298 -1339
2318 -1339 -630 1292 569 -815 -793 8 745 188 -372 -728 313 16 -389 -387 2 -307 -431 101 263 -153
2338 -153 -811 -175 272 434 -267 -1098 588 968 563 -1342 -560 1283 1569 -279 -1868 48 1455 1114
2356 1114 -1215 -1508 -42 1804 114 -2186 -1116 872 1350 -1039 -1974 -442 1339 710 -1386 -1421
2372 -1421 181 1574 -547 -1653 -584 809 697 -877 -959 -370 804 -89 -977 -984 100 372 -533 -604
2390 -604 -544 -113 -558 120 -161 -576 -381 -138 531 -53 -331 -1010 267 1174 458 -804 -975 1084 1239
2409 1239 243 -1533 -692 1306 1456 -358 -1802 311 1876 791 -1528 -731 756 1379 127 -1445
2425 -1445 100 1715 1448 -1384 -1059 729 1574 101 -1568 -513 1035 1446 -548 -1575 -231 1440
2441 1440 694 -1084 -710 -123 627 291 -440 -700 163 442 125 101 -276 -128 -204 471 694 -477 -687 -424
2461 -424 981 556 -360 -1061 221 1123 265 -826 -835 1079 806 -71 -1417 -27 1401 526 -888 -1219
2479 -1219 1146 1424 229 -1427 -435 1990 1216 -769 -1658 673 1894 989 -1516 -1370 1113 1969 404
2496 404 -1631 -246 1162 1049 -564 -993 59 764 579 -465 -171 130 465 4 -181 276 85 -66
2514 -66 -347 640 194 -178 -367 485 523 -219 -711 -542 580 -272 -597 -717 375 606 -588 -1180 -657 1113
2534 1113 239 -1085 -1332 245 1449 -487 -1927 -1339 909 1075 -680 -1984 -668 1414 807 -1301
2550 -1301 -1876 584 1378 402 -1175 -809 901 1055 -142 -1043 110 751 199 -600 -209 377 769 81
2568 81 -613 281 685 337 -225 -206 197 18 -367 -316 -34 -424 -476 -395 44 -79 -1312 -872 55 453 -581
2589 -581 -1474 -560 757 700 -983 -1054 -5 1739 297 -1517 -1318 338 1634 -263 -1455 -767 1292
2606 1292 989 -643 -1549 -105 1265 155 -934 -1275 587 780 -486 -1364 -301 927 296 -1075
2622 -1075 -1418 78 414 -215 -777 -436 307 350 -106 -878 39 158 115 16 79 189 -181 376 692 655 -19
2643 -19 -181 736 1160 871 -638 -232 871 1375 -177 -881 136 1300 663 -1082 -782 220 1308 -72
2661 -72 -1392 -777 805 1179 -867 -1442 -332 1216 377 -1067 -1096 246 1143 -304 -1032 -714 991 590
2679 590 -232 -838 200 1144 -151 -539 -336 541 543 -15 -220 22 393 0 -52 -260 150 -160 16 309
2699 309 -3 -33 -586 190 528 306 -435 -422 538 580 30 -1121 11 998 632 -527 -1133 294 1079 788
2719 788 -1107 -551 1071 1545 -46 -1333 -147 1152 1014 -840 -832 379 1432 376 -969 -457 622
2736 622 1181 -628 -813 115 646 189 -795 -916 -44 736 -492 -929 -617 346 180 -338 -439 -490 123 -346
2756 -346 -202 -527 -206 -334 -511 142 -237 -517 -824 248 485 -378 -936 -647 450 353 -364 -1444 46
2775 46 857 411 -991 -1141 719 963 -59 -1682 -81 698 794 -506 -1189 255 1211 625 -1400 -377
2793 -377 870 761 -111 -798 -171 691 780 -483 -830 56 772 47 -743 36 258 234 -174 -510 -343 124
2813 124 46 -463 -131 -67 -53 -579 -208 207 -354 -429 -268 175 -268 -447 -671 264 612 -229 -920 -413 1006
2834 1006 131 -777 -992 80 781 139 -1107 -995 738 802 -310 -1624 -172 905 559 -916 -1092
2851 -1092 302 796 288 -998 -570 698 580 -286 -708 404 639 487 -433 -502 511 892 -36 -382
2869 -382 290 634 593 -80 -147 162 249 213 139 334 -56 -106 -207 357 292 -366 -524 398 609 -205 -694 -258
2891 -258 671 442 -398 -977 -306 1066 510 -797 -1140 293 975 -207 -1048 -584 891 522 -293 -1010
2909 -1010 264 1086 218 -882 -690 741 629 -221 -733 14 951 202 -662 -979 418 677 61 -881
2927 -881 -385 293 399 4 -422 262 213 420 64 92 206 -47 303 526 506 23 -392 148 659 396 -377
2948 -377 -249 592 1077 -25 -661 -212 889 606 -464 -798 -13 844 -280 -809 -502 703 469 -623
2966 -623 -1032 -11 926 140 -779 -1058 581 1032 -313 -914 -476 1133 585 -667 -918 28 939 298
2984 298 -328 -782 276 424 77 -411 -287 76 -113 -268 -280 150 -228 -141 -214 -80 98 -690 -388 -16 321
3005 321 -509 -404 -118 511 76 -770 -118 388 687 -332 -519 365 712 143 -964 -90 851 1419 -37
3024 -37 -706 22 1124 996 -689 -903 243 1224 18 -880 -790 49 786 -389 -820 -629 534 -45 -577
3043 -577 -805 -120 218 -179 -483 -680 342 73 -509 -232 -66 65 -361 -101 -152 210 -166 -246 85 -154
3063 -154 60 -329 -64 84 -29 -478 -284 366 396 -260 -1028 -96 601 168 -811 -635 403 537 150 -1434
3083 -1434 -537 810 813 -529 -926 -67 751 662 -990 -664 278 950 55 -752 86 754 802 -421 -337 110
3103 110 901 220 -372 -237 683 341 -290 -198 68 373 354 -284 -195 -133 217 -501 -304 -88 -180 -83 -205 374
3125 374 -409 -324 -426 451 72 7 -708 -333 669 257 -588 -681 333 823 208 -655 -329 516 465 -100 -1029
3146 -1029 -255 937 599 -474 -637 449 658 174 -744 -79 782 532 -40 -624 288 675 395 -459 -263
3165 -263 326 665 227 -289 51 109 544 -75 -104 220 458 110 191 177 -121 21 27 529 147 117 30 119 666
3188 666 -84 -387 -370 265 114 -238 -694 62 625 15 -559 -672 458 658 107 -972 -307 772 333
3207 333 -609 -962 191 649 337 -930 -770 417 894 -255 -884 -61 581 328 -622 -658 -44 268 224
3226 224 -666 -553 207 430 -199 -363 69 113 104 -115 -133 88 78 237 -1 365 228 35 24 710 -37 -483
3248 -483 -49 446 494 -34 -89 -198 739 607 -251 -525 123 913 9 -766 -269 600 485 -413 -696 -300 934
3269 934 273 -857 -751 548 853 -219 -739 -373 739 619 -225 -761 53 486 35 -456 -225 450 496
3288 496 17 -296 -65 332 346 -168 -117 42 196 -49 -173 96 26 97 204 282 356 -375 11 -67 632 150
3310 150 -308 -76 483 418 -247 -450 51 891 129 -419 -462 400 1022 -162 -678 -126 1004 480 -435 -491
3330 -491 322 712 71 -592 -398 605 621 -236 -823 -170 676 348 -447 -543 -50 324 -139 -493 -396 363 129
3351 129 -436 -367 -43 43 -296 -207 -146 -19 -44 -22 -228 118 -142 -394 78 244 -37 -389 -35 317 342 -326
3373 -326 -607 -138 369 378 -571 -697 164 708 -173 -925 -216 250 658 -372 -645 -214 533 421 -356 -453 179
3394 179 631 -253 -826 -98 828 579 -526 -469 143 907 -27 -264 -327 427 460 -433 -611 10 431 111 -202
3415 -202 -441 7 -99 115 13 -75 -173 -252 146 -36 -159 -297 -727 263 281 52 -595 -65 233 485 -149
3436 -149 -389 -4 540 317 -389 -281 369 535 -110 -418 237 762 566 -344 -497 439 414 298 -608 -237
3456 -237 483 631 -10 -632 98 748 561 -297 -229 374 550 -48 -246 5 337 590 306 39 -32 352 110
3477 110 319 277 76 4 332 296 491 167 -114 206 668 172 -128 -261 419 -37 -161 -205 -103 382 63
3498 63 -579 -428 357 240 -126 -960 -105 450 470 -362 -748 98 825 183 -909 -481 547 599 267 -829
3518 -829 -228 610 355 -254 -578 333 597 291 -413 125 198 639 93 -20 275 398 119 -301 207 319
3538 319 -29 -256 -101 146 131 79 -184 273 241 -105 -169 322 92 -350 -164 -204 555 132 -138 -485 531
3559 531 744 188 -510 -481 549 466 20 -778 -68 881 309 -617 -544 -9 381 -151 -720 -693 351 365 -380
3580 -380 -634 37 195 153 -291 -269 137 345 -47 -537 -56 128 219 -361 -167 139 -58 16 -347 90 -81
3601 -81 66 -133 27 94 -218 177 76 332 -232 -2 -131 427 173 -301 -380 -46 765 -62 -328 -462 406
3622 406 614 -377 -380 -373 527 547 -373 -533 263 550 -19 -720 -537 393 439 -139 -548 -275 321 202 -289 -803
3644 -803 53 287 -139 -479 -319 -106 102 -191 -331 -7 -210 -42 -269 -211 87 -51 -11 85 95 -165 -14
3665 -14 42 64 18 -66 -67 -68 509 -285 -525 -27 591 141 -438 -60 92 326 -148 -594 -182 336 151 -410 -567
3688 -567 -133 547 131 -426 -730 -88 488 149 -428 -487 511 469 -411 -265 250 270 232 -204 -490 177 113 -75
3710 -75 -622 1 394 41 -212 -88 129 -206 148 -171 166 162 -257 -221 -268 -31 -248 -259 -80 392 101 -390
3732 -390 46 -6 391 -392 -90 305 247 374 -603 -147 384 474 -174 -505 -153 291 311 -418 -383 -94 1014
3753 1014 100 -425 -262 559 476 -162 -340 -267 458 413 -457 -179 105 630 -340 -544 -74 230 74 47 -183
3774 -183 287 315 -170 -125 -5 284 -252 -2 50 19 2 -57 147 4 158 -344 -143 73 168 -41 -484 -89
3796 -89 208 -91 -363 -313 6 137 12 -655 -254 52 508 -273 -635 -43 569 308 -678 -278 53 313 -112
3817 -112 -658 -254 331 335 -394 -443 69 406 46 -387 -183 -170 117 -125 -392 30 249 61 -188 -119 101 221
3839 221 22 -183 -203 144 255 154 388 -7 120 -160 122 276 -186 -86 50 194 332 -190 -410 501
3859 501 601 155 -290 -41 298 246 69 -437 -98 508 304 -231 -409 149 273 30 -588 -267 94 341
3879 341 -210 -571 89 291 169 -363 -48 386 426 -178 -371 -14 397 464 -198 -186 284 241 253 -42 310 192
3901 192 328 126 56 -98 244 -16 196 248 41 -102 -116 380 561 -71 59 117 497 358 -254 -327 37 541
3923 541 97 -216 -48 481 161 -30 -200 260 229 105 -314 -10 584 501 -120 -328 69 681 382 -248 -335
3944 -335 390 516 148 -474 -131 68 333 33 -199 -188 102 140 117 -196 -22 66 13 -26 -72 -295 -52 -192
3966 -192 -241 -64 -99 -12 -48 210 -16 28 -104 117 431 -80 -80 140 512 -63 -197 5 308 562 39 -272
3988 -272 206 479 129 -88 -166 467 410 -65 -393 -171 594 401 -90 -603 304 499 222 -270 -336 152 70
4009 70 271 -44 8 166 46 -30 -237 -26 -271 209 -237 -191 188 92 -145 -33 91 63 101 155 385 24 -80
4032 -80 -32 154 205 -231 -17 -116 53 -19 -368 -338 62 401 -457 -308 -1 615 325 -258 -319 220 844 -155
4054 -155 -385 -170 266 440 -73 -312 283 489 16 -85 -209 117 200 199 -282 -143 274 124 -93 -42 79
4075 79 199 -8 141 -7 259 141 47 -190 121 297 -303 47 -195 -15 -144 19 -22 -18 200 -132 -105 -2
4097 -2 -38 -438 -410 64 251 -108 -616 -281 172 327 -396 -301 -62 263 263 -330 -172 89 368 -154 -618 -43
4119 -43 299 431 -155 -63 -152 410 -11 -378 -47 120 544 -26 -186 -64 445 67 -64 -167 4 276 99
4140 99 -154 27 472 104 44 190 260 174 -167 7 126 137 -187 -253 313 -89 -72 -355 277 459 -294 -241 -146
4163 -146 136 245 23 -238 39 468 256 -200 -277 46 128 148 -499 -26 454 257 -380 -351 -3 235 108
4184 108 -168 -328 68 293 245 -483 -170 165 294 -150 -350 121 -215 -2 -90 -206 92 40 -51 102 102 169
4206 169 -164 58 211 -131 129 -164 132 -8 125 -140 116 121 191 -105 -152 311 158 -81 -364 -132 323
4227 323 457 -105 -290 -116 127 74 -358 -467 166 208 57 -455 66 199 -24 -584 -116 15 146 130 -461
4248 -461 -142 28 340 -84 -310 -136 275 126 -127 -118 -51 -101 -123 -333 120 -39 93 -348 76 -259 -134 121
4270 121 -16 178 -99 -120 73 407 -48 -122 -154 14 350 -63 -51 -70 121 268 -144 -208 -33 236 69 -343
4292 -343 -265 200 201 90 -347 -92 189 126 67 -318 72 339 174 -219 -25 27 268 -40 -57 43 193 263 25
4315 25 -164 191 -84 -90 -78 -217 -178 130 -176 -342 224 -6 91 -92 248 15 -218 -49 246 -57 -399 -199
4337 -199 -26 -117 -154 -557 210 -124 180 -495 -229 320 262 233 -214 -301 48 369 -14 -218 -501 306 320 76
4359 76 -199 112 473 331 -123 -148 258 269 -42 -170 -56 181 -34 211 -123 121 85 3 -55 -83 -5 80 236
4382 236 -85 -57 154 181 85 55 -33 78 217 -50 21 91 -191 -154 298 20 -621 -192 -35 228 17 -87 -341
4405 -341 -46 227 -252 -382 -61 390 -166 -369 -307 19 288 13 -216 -1 185 186 -192 -198 202 101 -166 -33
4427 -33 -145 38 172 -11 -249 -76 436 -90 -73 -14 -19 349 45 149 -201 51 357 183 -229 -4 -33 -96
4449 -96 298 138 130 -161 -38 262 295 39 -155 -27 320 79 -61 169 25 -8 -32 -316 -62 93 -89 -228
4471 -228 -271 -113 184 59 -263 -35 206 220 -310 -403 146 250 -191 -384 -149 174 254 -50 -117 -161 60 24
4493 24 -123 -263 -88 76 163 -30 33 16 62 -157 -155 -88 93 -69 -167 81 249 175 70 -136 -69 -12 69 -73
4517 -73 110 -181 -119 28 122 -39 78 -129 -134 321 -95 -97 -143 168 231 184 -239 -131 -40 334 -118 -271 146 182
4541 182 294 -10 -329 0 113 160 57 -58 202 243 -10 -139 99 346 53 -196 -74 -7 63 16 33 110
4563 110 78 14 -133 5 -42 97 -24 144 96 -169 -72 10 -171 -96 -82 143 42 193 37 -90 -114 150 252
4586 252 -149 51 -47 540 135 26 -112 424 283 285 -200 -16 331 73 -202 -262 -42 302 151 -25 -142
4607 -142 243 285 50 -414 112 57 223 -57 -158 -13 91 43 -150 68 51 -35 -124 -154 21 98 -12 -94 265
4630 265 246 -64 -27 287 151 -82 -106 -8 164 -167 34 -18 186 221 -73 -187 -13 237 144 -392 -127 235
4652 235 330 -51 -78 -157 94 252 70 -321 -18 164 329 83 -297 332 202 0 -108 -88 35 -153 -236 -163
4674 -163 4 113 -4 33 -26 -58 104 57 -69 83 108 -154 245 138 -191 126 121 -177 59 57 -244 -236 288 104
4698 104 -445 -82 264 105 30 -345 42 83 173 -334 -97 -134 231 121 -219 -205 128 212 43 -283 -122 210
4720 210 79 -155 -32 193 284 0 -224 -113 50 287 66 -106 -312 88 30 -35 -58 355 183 144 -107 -303
4742 -303 143 82 -141 -73 82 -19 355 -130 -24 33 5 -268 -67 85 -80 -190 -43 151 172 32 171 166
4764 166 186 -168 -122 -47 -24 1 -324 23 377 351 30 75 -213 419 202 -66 -207 -284 93 12 -454 108 -17
4787 -17 190 -79 23 267 240 189 -165 -128 190 232 -205 -192 176 23 -159 -107 -145 -95 6 -183 -35 -8 47 -129
4811 -129 -60 242 74 23 -160 158 -148 239 42 58 102 212 112 -130 109 198 81 -271 -73 94 -13 -126
4833 -126 -128 -57 71 240 -51 -27 -102 327 171 -57 -63 102 404 -115 -141 -72 245 -71 -27 -160 -94 -131 37 -94
4857 -94 59 371 148 -123 -283 -92 -28 20 -360 196 117 261 -43 -349 -180 237 -84 190 183 117 -168 24
4879 24 144 161 58 213 -204 251 166 69 10 145 99 -24 -238 -344 48 74 29 23 -353 21 267 -267 -141
4902 -141 292 140 -14 -196 -148 206 20 -188 -287 62 63 -66 -155 -92 238 -37 -50 -315 -91 -58 -120 -133 -96 -323
4926 -323 74 22 -69 -3 136 -29 -75 263 172 -153 -173 -99 288 -69 -283 -269 36 -111 -272 -125 -21 477 -111
4949 -111 23 -74 74 397 -233 -96 -10 404 176 -75 -81 -131 145 209 -111 -69 272 324 206 48 178 154 155 30
4973 30 -216 212 153 36 -102 21 -57 -37 173 -62 144 143 122 -239 49 27 53 -270 -236 -149 -400 161 -119 -18
4997 -18 -183 0 -5 -26 108 -131 -200 79 208 -93 49 -73 -134 -223 -51 -146 -322 107 177 33 -199 172 -19
5020 -19 -128 -109 -256 146 136 -197 -94 13 43 222 178 -170 217 2 5 -214 35 135 233 47 -241 339 123
5043 123 75 -78 -98 15 185 157 -216 -63 66 -161 119 -48 -11 53 106 8 302 125 -143 -148 147 47 -59
5066 -59 -142 98 155 -90 -265 13 254 138 -222 -271 33 212 192 -87 32 1 189 -2 48 -72 -64 22 94 28
5090 28 -37 298 188 -174 41 23 408 169 -175 -60 -88 -217 -11 -65 61 83 -40 175 62 -11 -28 20 -68
5113 -68 -1 -7 141 64 -64 343 34 -277 127 43 77 -247 222 110 7 -157 98 83 85 -37 -379 -108 -108 -18
5137 -18 25 -116 -23 332 119 -149 -147 -11 59 -177 -65 -127 97 98 -99 -77 50 188 131 -188 -54 31 73 80 -19
5162 -19 134 -5 -55 -84 -47 -223 -214 311 -156 78 70 22 -58 99 20 -66 -3 249 237 -51 -45 144 187 -15 -88 -116
5188 -116 60 177 138 -100 -115 -124 233 86 -249 198 16 23 108 64 22 116 -75 -74 -72 94 -121 -292 -247 -66 -66 96
5214 96 -167 137 29 -96 -43 -375 -93 54 -119 -180 2 -118 54 -214 129 -165 -70 347 54 238 -127
5235 -127 187 -102 166 155 104 -242 128 279 181 -128 -137 -255 150 -45 -174 -286 243 108 -30 148 -183 14
5257 14 134 111 -126 144 89 29 -22 4 5 432 107 47 111 142 208 -198 255 138 261 70 -201 105 52 282
5281 282 142 -71 46 81 101 117 79 -22 148 7 -88 132 -99 24 -66 33 5 -54 157 90 -47 67 -187
5304 -187 27 178 12 -62 8 191 461 -162 -81 19 260 -2 -34 -159 66 242 101 -85 1 10 76 107 -176
5327 -176 204 95 87 -62 12 203 241 25 -202 0 264 31 -18 22 -46 17 -126 130 -30 205 -74 -73 -88 113
5351 113 -249 84 -172 55 101 -105 -79 178 -79 -176 239 137 211 80 -218 -268 57 235 -7 -208 -87 -67
5373 -67 230 -106 25 -322 52 -25 -133 -68 -13 207 68 34 -337 -166 143 -45 -79 -249 16 165 4 221
5395 221 292 171 -88 -45 -66 218 44 -155 28 -69 109 104 -210 -64 -95 81 -26 -77 -73 -110 -221 274 58 -65
5419 -65 -102 88 -69 238 76 59 96 38 359 80 32 167 305 -43 69 -52 36 197 -374 3 -40 232 -80
5442 -80 -260 -126 158 -6 -99 -401 4 61 -122 -128 -58 -134 172 -51 -75 -237 -5 136 -6 36 -58 178 -24
5465 -24 -108 53 200 294 2 100 -131 39 7 -102 194 -65 -29 -35 75 -304 53 174 42 118 101 5 -64 64
5489 64 3 70 -100 -26 -81 102 -261 17 3 -96 29 -160 31 -77 96 168 56 99 114 6 91 36 -2 161
5513 161 -18 -49 -279 -25 -60 64 -226 -21 57 -49 54 17 84 -166 -90 -47 35 -216 83 11 -117 -130 9
5536 9 -40 62 -154 -32 -21 12 224 37 95 58 -54 151 39 -165 -117 373 148 62 -106 90 88 38 -54 -148 -79
5561 -79 -56 -52 -49 35 134 9 50 73 6 -82 260 -448 123 -170 61 -29 -289 -14 103 105 196 187 38 -148 83 8
5587 8 -11 -86 154 5 -233 -87 175 -79 40 193 -97 108 -165 81 162 -149 24 -182 243 -226 32 76
5609 76 -4 94 124 -48 4 75 41 91 -123 22 210 -72 -213 -266 110 159 172 -197 -120 198 -81 -73 -228 200 58
5634 58 -52 19 -130 199 -115 -3 78 -66 -119 -101 51 -115 76 91 -123 134 -14 23 -71 -12 159 4 -59
5657 -59 -67 69 -156 -2 172 34 -27 -41 162 13 53 213 44 -227 -50 -78 216 -225 -87 43 394 209
5679 209 -279 -40 -82 26 -54 -70 20 250 -1 185 71 164 58 -39 114 -324 67 120 -74 -11 -109 171 19
5702 19 -25 -52 47 300 51 -86 191 213 -84 -204 48 154 8 87 13 180 140 -67 29 177 24 127 95
5725 95 317 144 244 -51 30 11 -59 -85 -100 -12 98 21 -174 -21 34 127 76 -192 115 83 -118 -63 -127 -78 42
5750 42 92 22 -31 -175 221 -91 -49 -204 -242 64 -4 -264 -13 -93 -86 -35 -80 198 -51 4 -124 196 50 196
5774 196 -23 102 228 -114 -25 -84 -66 38 -140 105 -65 36 -113 -35 14 -52 -137 164 -12 -138 -49 -33 -141
5797 -141 16 176 187 -153 -263 73 103 -98 46 -18 16 -79 -89 -94 -77 59 -98 -59 143 -94 -271 65 -242
5820 -242 219 77 -125 -131 12 7 178 -7 -177 -153 -27 -189 36 115 50 170 59 111 -177 42 -123 18 183
5843 183 -78 -76 -17 -168 -23 86 -347 8 -3 118 224 -218 167 -66 -39 123 178 438 -40 112 89 197
5865 197 149 15 -266 -87 5 48 -29 -37 182 43 81 152 87 197 216 136 143 126 -112 20 42 93 -44 -162 84
5890 84 -85 -144 152 119 -121 -170 -44 18 -116 -191 40 -85 -25 -90 -25 67 18 222 -26 90 268 65 -52 -48
5914 -48 380 213 21 -146 32 -63 18 -225 32 -219 324 -202 -183 128 138 123 -179 -13 159 101 -117 -16
5936 -16 5 222 187 -90 51 -33 154 164 -235 -75 194 -141 139 49 -85 -104 -45 47 -106 -56 211 189 -124 207
5960 207 -20 78 -201 219 99 -28 151 25 21 -75 -36 -98 48 -201 92 -72 -184 -79 204 105 -10 23 -19
5983 -19 106 -177 -160 -178 275 36 -138 51 184 67 -41 11 117 -27 131 214 104 -94 1 -10 48 73 -136
6006 -136 -56 -15 -152 -20 -50 65 -94 173 83 -101 -85 311 -128 117 4 95 -166 -259 39 -19 86 142 -335
6029 -335 -168 113 -76 316 -58 -359 158 298 -195 -91 30 96 -9 -148 -18 77 101 -166 92 -124 -115 44
6051 44 192 -111 122 63 -309 -122 112 -59 -157 -76 -203 266 91 236 -153 -4 -155 -57 59 66 -160 156
6073 156 -88 -23 -226 -115 -242 -86 68 104 -108 -382 173 243 113 -145 -83 68 245 -226 -355 71 305
6094 305 -96 -219 -16 -15 125 71 -13 -126 127 30 -115 170 120 -152 -129 -60 -40 56 -176 -37 -90 -117 154 -26
6118 -26 -52 -140 -127 64 -197 -111 -87 125 -141 -458 39 23 13 -161 -81 -217 -88 138 -99 -148 -96 158 -120 46
6142 46 93 6 -82 119 249 191 31 -84 154 -31 59 -88 -131 170 17 66 -96 -82 208 -196 213 -216 74
6165 74 -122 44 -48 132 216 303 141 -35 243 -37 -177 114 -182 -216 55 46 -9 5 291 125 -167 154 5
6188 5 76 76 -128 -58 -5 -90 -121 118 -85 -10 112 37 -28 -190 -54 -192 28 63 -141 -3 217 139 -46 -81 9
6213 9 114 1 196 -14 274 99 -37 126 31 -62 -130 49 45 -258 -14 227 179 24 113 -37 181 -30 -179
6236 -179 -30 -63 43 70 -58 -114 -145 -25 -50 109 75 57 80 -120 39 -66 76 -179 51 -27 0 225 86
6259 86 163 132 -201 190 123 -164 65 130 -11 187 136 -151 31 115 233 -80 -63 -52 -18 104 28 -207 -214 -79
6283 -79 -129 5 -79 -253 -26 103 38 212 -94 164 -10 12 164 233 81 70 -81 -97 -16 37 216 209 -13 182
6307 182 253 49 164 132 -91 98 16 -257 -192 -12 150 109 211 -149 -57 -29 -64 -4 60 -98 -65 178 -50 -56
6331 -56 38 -228 -118 -114 100 205 75 -10 66 66 13 -24 -67 335 236 -147 -223 -32 52 53 165 -138 57 -10 185 -82
6357 -82 -99 36 105 -54 -11 116 -176 1 9 -107 138 -66 55 70 -66 -71 65 -23 295 231 220 -3 22 25 -90
6382 -90 -127 220 187 -6 -71 -19 -66 269 84 5 79 65 37 -11 103 -5 -190 -36 -91 -173 211 320 171 22
6406 22 154 47 6 -214 48 155 -115 -157 -138 -92 39 -32 -4 -266 -142 -59 -13 -217 -242 26 -49 58 -81 157
6430 157 -18 -85 19 272 94 -77 267 245 66 32 -266 99 22 -68 -62 1 39 -100 -97 -13 41 -82 75 -253
6454 -253 26 -40 -24 39 119 -187 -68 244 231 -19 128 284 -79 -122 219 -38 51 95 -184 36 -165 349 -164
6477 -164 -70 164 155 100 51 49 40 -26 -128 -45 -202 -132 109 -63 72 -19 105 -215 125 65 -57 -105 -79 -79 -11 144
6503 144 -257 7 -78 91 -75 -9 156 -18 37 73 159 74 221 167 -36 2 205 -93 10 -8 234 421 -65
6526 -65 -137 -206 111 -210 -127 59 206 173 137 118 -57 -65 202 141 -195 67 183 -39 -101 -76 1 271 -38 30 -40
6551 -40 124 89 -13 -65 -114 -4 -74 156 160 -63 296 -119 51 -271 128 243 41 -6 223 83 -32 130 128
6574 128 -45 -55 0 157 -17 -6 -102 66 254 -77 175 -165 46 135 -120 -21 25 33 87 -13 1 -26 -108 -37 162
6599 162 96 12 -1 -255 154 78 -10 58 -4 191 63 -39 -179 170 -66 10 162 71 -37 -42 -21 -21 148 15 -195
6624 -195 -17 -151 22 -129 -56 154 110 -13 -78 -30 -43 -198 17 -5 -40 271 73 129 -360 -310 126 39 -48 -352
6648 -352 -33 40 -25 271 -243 -22 5 205 -154 -108 67 146 40 100 177 -129 -128 -33 275 6 119 54 -68 8
6672 8 287 -42 2 50 42 -20 54 14 217 -143 191 69 36 7 116 -212 58 92 -117 70 -236 193 77 -153
6696 -153 149 207 238 0 48 177 45 -122 268 -2 5 327 -136 124 -55 207 6 7 56 -122 -150 -83 -58 248
6720 248 -185 -94 -94 -93 -12 -80 129 -146 -106 -314 53 63 40 70 49 -276 -5 -240 -61 4 62 32 -280 92 79
6745 79 90 -113 124 -125 41 -22 -20 -142 12 -93 25 25 -2 -85 159 181 116 16 38 78 10 -5 127 -85 -52
6770 -52 84 -111 115 -167 -7 196 71 153 66 60 19 -240 111 -22 -51 228 -81 -49 147 158 53 -114 88
6793 88 -241 42 -23 -34 57 -74 109 39 53 -42 50 39 -64 33 -38 13 207 170 -134 -164 -64 -12 -12 -221 -205 93
6819 93 -37 119 -41 235 41 112 -114 -107 23 -384 44 61 69 -12 94 -8 153 -98 -44 190 163 -96 30
6842 30 -21 -20 36 -99 -67 102 6 -97 -110 -60 24 84 87 91 -43 84 14 150 140 -172 147 134 -16 -123 -39 -107 -118
6869 -118 -27 -31 -9 18 -144 -28 39 30 140 84 101 232 -270 8 9 0 -28 -189 81 -5 114 38 105 -66 123 140
6895 140 39 -84 -77 -239 -219 195 118 -43 192 126 -86 56 154 -71 189 57 -43 30 26 8 87 -64 -66 -54 250
6920 250 217 -132 36 94 167 -79 175 -23 -121 -68 -68 -66 214 -166 83 -13 78 63 102 -25 62 -2 -7 -6 129 243
6946 243 -155 -42 -245 -164 -6 -4 7 51 170 -149 71 -113 68 194 50 12 148 -53 60 78 59 168 -139
6969 -139 147 -97 -35 -42 -40 -16 185 -76 -19 289 204 -14 91 135 16 -154 -128 38 -28 -62 139 -119 96 96 -135
6994 -135 -98 -180 -131 39 -8 163 30 214 72 -46 47 -39 118 91 -41 -205 160 46 1 121 -249 62 106
7017 106 -138 -83 207 -61 -86 117 -242 -90 239 -52 -231 -175 17 65 -109 -27 -252 -128 -64 117 -195 -34
7039 -34 -183 236 92 115 -63 46 70 167 -50 -39 104 127 207 51 -10 23 -1 -103 -87 -10 -8 -26 -90 71 -74
7064 -74 -9 44 3 110 -197 59 -161 57 -194 -171 -64 149 172 -49 -92 -81 -301 77 -58 -297 157 95 -145
7087 -145 -127 76 -174 31 -49 123 56 4 -13 184 -65 25 135 50 -12 36 62 184 89 82 317 150 -298 -25
7111 -25 108 -53 160 80 -10 50 -42 58 126 -16 166 107 -12 28 -34 137 14 116 -16 67 75 -58 85 -35
7135 -35 -17 140 113 63 -16 -43 19 -60 -225 70 -75 -287 28 73 -24 -166 -95 -187 82 6 -40 -83 -36 3 -26 -63
7161 -63 -64 -27 -30 59 18 -14 -81 71 21 -36 146 6 -171 -107 -237 -135 -205 163 81 97 -12 234 -221 -34 168
7186 168 36 75 33 -89 -84 152 -144 -148 6 41 29 74 -83 150 -96 93 80 12 132 -73 151 339 1 -17
7210 -17 -25 -40 10 230 135 32 -66 69 -189 50 128 68 26 51 -44 302 -4 278 -126 40 141 -71 -141 -110 -5
7235 -5 140 151 32 26 -72 127 14 -40 0 -76 166 -290 -202 -212 -219 -33 161 -88 29 -101 143 245 118 234
7259 234 -119 -67 31 -26 22 250 69 -23 126 -84 84 122 -105 -178 39 -34 7 -215 -88 22 -83 146 84
7282 84 253 29 35 -2 -22 125 -163 -10 -128 -286 90 -227 39 110 -228 172 24 -203 -34 60 -98 69
7304 69 -83 187 -124 -55 129 -41 -27 -24 -67 39 -97 201 294 124 -144 51 72 66 -6 136 21 -269 -71 225
7328 225 243 -23 28 33 30 -61 -40 -74 55 -98 15 -96 -1 3 66 140 128 -68 12 -144 -79 -149 85 -13 165 46
7354 46 31 -32 -78 -105 -231 54 -33 -192 -66 -95 -11 34 -85 -156 40 -35 -268 10 -68 -18 92 68 107 -61 -12
7379 -12 140 295 -60 14 49 -35 129 -248 -1 85 68 -61 -56 -111 146 239 103 136 98 -142 187 -127 -46 -94 -259
7404 -259 -184 110 -187 -117 -176 -111 -97 -222 -10 40 -82 67 -101 136 36 140 -84 23 -176 121 -111 -167
7426 -167 108 -189 -95 -106 -13 -13 46 29 154 -14 229 5 -127 -118 -122 48 -102 -97 86 69 74 -241 89 -29 -19 -197
7452 -197 230 91 -170 -273 -153 -194 -10 66 -38 120 48 -121 -39 -46 42 -82 -150 5 -63 156 -115 -71 -254
7475 -254 168 215 -25 -113 65 -50 -86 212 67 1 -166 -107 45 -76 1 192 -99 84 19 165 20 -28 -106
7498 -106 175 -103 -78 275 -106 119 -8 -26 -4 187 -60 -72 111 117 -90 19 164 42 141 83 72 -4 -145
7521 -145 -11 -263 22 -27 -154 115 77 -31 -3 -91 36 43 -83 -72 -222 -90 55 57 177 159 100 -50 -145 84
7545 84 1 -120 156 143 -28 -151 -66 94 -45 -28 163 31 160 -9 77 2 100 -43 86 -22 -37 60 -173
7568 -173 226 59 296 156 97 175 -40 -74 -82 -53 84 66 -57 42 -29 -25 26 96 58 62 -43 43 -159 81 -114 -115
7594 -115 -209 -108 -45 -30 163 236 66 -138 23 -4 -170 -43 -24 -89 3 -86 14 -81 272 -177 -150 73 157 94
7618 94 -42 30 99 208 408 -124 -63 95 92 -352 -316 226 -94 -4 -50 -68 -9 186 50 133 30 -10 -142 100
7642 100 65 -261 -121 220 -10 33 -27 12 92 -276 -250 77 -4 -37 156 -82 -13 -7 7 -13 232 73 -73 62
7666 62 199 -112 -226 30 -159 14 -2 -10 162 135 12 78 -117 -34 39 -285 -107 -5 -10 -95 41 -86 190 -114
7690 -114 -15 -158 -310 383 24 -30 -69 260 165 12 -125 126 -15 -186 -56 -58 130 -49 -288 -98 -69 251
7712 251 -191 -81 -41 156 -14 -2 25 -241 21 -67 -247 -95 95 -53 -279 60 -160 240 12 -52 153 -108
7734 -108 24 -203 88 234 -82 40 374 7 105 200 76 12 52 -13 -87 -82 -173 48 -78 -56 -138 84 175 26
7758 26 -68 -12 104 -74 102 -77 232 -95 -84 24 -24 170 -103 64 148 -42 -4 -5 -176 74 114 9 46 -26
7782 -26 -131 69 -94 -42 259 -115 -212 77 -46 -73 -107 156 168 -143 172 -17 -22 -86 -194 -55 -248 -156 39
7805 39 -42 -4 62 108 9 -42 186 -51 110 40 -91 56 34 148 -89 188 -107 119 119 256 55 -27 -36 -86 -61
7830 -61 53 34 102 285 -60 24 139 -40 -41 0 -178 235 -3 -116 -120 99 64 31 -74 -192 -150 191 -70 -174
7854 -174 -252 28 -118 -176 213 2 -145 -85 -190 57 43 27 139 -31 129 -203 -90 73 -52 -28 -78 -58 -144
7877 -144 23 110 -95 38 106 56 -56 -88 111 -212 36 47 218 43 76 134 -75 -42 -78 45 93 183 125 136
7901 136 -138 101 -117 -11 -80 -31 -159 204 94 0 363 161 -99 -96 30 21 -70 -206 15 -157 -30 -242 52
7924 52 121 66 -65 30 -196 10 25 -113 2 -173 112 -250 -137 57 128 -22 50 -99 1 -228 -199 183 14
7947 14 194 -264 181 -144 -11 -94 -81 57 -1 -150 -23 183 79 -168 149 46 -241 -28 297 137 -164
7968 -164 52 -118 153 16 71 -84 -4 64 -54 -55 291 154 -79 -15 -45 -15 232 -156 -63 105 130 76 -76 -171
7992 -171 -284 -61 -169 -98 45 -72 39 -93 21 204 16 -196 172 -91 -165 31 -11 -10 -52 272 121 99
8014 99 69 -143 109 37 -3 62 -79 -23 244 1 27 99 -174 -54 -29 -40 119 66 -32 38 -110 -37 -105 -66 -33 18
8040 18 79 112 122 -152 38 32 -167 47 -161 -569 148 -192 -150 85 94 -78 69 -168 -133 -171 -25 -176 -75 149
8064 149 44 -77 246 60 225 2 -89 -34 164 180 -85 -8 24 -132 -251 10 -55 29 132 176 151 -15 -132
8087 -132 -18 -37 120 -14 65 135 -91 71 206 115 -42 92 -172 258 -176 -21 72 85 137 15 -94 -175 -75
8110 -75 -53 -111 4 338 -145 98 -19 172 -118 -107 -272 -56 117 8 89 -1 -218 26 142 247 27 -38
8132 -38 118 166 -80 -137 -78 4 -41 15 -27 92 -62 -121 19 246 -175 61 125 181 185 0 225 -37 -28 -68 18 100
8158 100 -129 43 -11 226 -183 72 104 -233 -50 -134 6 -64 249 -64 42 -70 68 10 -64 -33 87 -23
8180 -23 150 128 -187 -95 -58 141 79 72 -115 88 -322
8191c22
$$ Imaginary data points
##PAGE= N=2
##DATA TABLE= (X++(I..I)), XYDATA
0 0 0 0 0 0 0 0 0 0 0 0 0 0 -8 8 -8 8 -8 16 -16 24 -24 32 -33 40 -48 56 -64 75 -88 101 -115 131 -149 169
34 169 -192 216 -241 268 -300 337 -373 415 -460 509 -565 621 -685 756 -834 919 -1012 1116
52 1116 -1229 1357 -1500 1661 -1844 2056 -2301 2591 -2940 3368 -3912 4624 -5596 7022 -9307
67 -9307 13581 -24312 112422 146311 -52468 26042 52712 54243 66703 17864 -56779 44613
79 44613 98155 8025 -50060 20950 46795 31905 43726 16617 6905 46230 41753 -3001 12631
92 12631 54826 26499 13626 19770 18443 11059 30198 22098 14532 41992 33506 13967 24837
105 24837 21768 -2539 29985 38506 10964 11358 -11778 -7480 32956 31763 -23464 -14561 41338
118 41338 44710 12933 -15207 -16365 28160 78001 11925 -50885 -5656 39121 18214 -28275
130 -28275 -38329 -17039 31624 22003 -41832 -50988 14180 40894 -4575 -13784 4191 26061 29983
143 29983 5073 -20273 8097 44525 15785 -10893 -7272 14546 11367 -2148 -7649 -2923 17460
156 17460 12386 -5279 -12673 -1557 -875 1899 33 -6753 -7400 -16655 -5663 -1701 -8267 -18723
170 -18723 -9071 13238 12622 -8248 -23938 400 22469 22270 -11274 -22946 9540 24195 -1114
183 -1114 -34610 -19758 12669 22413 -13600 -38225 -12323 22466 18194 -22678 -19618 14006 32771
196 32771 8769 -23774 -14359 22245 30091 -7435 -20475 -5055 19593 10102 -17294 -16859 3528
209 3528 20298 3898 -11931 -8966 8226 8917 2538 -274 -814 7975 1973 2954 3234 2244 -245
224 -245 6288 15350 9320 763 -3329 14197 19609 11061 -5123 -2020 21462 17834 -4201 -16843
238 -16843 4595 21324 12069 -16863 -18215 12934 22214 2021 -24231 -4333 25026 22328 -8968
251 -8968 -21494 6453 28984 15282 -19773 -12466 14488 24072 394 -21801 -5157 17767 17857
264 17857 -9559 -15378 1597 16999 5863 -10299 -5545 4607 12614 -260 -5583 -1074 5781
277 5781 5529 1299 2338 230 3105 1015 7876 5097 -731 -1777 4917 15324 3829 -6274 -4406
292 -4406 13764 15423 -254 -12663 -1037 20991 10925 -9929 -16441 8228 21967 3222 -18404
305 -18404 -11562 17576 19952 -3293 -21934 1499 24212 14591 -11538 -16402 12047 22073 4502
318 4502 -18658 -9020 13150 15499 -6829 -19518 -581 11218 7394 -12100 -11622 3518 9165
331 9165 695 -10272 -4571 2560 3727 -6198 -3992 -3393 -3803 -1162 -3090 -512 -4694 -4374 -2049 6374
347 6374 3238 -7351 -7542 3768 12556 -5143 -13687 -7792 8008 7336 -12247 -20506 -3661 16147
361 16147 2392 -17196 -14922 12564 19731 -1400 -16007 -5270 20935 15539 -9658 -19753 2082
374 2082 16669 1145 -21501 -19547 6697 8225 -9040 -22615 -9147 8339 4233 -11678 -17110
387 -17110 1289 9094 -1763 -16186 -7193 2133 -1070 -3818 -9743 -5205 70 1209 -5836 -2842
401 -2842 1740 -2849 -2514 2975 2017 -12787 -9097 -1930 -1560 -7910 -17938 -18154 -5903 3477 -15740
416 -15740 -26015 -9554 10441 1918 -17447 -15359 -811 13969 760 -19313 -15873 8612 8767
429 8767 -16946 -25992 -9060 9849 -3077 -19591 -19095 1066 11624 -4715 -18182 -6595 16984
442 16984 11850 -9137 -16280 2731 13370 638 -9527 -10712 2883 7560 -1475 -13901 -6917
455 -6917 6376 3277 -4357 -5508 -2481 -9888 -4899 -1967 -8614 -11422 -11425 -9881 -7233 -3322 -15289
470 -15289 -17005 436 12454 -1292 -13355 29 8905 11352 2238 -6683 -414 15614 7374
483 7374 -16998 -13089 4549 8172 -10450 -15586 -6353 4931 4112 -14294 -17034 4238 19120 -1340
497 -1340 -18497 -9488 8920 8681 -10190 -15950 -6806 9796 4540 -14659 -18328 173 10903 -179
511 -179 -6458 -5389 2837 1651 -1130 -4234 -3670 2082 -976 -2365 -2052 -292 -6932 -2137 7263 7716
527 7716 2618 -2407 4678 9335 9464 -1652 -1731 8682 9014 -4340 -14472 -6580 455 257 -15095
542 -15095 -18323 -1935 4617 -9743 -21942 -7754 7114 9086 -7316 -17191 -3850 13876 5226
555 5226 -18839 -11252 6769 10343 -3783 -15625 -12650 5153 12290 -7382 -13148 -603 8403
568 8403 -3079 -8761 -6523 -3561 3462 -2690 -11212 -8971 -315 -6570 -9003 -2400 -1476 -2276 -3388
583 -3388 -523 -3633 -1340 -2263 -1721 3219 323 -8366 -10452 391 -1289 -7487 -12876 -6685 4766
598 4766 1285 -11857 -16115 3294 13069 3561 -11015 -7370 8660 13528 -362 -17104 -3138
611 -3138 14594 8481 -11203 -14739 -1348 8243 2489 -13408 -10463 3849 8212 -8308 -15405 -2724
625 -2724 4424 1516 -8970 -10430 -2922 4336 -4374 -12197 -4132 3583 3509 -4742 -4575 -2543 2007 2554
641 2554 -1297 -2407 -1212 338 -2897 361 -3620 -6280 -4261 1384 3374 -5111 -9368 -5125 6718
656 6718 5901 -3984 -9690 839 12147 4084 -8119 -9590 7210 12645 504 -11689 -5575 9441
670 9441 8563 -4620 -12694 1947 12047 4260 -10407 -8911 7084 10111 -129 -10410 -2387 8774
684 8774 7528 -5679 -8824 3681 8941 3650 -6858 -3754 3850 6276 244 -5119 -618 3430
698 3430 3157 -2799 -1243 -1117 -265 905 264 65 -3667 -2340 -361 3554 -327 -5644 -4517 3785
714 3785 6534 -4500 -7300 -1336 8736 5091 -6011 -7674 2953 11514 1094 -9610 -6338 9003
728 9003 8551 -4387 -11288 -2770 11221 5677 -7474 -10405 5127 11710 1492 -8984 -4040 9753
742 9753 8635 -1060 -8773 601 9548 4754 -4639 -5139 4247 6580 1659 -4437 103 4568 4544 989
758 989 -1970 2096 1994 1625 -440 1040 -732 -2250 -420 783 676 -4595 -2162 1910 5305 550
774 550 -5511 -560 7821 8060 -3541 -5358 2096 10088 3123 -8632 -6723 3822 9455 -3418 -12077
789 -12077 -5215 8864 6253 -7490 -10123 893 10945 1423 -9100 -8499 5234 9036 -3282
802 -3282 -10770 -3368 8563 3879 -4823 -6923 2797 8730 3660 -3059 -2651 6838 6232 625 -2994
817 -2994 949 2858 1011 -474 -2654 -404 -496 1046 586 1247 751 -755 3520 5874 3954 -2997
833 -2997 501 5689 5450 -2325 -7436 -1054 4298 2759 -9027 -9796 845 7823 -1631 -11371 -4113
848 -4113 6731 8705 -3952 -8713 -189 10865 6509 -8245 -7409 5325 10896 -473 -7206 -2888
862 -2888 7917 8777 -1870 -5726 1288 9687 2668 -5806 -5030 2315 3152 -3900 -7133 -5457 762
877 762 -1564 -4630 -5312 -1427 2056 90 -54 671 2841 886 3170 4365 2249 -1039 -714 3998
893 3998 2659 -449 -5089 -1520 5759 5878 -3245 -6331 5101 10344 5310 -4224 -1308 7585 10967
908 10967 2592 -7866 -1214 9587 7571 -6083 -6524 2051 7226 2342 -7827 -4991 4779 8034
922 8034 -3835 -9016 -1219 5717 1662 -7421 -6352 -33 5685 -1508 -7521 -2767 5008 6022 523
937 523 -49 2272 7474 5479 2922 2233 3423 3999 1854 2728 -390 -2115 -2337 554 1621 -557 -4419
954 -4419 -5016 3690 4581 -1080 -5515 1003 6802 4175 -1941 -5484 2459 7744 2892 -7113 -2523
969 -2523 7242 5515 -2728 -5831 3155 9032 6128 -4515 -4148 6975 9957 859 -6808 857 8175
984 8175 7305 -2880 -5731 2367 8638 6432 -2805 -1404 5168 8552 2173 -1098 1226 3541 3821
999 3821 -238 -1219 -2597 -665 -2194 -2401 -691 -1639 -3285 -2778 2559 574 -1210 -901 2643 4972
1015 4972 2095 -409 -1119 5716 4954 -902 -3014 3725 6347 343 -4018 -2612 6857 6873 -1438 -6904
1031 -6904 670 8862 3765 -5467 -7024 4352 8791 2266 -8163 -5253 6448 7508 -145 -6018
1045 -6018 285 6898 6529 -1862 -3486 3224 5701 2866 -2113 -195 1012 2051 -599 -1968 640
1060 640 1863 136 -1925 1946 1247 218 571 1988 2294 792 1535 269 2302 1028 -1864 -1014
1076 -1014 3368 2633 -4806 -4079 168 4385 -438 -5452 -5348 2385 6476 -2752 -8820 -3408 7035
1091 7035 4321 -4293 -7727 -1165 7235 3157 -5874 -6779 3718 6566 -47 -6277 -2560 4476 3294
1106 3294 -1878 -5728 215 3753 548 -4238 -3229 2360 2122 -1335 -4169 221 1985 1165 -1175
1121 -1175 -1927 1162 1172 1642 -771 700 166 304 1294 1816 264 -2756 254 2221 2746 -1938 -4148
1138 -4148 -658 4396 2480 -5249 -4730 1245 6150 35 -6071 -3992 3751 6287 -2774 -6739 -1539
1153 -1539 6211 2829 -5128 -5727 1283 5823 -1236 -6152 -4031 4436 4046 -3103 -5810 -327 5490
1168 5490 1367 -4188 -4835 2197 3725 -968 -4469 -3013 2127 1562 -1305 -3451 -252 1657 770 -127
1184 -127 -476 829 -123 1946 1481 428 -753 -1012 1327 2379 165 -4093 -829 3113 3392 -2177
1200 -2177 -3649 1731 4777 3297 -3583 -2855 3247 6112 -833 -5605 -838 4711 3914 -4479 -5505
1215 -5505 372 6365 1478 -5733 -3131 3971 6045 -1690 -4869 -1721 5296 3440 -4139 -5385 36
1230 36 4076 -1002 -4253 -3157 1986 3071 -797 -2136 -55 3087 1079 589 -239 752 651 -414
1246 -414 -93 -579 -861 -2841 -861 233 -1057 -3489 -2763 1225 1416 -466 -4017 -647 3410 2219
1262 2219 -3701 -4234 2624 4630 382 -5291 -2457 3988 5640 -1202 -4876 1837 7142 4290 -3433
1277 -3433 -2631 3623 6851 1082 -5629 -1816 3855 3839 -3547 -5230 -593 4214 1659 -3974 -2723 1446
1293 1446 4200 -215 -2733 -707 2314 1332 -2200 -2218 -1212 -37 -1970 -1765 -1956 -1716 -2003 -1756 616
1310 616 -64 -340 -1433 1385 3119 695 -1814 -349 3834 2346 -980 -3529 841 4235 1423 -3707
1326 -3707 -3200 3793 4182 -963 -5892 -1066 4118 2908 -4118 -6964 232 4077 -512 -7595 -5046
1341 -5046 1977 3428 -2340 -6077 -1057 4261 4190 -2187 -2387 2724 5352 1808 -2516 -566 2233 2988
1357 2988 -922 -2254 -472 1538 347 -1806 -559 359 1064 -86 437 318 -519 -555 31 1229 -1168
1374 -1168 -2023 -2435 353 474 -3278 -4698 -1760 2631 -367 -4579 -4929 879 3116 -1610 -5707 -4228
1390 -4228 3072 2571 -3445 -6688 -850 4318 1178 -4191 -3932 2940 4393 857 -3915 -633 4914
1405 4914 3972 -1873 -3982 1324 3320 152 -4287 -3071 314 1358 -1768 -5136 -1689 1491 1017
1420 1017 -2499 -2000 245 863 1223 -142 -335 -635 1034 489 262 801 -1509 -875 1574 2904 -1110
1437 -1110 -2216 125 3054 2321 -1364 -2476 113 4983 977 -3605 -2649 2690 3378 -1289 -3473 -1150
1453 -1150 4065 2076 -2589 -3482 2005 4663 -369 -4109 -2410 3430 2405 -2773 -5359 -807 3628
1468 3628 310 -4006 -4273 1414 3452 466 -3601 -1372 2942 2486 263 -1248 841 1662 2245 624
1484 624 -42 744 626 519 793 1837 -934 -1087 1060 1957 435 -1808 -553 926 2975 -343 -2391
1501 -2391 16 3249 1906 -2130 -859 2148 3670 -76 -2126 -440 3950 3556 -2536 -2901 1733
1516 1733 4908 484 -3948 -2421 2889 4225 -1717 -4618 -1632 4080 2162 -2445 -3580 387 3657
1531 3657 820 -2515 -2665 1851 1955 -176 -1720 -443 1185 27 -213 -803 464 -25 -557 -854 87
1548 87 96 -1251 -395 199 715 -882 -1066 667 1190 210 -1479 375 2300 1582 -2290 -1573 1918 3242
1566 3242 26 -3713 -876 3078 3355 -2259 -4042 440 4862 2332 -3334 -2838 1866 4862 627
1581 627 -3707 -1541 2999 3397 -1397 -2961 -631 3454 1299 -1918 -1329 1245 2631 -560 -1352 -375
1597 -375 1827 568 -1423 -1356 77 1163 -1184 -1350 -1105 94 -312 -781 -386 -253 -224 -577 903 436
1615 436 -433 -2232 -392 1528 696 -1812 -3156 707 2356 226 -4106 -2774 2326 3251 -623 -4466
1631 -4466 -1340 3132 2636 -2633 -4226 549 3324 696 -4167 -2845 1126 2848 -1227 -3659 -467
1646 -467 2987 2213 -2597 -1662 1635 3629 311 -2210 -790 1899 1930 -1936 -1971 -531 1511 -26 -2031
1663 -2031 -1592 -481 637 -452 -255 -835 -677 -1113 -860 -189 -1349 -1942 -2296 409 -159 -2366 -3678
1680 -3678 -906 1873 -28 -2682 -3375 924 2255 -480 -3939 -2562 2260 1676 -2515 -5002 -824
1695 -824 2162 683 -3573 -3563 1537 2780 -365 -4121 -877 3322 2193 -2109 -3615 269 2167 101
1711 101 -4015 -2639 585 1263 -2076 -3962 -1447 927 699 -2017 -1477 189 991 121 -793 40 -79
1728 -79 826 90 563 348 -245 -117 1093 1888 20 -532 289 2826 1392 -915 -1322 678 2754 -93
1746 -93 -2913 -2721 1134 1725 -1815 -3973 -1044 2833 801 -2623 -3336 1373 3258 237 -3240 -1728
1762 -1728 2847 2179 -1943 -3861 223 2802 840 -2343 -2688 1493 2834 750 -2400 120 3188
1777 3188 2592 -210 -982 1424 2229 2035 -147 44 1007 1431 495 12 898 139 636 179 1417 223
1795 223 -933 -79 995 1366 -1137 -1341 -90 2195 823 -1749 -1098 1668 3246 136 -1611 223
1811 223 4044 3206 -208 -1148 1883 4613 1337 -1828 -1426 3078 3140 -872 -2868 -709 2964 1361
1827 1361 -1669 -2778 845 3030 287 -2442 -1685 1904 1825 -449 -2177 -313 1220 14 -1473 -1756
1843 -1756 148 445 -132 -1284 -113 244 -227 406 6 608 -318 70 351 829 -357 -965 334 1517
1861 1517 1189 -1148 -705 1436 3006 661 -1895 -372 2269 2686 -1057 -2401 73 2663 1113 -2667
1877 -2667 -2563 724 2690 -787 -3162 -1517 2227 2202 -1298 -2398 83 3259 1025 -1703 -1488 1759
1893 1759 1978 -702 -1853 -611 1882 683 -1037 -1859 68 1630 -82 -1338 -975 141 -178 -58
1909 -58 -853 -898 -549 -355 77 -331 -414 -1467 -342 909 355 -1613 -2165 692 1395 249 -2580 -1374
1927 -1374 1209 1891 -749 -3245 -666 1721 1487 -2224 -2125 670 2216 121 -2500 -861 1877 2357
1943 2357 -1207 -2132 473 2915 929 -2336 -1458 1193 2921 -288 -2363 -946 1983 1960 -1228 -2016
1959 -2016 -366 2194 668 -998 -1212 86 1105 256 141 -479 290 -115 349 371 -39 -476 -659 843
1977 843 618 -549 -1778 -661 1049 374 -1216 -1868 730 1281 -37 -2058 -969 1715 1011 -1252
1993 -1252 -2045 837 1896 139 -2353 -717 2094 2461 -628 -3167 590 2998 2066 -2063 -1800 1357
2009 1357 2674 1053 -2593 -1266 1555 2795 -554 -1574 90 1672 1651 -333 -102 443 1681 736
2025 736 189 745 734 482 92 1352 721 445 -450 594 1290 813 102 114 1542 1061 146 -462 861
2044 861 1569 340 -1106 -612 2054 1207 -1145 -1999 824 2960 759 -1696 -1826 1842 2549 306 -2561
2061 -2561 -615 2939 2127 -826 -2920 473 2601 1656 -1729 -1596 1262 2028 488 -1663 246 1572
2077 1572 1758 -381 -423 665 1388 529 -904 357 799 597 -273 -572 513 335 418 -240 770 243
2095 243 169 163 745 681 -154 -118 400 1749 -15 -995 -578 1644 2104 -430 -1549 86 2733 1651 -1019
2114 -1019 -1436 1282 3186 729 -1994 -1811 1505 2183 -812 -2704 -305 1924 199 -1790 -2282 372
2130 372 1339 -17 -2534 -1383 986 532 -1494 -2152 86 527 267 -1545 -1596 373 857 -114 -1211
2147 -1211 97 449 221 -70 144 316 116 360 242 712 -362 -823 -120 861 796 -1015 -616 536 1774
2166 1774 -135 -1525 -301 1665 1538 -1084 -1678 -399 1987 299 -2196 -1900 833 1919 -1242 -2247
2182 -2247 -948 1875 1354 -1057 -1988 414 2713 526 -1297 -993 1930 1741 -8 -1460 -227 1702
2198 1702 1100 -812 -1165 1001 1269 151 -996 -486 333 87 -326 -783 -228 -479 -453 -715 -462 -398 -1268
2217 -1268 -474 231 305 -959 -1029 84 1054 354 -1146 -496 873 1649 -468 -1466 139 1896 1249 -1243
2235 -1243 -971 771 2757 897 -1221 -182 2238 2441 -611 -1254 445 2908 1478 -1079 -1291 978
2251 978 2109 -304 -1559 -852 1393 1400 -519 -1315 52 1723 282 -618 -720 398 587 57 -340 6
2269 6 559 230 435 -5 477 -42 329 862 740 370 -330 590 1008 594 -758 -853 836 842 -92 -1656 -463
2290 -463 1010 892 -953 -1848 573 1523 246 -1781 -705 826 1579 -357 -1899 -644 1751 1239
2306 1239 -1469 -1317 693 2128 28 -1426 -475 1252 1748 -119 -962 46 1810 859 -580 29
2322 29 660 1150 254 74 -156 566 730 -175 324 354 533 -185 261 655 -56 -334 -128 662 86 -440 -904
2343 -904 290 707 48 -1226 -624 1491 860 -793 -1737 356 1565 642 -1466 -1472 883 1400 131 -2375
2361 -2375 -789 1538 1154 -1068 -2047 264 1227 483 -1659 -1179 533 1168 -312 -1650 320 1192 667
2378 667 -727 -906 342 1170 320 -944 -504 670 1084 -475 -268 104 286 -7 59 253 -359 42 156
2397 156 708 -217 -431 -307 305 1295 157 -949 -1073 1122 1341 -498 -1418 18 1589 626 -533 -1570
2415 -1570 429 1979 430 -1739 -954 1501 873 -426 -1267 20 1080 693 -1502 -1617 999 1241
2431 1241 -470 -1782 -172 1147 1025 -818 -1903 180 1334 455 -1769 -1096 47 433 85 -1136
2447 -1136 -519 189 551 -75 -190 -209 -248 280 359 694 -492 -282 -179 893 728 -526 -485 786 1584 -34
2467 -34 -613 -734 1117 1462 -463 -1036 143 1676 392 -1084 -468 1262 1185 -264 -871 -180 2088 973
2485 973 -992 -1305 1260 1978 264 -1456 -799 1664 1713 -124 -1588 -246 1379 477 -809 -1095 488
2502 488 782 468 -822 -426 354 192 68 -310 284 -406 -84 -208 307 -90 -426 -349 114 546 -146 -326
2522 -326 -63 770 655 -488 147 527 974 -325 -421 187 1517 631 -731 -286 949 1666 -169 -1123
2540 -1123 -312 1652 1349 -854 -1493 337 2265 735 -1214 -1259 824 1738 -228 -1117 -663 1396 1021
2557 1021 -402 -1003 80 1074 165 -279 -94 758 628 203 -427 312 827 158 -179 -337 596 316 -360
2576 -360 -114 11 20 -553 184 219 200 -954 -385 412 304 -585 -1324 -269 559 427 -1195 -1461 162 912
2596 912 -38 -1771 -1121 692 1293 -476 -1527 -299 1157 873 -899 -863 310 1598 455 -812 -542
2613 -542 1013 1257 -317 -677 166 1477 260 -855 -412 518 966 -226 -560 -565 645 259 -514 -490 -143
2632 -143 349 -257 -331 -729 -26 -526 -249 -139 -12 -441 -739 252 165 -60 -1041 -455 754 773 -389 -1235
2652 -1235 229 1144 255 -977 -936 640 1055 97 -1632 -642 1007 847 -1134 -1432 185 837 347 -1662
2670 -1662 -1149 258 902 -827 -1351 -639 706 279 -1256 -1010 229 821 -82 -876 -370 618 631 -133
2688 -133 -465 -158 373 16 -79 269 98 132 40 310 139 -42 -70 470 614 294 -326 -521 781 647 -231
2709 -231 -914 108 938 99 -775 -1272 275 814 116 -1395 -828 813 756 -464 -1621 7 1084 478
2727 478 -988 -1089 423 850 -83 -1414 -460 672 892 -915 -1268 223 636 419 -793 -702 328 940
2745 940 -128 -1099 -167 355 23 -671 -225 -260 203 135 -94 200 -218 290 -274 252 170 -439 -460 322 683
2766 683 -284 -634 -239 1071 546 -467 -1023 202 1091 165 -1052 -831 997 938 -328 -1040 -238 1105
2784 1105 366 -708 -1515 448 959 161 -1611 -765 997 535 -471 -1470 -245 905 518 -828 -951
2801 -951 402 736 -158 -1076 -238 193 20 -423 -496 -215 8 302 -638 -72 -208 -104 -455 -199 -21 -559
2821 -559 -174 -131 161 -347 -600 -574 120 445 -362 -731 -170 1001 -44 -1146 -740 623 918 -372 -972
2840 -972 -486 1308 971 -592 -1014 67 1567 234 -886 -839 429 887 227 -740 -628 1081 458 -656
2858 -656 -997 400 787 83 -520 -656 389 293 -385 -651 -44 123 -96 -469 -359 262 6 -58 -574 -202
2878 -202 -11 -115 -3 85 16 -616 -270 189 268 -400 -938 -210 588 509 -1012 -685 -223 1098 128 -1331
2898 -1331 -814 455 1280 -598 -1303 -65 859 428 -609 -656 138 1025 13 -653 -380 846 774 -565
2916 -565 -572 105 1189 535 -513 -561 999 837 47 -566 13 808 104 4 -486 65 369 113 54 -6 41
2937 41 -415 284 243 150 -399 -338 287 528 501 -829 -307 708 721 -269 -716 -62 711 700 -939 -579 25
2958 25 810 -173 -989 -259 571 575 -1087 -791 31 794 -127 -1109 -714 592 1194 -639 -1112 -273 1075 693
2978 693 -684 -939 283 1137 241 -617 -206 462 819 125 -222 279 405 263 494 147 176 249 225 720
2998 720 115 239 -449 223 405 516 -204 -257 477 467 294 -743 68 450 69 -468 -719 365 736 246
3018 246 -1067 -330 810 742 -269 -1127 -37 977 795 -953 -408 868 1167 126 -749 -198 787 989
3036 989 -361 -777 -106 774 430 -754 -219 -16 402 -372 -537 -278 87 104 -457 -35 -62 152 -377 -376 -245
3057 -245 -68 239 -108 283 126 73 -36 354 300 117 123 7 635 342 -180 -462 548 823 256 -334 -301
3078 -301 1030 603 159 -856 -293 978 556 -449 -1207 215 570 219 -843 -831 284 843 -611 -1329
3096 -1329 170 631 90 -867 -657 -75 760 78 -700 -112 555 541 -410 -381 -125 160 200 -207 144 -78
3116 -78 182 -162 -160 97 -83 26 -98 176 -348 -411 -131 122 -87 -291 -422 -191 606 233 -322 -772 343
3137 343 697 -149 -601 -479 782 448 -409 -753 57 1007 283 -535 -514 757 758 187 -540 132 981 720
3157 720 -168 -502 476 845 566 -611 -138 675 395 -5 -347 -146 526 424 -121 -413 60 111 76 -175
3177 -175 -77 -83 26 22 183 63 -124 113 117 473 -124 -506 -144 385 525 -576 -259 261 646 -56 -266 -550
3199 -550 501 707 25 -637 -293 1279 639 -226 -394 546 960 -76 -273 -346 909 762 -41 -769 185
3218 185 959 418 -111 -470 535 625 261 -326 -189 765 605 124 -400 453 386 386 -66 118 -113 -170 183
3239 183 -255 374 137 55 251 435 179 -517 -53 491 306 -326 -517 121 641 382 -405 -303 62 1123
3259 1123 -258 -633 -12 619 597 -307 -544 -120 999 212 -706 -360 292 658 -393 -446 -104 460 117
3278 117 -324 -451 328 879 77 -371 -424 608 438 -33 -119 -197 561 74 247 -143 354 660 394 250 248
3299 248 359 18 292 345 347 -121 94 365 506 398 -156 74 579 483 -338 -406 597 674 132 -618 33 614
3321 614 721 -407 -1047 5 929 569 -843 -823 523 807 -210 -538 41 609 634 -107 -504 -85 928
3340 928 144 -509 -6 126 661 -313 -270 -210 458 482 -198 -216 451 612 -155 -158 -109 340 160 70 -134 231 109
3363 109 48 529 584 261 -306 228 672 252 -71 -395 622 619 248 -164 -340 414 849 257 -912 -294 772
3384 772 922 -190 -770 310 557 241 -625 -298 446 454 -211 -671 -78 511 253 -636 -296 521 648 -188
3404 -188 -359 -16 626 466 -371 -503 361 164 14 -593 -240 -86 198 19 -215 -88 -51 -208 -93 62
3424 62 -426 -181 -358 290 6 -215 -588 -249 382 148 -468 -475 460 811 306 -278 -108 482 539 -97 -555
3445 -555 148 842 220 -550 -461 659 762 17 -506 -53 518 321 -307 -457 219 563 306 -636 -366 36
3465 36 567 -53 -512 -214 -2 211 -442 -463 -219 101 -72 -142 69 -212 -163 -8 279 84 -121 -36 137 83
3487 83 48 -232 -276 202 297 110 -107 -131 383 97 -417 -378 410 352 -262 -503 -109 314 49 -411 -737 166
3509 166 674 54 -642 -340 871 425 -9 -676 19 527 611 -314 -715 263 594 203 -275 -105 188 248
3529 248 115 -187 21 345 123 -126 102 276 -99 -103 -41 282 71 144 -221 416 7 -343 -147 -178 -5 -289
3551 -289 -349 0 447 103 -637 -430 -31 627 -428 -665 -56 120 501 -506 -437 15 1118 50 -664
3570 -664 -359 543 749 46 -387 -342 398 212 -387 -568 120 288 -217 -528 -407 56 504 -80 -541 1
3590 1 286 94 14 16 321 31 22 -282 -91 188 4 74 33 -44 48 187 194 222 -268 -417 118 197 494 -226 -332
3615 -332 54 532 -15 -749 -199 349 430 -437 -496 -104 375 158 -545 -193 299 487 -167 -606 -192 337 326
3636 326 -295 -613 7 213 -38 -441 -506 31 299 -275 -424 -307 297 182 78 -425 -192 347 -85 -485
3656 -485 -212 145 -89 -183 105 -138 -98 -25 -9 -107 -113 -5 83 342 316 59 -355 254 369 -35 -170 -94 301
3679 301 470 56 -759 -303 559 406 -520 -423 335 790 -74 -748 -331 79 615 -438 -469 -50 150 261
3699 261 -616 -319 -202 432 -110 -506 -99 259 197 -337 -286 -159 181 -45 -423 -184 -143 -42 -306 -63 -391
3720 -391 11 21 -187 79 188 -151 -31 134 202 13 -440 149 122 159 -51 -537 163 193 206 -545 -46 527
3742 527 429 72 -422 165 520 202 -364 -362 382 545 -49 -516 33 255 564 -335 -310 271 648 414 -222
3763 -222 -493 254 559 -209 -456 29 449 -13 -348 -449 92 145 202 -269 128 30 114 -133 -22 -156 -172 -105
3785 -105 -151 74 -329 -295 -163 -12 248 -130 -359 20 557 103 -191 -193 361 339 -232 -625 74 433 189 -310
3807 -310 -465 243 475 -85 -496 -90 401 501 -80 -377 -58 493 438 -120 -233 430 470 116 -412 67 242
3828 242 305 -147 -363 362 365 182 -460 92 138 -202 12 -150 -299 -173 -41 -356 -71 26 -135 -95 -193 244
3850 244 -189 -276 237 276 -172 -319 -441 51 14 -165 -232 -122 466 156 -415 -405 -169 284 178 -452 -311 295
3872 295 302 -202 -381 -71 446 48 -237 -450 -51 286 -245 -367 -496 319 344 -75 -506 -137 100 -166 -334
3893 -334 -467 229 78 370 -329 -293 141 487 1 310 177 -161 -42 333 227 -93 -126 260 158 148 -168
3914 -168 -150 155 490 4 -332 -354 -10 170 -404 -476 -275 518 119 -350 -394 -310 131 47 -436 -352 292 307 -506
3937 -506 -511 -116 457 -86 -335 -575 144 317 -93 -426 -3 435 91 38 -374 402 573 284 61 41 -73
3958 -73 -70 159 42 119 26 -192 260 -76 128 -125 -69 41 143 -262 -439 325 0 383 -230 -115 129 371
3980 371 246 -290 18 539 403 -295 -345 125 410 176 -352 -275 419 515 -125 -532 -78 215 64 -142 -203
4001 -203 290 574 2 -269 -345 309 231 -186 -101 -97 243 -75 -175 -246 -112 -97 -113 -187 72 99 -216 -239 -123 188
4025 188 -196 84 405 60 -87 -139 121 98 50 -242 -119 215 71 139 -342 -81 395 357 -246 -327 84 546
4047 546 190 -475 -117 306 468 -103 -417 -30 285 356 -113 -96 -7 553 140 -232 -191 133 381 -44 -470
4068 -470 88 123 -214 -264 -44 201 225 -357 9 13 -59 180 -92 119 -240 -13 -183 -41 229 -207 -55 20
4090 20 107 13 -58 -194 136 528 8 -299 -411 42 96 -42 -469 -115 151 108 -325 -267 447 419 78 -441 -111
4113 -111 246 304 -183 -448 61 513 47 -150 -430 74 267 -36 -453 -13 401 408 164 -100 133 399 229
4134 229 -124 -97 102 139 -7 -165 -142 72 60 193 5 -34 66 39 184 220 -83 42 -114 158 -157 -51
4156 -51 -286 -50 122 -208 -323 -204 257 208 -122 -253 -249 457 288 -214 -291 371 196 -111 -490 -112 456 404
4178 404 -283 -629 277 293 91 -103 48 269 146 -2 -499 -102 501 223 -85 -107 144 147 202 -492 -15 22
4200 22 168 31 -100 100 -51 363 173 169 26 -42 56 10 84 -153 -277 320 452 -167 -234 -258 139 439 -124
4223 -124 -95 18 397 176 116 -252 172 409 134 -444 -241 282 124 -160 -228 211 497 223 -211 -395 411
4244 411 337 -115 -333 -76 355 51 -78 -206 53 327 241 -144 0 -156 273 182 -146 296 250 -214 -153 -47
4266 -47 30 -62 -116 71 125 -197 -23 95 79 314 74 -115 226 424 75 10 154 467 301 -309 -112 158
4288 158 365 49 -308 -350 151 359 36 -316 -52 472 267 -51 -533 246 601 -39 -306 -157 298 294 -102
4309 -102 -197 -149 98 -3 -100 -38 147 102 100 12 -32 148 50 27 -107 -34 36 64 51 87 -1 -116 -19 64 -8 65 210
4336 210 -160 185 -239 -94 152 271 314 -248 -534 -115 240 99 -233 -104 -44 323 292 -293 -25 115 295
4357 295 -34 -33 80 516 -116 -112 -121 -107 38 -91 81 215 387 -243 -221 -170 298 390 -189 -279 -260 99 90 -126 -61
4382 -61 -226 238 -187 85 -30 148 -4 -249 199 -206 44 -154 189 20 38 -163 -30 145 -7 -94 -239
4403 -239 17 164 218 -239 -233 -49 228 221 -271 -10 201 299 44 -97 52 321 480 36 167 78 509 190
4425 190 -82 172 266 271 -307 -206 -11 302 7 -424 -202 110 234 12 10 72 -26 21 176 -84 -127 -2 -165
4448 -165 113 -71 -79 -154 -79 301 -3 -155 -59 306 -36 -304 -227 -205 -3 18 -95 -235 -129 212 135 -293 -137
4471 -137 249 222 -169 -393 -202 262 111 -338 -234 -189 174 -12 -196 -108 68 233 -154 1 -42 204 260 -283
4493 -283 -92 303 -33 108 -23 -59 -53 47 -100 -96 208 69 117 50 -18 -84 -3 -26 296 -42 -43 -58 8 41 -143
4518 -143 112 -149 228 44 139 -1 37 455 -42 -258 -139 -29 110 -219 -272 -287 174 307 -221 -403 58
4539 58 59 38 -359 -121 232 202 135 14 -100 299 222 -105 -334 161 -17 128 -3 5 -66 54 120 -64 235 104
4563 104 56 -234 -61 190 30 171 -221 53 -115 -156 25 163 109 -49 41 123 211 106 6 -225 116 300
4585 300 -132 -147 -46 215 61 -71 -113 135 174 -297 -14 173 696 24 -64 -75 -2 237 58 -185 -438 122
4607 122 84 -177 -51 -153 114 11 -187 -128 158 121 -43 -148 -84 117 170 19 -296 -105 229 -88 -34 65
4629 65 106 208 136 -77 228 -32 88 185 125 97 -49 -82 314 362 -178 -269 108 45 -22 -226 -82 109 240 102
4653 102 -96 -65 220 94 -130 -181 12 268 35 -25 -278 278 304 238 144 -80 318 81 -136 -451 54 177
4675 177 80 -130 -29 36 16 -16 -96 208 -5 -92 19 -62 208 -66 47 -27 86 7 28 149 23 142 -33
4698 -33 -181 41 29 38 -237 146 256 325 -340 -139 123 144 -71 -276 -71 98 184 -283 -83 30 369 112
4720 112 -140 74 0 158 90 -303 -143 15 20 -264 -157 -342 233 132 -121 -78 36 101 -144 168 -255 6
4742 6 43 -38 126 181 -58 -184 32 88 -16 -154 87 -49 -76 -157 -117 32 261 123 -140 -62 -19 214 -294 -470
4766 -470 120 177 18 -323 -252 188 67 -36 -293 15 218 175 -293 -298 449 184 -3 -119 -138 167 313 -22
4788 -22 92 350 262 54 -177 88 105 11 197 90 257 12 140 105 21 43 -51 119 -189 67 185 -207 -198
4811 -198 15 -159 -14 -153 51 -80 98 65 230 265 -23 -204 -230 -50 223 -101 -207 46 -114 -53 -136 -295
4833 -295 -165 -100 -145 -151 -420 -87 188 15 -90 -173 231 285 -165 -140 -173 195 -24 -13 52 -13 245 40 -197 200
4857 200 9 145 142 191 115 267 257 -111 173 71 146 -10 -92 72 -5 -91 -119 -55 128 66 52 220 30 -62 -72
4882 -72 85 -20 136 -44 -38 250 110 -78 -54 -394 171 110 -144 54 -8 153 27 -41 -220 130 184 8 -35
4905 -35 -78 68 17 -178 -298 130 185 -72 -252 57 245 -5 56 -178 178 54 24 0 -297 75 -176 139
4927 139 30 159 14 -46 193 326 -58 -276 236 104 -29 -29 -312 64 68 208 -25 -263 -122 59 -61 -44
4949 -44 -6 249 228 -92 -19 -70 247 -40 -192 -169 -5 357 237 -152 -266 169 253 -20 -173 63 103 5 -54
4972 -54 -129 -164 367 -103 24 42 -226 -12 210 82 -28 -97 -15 -161 47 271 64 -191 6 72 -84 -141 -149
4995 -149 -13 217 -67 118 288 180 86 -93 95 237 319 -79 179 -51 261 -52 -124 268 153 121 -236
5016 -236 -145 264 261 133 -196 -83 256 173 25 -231 30 233 158 -200 -107 -21 -69 106 56 -115 111 88 -9 233
5040 233 -116 235 -13 50 -155 -31 -73 116 -137 -226 84 -55 -90 90 10 60 -51 26 149 12 -51 -6 308
5063 308 250 -59 -37 95 -187 58 -192 -160 92 22 91 -14 96 175 275 -33 30 6 36 83 -256 -24 120
5086 120 335 -243 -6 102 198 133 -244 63 -36 135 208 -79 122 251 230 -177 -94 -37 85 33 71 87 -187
5109 -187 64 95 -64 -69 86 -35 80 -150 90 -62 131 172 181 -145 -62 -81 180 97 -304 -138 100 163 -223
5132 -223 -50 -47 200 399 135 -136 145 -16 -224 -48 -40 246 -9 -119 257 -171 153 150 213 -280 -43 85
5154 85 -62 -174 9 281 53 54 124 221 209 105 -282 96 95 -50 -94 -30 369 -254 71 -2 111 -63 -36 -46
5178 -46 10 -30 -66 214 -9 -26 53 -137 -175 107 188 -106 -95 -119 250 -17 -149 -4 97 270 -88 73 -297
5201 -297 90 256 79 -262 -100 43 -159 13 -73 124 -26 -4 -146 150 104 102 159 -64 21 285 -77 61
5223 61 127 -108 -53 103 100 -195 -250 -58 94 212 -191 160 129 -40 85 10 -133 93 176 -129 -150 -47 -27 252
5247 252 -158 22 -299 101 229 100 -101 -73 150 63 -39 -121 50 87 93 -211 137 149 -10 29 -25 110 25
5270 25 -19 -78 -213 -19 102 120 -183 -6 138 1 -49 -29 183 71 52 77 36 -138 -124 239 -256 25 55 208
5294 208 -11 -91 -126 -20 91 -218 155 -11 -76 -140 28 168 15 17 195 42 46 -246 -30 50 322 94 -129
5317 -129 50 150 42 -332 245 171 118 98 39 -128 181 144 -100 35 -75 212 115 -53 -52 14 61 115 -187 10
5341 10 -28 139 -148 100 166 -12 -1 -129 181 133 -38 -98 -165 -24 -32 136 -89 40 24 -89 1 36 198 36
5365 36 64 -287 175 -74 -93 253 -57 101 58 -193 -39 131 -26 83 -132 194 98 -232 -160 -370 138 -104
5387 -104 -229 42 26 102 -91 131 25 38 37 37 -74 -143 58 123 -149 201 22 -56 48 -62 -106 9 -63 63
5411 63 -143 -94 -44 -13 -201 51 312 -184 -49 77 204 88 -12 59 7 -76 -210 -203 -37 134 -158 -130 16
5434 16 -25 -215 -136 -42 76 26 34 121 -49 45 -59 84 -138 -62 208 -86 -214 -24 133 130 -40 -71 -165 131 158
5459 158 -134 113 60 30 31 -195 -47 28 169 218 84 33 -15 148 107 217 -12 172 84 13 124 0 -179 -30
5483 -30 -19 81 115 -23 -23 -39 182 -273 -210 50 154 -53 -348 130 -25 -66 -78 -76 318 17 169 70 29 -42 93
5508 93 -140 -329 113 26 85 -55 3 -97 28 -100 160 7 44 143 41 69 -51 -3 -34 157 179 81 -3 66
5532 66 -72 -124 -202 -166 -49 259 -14 5 -195 22 33 -38 -28 143 -82 185 -117 321 47 31 105 -238 -161 73
5556 73 -161 -174 -141 193 234 -81 47 -8 381 129 0 47 -75 190 184 -147 -172 -74 178 136 -101 -181 64 0
5580 0 -176 89 144 47 135 -3 19 278 111 93 119 187 114 177 -51 51 215 -224 21 -12 84 201 62 9 200
5605 200 -36 -26 71 257 -51 -46 -108 -17 176 145 298 146 127 221 39 80 -87 270 162 -111 -198 9 147 -31
5629 -31 24 -239 194 -18 197 69 -246 80 -93 -70 -144 -189 -120 117 -135 7 121 -22 140 -1 52 68 59
5652 59 -281 -12 6 -37 -64 69 59 -78 -65 42 29 -56 -75 -85 -233 -47 -43 1 1 45 216 -75 -70 -32 191 -37
5678 -37 31 108 61 171 -206 37 -197 37 91 58 111 110 260 149 29 -232 151 139 -19 182 -112 152 -56
5701 -56 -58 -72 115 -37 36 -56 -12 100 -130 -31 -101 9 -1 -175 229 -161 -64 -73 32 8 116 -310 -196 56 127
5726 127 133 -94 137 -73 -11 12 -202 10 63 164 -64 66 2 133 -144 -141 -15 36 87 -176 -176 168 108 269
5750 269 -141 -133 328 15 -74 16 -216 71 277 -186 -219 -11 4 142 -33 114 142 10 108 241 -179 -29 137
5773 137 116 153 233 10 114 319 -132 -55 174 20 85 81 -11 63 0 -118 16 -244 183 -17 10 -127 -213 7
5797 7 209 114 -272 -267 -18 148 106 -109 36 66 -280 -86 196 87 271 86 -248 94 132 -155 173 -49 265
5820 265 -62 58 -2 85 165 22 111 38 94 -85 24 27 -1 194 81 -85 235 119 32 -17 95 -8 292 -35
5844 -35 70 89 321 150 -329 -101 185 -114 -69 114 -287 26 231 -154 4 104 60 14 -235 180 -14 -32
5866 -32 -58 -205 -209 34 -21 -264 -247 -108 108 -237 -120 -51 232 176 -112 8 142 71 98 -165 -132 -128 35 -2 -299
5891 -299 -156 -54 -198 -120 23 -4 115 21 101 -122 -12 158 -132 -3 112 230 -183 193 105 -150 146 -101
5913 -101 -142 40 -51 -156 -39 191 10 100 -195 0 -30 -111 -274 53 150 112 -106 115 -85 282 -72 -239
5935 -239 42 50 301 -59 -158 36 -82 18 191 88 -7 1 -6 -83 -81 -45 169 55 -21 150 -94 -60 255 -49 -230
5960 -230 34 45 -77 -87 -149 120 -62 148 31 -116 -20 334 53 -24 -255 103 477 421 21 41 228 -131
5982 -131 -20 -79 -138 128 68 126 -132 77 300 -23 -9 -157 91 90 -162 -3 -15 -84 -86 -35 -95 2 -95 164 100
6007 100 99 194 -41 -39 49 93 -273 190 -2 -265 -119 -208 -58 -116 329 -157 -140 -273 -102 -96 -115 130 -87 52
6031 52 -17 -106 -31 107 -47 -86 -23 -81 393 -40 -36 -194 77 4 -18 61 -12 21 -71 -70 -84 -67 113 -108 -76 -9 224
6058 224 -23 118 -37 23 122 -61 -172 -79 182 -19 -59 15 -54 68 214 -82 37 103 -154 56 160 -100
6080 -100 111 181 94 -85 -60 -33 101 -299 -41 46 123 185 85 64 -186 95 172 -85 19 -41 15 21 12 -53 -24 -12
6106 -12 216 -118 -1 27 213 -133 152 -149 38 203 -94 105 -199 -135 -80 -101 -192 -326 52 -41 215 -197
6128 -197 -3 172 -28 -127 19 -61 20 66 -4 160 103 -199 -25 0 59 -38 66 25 52 48 -180 -253 -102 -41 42
6153 42 -82 152 -81 121 -140 89 248 30 -6 -310 -60 -257 -138 -60 62 110 12 -11 -382 -34 143 25
6175 25 -179 47 71 -232 -1 -43 48 -107 92 -186 -84 -131 201 127 -125 -98 40 -63 65 167 225 106 150
6198 150 28 -80 45 80 -182 52 171 -157 -100 63 61 -4 -69 108 -80 269 17 -152 127 28 214 -20
6220 -20 -141 98 136 128 59 -109 219 -92 -65 -118 -92 -140 -92 -167 -174 -105 118 142 -187 94 203 157 68 -255 -173 195
6246 195 -117 113 -74 30 205 0 -20 82 -99 -27 -66 -77 -8 95 49 280 60 -72 139 -32 -24 102 -82
6269 -82 44 175 208 28 91 -138 -1 131 -88 172 124 -36 161 80 -28 -173 66 127 4 -109 -199 -17
6291 -17 109 -167 -369 47 28 350 127 -164 -9 -20 -304 1 39 158 95 -32 243 210 -26 50 -72 184
6313 184 -8 292 -147 -21 -182 -119 107 118 -95 -109 -39 -294 89 -4 -78 -77 198 -31 119 -37 -90 145 -18
6336 -18 -74 74 -127 4 -100 -145 -92 167 -11 -257 -219 -13 142 -154 -97 -167 -159 -130 -2 -98 279 81 32 2
6360 2 35 -213 265 -88 -217 -146 34 170 160 137 33 13 -23 -123 143 12 55 -90 164 107 63 318 67 95
6384 95 82 -59 6 204 -269 -72 -223 -96 79 -16 -5 -128 -260 148 66 76 -245 -134 -75 -137 -5 -140 -181
6407 -181 30 -201 -31 -120 106 90 28 58 -116 45 -253 110 -78 16 49 -93 74 28 32 274 81 89 -211 97
6431 97 185 -74 -288 -115 -78 144 205 176 -123 28 30 -70 -27 5 30 -52 -272 -84 193 -156 289 167 43 -169
6455 -169 108 176 -54 -55 179 -17 -197 -160 -121 142 50 70 -195 -77 -50 -72 328 -114 115 17 -71 150 -54 86
6479 86 -203 -102 -158 -162 300 99 134 107 68 97 128 -41 -17 -77 -172 170 -2 31 55 114 -113 50 264 -203 153
6504 153 -239 -74 37 -8 88 -22 -46 88 40 -10 91 211 -97 -203 369 117 -142 3 32 -136 73 39
6526 39 -196 78 -37 -1 -23 -71 215 68 -71 -133 -77 77 -66 -288 -106 -7 -63 -56 -74 196 153 75 19 71 9
6551 9 99 4 -117 181 119 -162 29 -77 35 -20 22 -34 10 17 -70 -5 -5 49 -21 144 -22 -72 -2 -135 -67 117 223
6578 223 -4 -3 -137 152 -8 25 36 55 81 -187 194 110 -11 -3 218 106 -98 -16 41 91 -49 -111 31 18 -148
6603 -148 103 209 91 -1 83 -26 -118 -130 144 30 328 55 -65 -13 -9 -175 -39 -12 63 8 64 -170 -163 118
6627 118 -67 210 206 -76 70 -150 -94 75 -292 -185 -116 -10 68 -149 157 -139 82 -65 60 -99 164 -47
6649 -47 239 -61 112 -73 346 41 -175 334 -9 -121 -163 86 -230 266 -128 -69 -89 158 -245 186 2
6670 2 -164 -31 161 0 -62 -8 59 -137 150 -132 10 189 -193 -157 150 146 16 -168 -50 97 12 143 -28
6693 -28 94 -45 184 406 -55 18 -120 15 21 143 22 54 -124 24 -83 -64 -20 -132 204 167 100 -10 -224
6716 -224 -61 -145 -45 279 124 -5 96 -74 -168 34 -157 -121 20 90 48 231 -105 188 234 102 168 -118
6738 -118 214 155 108 -35 15 182 339 125 -136 36 -58 -37 -73 -152 132 -269 -73 -18 104 -37 23 132 183
6761 183 166 -19 -6 -21 -58 -31 -9 140 80 -126 -267 -127 -43 -39 174 -135 -144 85 -83 -335 127 -146 16 -139
6785 -139 -97 37 48 187 29 68 -24 100 -89 6 206 90 -75 142 56 4 229 44 -136 162 224 -186 76
6808 76 -21 133 124 -54 -53 71 157 -93 -183 -3 -111 148 135 161 -332 82 74 91 171 22 179 -78 -167 97 -88
6833 -88 -55 -55 33 -168 196 85 152 -334 -96 67 -209 50 152 119 44 13 -68 234 28 -9 -47 211 -81 -93
6857 -93 74 -30 -162 25 -35 -164 69 129 -54 163 -67 -4 15 168 78 22 41 -152 199 172 64 95 -68
6880 -68 225 160 -180 30 57 143 196 34 48 14 120 10 -155 17 233 61 70 90 63 18 -2 -17 -126 -102 -274
6905 -274 52 -39 13 -147 -37 212 -49 14 -113 -45 -206 -8 -126 -139 177 -161 15 -120 10 -167 9 227
6927 227 85 -130 -21 155 -59 -17 218 81 -177 -61 41 290 12 67 83 1 -97 10 -96 -297 23 119
6949 119 -318 17 41 250 -130 -11 -11 -22 -2 361 160 -255 -17 110 -30 53 13 -148 85 -82 -58 38 -168
6972 -168 29 -34 44 -146 -91 -110 100 -328 -284 23 79 225 11 147 -24 75 -31 172 0 -173 -14 -79 -85
6995 -85 -149 289 48 94 -44 -28 84 -40 -228 -191 110 25 -45 14 76 -94 -53 69 -22 -155 -81 98 65 -15 198
7020 198 21 55 213 16 -29 -147 -262 -66 -45 233 -59 -145 -218 179 -41 -20 -97 -127 187 223 -64 -48 -78 -20
7044 -20 149 -86 -75 195 125 113 -61 150 -221 42 8 19 -113 97 -291 -93 60 -78 50 -58 4 24 -8
7067 -8 -231 -61 -58 42 105 -192 168 190 -52 79 9 250 -59 -75 -181 -92 68 -269 -116 9 123 14 227
7090 227 33 -13 -29 -253 181 32 240 11 -35 11 231 63 -135 -103 -23 -209 266 -255 137 -82 -12 90
7112 90 87 3 97 -149 -85 -61 53 109 24 -104 -115 -30 98 20 52 -27 -210 92 45 -117 136 38 79 16 12 -16 -329
7139 -329 2 -30 -254 -250 -138 -19 -61 109 92 -183 -157 79 176 20 54 4 -94 -41 122 -147 -84 -11 -36 -8 145
7164 145 -30 -157 193 -74 -117 -112 -60 114 -181 -201 -232 75 76 6 231 290 67 67 -130 -143 -124 147 116 101 -16
7189 -16 -169 49 -36 -126 110 74 -205 -191 -36 -54 65 -109 163 3 -31 25 127 -209 -253 87 42 -97 -186 34
7213 34 116 -13 -65 -187 147 -157 -119 84 -86 -10 -68 14 -80 272 -62 -85 50 32 184 175 -111 143 -187 -4
7237 -4 -186 319 44 213 -151 168 129 92 140 -51 80 -174 -31 -111 143 -3 -181 56 -1 55 -74 154 -60
7260 -60 0 85 -25 -38 -63 215 -3 -13 -56 -98 -115 118 213 132 -12 150 45 35 -59 183 70 112 12 -15 18
7285 18 72 -136 -132 -210 -24 -76 59 -5 -55 -149 35 -61 -75 -21 98 -2 201 -25 74 -16 -109 119 -87 108 280
7310 280 39 -2 -80 -148 -82 99 146 -231 -82 193 -78 -193 -30 -2 -57 -104 -43 -81 310 5 -28 210 -113 -123
7334 -123 111 -36 -72 64 146 -172 -52 -375 -156 -215 -189 -76 149 -73 101 118 -14 200 -33 158 -53 -66
7356 -66 -18 123 -67 -101 91 -155 24 11 34 70 -290 -119 -67 -225 -219 66 -92 165 61 -145 -2 1 -60 158
7380 158 -247 80 -125 -79 107 -120 -51 -50 -203 4 35 -287 231 204 44 -226 -56 151 -154 -35 -36 171 -163
7403 -163 30 -160 21 -314 -250 -107 -112 28 -158 21 -87 25 -6 -44 -63 -60 -63 -44 15 173 -32 -117 1 237
7427 237 -12 28 94 -87 -100 -16 44 25 243 53 24 -156 35 -33 214 -239 10 -196 15 -48 108 172 -130
7450 -130 -183 -352 2 40 83 122 18 61 156 32 89 -82 -130 -76 79 -11 4 159 10 -489 -76 -74 -258 21
7474 21 11 140 -169 35 24 115 124 -58 22 40 -69 -151 -14 -155 224 134 91 55 180 180 -34 -144 102 52 -121
7499 -121 238 -38 -28 101 -30 -44 -250 -103 60 -92 171 -172 8 -65 -34 -67 139 -51 38 166 -214 21
7521 21 63 -154 98 -36 -117 34 163 75 -48 -2 -163 -178 -168 161 178 91 -125 42 -10 -45 212 -66 -133 -183
7545 -183 -64 -168 169 144 -10 -80 144 112 -68 113 191 -236 -102 223 27 -111 46 -14 107 4 -65 39
7567 39 7 -210 -104 20 -229 214 67 -125 111 180 -71 -9 176 76 -181 -323 -108 112 -32 -35 -9 65 291
7590 291 98 94 161 132 -79 -27 -142 55 49 -164 -158 59 105 -13 -61 -207 58 118 143 -28 77 164 210 85 64
7615 64 79 -33 45 -129 24 122 28 39 -133 -41 -116 -145 -26 59 14 8 -188 -5 93 -115 6 12 -7 37 -12 179
7641 179 153 -6 112 -220 137 85 -116 -66 -23 -132 -57 -146 28 -228 62 -26 47 99 -112 254 -135 115 111 -145
7665 -145 -69 113 -73 150 73 159 44 215 -216 -143 85 -142 11 49 118 -86 -68 29 51 -119 11 180 -219
7688 -219 43 -79 -77 -101 -14 57 58 110 28 18 -159 -185 -115 256 140 31 -137 89 192 113 148 -177 68 259 -20
7713 -20 75 -43 -71 -93 -177 50 -11 -48 -115 -136 276 214 193 275 102 -34 76 127 -64 119 -170 -370 -115 -196 44
7738 44 38 -71 -189 -38 62 63 -169 66 32 2 -80 -43 -158 -135 -109 -37 105 -329 -60 107 -256 85 11 147
7762 147 204 26 28 -31 -11 61 -222 44 114 -45 -71 -162 99 -175 -179 29 -107 89 -91 138 154 17 -164 130
7786 130 -48 -34 48 -139 -50 -335 -109 111 -19 -112 -9 125 -14 121 37 -10 66 -92 -154 106 -99 -147 194
7809 194 -35 25 30 -54 -1 105 355 17 -296 -54 -20 -16 179 0 -15 150 102 101 -141 -146 -18 65 52 -2 -77 -142
7835 -142 124 110 96 183 37 -39 195 -13 109 -134 33 51 103 36 190 -46 33 -41 160 -11 -175 -16 -12 -158
7859 -158 84 9 -110 68 -98 131 -91 -254 -90 65 -192 -241 -42 -56 25 -26 -36 -56 -45 128 132 289 -46
7882 -46 201 193 50 28 19 -19 81 254 95 -100 -50 -244 -82 -9 102 -107 84 123 -38 97 203 109 188 260
7906 260 -14 34 -102 -73 158 34 121 -208 49 48 -76 -219 58 -126 41 280 -29 -150 -198 145 75 -227
7928 -227 -352 -267 -87 190 11 -3 -188 -42 57 -184 -66 -319 -28 95 -3 -308 35 -11 207 176 40 -179
7950 -179 -173 26 8 -87 -50 -16 -233 122 -81 -110 -7 -223 -30 -167 -150 8 38 131 148 128 25 77 -295 330
7974 330 180 -91 -98 -33 11 -33 -107 -77 -40 -137 -205 109 -52 -153 100 -64 125 -89 23 190 -2 199 190 -24
7998 -24 128 251 124 -132 86 -66 95 -34 -129 -116 150 63 -65 232 124 27 82 -63 94 47 -171 -32
8020 -32 -39 -276 -25 255 236 233 -237 -86 69 -47 131 -129 -175 -5 173 95 71 121 99 3 -49 -90 -54 -121 -59 -135
8046 -135 -91 54 221 110 158 91 -11 -95 143 -55 -98 266 -36 181 22 113 -4 124 -121 307 -109 -115 -24
8069 -24 -139 -62 13 31 102 -1 39 173 45 -82 26 -140 8 -122 -127 108 0 57 64 151 128 96 44 150 -96
8094 -96 1 96 127 41 -40 -97 -11 45 -130 26 76 -82 -7 105 -100 -72 -59 -20 -149 -134 -83 -125 202 -3 -21 274
8120 274 -202 39 198 19 -145 39 211 90 78 -18 -28 -112 110 -36 97 90 -47 -129 76 11 -21 9 -172
8143 -172 2 -1 55 -229 54 310 5 -261 -105 -151 91 97 129 210 -126 -87 67 -15 181 -144 -46 -76 -44 156
8167 156 -56 -34 -227 -46 53 -26 76 23 -76 -19 6 -46 61 -22 -95 -36 -14 -62 130 198 89 -111 -145 151
8191A51
##END NTUPLES=NMR FID
##END=
