##TITLE=1H_SA_sl.OH_1
 CDCl3, 8 sc, 
 1.9.2020
##JCAMPDX= 6.0         $$ Bruker NMR JCAMP-DX V2.0
##DATA TYPE= NMR FID
##DATA CLASS= NTUPLES
##ORIGIN= UXNMR, Bruker Analytische Messtechnik GmbH
##OWNER= root
$$ XWIN-NMR		Version 3.5
$$ Tue Sep  1 11:31:46 2020 Russian Standard Time (UT+4h)  she@DPX200
##.OBSERVE FREQUENCY= 200.1315066352
##.OBSERVE NUCLEUS= ^1H
##.DELAY= (6, 6)
##.ACQUISITION MODE= SIMULTANEOUS
##.ACQUISITION SCHEME= undefined
##.AVERAGES= 8
##.DIGITISER RES= 18
##SPECTROMETER/DATA SYSTEM= spect
##.PULSE SEQUENCE= zg30
##.SOLVENT NAME= CDCl3
##.SHIFT REFERENCE= (INTERNAL, CDCl3, 0, 15.7039)
##AUDIT TRAIL= $$ (NUMBER, WHEN, WHO, WHERE, WHAT)
$$ ##TITLE= Audit trail, XWIN-NMR		Version 3.5
$$ ##JCAMPDX= 5.01
$$ ##ORIGIN= Bruker BioSpin GmbH
$$ ##OWNER= she
$$ F:/spectra/data/she/nmr/H-F/1/audita.txt
$$ ##AUDIT TRAIL=  $$ (NUMBER, WHEN, WHO, WHERE, WHAT)
(   1,<2020-09-01 11:30:27.42 +0400>,<she>,<DPX200>,
      <created by zg, POWCHK disabled, PULCHK disabled
       configuration hash MD5:
       00 E9 B6 7A A2 85 ED C7 34 08 36 98 17 FE 4E 26
       data hash MD5: 16K
       1A C9 0F 5E 50 35 CE B4 93 75 84 E0 A3 12 03 B4>)
$$ ##END=
$$ 
$$ hash MD5
$$ 1C 40 13 A8 E0 EA 99 56 6C 21 36 2A 93 2F A4 9C
##$RELAX= 
##$RELAX= 
##$RELAX= 
##$RELAX= 
##$RELAX= 
##$RELAX= 
$$ Bruker specific parameters
$$ --------------------------
##$DU= <F:/spectra>
##$EXPNO= 1
##$NAME= <H-F>
##$PROCNO= 1
##$TYPE= <nmr>
##$USER= <she>
##$AMP= (0..31)
100 100 100 100 100 100 100 100 100 100 100 100 100 100 100 100 100 100 
100 100 100 100 100 100 100 100 100 100 100 100 100 100 
##$AQSEQ= 0
##$AQ_mod= 1
##$AUNM= <au_zg>
##$AUTOPOS= <>
##$BF1= 200.13
##$BF2= 200.13
##$BF3= 200.13
##$BF4= 200.13
##$BF5= 200.13
##$BF6= 200.13
##$BF7= 200.13
##$BF8= 200.13
##$BYTORDA= 1
##$CFDGTYP= 0
##$CFRGTYP= 5
##$CHEMSTR= <none>
##$CNST= (0..31)
1 1 145 1 1 1 1 1 1 1 1 1 1 1 1 1 1 1 1 1 1 1 1 1 1 1 1 1 1 1 1 1 
##$CPDPRG= <>
##$CPDPRG1= <>
##$CPDPRG2= <>
##$CPDPRG3= <>
##$CPDPRG4= <mlev>
##$CPDPRG5= <mlev>
##$CPDPRG6= <mlev>
##$CPDPRG7= <mlev>
##$CPDPRG8= <mlev>
##$CPDPRGB= <>
##$CPDPRGT= <>
##$D= (0..31)
0 1.2 0 0 0 0 0 0 0 0.06 0 0.03 0 0 0 0 0.0002 0 0 0 0 0 0 0 0 0 0 0 0 
0 0 0 
##$DATE= 1598945427
##$DBL= (0..7)
120 120 120 120 120 120 120 120 
##$DBP= (0..7)
150 150 150 150 150 150 150 150 
##$DBP07= 0
##$DBPNAM0= <>
##$DBPNAM1= <>
##$DBPNAM2= <>
##$DBPNAM3= <>
##$DBPNAM4= <>
##$DBPNAM5= <>
##$DBPNAM6= <>
##$DBPNAM7= <>
##$DBPOAL= (0..7)
0.5 0.5 0.5 0.5 0.5 0.5 0.5 0.5 
##$DBPOFFS= (0..7)
0 0 0 0 0 0 0 0 
##$DE= 6
##$DECBNUC= <off>
##$DECIM= 32
##$DECNUC= <off>
##$DECSTAT= 4
##$DIGMOD= 1
##$DIGTYP= 9
##$DL= (0..7)
0 120 120 120 120 120 120 120 
##$DP= (0..7)
150 150 150 150 150 150 150 150 
##$DP07= 0
##$DPNAME0= <>
##$DPNAME1= <>
##$DPNAME2= <>
##$DPNAME3= <>
##$DPNAME4= <>
##$DPNAME5= <>
##$DPNAME6= <>
##$DPNAME7= <>
##$DPOAL= (0..7)
0.5 0.5 0.5 0.5 0.5 0.5 0.5 0.5 
##$DPOFFS= (0..7)
0 0 0 0 0 0 0 0 
##$DQDMODE= 0
##$DR= 18
##$DS= 0
##$DSLIST= <SSSSSSSSSSSSSSS>
$$ [...]
##$SUBNAM2= <"">
##$SUBNAM3= <"">
##$SUBNAM4= <"">
##$SUBNAM5= <"">
##$SUBNAM6= <"">
##$SUBNAM7= <"">
##$SUBNAM8= <"">
##$SUBNAM9= <"">
##$SW= 16.880792210976
##$SWIBOX= (0..15)
0 0 2 0 0 0 0 0 0 0 0 0 0 0 0 0 
##$SW_h= 3378.37837837838
##$TD= 16384
##$TD0= 1
##$TE= 0
##$TE2= 300
##$TE3= 300
##$TEG= 300
##$TL= (0..7)
0 120 120 120 120 120 120 120 
##$TP= (0..7)
150 150 150 150 150 150 150 150 
##$TP07= 0
##$TPNAME0= <>
##$TPNAME1= <>
##$TPNAME2= <>
##$TPNAME3= <>
##$TPNAME4= <>
##$TPNAME5= <>
##$TPNAME6= <>
##$TPNAME7= <>
##$TPOAL= (0..7)
0.5 0.5 0.5 0.5 0.5 0.5 0.5 0.5 
##$TPOFFS= (0..7)
0 0 0 0 0 0 0 0 
##$TUNHIN= 0
##$TUNHOUT= 0
##$TUNXOUT= 0
##$USERA1= <user>
##$USERA2= <user>
##$USERA3= <user>
##$USERA4= <user>
##$USERA5= <user>
##$V9= 5
##$VALIST= <valist>
##$VCLIST= <CCCCCCCCCCCCCCC>
##$VD= 0
##$VDLIST= <DDDDDDDDDDDDDDD>
##$VPLIST= <PPPPPPPPPPPPPPP>
##$VTLIST= <TTTTTTTTTTTTTTT>
##$WBST= 1024
##$WBSW= 4
##$XGAIN= (0..3)
0 0 0 0 
##$XL= 0
##$YL= 0
##$YMAX_a= 432402
##$YMIN_a= -340192
##$ZGOPTNS= <>
##$ZL1= 120
##$ZL2= 120
##$ZL3= 120
##$ZL4= 120
##$ABSF1= 10
##$ABSF2= 0
##$ABSG= 5
##$ABSL= 3
##$ALPHA= 0
##$AQORDER= 0
##$ASSFAC= 0
##$ASSFACI= 0
##$ASSFACX= 0
##$ASSWID= 0
##$AUNMP= <proc_1d>
##$AZFE= 0.1
##$AZFW= 0.1
##$BCFW= 1
##$BC_mod= 2
##$BYTORDP= 1
##$COROFFS= 0
##$CY= 11.3945322036743
##$DATMOD= 1
##$DC= 2
##$DFILT= <>
##$DTYPP= 0
##$F1P= 16.9975609425685
##$F2P= -3.02152046262296
##$FCOR= 0.5
##$FTSIZE= 0
##$FT_mod= 4
##$GAMMA= 1
##$GB= 0.15
##$INTBC= 1
##$INTSCL= 1
##$ISEN= 128
##$LB= 0.24
##$LEV0= 0
##$LPBIN= 0
##$MAXI= 10000
##$MC2= 0
##$MEAN= 0
##$ME_mod= 0
##$MI= 1.114404
##$NCOEF= 0
##$NC_proc= 0
##$NLEV= 6
##$NOISF1= 3.799351
##$NOISF2= 2.8
##$NSP= 1
##$NTH_PI= 0
##$NZP= 0
##$OFFSET= 15.70392
##$PC= 1
##$PHC0= -9972.421
##$PHC1= 9.80092
##$PH_mod= 1
##$PKNL= yes
##$PPARMOD= 0
##$PSCAL= 0
##$PSIGN= 0
##$REVERSE= no
##$SF= 200.130013532006
##$SI= 16384
##$SIGF1= 3
##$SIGF2= 2
##$SINO= 400
##$SIOLD= 16384
##$SREGLST= <1H.CDCl3>
##$SSB= 0
##$STSI= 0
##$STSR= 0
##$SW_p= 3612.71676300578
##$SYMM= 0
##$S_DEV= 0
##$TDeff= 0
##$TDoff= 0
##$TI= <>
##$TILT= no
##$TM1= 0
##$TM2= 0
##$TOPLEV= 0
##$USERP1= <user>
##$USERP2= <user>
##$USERP3= <user>
##$USERP4= <user>
##$USERP5= <user>
##$WDW= 1
##$XDIM= 8192
##$YMAX_p= 0
##$YMIN_p= 0
$$ End of Bruker specific parameters
$$ ---------------------------------
##NTUPLES= NMR FID
##VAR_NAME=  TIME,          FID/REAL,        FID/IMAG
##SYMBOL=    X,             R,               I
##VAR_TYPE=  INDEPENDENT,   DEPENDENT,       DEPENDENT
##VAR_FORM=  AFFN,          ASDF,            ASDF
##VAR_DIM=   8192,          8192,            8192
##UNITS=     SECONDS,       ARBITRARY UNITS, ARBITRARY UNITS
##FACTOR=    0.000296,      1,               1
##FIRST=     0,             0,               0
##LAST=      2.424536,      0,               0
##MIN=       0,             -340192,         0
##MAX=       2.424536,      432402,          0
$$ Real data points
##PAGE= N=1
##DATA TABLE= (X++(R..R)), XYDATA
$$ [...]
$$ plain form
2515 1590 4650 248 -5679 -4319 2224 4597 -417 -5617 -2726 3922 5126 -747 -4856 -1236 4918
2530 4918 4632 -2204 -5121 -379 4955 3028 -4063 -5712 153 5148 1609 -5149 -4989 1816 5682
2545 5682 1372 -4797 -3770 3792 5635 200 -5118 -2544 4101 4908 -1663 -6040 -2080 4261 3556
2560 3556 -3040 -6081 -983 5174 3377 -3711 -5239 644 5730 2427 -4609 -4968 1339 5363 414
2575 414 -6077 -4900 2139 4457 -1066 -6248 -3828 3471 4520 -1252 -5990 -1558 5001 4870 -1850
2590 -1850 -5013 386 5663 4080 -2752 -4624 1164 6262 3184 -3676 -3742 2771 6711 2124 -3490
2605 -3490 -2297 4278 6969 1306 -4022 -1808 4841 5743 -528 -4958 -1337 4864 4177 -2421 -5708
2620 -5708 -755 4787 2954 -3570 -5442 52 4873 2221 -4389 -4519 1351 5059 850 -4979 -3731
$$ packed form
2515A590L060m402n927J360O543K373n014n200K891O648J204n873m109L620O154
2530D918k86o836k917M742N334j927p091j649N865M995l539o758J60O805L866
2545E682m310o169J027P562J843n435n318K574O645Q07o571m377L960O341p05
2560C556o596l041N098O157j797p088j528N883N086l303p036l59O307M024m949
2575D14o491J177P039K318n523n182K420P299J049n772m738M432O559j31o720
2590a850l163N399N277j583o832j872N788N098l078o860o6O513L940m587n614
2605c490J193O575K691n663n328K214O649R02o271m430L621O201o87o598l287
2620e708M953N542j833o524j872N494M821k652o610j30N870L708m209n829J248
$$ plain form
2635 -3731 2325 5156 -369 -4895 -2538 3780 5146 -307 -4031 -602 5364 5227 -499 -3483 1173
2650 1173 6380 4814 -1203 -3098 2116 6344 3742 -2452 -2752 3056 6098 2501 -3007 -2005 3583
2665 3583 5535 1098 -3904 -1895 3886 4847 -530 -4152 -1288 3884 3541 -1820 -4586 -759 4181
2680 4181 2524 -2510 -4109 350 4471 2043 -3073 -3240 1694 4498 1656 -3196 -2159 2703 4782
2695 4782 986 -3195 -1231 3685 4672 523 -2791 -200 4671 4529 -443 -2480 696 4988 3895
2710 3895 -846 -1994 1609 5085 2693 -1533 -2028 2035 4468 1833 -2417 -1815 2821 3986 841
2725 841 -2724 -1326 3021 3455 -5 -2764 -550 3101 3199 -679 -2532 -41 3598 2543 -1120 -2245
2741 -2245 601 3808 1899 -1446 -1925 1619 3740 1308 -1500 -1451 1839 3479 925 -2056 -1130 2334
$$ packed form
2635c731O056K831n525m526K357O318J366n453l724L429N966j37n726k984M656
2650A173N207j566o017j895N214M228k602o194l00N808L042l597n508J002N588
2665C583J952m437n002K009N781R61n377l622K864N172l43n361k766L827M940
2680D181j657n034j599M459M121k428n116j67M934K804k842m852J037M862K079
2695D782l796m181J964M916R87m149l314K591M871j42m972k037L176M292j093
2710C895m741j148L603L476k392m226m95M063K433k635m250O02M636J165l145
2725H41l565J398M347M34l460k759K214L651R8l878j853K491L639j055l663j125
2741b245K846L207j909l345m79L544K121k432k808M9L290J640k554k981R26L464
$$ plain form
2757 2334 2896 317 -1987 -142 2310 2632 -231 -1916 213 2424 1951 -913 -1594 689 2465 1388
2773 1388 -884 -1229 1110 2561 1049 -1123 -653 1353 2504 368 -944 -324 1574 2114 471 -1333
2789 -1333 -169 2050 1777 323 -948 380 1801 1654 -637 -943 408 1634 1013 -789 -786 608 1374
2806 1374 382 -1169 -815 604 997 228 -1151 -672 606 677 -360 -1123 -482 573 65 -407 -1316 -485
2824 -485 284 -247 -892 -1014 -377 -305 -128 -1098 -798 -333 -79 -369 -689 -514 -388 -50 -478 -882 -586 -295
2844 -295 -519 -484 -379 -434 -226 -296 -339 -152 -169 264 -143 61 229 76 -55 190 546 391 333 -21 135 447
2866 447 451 -2 -510 -44 490 401 -421 -421 -404 336 -180 -858 -908 -350 -56 -515 -1415 -1917 -761 -366 -860 -2066
2888 -2066 -1819 -617 -424 -1340 -2394 -1453 49 70 -1480 -2061 -1124 417 502 -1214 -1641 -181 1047 666
$$ packed form
2757B334N62k579k304J845K452L22k863j685K129K211m73k864o81K283J776j077
2773A388k272l45K339J451j512k172M70K006J151k136j312O20J898N40j643j804
2789a333J164K219k73j454j271J328J421j47k291l06J351J226o21j802LJ394P66
2806A374r92j551L54J419L93p69j379M79J278P1j037p63O41J055n08m72r09Q31
2824d85P69n31o45j22O37P2J77r70L00M65K54k90l20J75J26L38m28m04K96K91
2844b95k24L5J05n5K08p0m3J87j7M33m07K04J68j53j31K45L56j55n8l54J56L12
2866D47Mm53n08M66N34q9q22%J7P40n16o78n0N58K94m59r00n02J156L95m94j206
2888b066K47J202J93r16j054R41J502K1j550n81R37J541Q5j716m27J460J228l81
$$ plain form
2906 666 -934 -1102 481 1726 726 -692 -547 1342 2492 654 -702 -342 1753 2186 332 -945
2922 -945 -280 1899 1725 -267 -1669 -192 1502 1260 -1262 -2227 -251 1503 514 -2116 -2275 -193 1601
2939 1601 -92 -2410 -1935 284 1536 -284 -2426 -1380 945 1860 -567 -2687 -890 1827 1900 -477
2955 -477 -2135 -225 2538 1757 -357 -1620 709 2709 1685 -1325 -1593 1108 3112 1235 -1907 -1287
2971 -1287 1674 2604 311 -2326 -1408 1716 2718 -337 -2495 -1093 2158 2288 -759 -2713 -343 2879
2987 2879 2099 -1142 -2421 617 3105 1929 -1146 -1954 1731 3843 1934 -1582 -1161 2319 3972 1286
3003 1286 -1499 -182 3045 4251 800 -1716 -343 2938 3293 -334 -2306 -340 3200 2575 -1222
3018 -1222 -2777 125 3502 1823 -1898 -2511 947 3505 1296 -2322 -2276 1706 3502 763 -2646 -1351
$$ packed form
2906F66j600j68J583J245j000j418J45J889J150j838j356L60K095M33j854j277
2922i45O65K179j74j992j402J477J694k42k522r65J976J754r89k630j59K082J794
2939A601j693k318M75K219J252j820k142J046K325R15k427k120J797K717P3k377
2955d77j658J910K763p81k114j263K329K000j024l010k68K701K004j877l142O20
2971a287K961R30k293k637R18L124J002l055k158J402L251J30l047j954K370L222
2987B879p80l241j279L038K488j176l075q08L685K112j909l516M21L480J653k686
3003A286k785J317L227J206l451k516J373L281L55l627j972J966L540o25l797
3018a222j555K902L377j679l721o13L458K558k209l618M6L982J796k739l409J295
$$ plain form
3034 -1351 2342 3614 390 -2189 -137 3769 3973 509 -1557 1157 4670 3955 288 -1259 2054
3049 2054 4723 3302 -328 -1220 2224 4598 2659 -1348 -1406 2471 4249 1312 -2142 -1287 2875 3559
3065 3559 276 -2535 -1004 2497 3064 -837 -3368 -690 2902 2521 -1720 -2776 204 3601 2169
3080 2169 -1785 -2407 1400 4295 1889 -1464 -1341 2530 4506 1678 -1569 -571 3275 4435 975 -1796
3096 -1796 94 3652 4158 270 -2002 769 3839 3539 -375 -2160 704 3901 2481 -1572 -2359 799
3112 799 3410 1132 -2246 -2563 1116 3204 -56 -2928 -2234 1968 2911 -23 -3035 -1323 2534 2792
3128 2792 -650 -2825 -355 2896 2651 -1021 -2775 437 3209 2292 -1401 -2059 997 3637 1785 -1921
3144 -1921 -1501 1584 3525 894 -2261 -1478 2156 3245 -106 -2725 -1261 2392 2473 -743 -2995 -732
$$ packed form
3034a351L693J272l224k579K052L906K04l464k066K714L513p15l667j547L313
3049B054K669j421l630q92L444K374j939m007n8L877J778k937l454Q55M162O84
3065C559l283k811J531L501N67l901k531K678L592l81m241j056K980L397j432
3080B169l954o22L807K895k406l353J23L871J976k828l247R98L846J160l460k771
3096a796J890L558N06l888k272K771L070l00l914j785K864L197j420m053p87L158
3112G99K611k278l378l17L679K088l260k872O94M202R43k934l012J712L857K58
3128B792l442k175K470L251k45l672j754L212K772r17l693o58L056K640j852l706
3144a921M20L085J941k631l155P83L634J089l351k619J464L653Q1l216k252K263
$$ plain form
3160 -732 2534 2029 -1337 -3144 134 2842 1478 -1911 -2397 488 2936 937 -2064 -2151 821 2794
3176 2794 299 -2576 -1824 1547 2637 100 -2442 -1066 2215 2243 -501 -2180 -546 1922 1486 -1138
3192 -1138 -2665 -448 2048 934 -2012 -2771 -6 1833 246 -2503 -2585 335 1577 -532 -2691 -2121
3208 -2121 921 1840 -711 -2647 -1883 1169 1524 -897 -2491 -847 1698 1265 -983 -2312 -142 2142
3224 2142 1203 -1091 -1978 520 2091 909 -1540 -1631 622 1861 203 -1989 -1372 706 1472 -488
3240 -488 -2111 -1149 695 1183 -969 -2122 -886 993 796 -1646 -2092 -872 1004 481 -1496 -2073 -176
3257 -176 1168 378 -1703 -1771 324 946 24 -1908 -1223 582 1125 -437 -1413 -896 761 1071 -496 -1669
3275 -1669 -689 838 897 -799 -1614 -398 734 212 -1045 -1536 -109 684 111 -1102 -1240 107 753
$$ packed form
3160g32L266n05l366j807L278K708j364l389m86K885K448j999l001q7K972J973
3176B794k495k875P52L371J090k537k542J376L281K8k744j679J634K468m36k624
3192a138j527K217K496j114k946p59K765J839j587k749q2K920J242k109k159N70
3208b121L042R19k551j936P64L052L55k421j594J644K545m33k248j329K170K284
3224B142r39k294q87K498J571j182k449r1K253J239j658k192O17K078P66j960
3240d88j623R62J844M88k152j153J236J879j97k442m46J220J876n23j977n77J897
3257a76J344p90k081o8K095O22r22j932O85J805N43j562r76N17J657L10j567j173
3275a669R80J527N9j696q15J216J132n22j257m91J427P93n73j213j38J347O46
$$ plain form
3292 753 -56 -1095 -805 385 855 47 -1065 -576 709 464 121 -935 -114 884 832 -189 -515 373
3310 373 738 740 -330 -347 384 746 596 -567 -338 315 602 170 -477 -541 -57 186 -164 -802 -719 135 131 -256
3332 -256 -550 -342 99 -164 -652 -605 -122 -285 -162 -529 -209 -100 83 -60 -428 -47 92 432 252 432
3352 432 756 717 749 524 723 705 621 487 734 746 511 291 302 530 650 381 341 404 701 778 399 97 292
3375 292 554 419 -81 -590 -365 -34 -37 -412 -792 -387 292 -51 -440 -477 128 873 450 95 162 854 1433
3396 1433 794 -9 476 1177 1326 321 -204 437 1201 1032 439 -71 456 1346 1269 390 16 626 1389 1032
3416 1032 -158 -598 246 1104 123 -879 -819 208 475 -120 -1132 -773 546 925 107 -604 74 1307
3434 1307 1493 267 -770 259 1599 1342 -144 -496 604 1549 1490 -130 -360 1165 2099 1389 77
$$ packed form
3292G53q09j039K90J190M70q08j112M89J285k45l43j056Q21R98n2j021l26Q88
3310C73L65Kj070j7P31L62j50j163K29O53K87m32o47o4M84K43l50o38Q3Q54ml87
3332b56k94K08M41k63m88M7M83j63J23l67L20J09J83j43l68L81J39L40j80J80
3352D32L24l9L2k25J99j8q4j34K47J2k35k20J1K28J20k69m0O3K97P7l79l02J95
3375B92K62j35n00n09K25L31ll75l80M05O79l43l89l7O05P45m23l55O7O92N79
3396A433o39q03M85P01J49j005n25O41P64j69n93n10N27Q90p7q79l74O10P63l57
3416A032j190m40Q44Q58r81j002O0J027K67n95j012L59J319L79q18p11O78J233
3434A307J86j226j037J029J340k57j486l52J100R45n9j620k30J525R34p10j312
$$ plain form
3451 77 176 1721 2211 1243 -173 122 1586 1741 158 -1040 -679 889 970 -732 -1662 -767 960 655
3469 655 -839 -1602 -302 1400 768 -1125 -1317 283 1435 523 -1510 -999 484 1463 312 -1459 -524
3486 -524 1400 1975 576 -726 401 2280 2344 690 -265 509 2437 2236 -152 -1169 225 1884 984
3503 984 -1068 -1339 108 1518 446 -1625 -1386 519 1693 231 -1966 -1367 474 1270 -874 -2648
3519 -2648 -1599 705 743 -1455 -2447 -1090 1187 640 -1224 -1920 99 2171 1179 -741 -1086 979 2622
3536 2622 1517 -1052 -1111 1446 2378 787 -1497 -833 1588 2356 51 -1598 -273 1964 1981 -428 -1752
3553 -1752 -419 1817 1314 -1180 -2099 -612 1223 176 -2181 -2718 -560 938 -306 -2556 -2235 202
3569 202 1320 -198 -2173 -1251 921 1767 -523 -2154 -1096 1203 1571 -727 -2183 -591 1389 1476
$$ packed form
3451G7R9J545M90r68j416K95J464J55j583j198L61J568Q1j702r30Q95J727l05
3469F55j494p63J300J702o32j893j92J600J152r12k033N11J483R79j151j771R35
3486e24J924N75j399j302J127J879O4j654r55P74J928k01k388j017J394J659r00
3503I84k052k71J447J410j072k071K39J905J174j462k197N99J841P96k144j774
3519b648J049K304L8k198r92J357K277n47j864o96K019K072r92j920l45K065J643
3536B622j105k569n9K557R32j591k284O64K421P68k305j649J325K237J7k409j324
3553a752J333K236n03k494r19J487J835j047k357n37K158J498j244k250L21K437
3569B02J118j518j975R22K172Q46k290j631J058K299L68k298j456J592J980Q7
$$ plain form
3585 1476 -1272 -1883 226 2175 1121 -1227 -1153 845 2324 936 -1292 -1256 780 1756 309 -2010
3601 -2010 -1401 741 1204 -601 -2306 -1138 978 1240 -797 -2312 -469 1659 1543 -1184 -1909 -249
3617 -249 1673 703 -1489 -1756 194 1601 258 -1775 -1558 732 1641 329 -1743 -1328 1236 1687 -19
3634 -19 -1884 -919 1319 1466 -535 -2171 -913 1054 890 -1225 -2246 -582 1218 715 -1678 -1682 -99
3651 -99 1211 433 -1737 -1520 359 1846 41 -1742 -1394 795 1704 -41 -1376 -804 1250 1889 -111
3668 -111 -1183 -82 1954 1390 -324 -1362 315 1898 1298 -765 -1082 502 1893 677 -1188 -917
3684 -917 517 1444 183 -1807 -1209 640 1362 -379 -1482 -1016 827 813 -734 -1781 -307 862 567
3701 567 -816 -1557 -192 1379 854 -758 -1188 477 1587 775 -731 -726 763 1685 712 -971 -256 1245
$$ packed form
3585A476k748o11K109J949j054k348P4J998J479j388k228L6K036R76j447k319
3601b010O09K142M63j805j705J168K116K62k037j515J843K128j16k727p25J660
3617b49J922r70k192k67J950J407j343k033K17K290R09j312k072M15K564M51j706
3634a9j865R65K238J47k001j636J258J967j64k115j021J664J800n03k393mJ583
3651i9J310p78k170K17J879J487j805j783L48K189R09j745j335N72K054O39k000
3668a11j072J101K036n64j714j038J677J583o00k063l17J584J391j216j865K71
3684i17J434R27j261j990N98J849P22j741j103M66J843j4j547j047J474J169k95
3701E67j383p41J365J571n25j612m30J665J110q12j506NJ489R22r73j683P15J501
$$ plain form
3719 1245 1790 193 -903 -253 1146 1385 21 -949 -182 1194 831 -546 -991 -39 1231 785 -810
3736 -810 -1264 253 1050 450 -784 -917 157 892 171 -1037 -634 706 1101 -43 -1081 -346 1030
3753 1030 1067 -88 -977 -148 1004 863 -229 -582 137 1336 1076 -212 -485 460 1333 392 -400 -473 521
3772 521 800 122 -751 -428 476 775 -200 -700 -299 689 645 -239 -1005 -372 507 -69 -507 -909 -172 482
3792 482 48 -563 -763 -148 906 267 -385 -389 416 1092 534 -368 129 622 889 247 -303 -381 308 249 -139
3813 -139 -342 -69 401 571 -157 -363 -109 598 289 -221 -400 -140 261 158 -509 -395 -250 49 -107 -481
3833 -481 -375 -28 292 -40 -278 -96 413 342 204 -69 196 362 270 42 186 240 50 172 -158 -98 143
3854 143 -72 55 129 137 -85 129 63 168 26 -113 31 -348 -362 -171 -351 -877 -778 -574 -560 -798 -840 -378 -225
$$ packed form
3719A245N45j597j096O50J399K39j364r70P67J376l63j377m45R52J270m46j595
3736h10m54J517P97o00j234j33J074P35p21j208M03J340L95j144j038P35J376
3753A030L7j155q89Q29J152j41j092l53P19J199k60j288k73R45Q73r41p92p3R94
3772E21K79o78q73L23R04K99r75n00M01R88m4q84p66O33Q79n76m38m02P37O54
3792D82m34o11k00O15J054o39o52mQ05O76n58r02M97M93K67o42n50p8O89n9l88
3813a39k03K73M70J70p28k06K54P07l09n10j79K60M01j03o67J14J45K99j56l74
3833d81J06L47L20l32k38J82N09p1j38k73K65J66r2k28J44N4j90J22l30O0K41
3854A43k15J27P4Qk22K14o6J05j42j39J44l79j4J91j80n26R9K04J4k38m2M62J53
$$ plain form
3877 -225 -535 78 -213 21 149 112 -107 -39 185 319 -87 -131 -249 247 360 -102 -95 262 546 572 199 -55
3899 -55 392 709 512 -11 9 81 312 -45 -810 -900 -306 -148 -752 -1132 -1082 -367 -80 -912 -1140 -592 -36 -109
3921 -109 -659 -906 -450 184 -192 -1059 -982 -501 147 -370 -820 -544 74 520 141 -605 -126 736 823 461 -217
3942 -217 103 874 915 -22 -763 -216 313 165 -630 -1343 -107 396 139 -1184 -1198 -295 437 27 -1011 -936
3962 -936 -189 247 -614 -1329 -1301 -64 25 -832 -1476 -1163 110 492 -480 -1095 -349 929 999 -371 -585 192
3982 192 1207 811 -599 -607 405 1205 492 -758 -723 392 1122 164 -981 -821 724 1085 -186 -1106
4000 -1106 -612 716 689 -831 -1434 -702 429 -194 -1392 -1826 -856 250 -287 -1246 -1773 -204 691 126
4018 126 -1042 -932 397 1284 136 -1055 -707 559 1235 203 -1000 -452 1039 1095 103 -549 -112 1212
$$ packed form
3877b25l10O13k91K34J28l7k19O8K24J34m06m4j18M96J13m62PL57K84K6l73k54
3899e5M47L17j97n23K0P2K31l57p65r0N94J58o04l80N0P15K87q32k28N48N56p3
3921a09n50k47M56O34l76q67P7M81O48n17m50K76O18M46l79p46M79Q62Q7l62o78
3942b17L20P71M1r37p41N47N29j48p95p13J236N03k57j323j4R03P32m10j038P5
3962i36P47M36q61p15K8J237Q9q57o44L13J273L82r72o15P46J278P0j370k14P77
3982A92J015l96j410qJ012Q00p13j250L5J115P30r58j145J60J545L61j271r20
4000a106M94J328k7j520o03P32J131o23j198m34R70J106n37r59n27J569Q95n65
4018A26j168J10J329Q87j148j191L48J266O76j032j203N48J491N6r92o52M37J324
$$ plain form
4036 1212 1300 60 -742 325 1525 1012 -348 -942 259 1266 393 -1003 -1234 181 795 -410 -1740
4053 -1740 -1255 357 941 -282 -1535 -695 698 1099 -424 -1354 -595 875 919 -800 -1391 -211 1018
4070 1018 532 -919 -1119 81 1533 709 -774 -540 834 1615 533 -622 -607 773 1426 9 -1074
4087 -1074 -390 951 1061 -386 -1532 -491 961 907 -508 -1177 43 1229 841 -754 -1219 295 1398
4104 1398 319 -842 -1004 300 1343 77 -1049 -1162 778 1184 -41 -1147 -401 866 1148 28
4120 28 -933 -185 1236 1147 -281 -983 -35 1059 726 -805 -1260 32 1030 521 -1190 -821 352 1090
4138 1090 476 -982 -742 708 1225 143 -991 -594 747 922 -68 -1323 -246 1065 978 -486 -888
4155 -888 190 1232 1056 -439 -967 446 1326 792 -781 -981 424 1094 435 -789 -727 327 1137 110
$$ packed form
4036A212Q8j240q02J067J200n13j360n94J201J007q73j396k31J415O14j205j330
4053a740M85J612N84j223j253Q40J393M01j523r30P59J470M4j719n91J180J229
4070A018m86j451k00J200J452q24j483K34J374P81j082j155J5J380O53j417j083
4087a074O84J341J10j447j146J041J452n4j415o69J220J186l88j595m65J514J103
4104A398j079j161j62J304J043j266j126j13J940M06j225j106P46J267K82j120
4120B8r61P48J421q9j428p02R48J094l33j531m55J292R98n09j711L69J173P38
4138A090o14j458K40J450N17j082j134L97J341J75r90j255J077J311q7j464m02
4155h88J078J042j76j495n28J413Q80n34j573k00J405O70o59j224O2J054Q10j027
$$ plain form
4173 110 -1305 -941 593 733 -306 -1155 -526 693 580 -585 -1195 -326 789 358 -648 -1263 -83
4190 -83 833 499 -979 -973 372 995 233 -832 -451 874 1122 -117 -622 -408 921 1272 -122 -688 -52
4209 -52 1057 972 -116 -691 -118 1127 713 -482 -790 54 935 378 -657 -1024 163 715 102 -722 -816
4228 -816 89 781 -218 -1413 -904 32 551 -527 -1194 -767 269 243 -504 -786 -424 581 198 -607 -1177
4247 -1177 -193 802 -101 -766 -686 292 546 374 -747 -537 381 605 229 -612 -279 416 371 -311 -814 -174
4267 -174 508 530 -481 -759 -291 300 294 -584 -771 -379 456 -112 -611 -867 -256 274 -14 -715 -502 -34 473
4288 473 -313 -700 -455 -23 168 -242 -786 -439 -38 -12 -422 -756 -360 -63 -147 -645 -865 -399 122 -237 -892
4309 -892 -890 -150 51 -256 -799 -768 -152 -70 -275 -561 -467 -201 -206 -548 -670 -375 -89 77 -231 -363 -19 85
$$ packed form
4173A10j415L64J534J40j039q49O29J219j13j165o10Q69J115m31j006o15J180
4190h3R16l34j478OJ345O23p62j065L81J325K48j239n05K14J329L51j394n66O36
4209e2J109q5j088n75N73J245m14j195l08Q44Q81n57j035l67J187N52o13q24r4
4228h16R05O92r99j195N09R36N19j078o67M27J036k6p47k82L62J005l83q05n70
4247a177R84R95r03o65Q0R78K54j72j121K10R18K24l76q41L33O95m5o82n03O40
4267a74O82K2j011k78M68N91oq78j87L92Q35n68m99k56O11N30k88p01K13M68N07
4288D73p86l87K45M32J91m10n44L47M01K6m10l34L96K97q4m98k20M66N21l59o55
4309h92KP40K01l07n43L1O16Q2k05k86R4K66nl42j22K95K86J66l08j32L44J04
$$ plain form
4331 85 206 -461 -337 -174 177 -44 -144 -283 -65 25 -21 -405 -74 -4 -197 -207 -377 -156 -53 -12 -166 -309
4353 -309 -301 -406 -572 -622 -658 -506 -384 -207 -617 -626 -372 -504 -535 -456 -154 -229 -312 -261 34 -218 -122 -336 -144 -166
4377 -166 -306 -266 -19 -55 117 112 -87 -16 121 349 360 -180 277 163 113 63 -245 209 -100 169 -85 -409 -303
4400 -303 -44 -77 -234 -434 -131 142 287 -437 -336 -157 212 -195 -473 -562 -170 -81 -9 -284 -376 45 141 86
4422 86 -273 -147 413 523 459 19 314 773 824 338 28 334 542 631 -161 -197 113 580 447 10 -497 245
4444 245 505 61 -115 -195 268 508 16 -491 -351 272 385 -351 -686 -520 255 491 -181 -613 -186 734
4464 734 243 -159 -189 205 779 665 -52 -461 332 787 527 -347 -118 531 1131 287 -278 -321 873 767
4484 767 194 -42 47 770 687 -12 -558 30 729 166 -392 -934 -156 627 184 -605 -626 56 510 -14 -740
$$ packed form
4331H5J21o67J24J63L51k21j00j39K18R0m6l84L31P0j93j0j70K21J03M1j54j43
4353c09Qj05j66n0l6J52J22J77m10rK54j32l1P9L02p5q3N1K95k52R6k14J92k2
4377a66j40M0K47l6J72nj99P1J37K28J1n40M57j14n0n0l08M54l09K69k54l24J06
4400c03K59l3j57k00L03K73J45p24J01J79L69m07k78q9L92Q9P2k75r2M21R6n5
4422H6l59J26N60J10o4m40K95M59N1m86l10L06K08Q9p92l6L10M67j33m37n07P42
4444B45K60m44j76q0M63K40m92n07J40O23J13p36l35J66P75K36o72m32M27R20
4464G34m91m02l0L94N74j14p17m09P93M55k60q74K29O49O00q44n65m3J194j06
4484G67n73k36Q9P23q3o99n46N88O99n63n58n42P78P83m43p89k1O82M54n24p26
$$ plain form
4505 -740 -861 431 870 41 -890 -564 376 617 89 -702 -281 619 565 -13 -599 135 860 736 -1 -323
4525 -323 472 1147 621 -249 -467 396 696 362 -463 -390 394 585 234 -656 -434 655 1026 -49 -628 -229
4545 -229 681 672 -385 -1031 -236 793 597 -273 -762 -285 674 256 -821 -738 63 784 641 -611 -671 444
4565 444 1085 243 -761 -480 520 720 8 -855 -303 686 903 -364 -856 -257 785 435 -173 -810 192
4584 192 712 483 -415 -838 354 811 391 -731 -671 525 844 -55 -631 -422 575 671 -237 -1054 -756 544
4604 544 496 -415 -1013 -300 620 496 -815 -1033 -109 965 349 -823 -776 164 676 178 -903 -785 82
4623 82 583 21 -1065 -738 381 784 -358 -1130 -724 407 687 -276 -1006 -156 583 510 -357 -906 -71
4642 -71 778 562 -779 -741 223 1174 267 -742 -683 111 809 -245 -730 -737 225 737 116 -1174 -594 577
$$ packed form
4505g40j21J292M39q29r31L26R40K41n28p91M21R00n4n78n86P34P25j24p37l22
4525c23P95O75n26q70k18Q63L00l34q25P3P84J91l51q90K22J089L71j075n79L99
4545b29R10rj057o46P95J029j96q70m89M77R59m18j077Q3Q01P21j43j252o0J115
4565D44O41q42j004K81J000K00p12q63N52R89K17j267m92N99J042l50o08o37J002
4584A92N20k29q98m23J192M57m20j122O0J196L19q99n76K09R97R6r08q17K98J300
4604E44m8r11n98P13R20j24j311k18R24J074o16j172M7R40N12m98j081J18Q67
4623H2N01n62j086L27J119M03j142p72M06J131K80r63p30Q50P39p3q67n49Q35
4642g1Q49k16j341L8R64R51r07j009N9P94O98j054m85pR62N12o21j290N80J171
$$ plain form
4662 577 561 -445 -1075 -674 414 347 -629 -1048 -346 386 142 -866 -1113 -370 420 -117 -1064 -790 75 472
4682 472 -95 -1060 -805 320 291 -329 -877 -516 299 274 -152 -797 -379 531 518 -226 -641 -151 728 288 -470
4703 -470 -900 -197 734 60 -673 -464 340 690 168 -621 -642 450 599 438 -702 -566 660 380 -115
4722 -115 -828 -472 461 295 -380 -959 -188 192 71 -549 -675 -203 308 263 -495 -747 -126 291 78 -837
4742 -837 -855 -2 579 -337 -528 -475 346 391 -98 -520 -472 223 214 -320 -733 -125 502 134 -509 -539 -74 273
4764 273 63 -394 -632 43 346 107 -661 -359 5 315 -75 -280 -369 319 386 -191 -470 -326 726 149
4784 149 -284 -317 -58 382 188 -131 -464 -132 363 143 -399 -494 37 253 145 -581 -375 59 11 -269 -648
4805 -648 -284 157 70 -154 -425 -8 -49 222 -231 52 40 259 275 -67 -172 -15 352 248 5 -194 188
$$ packed form
4662E77j6j006o30M01J088o7r76m19P02P32k44j008k47P43P90n37r47K74Q65L97
4682D72n67r65K55J125k9o20n48L61Q15k5m26o45M18R10j3p44m15M90Q79m40p58
4703d70m30P03R31o74p33K09Q04L50n22p89k1J092J49j61j140J36J226k80m95
4722a15p13L56R33j66o75n79P71L80j21o20j26M72N11m5p58k52O21M17k13r15
4742h37j8Q53N81r16j91N3Q21M5m89m22M8O95rn34m13O08O27l68o43l0M65L47
4764B73k10m57k38O75L03k39p68L02L64L10l90k05q9O88O7n77k79J44J052n77
4784A49m33l3K59M40j94l19l33L32M95k20n42r5N31K16j08p26K06M34m8k80l79
4805f48L64M41q7k24k71M17m1K71m53K83j2K19J6l42j05J57L67j04k43j99L82
$$ plain form
4826 188 419 183 44 255 353 240 59 173 83 402 255 20 -221 -49 348 239 -19 -197 23 -89 110
4847 110 30 -368 173 180 -58 -184 -40 121 -1 -50 -119 274 -22 -178 35 118 -119 178 1 -2 -40 270 -15
4870 -15 88 117 251 449 116 304 328 143 166 -46 34 82 -93 288 146 -39 -62 246 -173 -102 -62 170 43
4893 43 30 -103 74 100 9 -335 -381 -307 259 -8 -148 63 -77 65 -76 -148 -463 136 103 124 -163 -114 -73 198
4917 198 8 122 194 276 283 -107 -82 278 90 2 53 -163 146 226 235 -23 -125 -30 267 35 -514 -330 -122 243
4941 243 -59 -537 -148 61 -103 -264 -575 -404 212 8 -480 -506 -161 239 3 -415 -411 62 248 57 -323
4962 -323 -302 304 536 -2 -165 -259 117 277 -102 -270 -234 109 497 -218 -375 -26 317 499 -205 -711 38
4983 38 84 208 -296 -586 73 355 -34 -634 -472 5 385 110 -734 -714 208 57 -15 -660 -301 389 472 -180
$$ packed form
4826A88K31k36j39K11R8j13j81J14r0L19j47k35k41J72L97j09k58j78K20j12J99
4847A10q0l98N41Pk38j26J44J61j22m9o9L93k96j56K13Q3k37K97j77ll8L10k85
4870a5J03K9J34J98l33J88K4j85K3k12Q0M8j75L81j42j85k3L08m19P1M0K32j27
4893D3j3j33J77K6r1l44m6P4N66k67j40K11j40J42j41p2l15N99l3K1k87M9M1K71
4917A98j90J14P2Q2Pl90K5L60j88q8N1k16L09Q0Rk58j02R5K97k32n49J84K08L65
4941B43l02m78L89K09j64j61l11J71O16k04m88k6L45M00k36m18MM73J86j91l80
4962c23K1O06K32n38j63r4L76J60l79j68L6L43L88p15j57L49L43J82p04n06P49
4983C8M6J24n04k90O59K82l89o00J62M77L80k75q44K0R22j51p2o45L59O90Q3o52
$$ plain form
5005 -180 -589 -144 384 338 -545 -501 -18 692 407 -449 -308 132 530 111 -128 -245 -105 793 253 -777
5025 -777 -223 212 518 221 -747 -358 537 512 -351 -613 -362 421 221 -244 -696 151 424 113 -558 -664
5045 -664 -135 678 80 -809 -682 -4 791 -222 -742 -661 249 575 -136 -677 -547 502 583 -374 -924 -425
5065 -425 717 527 -41 -794 -132 450 263 -633 -610 181 605 328 -644 -617 190 425 371 -369 -251 242 234
5086 234 -68 -814 -370 548 685 -81 -649 -342 772 365 -110 -914 -402 596 361 -182 -529 -69 717 419
5106 419 -322 -660 324 715 161 -447 -429 588 755 -38 -904 -419 481 596 -98 -649 -319 619 661 -293
5126 -293 -595 -28 519 375 -353 -1056 9 603 470 -729 -589 99 433 93 -689 -433 270 887 -30
5145 -30 -877 -185 405 844 3 -582 -20 580 739 -123 -468 28 723 454 -251 -494 302 943 262 -258
$$ packed form
5005a80m09M45N28m6q83M4M83P10k85q56J41M40L98m19k39j17J40Q98n40j030
5025g77N54M35L06k97r68L89Q95k5q63k62K51P83k00m65m52Q47K73l11o71j06
5045f64N29Q13n98q89J27O78P95j013n20Q1R10L26p11n41J30J049Q1r57n50M99
5065d25J142j90n68p53O62N82j87q96K3P91M24k77r72K7Q07K35n4p40J18M93q
5086B34l02p46M44R18J37p66n68L07J114m07m75q04N12R98k35n43l47M60P86k98
5106D19p41l38R84L91n54o08J8J017J67p93q66M85R00J15o94n51L30R38M2r54
5126b93l02N67N47j44p28p03J065N94j33j199J40O88L34l40p82K56P03O17r17
5145c0q47O92N90M39q41n85N62O00J59q62l45M96O95k69p05k43P96O41o81n20
$$ plain form
5165 -258 -333 172 781 147 -377 -219 394 789 148 -587 -146 499 784 -118 -579 -137 330 577 -117 -699
5185 -699 -66 615 256 -423 -478 -23 614 237 -385 -597 196 605 68 -264 -589 310 483 284 -595 -296
5205 -296 483 741 26 -305 -130 655 747 -47 -673 171 598 539 -109 -277 96 822 493 -23 -142 263 395
5226 395 137 -365 -216 336 471 191 -596 -307 344 402 -165 -601 -163 255 220 53 -327 -91 529 393 -414
5247 -414 -537 -31 345 125 -288 -408 91 427 77 -279 -472 154 596 55 -260 -284 398 353 35 -503 127
5268 127 368 248 16 -238 -114 437 120 -285 -215 -55 415 -8 -340 -257 -335 323 228 -521 -372 102 256
5289 256 -114 -158 -371 38 364 -248 -438 -142 261 348 -332 -551 -198 -99 -26 -186 -425 -24 168 -164 -82 -29
5311 -29 43 123 -96 -171 -137 206 169 -101 -289 -147 30 121 -151 112 -149 58 125 -18 -102 -178 4 132 -59
$$ packed form
5165b58p5N05O09o34n24J58O13L95o41p35M41O45K85r02m61M42M67K47o94n82
5185f99O33O81l59o79n5M55O37l77o22k12P93M09n37l32l25Q99J73j99q79K99
5205b96P79K58p15l31J75P85R2p94o26Q44M27n9o48j68L73P26l29n16j19M05J32
5226C95k58n02J49N52J35k80p87K89O51N8n67m36M38M18l5j67l80K36O20j36q07
5247d14j23N06L76k20m13j20M99L36l50l56j93O26M42n41l15k4O82m5l18n38O30
5268A27K41j20k32k54J24N51l17m05P0J60M70m23l32Q3p8O58r5p49J49M74J54
5289B56l70m4k13M09L26o12j90K96M03Q7o80k19L53R9P3j60k39M01J92l32Q2N3
5311b9P2Q0k19p5L4L43l7k70j88J42J77R1k72K63k61K07O7j43q4p6J82J28j91
$$ plain form
5334 -59 -115 313 215 20 -122 -71 -331 -53 -115 -290 -352 -244 -25 -58 -225 -126 6 88 43 32 157 90 99 -253 -203
5359 -203 -116 -91 -332 -280 -238 -28 66 -113 -36 113 194 29 41 -101 -42 -33 50 46 -92 22 -408 52 1 -257 27
5384 27 -151 -45 -4 113 -85 -150 112 -204 70 103 84 -143 -68 -57 -38 -178 -273 -17 -159 8 162 -22 -245
5407 -245 261 -59 -121 64 50 273 -38 -11 91 -79 83 169 -170 202 44 47 -169 -313 5 118 -96 -182
5429 -182 125 78 170 -16 -61 -13 288 -56 -132 -306 -244 99 -122 -305 -388 -190 269 -107 -392 -69 104 349
5451 349 131 60 -36 286 174 56 -241 18 280 333 -46 -271 103 427 442 -112 133 173 499 457 -73 -187
5473 -187 142 565 151 -263 -96 -127 280 311 -416 -303 288 205 281 -412 -108 189 344 -227 -301 -112 405 217
5495 217 -248 -387 -30 407 233 -380 -410 75 210 406 -380 -235 134 479 -20 -247 18 305 644 -20
$$ packed form
5334e9n6M28r8j95j42N1k60K78o2j75o2J08K19l3j67R9J32Q2m5j1J25o7Rl52N0
5359b03Q7K5k41N2M2K10R4j79P7J49Q1j65J2j42N9RQ3mj38J14m30M60n1k58K84
5384B7j78J06M1J17j98o5K62l16K74L3j9k27P5J1J9j40r5K56j42J67J54j84k23
5407b45N06l20o2J85j4K23l11K7J02j70J62Q6l39L72j58Lk16j44L18J13k14q6
5429a82L07m7R2j86m5M8L01l44p6j74O2L43k21j83q3J98M59l76k85L23J73K45
5451C49k18p1r6L22j12j18k97K59K62N3l79k25L74L24J5n54K45M0L26m2n30j14
5473a87L29M23m14m14J67l1M07L1p27J13N91q3P6o93L04K97J55n71p4J89N17j88
5495B17m65j39L57M37j74o13l0M85J35J96p86J45L69L45m99k27K65K87L39o64
$$ plain form
5515 -20 -389 -179 365 483 -76 -582 -53 376 226 -359 -218 102 517 106 129 -445 217 520 274 -38 -347
5536 -347 395 615 -183 -467 -554 222 578 -160 -419 -206 396 605 146 -413 -72 630 407 -233 -256 -43 703
5557 703 267 -283 -375 113 374 216 -300 -459 272 340 -168 -326 -318 445 420 -132 -536 -147 220 327 -239 -634
5579 -634 -203 340 280 -430 -426 64 453 398 -295 -536 -7 621 153 -49 -201 367 484 183 -472 -241 253
5600 253 604 1 -428 -262 443 459 -47 -374 -10 535 409 -220 -361 37 502 423 -311 -400 230 523 94
5621 94 -564 -330 109 639 -5 -360 -390 140 605 -171 -576 -279 319 119 -274 -547 -256 420 346 -394 -595
5642 -595 -130 674 370 -300 -338 133 648 131 -273 -370 248 438 305 -125 -441 208 536 -117 -356 -250 382
5663 382 496 -211 -493 -89 399 329 -68 -414 146 424 29 -448 -672 163 399 281 -395 -129 263 328 -84
$$ packed form
5515b0l69K10N44J18n59n06N29M29j50n85J41L20M15m11K3n74O62L03k46l12l09
5536c47P42K20p98k84q7P76L56p38k59K13O02K09m59n59L41P02k23o40k3K13P46
5557G03m36n50r2M88K61j58n16j59P31O8n08j58QP63k5n52m04L89L67J07n66l95
5579f34M31N43o0p10MM90L89n5o93k41N29O28m68k02j52N68J17l01o55K31M94
5600B53L51o03m29J66P05J6n06l27L64N45j26o29j41L98M65p9p34q9O30K93m29
5621I4o58K34M39N30o44l55l0N30M65p76m05K97N98k00l93k73K91O76p4p40k01
5642e95M65Q04l04o70l8M71N15n17m04r7O18J90j33m30l16O49L28o53k39J06O32
5663C82J14p07k82M04M88p0l97l46N60K78l95m77k24Q35K36j18o76K66L92O5m12
$$ plain form
5684 -84 -464 -237 249 473 -298 -399 -196 317 397 -64 -541 -241 520 503 -113 -352 -173 517 458 -277 -306 177
5706 177 523 120 -239 -350 279 294 116 -512 -209 246 481 -107 -406 83 241 186 -189 -378 -172 118 149
5727 149 -125 -455 68 248 368 -440 -233 -145 201 -84 -199 -570 164 245 -27 -354 -417 -16 330 -48 -616
5748 -616 -85 179 36 -136 -472 -282 218 132 -220 -312 54 226 168 -265 -246 12 341 -25 -112 2 -99 210
5770 210 265 -389 -98 111 165 140 -395 62 111 175 -42 -217 -223 125 173 -269 -370 -133 236 250 -320 -192 -64
5793 -64 218 285 -203 -101 -5 -40 125 -293 -274 -121 76 -236 -214 11 -21 218 -209 -296 -72 23 253 72 -256
5816 -256 38 151 207 116 -229 197 317 201 24 -275 -78 146 -41 -101 -41 125 33 341 -208 -67 138 14
5838 14 58 128 81 356 61 -59 -235 27 -63 -61 288 -78 19 161 57 -40 -89 0 201 324 66 -3 -4 119 203
$$ packed form
5684h4l80K27M86K24p71j01K03N13Q0m61m77L00P61j7o16k39J79O90n9p35k9M83
5706A77L46m03l59j11O29J5j78o28L03M55K35n88k99M89J58n5l75j89K06K90L1
5727A49k74l30N23J80J20q08K07Q8L46k85j15l71P34Q1k72l27o3M01L46l78n68
5748f16N31K64j43j72l36J90N00q6l52r2L66J72n8m33J9K58L29l66q7J14j01L09
5770B10N5o54K91K09N4k5n35M57M9O4k17j75oL48M8m42j01K37L69J4n70J28J28
5793f4K82O7m88J02R6l5J65m18J9J53J97l12K2K25l2K39m27q7K24R5K30j81l28
5816b56K94J13N6r1l45M26J20j16j77k99J97K24j87o0O0J66r2L08n49J41K05j24
5838A4M4P0m7K75k95j20j76K62r0KL49l66R7J42j04r7m9Q9K01J23k58o9jJ23Q4
$$ plain form
5863 203 149 199 137 -9 -28 -10 -23 81 21 38 -15 162 -12 91 -74 -46 339 145 474 -21 25 70 -34 156
5887 156 42 248 46 96 -121 -2 -1 276 199 353 207 19 13 80 -221 198 164 130 18 193 89 147 -16
5910 -16 226 287 75 382 -88 12 117 318 8 129 121 261 331 121 71 78 315 43 -301 4 18 145 -103
5933 -103 34 142 17 57 115 -80 -410 108 200 -34 -283 28 65 2 -24 -165 -12 232 331 -74 -241 140
5955 140 202 132 -231 -29 81 186 114 -173 -124 -59 193 -75 -380 19 238 392 -50 -39 -211 120 89 7 -239
5978 -239 44 432 551 -78 -42 91 -67 -12 -213 -155 169 164 -127 -31 -147 164 166 -3 -330 -25 212 212 -11
6001 -11 -352 -125 165 190 -215 -354 -468 215 54 45 -221 -4 43 189 -416 -458 10 78 98 -226 -40 166 39
6024 39 -8 -434 -86 143 120 -233 -407 -342 143 313 -157 -194 -177 359 258 -6 -268 251 159 186 -255 -257 110
$$ packed form
5863B03n4N0o2j46j9J8j3J04o0J7n3J77j74J03j65K8L85j94L29m95M6M5j04J90
5887A56j14K06k02N0k17J19JK77p7J54j46j88oO7l01M19l4l4j12J75j04N8j63
5910a6K42O1k12L07m70J00J05K01l10J21qJ40P0k10n0PK37k72l44L05J4J27k48
5933a03J37J08j25M0N8j95l30N18R2k34k49L11L7o3k6j41J53K44R9m05j67L81
5955A40O2p0l63K02J10J05p2k87M9O5K52k68l05L99K19J54m42J1j72L31l1q2k46
5978b39K83L88J19o29L6J33j58N5k01N8L24nk91R6j16L11Kj69l27L05K37%k23
6001a1l41K27K90K5m05j39j14O83j61rk66K17M7J46o05m2M68O8K0l24J86K06j27
6024C9m7m26L48K29k3l53j74O5M85J70m70l7J7N36j01k64k62N19r2K7m41kL67
$$ plain form
6047 110 202 398 -221 -188 98 331 -122 -152 -347 224 329 -141 -215 -212 341 200 -250 -427 -189 473 244 -346
6069 -346 -469 -227 438 18 -168 -226 -101 309 40 -420 -379 301 389 99 -277 -283 345 -62 -82 -153 -156 322 334
6092 334 -239 -200 -222 346 122 -153 -63 112 203 220 -426 -392 128 134 132 -266 -159 106 443 136 -425 -32 353
6115 353 506 118 -447 -220 217 153 86 -468 -162 235 496 -85 -446 -25 315 314 -211 -411 76 618 145
6136 145 -528 -309 355 530 203 -235 26 88 101 -38 -189 -61 193 380 64 -403 8 291 204 -334 -286
6157 -286 19 338 25 -453 -386 254 430 -4 -449 -259 -104 269 -48 -522 -270 114 145 -64 -515 -346 230
6178 230 437 41 -480 -259 187 219 -85 -242 -161 431 145 -182 -454 155 71 182 -97 -293 67 250 -40
6199 -40 -416 15 383 591 70 -591 -12 170 174 -3 -119 -288 426 78 -220 -329 68 84 133 -32 -403 103
$$ packed form
6047A10R2J96o19L3K86K33m53l0j95N71J05m70p4LN53j41m50j77K38O62k29n90
6069c46j23K42O65m20j86n8J25M10k69m60M1O80Q8k90l76oO28m07k0p1lM78J2
6092C34n73L9k2N68k24k75R0J75R1J7o46L4N20Okl98J07K65L37l07n61L93L85
6115C53J53l88n65K27M37o4o7n54L06L97K61n81l61M21L40jn25k00M87N42m73
6136A45o73K19O64J75l27m38K61O2J3j39j51J28K54J87l16m67M11K83q7n38M8
6157b86L05L19l13m78O7O40J76m34m45J90J55L73l17m74K52L84L1k09m51J69N76
6178B30K07l96n21K21M46L2l04j57Q1N92k86l27k72O09q4J11k79j96L60J83k90
6199d0l76M31L68K08n21o61N79J82Mj77j16j69P14l48k98j09L97J6M9j65l71N06
$$ plain form
6221 103 316 31 -183 -325 191 520 144 -231 -179 23 170 138 -263 -131 142 497 -52 -319 32 220 269
6242 269 -218 -319 192 185 139 -124 -204 425 228 -85 16 -232 284 189 -59 -55 -180 171 146 53 -360 99 248
6265 248 263 -204 34 -24 215 106 6 -159 -51 98 194 -17 -161 -196 293 36 147 -141 -35 227 -37
6286 -37 -215 -65 300 -24 2 -151 -192 -90 301 -239 -158 94 317 127 46 -255 134 117 233 260 -207 111
6308 111 369 -76 -91 -119 211 153 -66 29 -90 57 -37 142 -103 -28 -290 131 192 -136 32 227 155 166 -122
6331 -122 12 45 -50 54 -376 -126 -99 -213 114 110 -2 93 328 -234 49 156 34 36 -207 81 133 -68 186
6354 186 -119 45 209 168 -127 -187 212 -52 338 14 52 152 110 196 -268 0 -50 -8 -70 30 -98 72 -310
6377 -310 -79 -142 -191 106 -385 341 -130 18 37 64 -285 -117 -50 -307 -70 -16 -16 -399 -258 -180 10 168 -219
$$ packed form
6221A03K13k85k14j42N16L29l76l75N2K02J47l2m01J32K73L55n49k67L51J88M9
6242B69m87j01N11pm6k63q0O29j97l13J01k48N16r5k48Mj25L51k5r3m13M59J49
6265B48J5m67K38n8K39j09j00j65J08J49R6k11j44l5M89k57J11k88J06K62k64
6286c7j78J50L65l24K6j53m1J02L91n40Q1K52K23j90q1l01L89j7J16K7m67L18
6308A11K58m45j5k8L30n8k19R5j19J47r4J79k45P5k62M21O1l28J68J95p2J1k88
6331a22J34L3r5J04m30K50K7j14L27mj12R5K35n62K83J07j22Kk43K88N2k01K54
6354A86l05J64J64m1k95o0L99k64L90l24L8J00m2Q6m64K68n0M2o2J00j28J70l82
6377c10K31o3m9K97m91P26m71J48J9K7l49J68O7k57K37N4%l83J41P8J90J58l87
$$ plain form
6400 -219 104 231 293 78 -227 132 35 101 -6 30 -48 -107 133 -137 -155 -59 -102 208 37 -136 84 -330 -250
6423 -250 276 -63 -87 238 -138 16 -166 -5 -29 -66 72 -144 -139 33 -35 -367 -41 -40 170 270 124 103 403
6446 403 256 8 -69 -34 228 91 18 -201 -71 -30 200 -209 -170 -135 10 269 -457 -221 -12 248 127 104
6468 104 -135 -265 224 134 -361 -134 -38 165 -66 -312 -172 102 76 -125 -126 22 142 173 -282 -193 84 92 271
6491 271 11 -26 12 183 -53 21 100 312 53 186 -125 -171 133 266 -85 -308 -48 34 125 -36 -206 -271 -71
6514 -71 228 -66 -357 -154 17 245 -114 -214 67 55 208 -82 -268 190 73 21 -165 5 355 342 253 -150
6536 -150 -321 194 232 116 -238 -297 94 262 6 -53 -27 72 185 -43 -167 -142 319 183 19 -220 -87 262
6558 262 42 -392 -286 93 113 -3 -258 -22 121 201 72 -451 -175 88 227 45 -260 -51 306 316 64
$$ packed form
6400b19L23J27O2k15l05L59r7O6j07L6p8n9K40k70j8R6m3L10j71j73K20m14Q0
6423b50N26l39k4L25l76J54j82J61k4l7J38k16NJ72o8l32L26JK10J00j46k1L00
6446D03j47k48p7L5K62j37p3k19J30M1K30m09L9L5J45K59p26K36K09K60j21k3
6468A04k39j30M89r0m95K27R6K03k31k46J40K74k6k01jJ48J20L1m55Q9K77QJ79
6491B71k60l7L8J71k36P4P9K12k59J33l11m6L04J33l51k23K60Q2R1j61j70o5K00
6514g1K99k94k91K03J71K28l59j00K81j2J53k90j86M58j17n2j86J70L50j3q9m03
6536a50j71N15L8j16l54n9L91J68k56n9K6R9J13k28j24K5M61j36j64k39J33L49
6558B62k20m34J06L79K0j16k55K36J43Q0j29n23K76K63J39j82l05K09L57J0k52
$$ plain form
6579 64 -110 -109 388 349 47 -210 297 328 67 -105 115 206 280 63 -191 -167 351 492 17 -187 121 233 332
6602 332 -306 -295 -97 -41 119 -184 -287 58 179 140 -177 -311 -41 212 214 -189 -280 136 317 12 -137 -131 -21
6625 -21 204 155 -103 -246 286 355 -181 -115 116 286 216 -10 -67 -126 -82 184 -241 -175 366 293 205 -314 -207 262
6649 262 19 138 -367 -54 263 65 -10 -377 -83 -1 297 -178 -195 -63 182 132 -187 -271 145 511 152 -412
6671 -412 -416 -98 341 106 -288 -244 82 261 84 -41 -167 -16 294 9 -312 -28 4 79 -202 -216 -69 -14
6693 -14 54 -82 -71 -84 204 166 -282 -411 -56 307 -13 -233 -283 13 221 123 -90 -18 90 270 -94 -234 -187
6716 -187 -44 194 -35 -221 -124 9 52 -213 -72 -104 119 285 -267 -286 -38 -115 -105 -140 23 43 265 -102 -230
6739 -230 -247 175 209 62 -244 45 6 206 -43 -250 -208 177 127 -88 -349 108 -13 104 -146 -341 60 146
$$ packed form
6579F4j74JM97l9l02k57N07L1k61j72K20R1P4k17k54K4N18J41m75k04L08J12R9
6602C32o38J1J98N6J60l03j03L45J21l9l17j34K70K53Km03r1M16J81l05j49OJ10
6625b1K25m9k58j43N32O9n36O6K31J70p0k26n7n9M4K66m25O6N41p3q8n19J07M69
6649B62k43J19n05L13L17j98p5l67K94Q2K98m75j7J32K45n0l19q4M16L66l59n64
6671d12mL18M39k35l94M4L26J79j77j25j26J51L10k85l21K84L2P5k81j4J47N5
6693a4O8j36J1j3K88l8m48j29L55L63l20k20n0K96K08r8k13P2J08J80l64j40M7
6716a87J43K38k29j86R7J33M3k65J41l2K23J66n52j9K48p7J0l5J63K0K22l67j28
6739b30j7M22L4j47l06K89l9K00k49k07M2L85n0k15k61M57j21J17k50j95M01Q6
$$ plain form
6761 146 124 -358 -332 126 165 108 -425 -219 180 231 -175 -183 -84 111 117 -23 247 13 -37 -45 58 -140 -137 -250 138
6786 138 -168 -106 85 157 -89 -81 -4 157 41 -43 -210 -167 169 277 -31 10 -7 -93 118 19 -93 -332 217 201
6810 201 -113 104 183 166 149 -71 -90 143 520 0 -75 -439 7 66 58 -191 -94 185 116 -129 -104 7 93 -144
6834 -144 -53 -276 -159 82 31 103 16 -89 -57 97 109 -176 -176 54 217 -61 -41 -60 -75 220 11 -66 106 58
6858 58 -129 -87 -84 -58 117 147 -55 -226 -138 -166 -156 -154 -120 46 116 -47 137 -65 -119 -171 -153 -273 -29 115 -3
6883 -3 -17 -64 61 31 38 45 52 23 172 327 127 229 -164 -220 137 134 13 133 -30 -63 103 -79 57 49 -216 178
6909 178 -130 93 110 39 -129 -136 -302 28 107 -41 -328 125 -23 -27 27 49 144 23 143 112 -212 -82 -91 -90 -10
6934 -10 -24 -27 95 103 211 -175 66 -29 288 131 -125 52 259 291 -88 226 104 -25 -35 150 -132 195 50
$$ packed form
6761A46k2m82K6M58L9n7n33K06L99N1m06qR9J95Oj40K70k34n0qJ03j98Lj13L88
6786A38l06O2J91P2k46QP7J61j16q4j67M3L36J08l08M1j7q6K11r9j12k39N49j6
6810B01l14K17P9j7j7k20j9K33L77n20p5l64M46N9qk49R7K79o9k45K5J11Q6k37
6834a44R1k23J17K41n1P2q7j05L2J54J2k85%K30J63k78K0j9j5K95k09p7J72m8
6858E8j87M2LK6J75L0k02j71Q8k8J0KL4J66P0j63J84k02n4n2J8j20K44J44j18
6883cj4m7J25l0PPPk9J49J55k00J02l93n6L57lj21J20j63l3J66j82J36qk65L94
6909A78l08K23J7p1j68pj66L30P9j48k87M53j48mN4K2R5j21J20l1l24J30rJQ0
6934a0j4lJ22QJ08l86K41r5L17j57k56J77K07L2l79L14j22j29j0J85k82L27j45
$$ plain form
6957 50 -123 107 65 -29 180 68 170 79 -262 21 146 139 -53 134 130 -19 -253 -32 264 -6 134 68 -74
6980 -74 301 198 -60 -215 -143 120 73 43 -84 129 216 -13 -215 -148 51 67 -93 47 52 53 -6 31 40 -107 -42
7005 -42 110 -49 -201 240 53 3 -115 -204 59 47 217 77 -108 -85 118 -35 156 -24 -36 203 -157 -44
7027 -44 -37 103 91 -73 128 61 -2 164 26 -164 -72 242 133 -120 -191 -125 237 13 -148 -116 45 140 -144 -134
7051 -134 -325 -23 250 238 -227 -61 -105 -13 -74 -278 -94 -103 -62 -266 -60 159 395 147 -136 67 118 267 100
7074 100 81 -15 107 392 -357 -251 -180 273 171 -50 -109 -130 188 170 -159 -395 -12 366 9 8 -130 -30 128
7097 128 203 -307 -200 232 307 -20 -78 -24 118 133 -162 -98 32 236 146 -165 -70 -5 130 372 -151 -136 -74 -24
7121 -24 -35 -51 -328 -110 108 167 -237 -115 136 -15 -131 -188 -83 119 157 44 -272 -183 188 74 -69 213
$$ packed form
6957E0j73K30m2r4K09j12J02r1l41K83J25pj92J87mj49k34K21K96k70J40o6j42
6980g4L75j03k58j55P2K63m7l0j27K13Q7k29k02O7J99J6j60J40NJn9L7Rj47O5
7005d2J52j59j52M41j87n0j18q9K63j2J70j40j85K3K03j53J91j80j2K39l60J13
7027d4PJ40j2j64K01o7o3J66j38j90R2L14j09k53p1O6L62k24j61L2J61R5k84J0
7051a34j91L02K73j2m65J66m4R2o1k04J84rM1k04K06K19K36k48k83K03N1J49j67
7074A00j9r6J22K85p49J06P1M53j02k21n9k1L18j8l29k36L83L78l57jj38J00J58
7097A28P5n10J07M32P5l27n8N4J42J5k95O4J30K04r0l11R5O5J35K42n23J5O2N0
7121b4j1j6k77K18K18N9m04J22K51j51j16n7J05K02L8j13l16Q9L71j14j43K82
$$ plain form
7143 213 181 -102 -37 -222 -182 -3 308 138 -243 32 -1 130 102 -248 -331 107 252 179 -237 -217 232 -61 222
7166 222 -263 -183 201 77 -212 -214 -67 -19 -40 -203 -76 59 96 -3 -99 -263 -29 227 134 74 -26 258 121
7189 121 -3 -175 88 95 226 -255 -90 -150 -30 350 -163 48 -313 74 237 -109 -225 203 145 49 87 -103
7211 -103 -69 42 -301 19 -291 66 2 -222 -80 -192 22 34 -98 -213 -17 -78 268 -223 186 -30 -34 69
7233 69 -134 -204 12 213 12 -206 -80 162 -9 12 -64 -87 324 200 70 -247 182 175 175 -75 -69 -145 -17 153
7257 153 219 -39 -34 103 199 93 -86 -45 26 259 -279 -317 175 325 -117 -202 -210 122 -87 153 -167 -35 151
7280 151 159 80 -129 63 101 -115 -21 -84 -164 -78 236 -86 162 185 -92 241 -291 -56 119 46 -31 -63 -150 146
7304 146 -93 170 -134 -134 145 67 -111 14 -175 -1 316 35 -231 -60 121 56 -118 -91 -37 151 -2 -25
$$ packed form
7143B13l2k83O5j85M0J79L11j70l81K75l3J31k8l50q3M38J45p3m16K0M49k93K83
7166B22m85Q0L84j24k89kJ47M8k1j63J27J35L7r9r6j64K34K56r3o0j00K84j37
7189A21j24j72K63PJ31m81J65o0J20L80n13K11l61L87J63l46j16M28n8r6L8j90
7211a03L4J11l43L20l10L57o4k24J42j12K14J2j32j15J96o1L46m91M09k16mJ03
7233F9k03p0K16K01k01k18J26K42j71K1p6k3M11j24j30l17M29p%k50Op6J28J70
7257A53O6k58NJ37R6j06j79M1P1K33n38l8M92J50m42q5qL32k09K40l20J32J86
7280A51Qp9k09J92L8k16R4o3q0Q6L14l22K48K3k77L33n32K35J75p3p7l2q7K96
7304A46k39K63l04%K79p8j78J25j89J74L17k81k66J71J81o5j74K7N4J88j53k3
$$ plain form
7326 -25 -11 320 83 88 41 -101 89 235 -261 -180 106 94 54 -45 -83 178 52 60 15 -358 -161 41 -30 -70 111
7351 111 -130 65 213 105 -37 -54 -50 -29 -94 -61 1 124 82 -318 108 -102 85 -139 -194 -95 25 120 -153 174
7375 174 206 149 -8 -13 7 146 98 53 470 125 -85 49 210 -40 119 -23 -3 49 82 6 -217 -146 111 47
7399 47 126 198 30 63 18 -65 -88 -36 45 -23 26 -158 60 94 -35 -35 -85 -81 74 -166 -82 98 83 105 -76 177 -37
7426 -37 39 -110 -121 289 -6 5 128 162 88 117 245 74 87 81 -158 115 -16 -99 -169 30 83 -11 62 -128 27
7451 27 -32 -160 -210 -117 -23 137 -2 -51 -190 6 13 79 -134 -186 -94 177 -90 -368 -28 33 -114 -56 -44 -163 -82
7476 -82 308 -246 7 57 -66 10 -170 82 -256 166 125 90 -43 -73 3 97 -130 -30 -95 82 -188 -110 90
7499 90 95 -29 -142 -72 155 28 148 -39 -174 -53 200 280 33 1 25 153 44 -37 134 174 -61 -12 -20 150
$$ packed form
7326b5J4L31k37Nm7j42J90J46m96Q1K86j2m0r9l8K61j26Qm5l73J97K02p1m0J81
7351A11k41J95J48j08j42j7MK1o5L3O2J23m2m00M26k10J87k24n5R9J20R5k73L27
7375A74L2n7j57nK0J39m8m5M17l45k10J34J61k50J59j42K0N2L3p6k23P1K57o4
7399D7P9P2j68L3m5q3k3N2Q1o8M9j84K18L4j29%n0MJ55k40Q4J80j5K2j81K53k14
7426c7P6j49j1M10k95J1J23L4p4K9J28j71J3ok39K73j31q3p0J99N3r4P3j90J55
7451B7n9j28n0R3R4J60j39m9j39J96PO6k13n2R2K71k67k78L40O1j47N8J2j19Q1
7476h2L90n54K53N0j23P6j80K52l38M22m1l5j33l0P6R4k27J00o5J77k70P8K00
7499I0Nj24j13P0K27j27J20j87j35J21K53Q0k47l2K4J28j09q1J71M0k35M9qJ70
$$ plain form
7523 150 144 314 -203 55 57 99 187 110 -68 237 248 337 42 -20 170 45 115 -44 -111 182 91 -266 -92 -51 -58
7548 -58 -148 66 -207 -193 103 284 155 144 73 209 2 -149 -110 -131 205 -42 -114 -302 -12 379 101 -174 -105
7571 -105 153 239 -93 -50 -465 -96 42 -54 -118 -50 372 307 155 -294 -361 211 98 33 -346 -34 211 -120 96
7594 96 -145 -106 42 140 99 -39 -94 211 175 -168 -97 -14 31 77 -295 -55 116 75 70 -198 -199 130 89 -88 -341
7619 -341 39 375 191 -156 -425 -130 235 -62 -232 0 16 -35 54 -24 -135 54 143 218 -150 -119 73 -19 -104
7642 -104 -181 70 159 162 94 -114 107 31 191 126 -240 -80 44 66 -31 2 229 45 -105 -45 20 257 -11 21
7666 21 -197 -193 145 -3 -113 -94 27 -130 50 -102 -213 -183 183 115 -47 72 18 62 106 -181 -148 233 9
7689 9 102 -67 -116 -49 24 257 -168 -248 156 201 -83 123 -4 101 132 -161 -178 38 344 222 -28 -158 -14
$$ packed form
7523A50oJ70n17K58KM2Q8p7j78L05J1Q9k95o2J90j25P0j59o7K93r1l57J74M1p
7548e8r0K14k73J4K96J81j29j1p1J36k07j51L9k1L36k47p2j88K90L91k78k75O9
7571a05K58Q6l32M3m15L69J38r6o4O8M22o5j52m49o7N72j13o5l79L12K45l31K16
7594I6k41L9J48R8m1j38n5L05l6l43P1Q3M5M6l72K40J71m1nk68jL29m1j77k53
7619c41L80L36j84l47k69K95L65k97j70K32J6n1Q9p8j11J89Q9P5l68L1J92r2q5
7642a04p7K51Q9Lo8k08K21p6J60o5l66J60J24K2r7L3K27j84j50O0O5K37k68L2
7666B1k18ML38j48j10J9J21j57J80j52j11L0L66o8j62J19n4M4M4k87L3L81k24
7689IR3j69m9O7P3K33m25q0M04M5k84K06j27J05L1k93j7K16L06j22k50j30J44
$$ plain form
7712 -14 72 233 87 87 -339 184 4 -70 -209 0 265 103 -38 -228 -121 313 -195 -335 -125 -159 179 -27
7734 -27 -136 -220 303 -134 -47 -85 -40 216 139 -179 152 48 287 182 -202 -189 168 115 108 -86 -138 287 321 -5
7758 -5 -232 125 81 68 -23 -186 -36 -138 49 -239 -79 -64 316 114 -68 141 117 -22 -17 -81 -139 297 101 20
7782 20 -114 7 123 -69 22 -35 57 97 156 -33 -378 -194 320 -80 -80 -109 -292 94 115 -108 -161 -17 -20 91
7806 91 -273 -33 -8 50 -26 -88 79 -31 -69 -48 -124 106 212 31 -369 -148 -171 -118 53 110 13 -288 -86 5
7830 5 171 -309 -3 54 -74 192 59 -54 -13 221 23 -139 188 82 -90 -300 -51 101 -64 -171 -254 250
7852 250 173 -170 -110 -231 246 101 13 -140 -126 -31 -136 -170 -217 0 -128 73 -66 315 92 -73 40 93 -106
7875 -106 -63 17 -58 -68 85 -1 -173 -171 190 -102 -78 -14 62 -105 -127 28 -10 68 146 288 266 -6 -130 223 -90
$$ packed form
7712a4Q6J61j46%m26N23j80p4j39K09K65j62j41j90J07M34n08j40K10l4L38k06
7734b7j09q4N23m37Q7l8M5K56p7l18L31j04K39j05l84J3L57n3pj94n2M25L4l26
7758ek27L57m4j3r1j63J50j02J87k88J60J5L80k02j82K09k4j39No4n8M36j96q1
7782B0j34J21J16j92R1n7R2M0N9j89l45J84N14m00%k9j83L86K1k23n3J44lJ11
7806I1l64K40K5N8p6o2J67j10l8K1p6K30J06j81m00K21k3N3J71N7r7l01K02R1
7830EJ66m80L06N7j28K66j33j13M1K34j98j62L27j06j72k10K49J52j65j07q3N04
7852B50p7l43O0j21M77j45q8j53J4R5j05l4m7K17j28K01j39L81k23j65J13N3j99
7875a06M3Q0p5j0J53q6j72KL61k92K4O4P6j67k2J55l8P8P8J42k2k72j24L53l13
$$ plain form
7900 -90 11 -84 -50 -120 101 66 6 -140 217 219 -27 -146 -96 46 29 -183 -2 86 86 223 3 -82 96 33 88
7925 88 -125 62 -14 50 183 60 24 -110 -191 -101 -115 -112 -171 -93 159 149 -16 333 -71 -111 93 259 -180 184
7949 184 -121 -177 -50 -162 -81 -187 -176 134 19 -71 -230 -111 87 -77 -8 75 -48 -75 44 -97 191 35
7971 35 222 1 120 150 118 28 -55 111 -11 97 -234 120 0 171 1 227 46 -18 -78 -102 20 -64 -148
7994 -148 -149 230 -146 64 62 -57 -69 128 -150 106 197 -85 184 -101 -184 17 29 -247 -91 13 -47 67 102
8017 102 -116 73 47 166 -264 145 134 -10 143 -79 -315 -19 -134 -53 -124 37 -14 127 -21 65 -124 46
8039 46 200 -15 -280 -78 -34 -20 95 71 -86 34 -102 48 14 -88 297 -232 63 13 188 -24 49 -30 -19
8062 -19 -24 0 -50 -196 -126 96 -24 -180 170 -41 316 -31 -17 220 36 -33 128 76 -176 95 129 271 -271
$$ packed form
7900i0J01r5L4p0K21l5o0j46L57Kk46j19N0J42j7k12J81Q8%J37k20q5J78o3N5
7925H8k13J87p6O4J33j23l6j34q1R0j4Ln9P8K52j0j65L49m04m0K04J66m39L64
7949A84l05n6J27j12Q1j06J1L10j15r0j59J19J98j64O9Q3j23k7J19j41K88j56
7971C5J87k21J19L0l2r0q3J66j22J08l31L54j20J71j70K26j81o4o0k4J22q4q4
7994a48jL79l76K10kj19j2J97k78K56R1k82K69k85q3K01J2k76J56J04o0J14L5
8017A02k18J89k6J19m30M09j1j44J53k22k36K96j15Q1p1J61n1J41j48Q6j89J70
8039D6J54k15k65K02M4J4J15k4j57J20j36J50l4j02L85n29K95n0J75k12P3p9J1
8062a9nK4n0j46P0K22j20j56L50k11L57l47J4K37j84o9J61n2k52K71L4J42n42
$$ plain form
8085 -271 -62 195 282 48 -129 -117 -116 -92 285 25 -179 40 331 42 -180 -30 -85 126 -72 -135 174 106 -175
8108 -175 -180 86 -97 22 -143 -89 84 51 130 46 100 31 -15 -48 -103 -275 -25 -202 46 20 -87 -181 216 67
8132 67 173 -31 161 101 243 -277 -23 134 -146 95 -22 -63 71 141 -101 -108 6 36 133 -134 -112 117 14
8155 14 56 -192 -213 55 -49 292 30 -360 7 106 87 -205 -231 -157 -286 -85 -169 -54 62 -57 20 -16 -70 82
8179 82 50 165 -108 -1 3 -57 13 -125 -79 60 54 -145
$$ packed form
8085b71K09K57Q7k34j77J2JK4L77k60k04K19K91k89k22J50n5K11j98o3L09o8k81
8108a75nK66j83J19j65N4J73l3P9q4N4o9m6l3n5j72K50j77K48k6j07r4L97j49
8132F7J06k04J92o0J42n20K54J57k80K41j17m1J34P0k42pJ14L0R7k67K2K29j03
8155A4M2k48k1K68j04L41k62l90L67R9j9k92k6P4j29K01q4J15J16j19P7l6n4J52
8179H2l2J15k73J07Mo0P0j38M6J39oj99
8191a45
$$ Imaginary data points
##PAGE= N=2
##DATA TABLE= (X++(I..I)), XYDATA
$$ plain form
0 0 0 0 0 0 0 0 0 0 0 0 -8 8 -8 12 -16 16 -24 32 -32 40 -50 60 -72 88 -99 115 -136 155 -179 204 -235 267
32 267 -305 346 -388 436 -492 550 -614 684 -762 848 -938 1039 -1151 1269 -1402 1546 -1701
49 -1701 1874 -2066 2275 -2509 2767 -3061 3387 -3763 4193 -4696 5288 -6002 6879 -7989 9443
64 9443 -11444 14376 -19111 28039 -50878 241182 432402 78431 84990 160907 356643 268065
76 268065 -12308 -67143 154376 251549 144370 -88494 -84392 131967 240427 74315 -124776
87 -124776 -62863 148474 187362 16575 -159690 -75996 139137 145469 -71535 -163577 -43982
98 -43982 149021 156471 -57452 -117034 86431 240542 197736 31542 -23675 193349 336347
109 336347 207020 48019 37680 222174 324788 168735 -2668 41714 225528 280650
$$ packed form
0@%%%%%%%%%%qJ6j6K0k8L2m0N6o4P2r0J10j32J60j87K14k51K91l34L83m39N02
32B67n72O51p34Q24r28J042j164J298j446J610j786J977k190K420k671K948l247
49a701L575l940M341m784N276n828O448p150P956q889R984j1290J2881j4868J7432
64I443k0887K5820l3487M7150p8917K92060J91220l53971O559P5917J95736q8578
76B68065k80373n4835K21519R7173j07179k32864M102K16359J08460j66112j99091
87a24776O1913K11337L8888j70787j76265Q3694K15133O332k17004r2042J19595
98d3982J93003P450k13923n9582K03465J54111m2806j66194n5217K17024J42998
109C36347j29327j59001j0339J84494J02614j56053j71403M4382J83814N5122
$$ plain form
119 280650 114385 -21138 61223 236612 268649 77710 -26118 98993 231182 216069
129 216069 35719 -68732 72095 203040 108999 -51665 -97453 26490 157586 55858
139 55858 -109331 -87979 66047 149188 55565 -87899 -46280 126873 169584 43112 -77240
150 -77240 -9410 136476 144715 5384 -102146 -7162 135906 103950 -34300 -90069 10271
161 10271 151219 103388 -49016 -54686 58171 155410 94353 -55178 -55155 76885 130881 37329
173 37329 -83772 -71315 63887 99157 -9153 -101862 -51934 77886 96988 -8526 -79246
184 -79246 -3070 116208 109892 -7967 -52438 31140 120400 97036 -33062 -61205 41534
195 41534 102621 53321 -49996 -67464 44278 105816 22167 -58261 -43773 53538 97877 6388
$$ packed form
119B80650j66265j35523Q2361J75389L2037j90939j03828J25111J32189j5113
129B16069j80350j04451J40827J30945r4041j60664m5788J23943J31096j01728
139E5858j65189K1352J54026Q3141r3623j43464M1619J73153M2711j26472j20352
150g7240O7830J45886Q239j39331j07530R4984J43068l1956j38250n5769J00340
161A0271J40948m7831j52404n670J12857R7239o1057j49531K3J32040N3996r3552
173C7329j21101J2457J35202L5270j08310r2709M9928J29820J9102j05514p0720
184g9246P6176J19278o316j17859m4471Q3578Q9260k3364j30098k8143J02739
195D1534O1087m9300j03317j7468J11742O1538q3649q0428J4488R7311M4339r1489
$$ plain form
207 6388 -75204 -40230 51359 58398 -36351 -104122 -56772 23838 15805 -78862 -126475 -52439 14324
220 14324 -5481 -82031 -109677 -28499 38948 -2256 -72964 -70106 -1980 53614 2025 -70099
232 -70099 -47514 19608 51384 -2185 -61254 -30630 43888 54677 -127 -42166 -4148 66013
244 66013 58060 846 -31747 10746 64937 40604 -20049 -42588 -671 39284 7438 -57372
256 -57372 -57590 -16437 8644 -17991 -77109 -66717 -16241 -4584 -38526 -74291 -64237 -15839
268 -15839 -7343 -51926 -72888 -54777 -15816 -14997 -52531 -67355 -41933 -5584 -12133 -44580 -49012
281 -49012 -16996 5070 599 -28159 -31804 5327 15151 1437 -18797 -20894 5872 16105 -7821
294 -7821 -24024 -17065 -3099 4648 -18726 -30730 -21235 -10861 -8676 -26565 -34714 -24676 -15918
$$ packed form
207F388q1592L4974R1589P039r4749o7771M7350Q0610q033r4667m7613P4036O6763
220A4324j9805p6550k7646Q1178O7447m1204p0708K858O8126N5594n1589p2124
232g0099K2585O7122L1776n3569n9069L0624P4518J0789n4804m2039L8018P0161
244F6013p953n7214l2593M2493N4191k4333o0653k2539M1917L9955l1846o4810
256e7372k18M1153K5081k6635n9118J0392N0476J1657l3942l5765J0054M8398
268a5839Q496m4583k0962J8111L8961Q19l7534j4824K5422L6349o549l2447m432
281d9012L2016K2066m471k8758l645L7131R824j3714k0234k097K6766J0233k3926
294g821j6203O959J3966P747k3374j2004R495J0374K185j7889q149J0038Q758
$$ plain form
307 -15918 -20955 -28709 -35433 -25850 -18726 -25346 -26580 -30187 -21945 -17389 -21969 -19633 -17772 -16436 -11626
322 -11626 -10691 -11079 -2037 -8264 -6556 2418 1659 5343 1015 -1450 7812 14263 5563 -570 -1504 7138
338 7138 11792 -3204 -12740 -13883 -266 952 -19816 -30062 -22414 -9888 -8869 -28708 -43618
351 -43618 -21802 -7779 -14492 -31986 -42813 -19144 -786 -13646 -37208 -37263 -12649 6947 -11149
364 -11149 -35168 -25071 3445 22875 29 -21208 -2458 31712 42202 16103 -4991 17301
376 17301 55296 50408 18055 -2294 23894 58446 41760 3441 -10939 21117 52612 30406
388 30406 -14866 -13769 24607 47998 22335 -25843 -15570 28669 41886 4056 -38049 -22890
400 -22890 22953 28399 -19654 -52423 -27378 23437 19892 -29161 -48481 -12498 40545 29808
$$ packed form
307a5918n037p754o724R583P124o620j234l607Q242M556m580K336J861J336M810
322a1626R35l88R042o227J708Q974p59L684m328k465R262O451q700o133r34Q642
338G138M654j4996r536j143J3617J218k0768j0246P648J2526J019j9839j4910
351d3618K1816J4023o713j7494j0827K3669J8358j2860k3562n5K4614J9596j8096
364a1149k4019J0097K8516J9430k2846k1237J8750L4170J0490k6099k1094K2292
376A7301L7995m888l2353k0349K6188L4552j6686l8319j4380L2056L1495k2206
388C0406m5272J097L8376K3391k5663m8178J0273M4239J3217l7830m2105J5159
400b2890M5843N446m8053l2769K5045N0815l545m9053j9320L5983N3043j0737
$$ plain form
412 29808 -22372 -31745 17610 58059 37909 -16705 -23258 35773 63400 27971 -25470 -20473 40538
425 40538 62514 15782 -31781 -9195 54162 69304 10938 -25172 9383 68399 71357 3097
437 3097 -28290 17393 69888 52736 -16007 -38849 17661 66454 34693 -27060 -34898 34146
449 34146 77294 35644 -20285 -10995 61103 93108 39845 -18170 8181 74206 87881 24484
461 24484 -30727 7326 72561 70602 -853 -39743 11121 76566 59753 -13073 -36115 23985
473 23985 84783 47341 -27480 -36424 26365 73041 20802 -57007 -50048 22195 50150 -7834
485 -7834 -74945 -49320 32383 49626 -12277 -64935 -18516 62862 65592 -3545 -41359 13404
497 13404 86664 72178 -8019 -30023 32011 93055 63572 -16397 -22932 51103 102085 57748
$$ packed form
412B9808n2180r373M9355M0449k0150n4614o553N9031K7627l5429n3441M997O1011
425D0538K1976m6732m7563K2586O3357J5142n8366l6110L4555N9016K958o8260
437C097l1387M5683N2495j7152o8743k2842N6510M8793l1761o1753p838O9044
449C4146M3148m1650n5929R290P2098L2005n3263n8015K6351O6025J3675o3397
461B4484n5211L8053O5235j959p1455l8890N0864O5445j6813p2826k3042O0100
473B3985O0798l7442p4821q944O2789M6676n2239p7809O959P2243K7955n7984
485g834o7111K5625Q1703J7243o1903n2658M6419Q1378K730o9137l7814N4763
497A3404P3260j4486q0197k2004O2034O1044k9483p9969o535P4035N0982m4337
$$ plain form
509 57748 -13759 -5316 75362 110064 50522 -15843 1852 82247 94410 17696 -42958 -11561
521 -11561 60396 56644 -28844 -76892 -24670 41211 26015 -57777 -86413 -17684 43251 13910
533 13910 -66783 -76673 -523 48325 1133 -72631 -69463 9602 49010 -14301 -76842 -52707
545 -52707 28533 55009 -10609 -61824 -18008 64247 72418 3113 -39078 16975 88920 75479
557 75479 -1943 -36015 27298 86276 51414 -29146 -45462 21660 72616 23782 -54381 -47933
569 -47933 24843 62633 3143 -66501 -44998 30130 49386 -20667 -81889 -48004 25870 24902
581 24902 -48572 -95837 -48646 24376 10379 -62569 -88560 -27126 38041 16382 -56122 -65410
593 -65410 5726 56489 20644 -51035 -46777 24908 59824 9728 -56810 -40005 33811 54577
$$ packed form
509E7748p1507Q443Q0678L4702n9542o6365J7695Q0395J2163p6714o0654L1397
521a1561P1957l752q5488m8048N2222O5881j5196q3792k8636O8729O0935k9341
533A3910q0693r890P6150M8848m7192p3764L168P9065L9408o3311o2541K4135
545e2707Q1240K6476o5618n1215M3816Q2255Q171o9305m2191N6053P1945j3441
557G5479p7422l4072O3313N8978l4862q0560j6316O7122N0956m8834p8163O448
569d7933P2776L7790n9490o9644K1503P5128J9256p0053o1222L3885P3874r68
581B4902p3474m7265M7191P3022j3997p2948k5991O1434O5167k1659p2504r288
593f5410P1136N0763l5845p1679M258P1685L4916n0096o6538J6805P3816K0766
$$ plain form
605 54577 -7408 -58752 -29610 44099 52459 -17825 -56086 -13109 53129 43580 -29489 -59450
617 -59450 -6729 48154 22221 -51135 -68419 -5634 36810 1007 -64977 -66194 4014 38389
629 38389 -6960 -63740 -46459 20759 45104 -9508 -58571 -29390 33072 41342 -19847 -58389
641 -58389 -20465 37622 31655 -30689 -57679 -9040 44525 23362 -33991 -48471 5395 50081
653 50081 16654 -40973 -41696 14358 44002 1876 -53727 -41377 14826 32334 -16034 -62768
665 -62768 -35860 19033 26427 -23483 -58079 -22323 31885 26967 -25753 -46258 -6493 40665
677 40665 24541 -28666 -39312 5880 43294 17165 -30840 -31577 17610 44965 13453 -30154
689 -30154 -20290 31340 45415 8617 -28653 -11443 35744 40732 -3926 -33627 -8281 31482
$$ packed form
605E4577o1985n1344K9142P3709Q360p0284l8261M2977O6238r549p3069k9961
617e9450N2721N4883k5933p3356j7284O2785M2444l5803o5984j217P0208L4375
629C8389m5349n6780J7281O7218K4345n4612m9063K9181O2462Q270o1189l8542
641e8389L7924N8087n967o2344k6990M8639N3565k1163n7353j4480N3866M4686
653E0081l3427n7627p23N6054K9644m2126n5603J2350N6203J7508m8368m6734
665f2768K6908N4893P394m9910l4596L5756N4208m918n2720k0505L9765M7158
677D0665j6124n3207j0646M5192L7414k6129m8005p37M9187K7355l1512m3607
689c0154R864N1630J4075l6798l7270J7210M7187M988m4658k9701K5346L9763
$$ plain form
701 31482 27562 -19927 -39535 -8208 27755 15345 -30105 -38710 -1736 27620 7641 -31997
713 -31997 -34067 6691 28696 767 -32746 -26885 13028 26655 -3903 -32634 -17567 20754
725 20754 26472 -5019 -26909 -4337 28746 29039 -4025 -19282 8097 35095 27027 -5187 -14114
738 -14114 12283 36187 19176 -11045 -11745 14507 31953 10803 -14607 -10197 17332 27946 4471
751 4471 -16605 -6262 19667 22665 385 -18093 -2987 20651 17285 -4691 -16510 702 20557
764 20557 14640 -7372 -12378 6633 21963 13387 -6627 -5772 11550 23422 11949 -5606 -1627
777 -1627 15327 21494 7788 -4639 -591 16348 17636 2808 -5253 769 14649 12600 -32
790 -32 -6523 2214 12615 8805 -3052 -5721 4276 9648 6852 -4455 -4440 5520 9141 4683 -2496
$$ packed form
701C1482l920m7489j9608L1327L5963j2410m5450q605L6974K9356j9979l9638
713c1997k070M0758K2005k7929l3513N861L9913J3627l0558k8731J5067L8321
725B0754N718l1491k1890K2572L3083K93l3064j5257K7379K6998q068l2214q927
738a4114K6397K3904j7011l0221p00K6252J7446k1150k5410M410K7529J0614k3475
751D471k1076J0343K5929K998k2280j8478J5106K3638l366k1976j1819J7212J9855
764B0557n917k2012n006J9011J5330q576k0014Q55J7322J1872j1473j7555L979
777a627J6954O167j3706j2427M048J6939J288j4828q061O022J3880k049j2632
790c2o491Q737J0401l810j1857k669R997N372k796j1307J5R960L621m458p179
$$ plain form
805 -2496 -561 6819 10991 4762 805 4024 9671 11939 6696 5770 7532 12384 12834 9300 8812 11325
821 11325 12696 11396 11445 9386 11251 10844 9227 9500 8999 8182 5662 6057 6968 6688 3465 1754 2803
838 2803 5427 5546 -1047 -1342 1501 4489 2671 -3562 -4838 1335 5391 -469 -5483 -5205 3616 6369
854 6369 -153 -5644 -2939 8199 9462 894 -4673 2114 11394 11904 1005 -5457 4877 13807 10461
869 10461 -2628 -6081 4704 14271 7700 -7081 -7452 5969 14717 3984 -9513 -7571 7424
882 7424 14865 -290 -13539 -7416 9236 11325 -4815 -17917 -7385 10717 8579 -9180 -18905
895 -18905 -2819 13764 8924 -10710 -16485 2789 18298 8215 -13102 -13007 6340 19132 4565
908 4565 -17698 -13156 8454 16668 -2578 -21523 -13817 10029 13770 -9134 -25333 -12072 12049
$$ packed form
805b496J935P380M172o229l957L219N647K268n243r26J762M852M50l534m88K513
821A1325J371j300M9k059J865m07j617K73n01q17k520L95R11k80l223j711J049
838B803K624J19o593k95K843K988j818o233j276O173M056n860n014K78Q821K753
854F369o522n491K705J1138J263q568n567O787R280N10j0899o462J0334Q930l346
869A0461j3089l453J0785R567o571j4781l71J3421Q748j0733j3497J942J4995
882G424P441j5155j3249O123J6652K089j6140j3102J0532J8102k138j7759r725
895a8905J6086J6583m840j9634n775J9274J5509j0083k1317R5J9347J2792j4567
908D565k2263M542K1610Q214j9246j8945P706K3846L741k2904j6199J3261K4121
$$ plain form
921 12049 8628 -15617 -28812 -11642 11400 2752 -24820 -32597 -9661 8676 -3454 -31480 -32449
934 -32449 -5223 10170 -6893 -32993 -26256 2856 14108 -8040 -30652 -19005 11728 16755
946 16755 -11012 -28465 -12608 17167 16331 -14724 -28322 -5526 21255 12757 -17479 -27248 14
959 14 23097 8121 -23455 -26991 3680 20147 -787 -31840 -28920 3284 15202 -13104 -40717
972 -40717 -28616 2572 9358 -22515 -45421 -25853 6182 5537 -28730 -44564 -18921 11554 2810
985 2810 -31345 -41595 -10240 17300 33 -32580 -35174 132 21845 -655 -32741 -26401 10570
998 10570 24881 -2039 -31922 -18243 18346 25385 -7257 -32602 -12177 22023 20759 -15515
1010 -15515 -34736 -9985 22767 12996 -25796 -36606 -7272 21347 4266 -33665 -37557 -2455
$$ packed form
921A2049l421k4245j3195J7170K3042q648k7572p777K2936J8337j2130k8026r69
934c2449K7226J5393j7063k6100O737K9112J1252k2148k2612J1647L0733N027
946A6755k7767j7453J5857K9775q36l1055j3598K2796K6781q498l0236r769K7262
959A4K3083j4976l1576l536L0671J6467k0934l1053K920L2204J1918k8306k7613
972d0717J2101L1188O786l1873k2906J9568L2035o45l4267j5834K5643L0475q744
985B810l4155j0250L1355K7540j7267l2613k594L5306K1713k2500l2086O340L6971
998A0570J4311k6920k9883J3679L6589P039l2642k5345K0425L4200j264l6274
1010a5515j9221K4751L2752r771l8792j0810K9334K8619j7081l7931l892L5102
$$ plain form
1022 -2455 19734 -4151 -39063 -34656 3844 18342 -9623 -41876 -28675 11783 18187 -14344
1034 -14344 -39499 -19149 18853 19695 -17087 -35860 -8169 25981 19061 -19282 -29969 1815
1046 1815 31690 16447 -21885 -25026 9908 33186 10058 -24789 -22426 15396 31396 1066
1058 1066 -29889 -19372 18257 26407 -7071 -34452 -15011 21099 21270 -14955 -35248 -8290 24003
1071 24003 17144 -21078 -33611 -798 27120 11601 -25056 -28869 5862 30319 6856 -26928
1083 -26928 -21990 14669 31967 3534 -25450 -14098 23530 32426 58 -25178 -6725 28558
1095 28558 28295 -5417 -26570 -2113 30039 22016 -13618 -26352 2692 29821 16327 -19643
1107 -19643 -24298 8040 30096 9731 -24183 -20158 12850 28743 2537 -27238 -16804 17896
$$ packed form
1022b455K2189k3885l4912M407L8500J4498k7965l2253J3201M0458O404l2531
1034a4344k5155K0350L8002Q42l6782j8773K7691L4150o920l8343j0687L1784
1046A815K9875j5243l8332l141L4934K3278k3128l4847K363L7822J6000l0330
1058A066l0955J0517L7629Q150l3478k7381J9441L6110J71l6225k0293K6958L2293
1071B4003o859l8222j2533L2813K7918j5519l6657l813L4731K4457k3463l3784
1083b6928M938L6659J7298k8433k8984J1352L7628Q896l2368k5236J8453L5283
1095B8558k63l3712k1153K4457L2152q023l5634j2734K9044K7129j3494l5970
1107a9643m655L2338K2056k0365l3914M025L3008J5893k6206k9775J0434L4700
$$ plain form
1119 17896 25700 -4388 -27675 -11387 23877 24740 -7643 -24837 -1822 29692 23254 -9176 -21007
1132 -21007 6527 32747 19938 -13070 -17686 12262 31492 13906 -17441 -15505 15893 30352
1144 30352 6872 -20099 -11212 19281 28455 652 -21537 -7384 22259 23314 -6771 -23271
1156 -23271 -4524 22235 16426 -13205 -24713 -239 22671 10919 -16959 -21677 6024 24221
1168 24221 8304 -18158 -15881 12420 24777 5016 -19456 -10815 16283 23484 -638 -19717
1180 -19717 -6210 18882 21149 -4299 -18137 -1342 22893 18073 -6934 -15323 3800 24531
1192 24531 14737 -9739 -14283 7518 22978 8872 -13790 -13274 10117 20484 3844 -16661 -10004
1205 -10004 13036 18423 107 -16290 -5686 15530 16962 -4373 -15961 -2226 16374 12961
$$ packed form
1119A7896P804l0088k3287J6288L5264Q63l2383j7194K3015L1514o438l2430j1831
1132b1007K7534K6220j2809l3008m616K9948J9230j7586l1347J936L1398J4459
1144C0352k3480k6971Q887L0493R174k7803k2189J4153K9643J055l0085j6500
1156b3271J8747K6759n809k9631j1508K4474K2910j1752k7878m718K7701J8197
1168B4221j5917k6462K277K8301J2357j9761k4472Q641K7098P201k4122j9079
1180a9717J3507K5092K267k5448j3838J6795K4235m820k5007q389J9123K0731
1192B4531r794k4476m544K1801J5460j4106k2662N16K3391J0367j6640k0505O657
1205a0004K3040N387j8316j6397J0604K1216J432k1335j1588J3735J8600l413
$$ plain form
1217 12961 -8454 -15629 -102 16570 8551 -11428 -14247 3392 16095 5410 -12370 -11895 7483
1230 7483 15270 2267 -13039 -9011 8989 13742 -774 -14307 -6060 9991 11175 -4313 -13806
1243 -13806 -3340 10657 9514 -6660 -12047 -190 11669 6698 -8030 -10665 2139 11781 3252
1256 3252 -9675 -9283 3482 9717 77 -10717 -8478 4946 7726 -2763 -11646 -5965 5122 6114
1270 6114 -4076 -11706 -4072 5578 3948 -6112 -10184 -2285 5305 2702 -7462 -8570 -622 5366
1284 5366 428 -7305 -6698 389 5162 -928 -7498 -5458 1790 3106 -2196 -7008 -4955 1930 1415
1299 1415 -4296 -7832 -4199 294 -1289 -6286 -8936 -4854 -2278 -4206 -8940 -9345 -5812 -4216 -5758
1314 -5758 -9698 -9071 -6116 -4714 -7099 -8711 -8106 -6058 -5159 -7393 -7918 -7341 -5388 -5856 -6315 -5921 -5753
$$ packed form
1217A2961k1415p175J5527J6672q019j9979k819J7639J2703j0685j7780M75J9378
1230G483P787j3003j5306M028J8000M753j4516j3533Q247J6051J184j5488r493
1243a3806J0466J3997j143j6174n387J1857J1859m971j4728k635J2804R642q529
1256C252j2927L92J2765O235r640j0794K239J3424K780j0489q883N681J1087R92
1270F114j0190p630P634R650j630j0060m072P899P590k603j0164j108P948N988
1284E366m938p733O07P087M773o090o570K040P248J316n302m812K053O885n15
1299A415n711l536L633M493j583m997k650M082K576j928m734m05L533J596j542
1314e758l940O27K955J402k385j612O05K048Q99k234n25N77J953m68m59L94J68
$$ plain form
1331 -5753 -4682 -4788 -4496 -3830 -2988 -3693 -3098 -1543 -1715 -1520 -3288 -2486 -1189 -511 -2756 -4924 -3139
1348 -3139 -1647 -2075 -5242 -6272 -4978 -2008 -3179 -7384 -7668 -4823 -2178 -4905 -9226 -9822 -5254 -3688
1364 -3688 -7588 -12308 -11667 -6167 -5242 -9659 -14637 -11749 -5420 -4664 -10290 -13807 -8855 -2118 -2054 -9272
1380 -9272 -11884 -5667 491 -1610 -9873 -11191 -3925 2363 -2450 -10598 -10298 -831 3913 -2340 -9678
1395 -9678 -7565 3381 6242 -2117 -9169 -4614 5542 5823 -3975 -11634 -4714 4921 2707 -8598
1409 -8598 -13507 -4434 4221 926 -10956 -13037 -1958 6408 -25 -11551 -11058 209 7246 -2409
1423 -2409 -14233 -11136 1465 5480 -6472 -16376 -10927 3298 5031 -7541 -15885 -6071 8077
1436 8077 6872 -6127 -12566 -564 12331 6886 -8151 -11166 2239 12238 4127 -11366 -10905 3991
$$ packed form
1331e753J071j06K92O66Q42p05N95J555j72J95j768Q02J297O78k245k168J785
1348c139J492m28l167j030J294K970j171m205k84K845K645k727m321n96M568J566
1364c688l900m720O41N500R25m417m978K888O329P56n626l517M952O737O4p218
1380i272k612O217O158k101q263j318P266O288m813q148L00R467M744o253p338
1395i678K113J0946K861q359p052M555J0156K81r798p659O920R635k214j1305
1409h598m909R073Q655l295j1882k081J1079Q366o433j1526M93J1267P037r655
1423b409j1824L097J2601M015j1952r904N449J4225J733j2572q344R814J4148
1436H077j205j2999o439J2002J2895n445j5037l015J3405R999q111j5493M61J4896
$$ plain form
1450 3991 12394 1549 -12451 -7669 8250 14424 1148 -10900 -3804 12850 13886 -1678 -11725
1463 -11725 -3070 12832 9722 -7534 -15478 -2437 11394 5990 -10985 -15079 1118 13896 5932
1476 5932 -11297 -10871 7179 16311 4599 -11843 -8231 9834 15108 -808 -14846 -7463 10954
1489 10954 13293 -4180 -14834 -2831 15426 14060 -4195 -10809 3828 19981 14289 -4929 -9958
1502 -9958 7449 19873 9182 -9805 -10898 7613 17136 3818 -14295 -9627 10488 17083 1470
1515 1470 -13581 -4585 14888 18310 -1078 -13354 -1135 16398 14002 -6679 -16082 -1880 15609
1528 15609 8153 -12024 -16313 1757 16696 6587 -12238 -12189 8712 20019 6133 -11840 -7783
1541 -7783 12854 19223 1899 -15366 -7121 12671 14623 -4081 -17565 -5062 14502 13716 -6487
$$ packed form
1450C991Q403j0845j4000M782J5919O174j3276j2048P096J6654J036j5564j0047
1463a1725Q655J5902l110j7256p944J3041J3831n404j6975m094J6197J2778p964
1476E932j7229M26J8050R132j1712j6442L612J8065N274j5916j4038P383J8417
1489A0954K339j7473j0654J2003J8257j366j8255o614J4637J6153n692j9218n029
1502i958J7407J2424j0691j8987j093J8511R523j3318j8113M668K0115O595j5613
1515A470j5051Q996J9473L422j9388j2276J2219J7533k396k0681r403J4202J7489
1528A5609p456k0177m289J8070J4939j0109j8825M9K0901J1307j3886j7973M057
1541g783K0637O369j7324j7265Q245J9792J952j8704j3484J2503J9564p86k0203
$$ plain form
1554 -6487 -14822 834 19143 13820 -6617 -11499 5481 20591 9698 -11125 -12690 6080 17063
1567 17063 2966 -15909 -13037 8460 15783 -303 -15991 -7847 13180 16688 -1432 -14873 -2600
1580 -2600 16137 14424 -6435 -16381 -2181 14452 8419 -12881 -18505 -792 13682 4710 -14854
1593 -14854 -15589 3878 16467 3433 -14103 -10958 9051 16365 282 -16073 -9990 9744 12378
1606 12378 -5790 -19264 -8288 10168 9299 -8885 -18441 -3136 14071 9740 -9138 -13974 2671
1619 2671 16529 7851 -11532 -12799 4648 14902 1964 -15666 -13145 5135 12136 -2769 -17237
1632 -17237 -10284 8710 11910 -3803 -15788 -5932 11872 10793 -6818 -16132 -3631 10997 6187
1645 6187 -11842 -18069 -3398 9391 1971 -15343 -16453 -44 10700 715 -15097 -12201 4561
$$ packed form
1554f487q335J5656J8309n323k0437m882J6980J5110j0893k0823j565J8770J0983
1567A7063j4097j8875K872K1497P323j6086j5688Q144K1027L508j8120j3441J2273
1580b600J8737j713k0859r946J4200J6633o033k1300n624J7713J4474q972j9564
1593a4854p35J9467J2589j3034j7536L145K0009P314j6083j6355O083J9734K634
1606A2378j8168j3474J0976J8456q69j8184r556J5305J7207m331j8878m836J6645
1619B671J3858q678j9383j267J7447J0254j2938j7630K521J8280P001j4905j4468
1632a7237O953J8994L200j5713j1985R856J7804j079j7611r314J2501J4628m810
1645F187j8029o227J4671J2789p420j7314j110J6409J0744r985j5812K896J6762
$$ plain form
1658 4561 11938 -1283 -14535 -9479 6573 9863 -5447 -16833 -8656 7434 6339 -8821 -16556
1671 -16556 -5127 9147 5983 -9083 -13597 603 12166 5564 -9328 -11128 3095 11612 2099
1684 2099 -12267 -10662 3229 9521 -1772 -14223 -9518 4903 8428 -4299 -13501 -6454 7052
1697 7052 7323 -5919 -13612 -4682 7347 3981 -9479 -14348 -4188 5495 -25 -12664 -14518 -2185
1711 -2185 5232 -1725 -12900 -11087 1169 6745 -1659 -11903 -7473 4437 7085 -2754 -10509 -4835
1725 -4835 6512 6906 -4161 -9267 -1829 8267 6584 -3846 -7082 1802 10435 6089 -3648 -5053
1739 -5053 4041 9996 4244 -5141 -5010 4282 7272 597 -8059 -5612 2683 4716 -3033 -9950 -5468
1754 -5468 1894 2078 -5822 -10258 -5392 1673 283 -8013 -10216 -4192 1681 -1256 -7931 -8762 -2093
$$ packed form
1658D561P377j3221j3252N056J6052L290j5310j1386Q177J6090j095j5160p735
1671a6556J1429J4274l164j5066m514J4200J1563o602j4892j800J4223Q517r513
1684B099j4366J605J3891O292j1293j2451M705J4421L525j2727r202P047J3506
1697G052K71j3242p693Q930J2029l366j3460m869J0160R683n520j2639j854J2333
1711b185P417o957j1175J813J2256N576q404j0244M430J1910K648r839p755N674
1725d835J1347L94j1067n106P438J0096j683j0430l236Q884Q633m346r737j405
1739e053R094N955n752r385J31R292K990o675q656K447Q295K033p749o917M482
1754e468P362J84p900m436M866P065j390q296k203O024N873k937o675q31O669
$$ plain form
1769 -2093 3018 -1211 -6690 -5792 1152 4244 510 -4499 -2636 4559 5852 1541 -2166 1132 6402
1784 6402 6875 2153 -1001 2908 7151 6294 1245 -356 2774 6344 4260 -461 -1038 2355 4543 1626
1800 1626 -1798 -1995 1182 2771 -330 -2954 -2020 795 765 -1358 -4014 -2509 -5 -620 -2545 -4104
1816 -4104 -1985 -218 -244 -1953 -2298 -348 1396 1082 -463 129 1543 2577 1969 859 1622 2190 2234
1833 2234 1530 1704 1517 2093 1784 1426 1946 2039 1990 1558 2797 2923 2908 2094 1746 2590 3074 2083 321 752
1853 752 1675 1845 121 -1184 -177 1185 1988 92 -934 1117 3210 3209 1111 445 2250 4913 3281
1870 3281 525 0 2080 4024 1859 -1425 -1950 1880 3490 954 -1867 -471 3352 4823 2088
1885 2088 -1362 958 4805 4772 495 -2575 211 4030 3061 -2537 -4602 -833 3345 1371 -3752 -4054
$$ packed form
1769b093N111m229n479Q98O944L092l734n009J863P195J293m311l707L298N270
1784F402M73m722l154L909M243q57n049j601L130L570k084m721n77L393K188k917
1800A626l424j97L177J589l101k624R34K815l0k123k656J505K504o15j925j559
1816d104K119J767k6j709l45J950J744l14j545N92J414J034o08j110P63N68M4
1833B234p04J74j87N76l09l58N20R3m9m32J239J26j5q14l48Q44M84r91j762M31
1853G52R23J70j724j305J007J362Q03j896j026K051K093jk098o66J805K663j632
1870C281k756n25K080J944k165l284n25L830J610k536k821J396L823J471k735
1885B088l450K320L847l3m277l070K786L819r69n598k065L769M178j974n123l02
$$ plain form
1901 -4054 622 5314 1959 -2622 -2025 3656 6241 2006 -3321 -2361 4038 4764 -779 -5759 -2812 2796
1917 2796 3260 -2433 -6377 -1726 4815 4630 -2577 -4330 1210 6823 4751 -3149 -4577 1879 6607
1932 6607 1708 -6164 -6344 1042 5015 -1029 -7625 -5447 3220 5648 -961 -6248 -2110 6427 6916
1947 6916 -1306 -6397 -687 6146 4131 -4548 -8822 -2117 4586 1261 -7966 -9305 -1267 5382 783
1962 783 -7527 -7066 1825 7058 83 -7933 -6192 3156 5770 -3264 -10961 -6717 2506 2711 -6458 -12488
1978 -12488 -5822 3930 3166 -6260 -10163 -1301 7443 4522 -5420 -7790 1431 8413 2559 -8198 -8153
1993 -8153 1505 6379 -921 -10784 -8081 2853 6505 -2364 -9744 -5110 6353 7624 -2216 -8837
2007 -8837 -2452 7644 5606 -5728 -10872 -3316 5675 1503 -9957 -12966 -2794 4829 -400 -10949
$$ packed form
1901d054M676M692l355m581N97N681K585m235n327R60O399P26n543m980K947N608
1917B796M64n693l944M651O541j85p207j753N540N613k072p900j428O456M728
1932F607m899p872j80P386L973o044o596K178Q667K428o609n287M138Q537M89
1947F916q222n091N710O833k015q679m274O705O703l325r227j339Q038O649m599
1962G83q310M61Q891N233o975q016J741R348K614r034p697M244R223K05r169o030
1978a2488O666R752p64r426l903Q862Q744k921r942k370R221O982n854j0757M5
1993h153R658M874p300r863K703J0934L652q869p380M634J1463J271r840o621
2007h837O385J0096k038j1334n144P556Q991m172j1460l009J0172P623n229j0549
$$ plain form
2021 -10949 -10550 945 7136 213 -10369 -7167 3785 7521 -2330 -11466 -7112 4039 5294 -6229
2035 -6229 -12944 -6009 4971 4139 -7022 -11136 -2002 8489 4888 -5823 -8399 1917 9885 4049
2049 4049 -7680 -8351 3148 8083 -169 -11008 -8643 2720 6734 -2448 -11752 -6269 5721 7767
2063 7767 -3192 -10085 -3003 8178 6835 -5106 -10164 -1963 7440 3218 -8543 -11974 -1803 6646
2077 6646 415 -10737 -10695 1435 7738 275 -10167 -7220 5105 8737 -701 -10176 -5448 5580
2091 5580 6842 -4099 -11794 -4597 5833 4797 -6315 -11031 -2136 8033 5442 -5982 -8470 2028
2105 2028 10242 4859 -6033 -6875 3940 10059 1786 -8339 -6523 4338 8043 -778 -9560 -5039
2119 -5039 6491 8138 -1713 -8066 -1547 8772 8535 -2735 -7618 391 9115 5448 -5906 -8525
$$ packed form
2021a0949L99J1495O191o923j0582L202J0952L736r851r136M354J1151J255j1523
2035f229o715O935J0980q32j1161m114R134J0491l601j0711k576J0316P968n836
2049D049j1729o71J1499M935q252j0839K365J1363M014r182r304N483J1990K046
2063G767j0959o893P082J1181j343j1941n058Q201R403m222j1761l431J0171Q449
2077F646o231j1152M2J2130O303p463j0442K947J2325L632r438r475M728J1028
2091E580J262j0941p695P197J0430j036j1112m716Q895J0169k591j1424k488J0498
2105B028Q214n383j0892q42J0815O119q273j0125J816J0861L705q821q782M521
2119e039J1530J647r851o353O519J0319k37j1270m883Q009Q724l667j1354k619
$$ plain form
2133 -8525 199 7649 2292 -8232 -8499 1847 7780 670 -8554 -6334 4686 8199 -214 -8347
2147 -8347 -4395 5875 6600 -2268 -9034 -3499 6035 4953 -4569 -9088 -1421 7128 4749 -4653 -6966
2162 -6966 2261 9808 5195 -4109 -3915 4823 10851 4317 -4561 -2825 6607 9820 2080 -4812 -1577
2177 -1577 7691 9221 912 -4796 438 9435 8481 105 -4402 2053 9086 6228 -2571 -5261 1944
2192 1944 7026 3175 -5655 -5990 946 6139 153 -7332 -5447 2178 5683 -288 -6673 -4435 3826
2207 3826 4856 -2079 -6824 -2787 4943 4264 -2853 -6096 -649 6204 4372 -2136 -3994 2341 7818
2222 7818 4992 -1467 -1562 5053 8874 4744 -1296 -119 6094 8807 3391 -2303 252 6200 7411
2237 7411 1404 -2632 144 6051 5961 -707 -3233 508 5492 3763 -2143 -4127 435 4333 1411
$$ packed form
2133h525Q724P450n357j0524k67J0346N933p110r224K220J1020L513q413q133
2147h347L952J0270P25q868o766N535R534j082r522m519P667Q549k379r402k313
2162f966R227P547m613r304J94Q738O028o534q878J736R432L213p740o892L235
2177a577R268J530q309n708N234Q997r54q376m507O455P033k858q799k690P205
2192A944N082l851q830l35O936N193n986p485J885P625L505n971o385K238Q261
2207C826J030o935m745M037P730o79p117l243N447O853j832o508j858O335N477
2222G818k826o459r5O615L821m130o040J177O213K713n416n694K555N948J211
2237G411o007m036K776N907r0o668k526L741M984j729n906j984M562L898k922
$$ plain form
2252 1411 -3597 -4258 497 3264 383 -4370 -3736 1183 2914 -321 -4164 -2148 2186 3664 -548
2267 -548 -3385 -643 3223 3484 -400 -2198 627 4286 3315 -409 -1874 1637 4659 2783 -810 -1517
2283 -1517 2136 4083 1987 -1287 -879 2306 3400 1248 -1831 -658 2258 2784 308 -1937 -448
2298 -448 1729 1946 -736 -1825 -593 1783 921 -1031 -1738 -269 1835 965 -760 -776 923 1931 634
2315 634 -403 -462 1202 1414 89 -1144 -704 710 375 -362 -1367 -495 211 397 -841 -976 -341 -17
2333 -17 -28 -662 -992 -629 -224 -791 -1385 -1377 -1311 -1014 -1616 -1558 -1403 -1183 -1253 -1291 -638 -575 -583 -673 -14 55 275 -506
2357 -506 -781 205 -3 -531 -1291 -1389 -537 64 -734 -1641 -1237 124 476 -796 -1269 -872 542 1017 -982
2376 -982 -1703 -1017 629 -153 -2332 -3016 -1435 -33 -998 -3100 -3448 -940 165 -472 -2504 -2592 233
$$ packed form
2252A411n008o61M755K767k881m753O34M919J731l235l843K016M334J478m212
2267e48k837K742L866K61l884j798K825L659r71l724j465L511L022j876l593p07
2283a517L653J947k096l274M08L185J094k152l079J173K916N26k476k245J489
2298d48K177K17k682j089J232K376q62j952p07J469K104q70j725j6J699J008j297
2315F34j037n9J664K12j325j233M40J414l35p37j005Q72P06J86j238j35O35L24
2333a7j1o34l30L63M05n67n94QO6K97o02N8J55K20p0l8O53O3qr0O59O9K20p81
2357e06k75R86k08n28p60r8Q52O01p98r07M04J361L52j272m73L97J414M75j999
2376i82p21O86J646p82k179o84J581J402r65k102l48K508J105o37k032q8K825
$$ plain form
2393 233 1200 -429 -3072 -2251 555 895 -1667 -4062 -2552 -84 -10 -2925 -4383 -2434 571 438 -2789
2410 -2789 -3748 -876 2379 843 -2450 -3350 -7 2323 79 -3587 -3336 226 1663 -979 -4300 -2999
2426 -2999 670 2313 -863 -3809 -1355 2611 3121 -700 -3303 -362 3603 2439 -2220 -3582 -630
2441 -630 3054 942 -3978 -4668 -558 2634 -56 -4333 -3993 920 3126 -528 -4476 -3438 1921 2745
2457 2745 -1663 -5434 -3006 1410 1613 -3393 -6186 -2553 2274 1648 -3543 -5204 -720 4021 2439
2472 2439 -2976 -3602 1495 5304 2304 -3301 -2999 2565 5004 516 -4453 -2955 3129 4755 -91
2487 -91 -4471 -1555 4619 4767 -420 -3982 -226 5195 3733 -2431 -4740 25 4458 1998 -4788 -5709
2503 -5709 -365 3929 430 -5970 -5154 1139 4577 -49 -5412 -3627 2823 4788 -851 -5488 -2853
$$ packed form
2393B33R67j629k643Q21K806L40k562k395J510K468P4k915j458J949L005j33l227
2410b789r59K872L255j536l293r00L343K330k244l666K51L562J437k642l321J301
2426b999L669J643l176k946K454L966N10l821k603K941L965j164m659j362K952
2441f30L684k112m920o90M110L192k690m277L40M913K206l654l948J038N359Q24
2457B745m408l771K428M416K03n006k793L633M827o26n191j661M484M741j582
2472B439n415o26N097L809l000n605L02N564K439m488m969J498O084J626m846
2487i1m380K916O174J48n187l562L756N421j462o164k309M765M433k460o786r21
2503e709N344M294l499o400Q16O293L438m626n363J785O450J965n639m637K635
$$ plain form
2518 -2853 3640 3704 -2410 -5969 -1981 4100 3077 -3143 -5727 -257 5432 3393 -3314 -4296 2054 6333
2534 6333 2945 -4030 -3375 2763 6164 1023 -5080 -3251 3225 5292 -411 -5310 -2341 4655 5063
2549 5063 -1322 -4738 -740 5989 4882 -1835 -4734 674 6082 3593 -3282 -4798 1213 5758 2341
2564 2341 -4749 -4516 2438 5888 1366 -4883 -3037 3811 6181 -102 -5400 -2160 4262 4860 -1831
2579 -1831 -5800 -1877 4154 3238 -3525 -6314 -1266 4717 2345 -4127 -5424 601 5472 1490 -4634
2594 -4634 -4541 2455 5599 715 -5132 -3359 3495 5617 -238 -5320 -2003 4494 5720 -720 -4306
2609 -4306 -260 6349 5293 -986 -3533 1220 6831 4246 -2175 -3524 2413 6459 2869 -3481 -3804
2624 -3804 2659 5843 1251 -4598 -3127 3347 4968 -142 -5612 -2467 3462 4121 -2188 -5876 -2254
$$ packed form
2518b853O493O4o114l559L988O081j023o220k584N470N689k039o707r82O350M279
2534F333l388o975O55O138L401n141o103J829O476K067n703m899K969O996M08
2549E063o385l416L998O729j107o717k899N408N408k489o875j516O011M545l417
2564B341p090K33O954L450m522o249J846O848K370o283n298L240O422N98o691
2579a831l969L923O031r16o763k789N048N983k372o472j297O025M871l982o124
2594d634R3O996L144m884n847J773O854K122n855n082L317O497J226o440l586
2609d306M046O609j056o279k547M753N611k585o421j349N937M046l590o350l23
2624c804O463L184m592n849J471O474J621n110n470L145N929O59o309l688L622
$$ plain form
2639 -2254 3271 2463 -3698 -6245 -1425 3406 1574 -4572 -5575 -162 4244 1356 -4359 -4373 1481 4952
2655 4952 687 -4360 -3200 3126 5030 256 -4655 -1838 4082 4760 -553 -3981 -471 4807 4436
2670 4436 -1359 -3565 462 5098 3594 -2304 -3292 1097 4860 2012 -3215 -3327 1538 4434 741
2685 741 -4338 -3146 2137 3736 -827 -4734 -2391 2472 3154 -1522 -4937 -2077 2899 2332 -2359 -4769
2701 -4769 -788 2868 1799 -3056 -3692 379 3559 1510 -2980 -3412 1168 3825 619 -3262 -2403 1797
2717 1797 3610 -145 -3334 -1738 2495 2983 -957 -3565 -1396 2950 2202 -1500 -3631 -281 2497
2732 2497 1741 -2065 -3257 255 2989 817 -2952 -2801 581 2387 25 -3167 -2491 976 2724 -491
2748 -491 -2899 -1643 1608 2353 -991 -2852 -1371 2165 1750 -1236 -2765 -711 2260 1155 -1869 -2634
$$ packed form
2639b254N525q08o161k547M820M831j832o146j003N413M406k888n715j4N854L471
2655D952m265n047J160O326J904m774m911K817N920O78n313l428L510N278l71
2670D436n795k206M027M636j504n898r88M389L763k848n227j12M865K896l693
2685G41n079J192N283J599m563l907K343M863O82m676l415K860M976n67m691k410
2701d769L981L656j069m855o36M071L180k049m490m32M580K657l206l881Q59M200
2717A797J813l755l189J596M233M88l940k608K169M346p48l702k131L350K778
2732B497p56l806j192L512K734k172l769J51L382J806k362l192O76L467J748l215
2748d91k408J256L251P45l344j861J481L536m15k986j529K054K971j105l024p65
$$ plain form
2764 -2634 49 2032 824 -2207 -2222 317 1660 33 -2569 -1946 964 1316 -709 -2701 -1502 478
2780 478 1181 -1041 -2538 -1159 759 327 -1657 -2509 -856 951 39 -1713 -2151 -348 934 31 -1588
2797 -1588 -1839 -61 829 -311 -1677 -1320 282 1029 -465 -1579 -1062 544 599 -751 -1553 -537 464
2814 464 645 -827 -1226 -370 671 415 -505 -731 -154 378 -69 -644 -591 27 424 9 -711 -654 335 308
2834 308 -294 -497 -298 131 332 -355 -259 -178 63 -117 -142 -322 -562 -343 -363 -294 -354 -596 -351 -450 -169 12
2856 12 -232 -439 -212 189 155 -207 -330 188 598 468 159 169 473 716 873 -92 407 940 1430 1131 159
2877 159 339 937 1730 851 124 612 1312 1579 428 -272 133 1201 1505 -43 -546 -222 1199 439 -466
2896 -466 -1205 67 829 151 -1074 -1283 416 961 97 -1145 -1046 600 1444 -96 -1398 -592 1138 1833
$$ packed form
2764b634K683J983j208l031j5K539J343j627k602O23K910L52k025j992J199J980
2780D78P03k222j497J379J918m32j984q52J653J807r12j752m38J803J282r03j619
2797a588k51J778Q90j140j366L57J602P47j494j114N17J606N5j350q02J016J001
2814D64J81j472l99Q56J041k56r20k26N77N32m47n75N3O18L97m15p20N7R89k7
2834C08o02k03J99M29K01o87R6Q1K41j80k5j80k40K19k0O9o0k42K45r9K81J81
2856A2k44k07K27M01l4l62j23N18M10j30l09J0L04K43J57r65M99N33M90k99r72
2877A59J80N98P93q79p27M88P00K67j151p00M05J068L04j548n03L24J421p60r05
2896d66p39J272P62o78j225k09J699N45q64j242R9J646Q44j540j302Q06J730O95
$$ plain form
2914 1833 42 -909 248 2066 2244 358 -627 623 2818 2209 236 -332 1821 3117 2052 -64
2930 -64 -182 1739 3097 1523 -782 -568 1963 2763 694 -1342 -772 1842 2445 -71 -2047 -584 1680
2947 1680 1914 -856 -2146 -298 2238 1342 -1378 -1884 148 2699 1014 -1664 -1728 1053 2590 1442
2963 1442 -1362 -934 1881 3120 1469 -1439 -440 2867 3374 615 -1695 304 3001 3295 -132 -1708
2979 -1708 546 3365 2601 -1025 -1690 655 3288 1745 -1500 -1853 1233 3209 1186 -2091 -1742 1808
2995 1808 3270 462 -2458 -1256 2506 3333 -38 -2151 16 3150 3315 -291 -1971 796 3874
3010 3874 3259 -600 -1532 1401 4201 2442 -1519 -1983 1694 3862 1184 -2374 -2014 1866 3207 88
3026 88 -2888 -1688 1992 2718 -725 -3356 -1448 2265 2099 -1634 -3985 -1060 2598 1578 -2392 -3631
$$ packed form
2914A833j791r51J157J818J78j886r85J250K195o09j973n68K153J296j065k116
2930f4j18J921J358j574k305K14K531Q00k069k036N70K614O03k516j976J463K264
2947A680K34k770j290J848K536q96k720n06K032K551j685k678o4K781J537j148
2963A442k804M28K815J239j651k908R99L307N07k759k310J999K697K94l427j576
2979a708K254K819p64l626o65K345K633j543l245l53L086J976k023l277L49L550
2995A808J462k808k920J202L762Q27l371k113K167L134J65l606j680K767L078
3010C874o15l859r32K933K800j759l961m64L677K168k678l558L60L880J341l119
3026H8k976J200L680P26l443k631J908L713j66l733k351K925L658j020l970j239
$$ plain form
3042 -3631 -283 2656 1576 -2427 -2695 1134 3844 1093 -2211 -1677 2200 3829 1078 -2190 -892
3057 -892 3098 3910 420 -2295 -502 3407 3323 -698 -2466 -42 3976 2793 -1405 -2848 348 3199
3073 3199 1351 -2645 -3163 145 2288 96 -3931 -3591 258 2145 -1067 -3931 -3028 1086 2235 -1559
3089 -1559 -4102 -2055 1742 1719 -1391 -3929 -1065 2562 1502 -2447 -3645 -142 2712 1506 -2261
3104 -2261 -2851 964 3224 1057 -2476 -2163 1791 3122 560 -3033 -1793 2196 3119 -801 -3452 -1893
3120 -1893 2277 2252 -1514 -3705 -1247 2461 1216 -2260 -3891 -325 2397 1041 -2593 -3397 27 2502
3136 2502 53 -3382 -3171 660 2405 -324 -3288 -2115 1619 2563 -418 -3203 -1284 2337 2239 -973
3152 -973 -3295 -595 2528 1676 -1936 -3216 -423 2354 921 -2532 -3204 6 2362 85 -2903 -2724
$$ packed form
3042c631L348K939j080m003k68L829K710k751l304N34L877J629k751l268J298
3057h92L990Q12l490k715J793L909q4m021j768K424M018j183m198j443L196K851
3073C199j848l996n18L308K143k192m027L40L849J887l212k864R03M114J149l794
3089a559k543K047L797k3l110k538K864L627j060l949j198L503K854j206l767
3104b261n90L815K260k167l533L13L954J331k562l593J240L989R23l920k651J559
3120a893M170k5l766k191K458L708j245l476j631L566K722j356l634q04L424K475
3136B502k449l435K11L831J745k729k964J173L734R44k981k785J919L621r8l212
3152i73k322K700L123q52l612j280K793K777j433l453o72L210K356k277k988J79
$$ plain form
3168 -2724 585 2092 -380 -3007 -1952 1104 2140 -1005 -3293 -1487 1531 1642 -1663 -3018 -674
3183 -674 1994 1538 -1467 -2381 69 2382 1477 -1625 -2384 776 2692 1016 -1992 -1648 1379 2585
3199 2585 403 -2415 -1336 1546 2102 -51 -2273 -1359 1643 1680 -902 -2712 -631 1675 1087 -1515
3215 -1515 -2453 -239 1556 733 -1854 -2239 251 1804 278 -2167 -1935 523 1912 121 -1824 -1074
3231 -1074 1322 1817 -84 -1611 -559 1763 1730 -189 -1563 -218 1795 1628 -822 -1539 184 1901
3247 1901 1104 -1168 -1187 595 1858 645 -1595 -999 783 1745 255 -1287 -934 994 1467 -83 -1353
3264 -1353 -647 1124 1063 -12 -1186 -262 1402 1311 -614 -1053 329 1623 1289 -157 -576 830 1576
3281 1576 1025 -824 -238 918 1580 349 -770 -222 1083 1474 292 -630 -247 1157 1116 -95 -602
$$ packed form
3168b724L309J507k472k627J055L056J036l145k288J806L018J11l305j355K344
3183f74K668m56l005r14K450K313r05l102p59L160J916j676l008L44L027J206
3199B585k182k818J079K882N56k153k222R14L002L7k582j810K081K306n88k602
3215a515r38K214J795q23k587l85K490J553j526k445K32K458J389j791j945P50
3231a074K396M95j901j527J052K322l3j919j374J345K013j67k450p17J723J717
3247A901p97k272j9J782J263j213k240N96J782R62j490j542L53J928M73j550j270
3264a353P06J771o1j075j174R24J664r1j925m39J382J294l34j446m19J406P46
3281A576n51j849N86J156O62j231j119N48J305L91j182r22L83J404m1j211n07
$$ plain form
3298 -602 -125 1162 742 -117 -613 258 939 567 -230 -540 590 980 409 -213 77 835 1173 603 -80
3317 -80 361 968 1222 607 172 660 1089 997 490 220 228 1020 618 395 -158 452 650 699 157 107 476 550
3339 550 290 -159 48 161 103 30 -317 -204 50 -346 -185 -158 156 -22 296 178 149 485 554 638 609 766
3361 766 580 448 596 807 1138 644 873 646 1296 1046 602 625 693 1148 793 683 397 557 1040 792 89
3382 89 -19 223 595 164 -704 -820 -343 169 -283 -791 -536 102 166 -166 -748 -212 515 351 -163 -427 -289
3403 -289 629 419 -363 -630 -148 918 618 -341 -326 645 1505 844 46 130 1347 1651 976 -118 128 821
3423 821 1385 -13 -859 -462 671 782 -328 -1230 -373 855 628 -728 -1098 96 1128 547 -1051
3440 -1051 -1216 278 931 41 -1319 -1215 477 709 -12 -1529 -819 871 1308 -35 -1167 -53 1871
$$ packed form
3298f02M77J287m20q59m96Q71O81l72p97l10J130L90n71o22K90P58L38n70o83
3317h0M41O07K54o15m35M88M29r2n07k70QP92m02k23n53O10J98M9n42n0L69P4
3339E50k60m49K07J13n8p3l47J13K54l96J61K7L14j78L18j18k9L36O9Q4k9J57
3361G66j86j32J48K11L31m94K29k27O50k50m44K3O8M55l55j10k86J60M83k48p03
3382H9j08K42L72m31q68j16M77N12m52n08K55O38O4l32n82N36P27j64n14k64J38
3403b89R18k10p82k67M82J066l00r59J5R71Q60o61p98Q4J217L04o75j094K46O93
3423H21N64j398q46L97J133J11j110r02Q57J228k27j356l70J194J032n81j598
3440a051j65J494O53q90j360J04J692K32p21j517P10J690M37j343j132J114J924
$$ plain form
3457 1871 1482 98 -508 419 2030 1527 -398 -995 248 1353 575 -1222 -1736 13 1133 129 -1615
3474 -1615 -1443 230 950 -360 -2097 -1278 315 522 -1172 -2314 -1381 7 366 -1505 -2532 -943
3490 -943 593 671 -1156 -1759 195 1822 1190 -677 -1115 1167 2480 1080 -793 -808 1263 2251 480
3507 480 -1217 -720 1387 1752 206 -1397 -163 1845 1831 -314 -1738 -82 1645 1314 -1189 -2099 -506
3524 -506 1040 -57 -2482 -2578 -771 750 -678 -2550 -2184 -16 1588 -196 -2029 -1558 1001 1620
3540 1620 -449 -2135 -741 1497 1590 -587 -1915 -221 1862 1352 -701 -1554 738 2465 1544 -756
3556 -756 -860 1094 2585 889 -972 -1101 1184 2130 350 -2005 -1555 783 1571 -622 -2421 -951
3572 -951 1257 1217 -902 -2034 -354 1761 1292 -1313 -1959 -16 1871 874 -1776 -1922 462 1825 469
$$ packed form
3457A871l89j384o06R27J611n03j925n97J243J105p78j797n14J749J120j004j744
3474a615J72J673P20j310j737Q19J593K07j694j142R33J388L59j871j027J589
3490i43J536P8j827o03J954J627o32j867m38K282J313j400j873j5K071R88j771
3507D80j697M97K107L65j546j603J234K008j4k145j424J656J727l31k503r10J593
3524e06J546j097k425r6J807J521j428j872L66K168J604j784j833M71K559O19
3540A620k069j686J394K238R3k177j328J694K083n10k053q53K292J727r21k300
3556g56j04J954J491j696j861j29K285R46j780k355M50K338P88k193j799J470
3572i51K208m0k119j132J680K115m69k605o46J943J887r97k650j46K384J363j356
$$ plain form
3589 469 -1517 -1512 954 2314 707 -1332 -654 1692 2460 305 -1267 -176 1882 2089 -334 -1676 -493
3606 -493 2134 1562 -803 -1879 51 1898 916 -1233 -1427 746 1911 779 -1571 -1205 946 2110
3622 2110 191 -1805 -922 1180 1912 -69 -1968 -714 1764 1677 -429 -1476 -73 2423 1906 -361
3638 -361 -930 788 2401 1392 -652 -1068 731 2212 854 -1176 -1373 977 1802 515 -1479 -929
3654 -929 1432 1829 -109 -1603 -533 1387 1739 -265 -1577 -370 1693 1379 -702 -1373 215 1869
3670 1869 1087 -820 -1064 1006 2194 827 -647 -585 1504 2168 824 -996 -251 1605 2063 348 -1215
3687 -1215 -435 1596 1735 -167 -1148 164 1689 1348 -780 -1231 105 1485 623 -1073 -1149 300 1618
3704 1618 313 -1349 -1298 697 1029 -126 -1406 -1106 794 1110 6 -1302 -478 1268 1403 -153 -947
$$ packed form
3589D69j986NK466J360j607k039O78K346P68k155j572J091K058K07k423j342J183
3606d93K627n72k365j076J930J847r82k149j94K173J165j132k350L66K151J164
3622B110j919j996Q83K102P32j981j899J254K478q7k106j047J403K496n17k267
3638c61n69J718J613j009k044m16J799J481j358k030j97K350Q25j287j994N50
3654i29K361L97j938j494J070J920L52k004j312J207K063l14k081o71J588J654
3670A869p82j907k44K070J188j367j474O2K089O64j344j820P45J856M58j715j563
3687a215P80K031J39j902r81J312J525l41k128m51J336J380q62j696p6J449J318
3704A618j305j662N1J995L32j155j280L00J900L16j104j308Q24J746J35j556p94
$$ plain form
3721 -947 280 1340 1107 -592 -699 426 1652 1184 -414 -306 783 1904 942 -554 -397 978 1621
3738 1621 728 -751 -594 970 1258 125 -805 -456 1121 959 -475 -1186 -385 803 551 -687 -1106
3755 -1106 -146 796 447 -887 -1099 107 793 179 -674 -467 275 1028 549 -584 -414 654 1072 135
3773 135 -653 -274 666 940 -241 -771 -281 1081 515 -229 -626 123 919 383 -373 -487 292 697 204
3792 204 -905 -803 171 437 39 -700 -422 269 568 -59 -555 -121 763 635 63 -525 -88 615 488 -226
3812 -226 -210 16 388 213 -316 -455 173 499 252 -247 -102 390 476 77 -197 -19 196 206 -368 -276 -430
3833 -430 -226 -207 -536 -707 -564 -280 -217 -255 -499 -156 -212 -218 -29 -266 44 83 17 42 -173 183 56 -52 -21
3856 -21 -113 68 226 117 369 373 205 455 401 554 344 375 94 386 236 10 -347 -464 -296 -476 -536 -698
$$ packed form
3721i47J227J060k33j699j07J125J226m68j598J08J089J121r62j496J57J375O43
3738A621q93j479J57J564K88j133r30L49J577j62j434p11Q01J188k52j238m19
3755a106R60R42l49j334k12J206O86o14q53K07P42P53m79j133J70J068M18r37
3773A35p88L79R40K74j181n30M90J362n66p44l97P49P96n36p56j14P79M05m93
3792B04j109J02R74K66l98p39K78O91K99o27m96M34Q84j28n72n88M37P03j27p14
3812b26J6K26L72j75n29j39O28L26k47m99J45M92Q6l99k74J78K15J0n74R2j54
3833d30K04J9l29j71J43K84O3l8k44L43n6oJ89k37L10L9o6K5k15L56j27j08L1
3856b1r2J81J58j09K52Mj68K50n4J53k10L1k81K92j50k26l57j17J68j80o0j62
$$ plain form
3878 -698 -577 -303 -155 -488 -478 -187 -35 -96 -306 -592 -147 -53 -134 -740 -484 -303 241 -74 -449 -258 -79
3899 -79 394 220 -79 85 825 944 465 352 256 901 917 275 19 183 367 406 -418 -720 -348 259 -95
3920 -95 -656 -762 -311 422 -84 -557 -842 54 235 -304 -976 -678 -72 31 -298 -1397 -629 206 260 -483
3940 -483 -838 -203 770 903 -5 -78 551 1392 723 77 -44 865 911 701 -500 -216 823 781 584 -284
3960 -284 -232 1009 1143 64 -767 -238 839 694 -162 -978 -600 495 286 -1004 -1527 -727 95 -150 -1062
3979 -1062 -1025 118 927 418 -847 -901 704 1213 522 -446 -394 1133 1315 328 -596 6 1025 1211 -20
3998 -20 -700 444 1404 1556 124 -174 596 1745 1110 -405 -639 551 1073 411 -1082 -1001 80 706
4016 706 -59 -1191 -1205 383 989 -224 -1306 -517 842 904 -405 -1392 -87 1109 911 -575 -847 -169
$$ packed form
3878f98J21K74J48l33J0K91J52o1k10k86M45R4q1o06K56J81N44l15l75J91J79
3899g9M73j74k99J64P40J19m79j13r6O45J6o42k56J64J84L9q24l02L72O07l54
3920i5n61j06M51P33n06m73k85Q96J81n39o72K98O06J03l29j099P68Q35N4p43
3940d83l55O35R73J33r08p3O29Q41o69o46j21R09M6k10j201K84J039m2j97q68
3960b84N2J241J34j079q31N29J077j45q56q16L78J095k09j290n23Q00Q22k45r12
3979a062L7J143Q09n09j265n4J605N09o91r68N2J527J82r87r24O02J019J86j231
3998b0o80J144R60J52j432k98P70J149o35j515k34J190N22o62j493Q1J081O26
4016G06p65j132j4J588O06j213j082P89J359O2j309r87J305J196j98j486k72O78
$$ plain form
4034 -169 1067 830 -576 -869 561 1620 900 -550 -254 1103 2123 1079 -761 -137 1398 1622 398
4051 398 -1040 -338 1268 1104 -272 -1193 -368 953 877 -539 -1173 123 1117 474 -1097 -1346 389 1324
4069 1324 341 -1282 -1177 44 1149 101 -1297 -799 720 1189 98 -1186 -310 1358 1315 147 -955
4086 -955 369 1592 1249 -248 -1109 192 1331 999 -702 -728 373 1266 683 -483 -819 789 1618
4103 1618 277 -930 -607 768 1683 148 -1307 -628 777 968 -415 -1173 -507 1131 676 -562 -1200
4120 -1200 88 1291 856 -643 -1175 436 1413 471 -971 -1022 287 1290 6 -1271 -797 447 708
4137 708 -235 -1246 -905 780 1002 -553 -1346 -331 875 702 -617 -1180 -228 786 466 -979 -1235
4154 -1235 -243 852 454 -919 -980 356 1228 418 -855 -441 878 1361 449 -923 -186 949 1377 -78
$$ packed form
4034a69J236k37j406k93J430J059p20j450K96J357J020j044j840O24J535K24j224
4051C98j438P02J606j64j376r21Q25J321p6j416o34J296R94o43j571k49J735R35
4069A324r83j623J05J221J105j048j398M98J519M69j091j284Q76J668m3j168j102
4086i55J324J223l43j497q61J301J139l32j701k6J101Q93n83j166l36J608Q29
4103A618j341j207L23J375R15j535j455O79J405J91j383p58O66J638m55j238o38
4120a200J288J203m35j499n32J611R77r42j442n1J309J003j284j277M74J244K61
4137G08r43j011L41J685K22j555p93J015J206j73j319n63R52J014l20j445k56
4154a235R92J095l98j373o1J336Q72q10j273M14J319M83r12j372P37J135M28j455
$$ plain form
4172 -78 -959 -90 1102 1155 -246 -1008 -26 1393 765 -611 -1031 170 1134 392 -910 -860 283 868 22
4191 22 -971 -1030 277 701 -342 -1247 -798 480 621 -441 -1117 -446 425 391 -593 -975 -205 951 343
4210 343 -693 -974 36 1079 377 -697 -549 363 1011 288 -650 -481 743 833 155 -788 -344 671
4228 671 798 -144 -903 -161 805 591 -249 -861 -481 715 128 -757 -942 -287 613 291 -745 -1002 8
4247 8 770 -35 -1008 -539 -12 519 -158 -721 -496 310 527 -294 -966 -255 384 578 -309 -550 25 683 424
4268 424 -434 -619 14 611 399 -525 -310 100 316 143 -323 -446 196 247 -207 -696 -396 149 418 -103
4288 -103 -588 -239 610 80 -328 -522 171 305 204 -287 -463 142 368 -1 -376 -224 122 462 -37 -433
4308 -433 -252 115 427 -35 -335 14 245 377 -183 -662 -245 107 163 -351 -476 -198 0 -40 -143 -378 -115
$$ packed form
4172g8q81Q69J192N3j401p62R82J419o28j376m20J201R64p42j302N0J143N85q46
4191B2r93n9J307M24j043r05M49J278J41j062o76O71Q71l4r84l82P70J156o08
4210C43j036k81J010J043p02j074J48R12O48p23r38J69J224R0o78r43M44J015
4228F71J27r42p59P42R66k14q40o12L80J196n87q85j85O55R00l22j036k57J010
4247HP62q05r73M69N27N31o77n63K25Q06K17q21o72P11O39J94q87k41N75O58k59
4268D24q58j85O33N97k12r24K15M10K16j73m66j23O42N1m54m89L00N45K69n21
4288a03m85L49Q49n30m08j94O93J34j01m91j76O05K26l69l75J52L46L40m99l96
4308d33J81L67L12m62l00L49K31J32n60m79M17L52N6n14j25K78J98m0j03k35K63
$$ plain form
4329 -115 76 248 -203 -166 -60 438 310 -329 12 253 219 1 -21 192 242 383 99 259 403 164 146 226
4351 226 330 551 429 278 91 276 257 73 58 95 6 -63 65 -132 -188 -282 -186 9 -126 -293 -225 -297 -347 -323
4375 -323 87 -354 -257 -435 -161 105 -121 -214 -210 61 51 184 220 184 510 335 665 333 359 643 637 475 132
4398 132 595 440 273 160 175 236 475 607 140 -100 432 539 231 124 162 336 617 203 -96 -147 248
4419 248 274 -530 -346 -351 188 126 -309 -616 -120 609 391 -207 -264 460 472 688 -116 -233 373 965 490 -434
4441 -434 -5 585 967 373 -147 59 523 736 159 -495 80 761 521 -152 -511 -22 453 301 -345 -458
4461 -458 88 367 -97 -650 -635 27 522 96 -685 -576 215 630 -33 -737 -165 566 765 -278 -338 -268 796
4482 796 585 62 -535 145 1005 845 -226 -336 439 864 787 -82 -455 526 898 258 -691 -433 328 807
$$ packed form
4329a15J91J72m51L7J06M98j28o39L41K41l4k18k2K13N0J41k84J60J44k39j8Q0
4351B26J04K21j22j51j87J85j9j84j5L7q9o9J28j97n6r4R6J95j35j67O8p2n0K4
4375c23M10m41R7j78K74K66k26r3MK71j0J33L6l6L26j75L30l32K6K84oj62l43
4398A32M63j55j67j13J5O1K39J32m67k40N32J07l08j07L8J74K81m14k99n1L95
4419B48K6q04J84nN39o2m35l07M96P29k18n98n7P24J2K16q04j17O06N92m75r24
4441d34M29N90L82n94n20K06M64K13n77o54N75O81k40o73l59M89M75j52o46j13
4461d58N46K79m64n53J5O62M95m26p81J09P91M15o63p04N72P31J99j043o0P0J064
4482G96k11n23n97O80Q60j60j071j10P75M25p7q69l73R81L72o40r49K58P61M79
$$ plain form
4502 807 -32 -908 -647 -7 476 -396 -979 -414 356 329 -552 -1211 -659 363 296 -484 -916 -287 471 78
$$ packed form
4502H07q39q76K61O40M83q72n83N65P70k7q81o59N52J022o7p80m32O29P58l93
$$ [...]
8191a17
##END NTUPLES=NMR FID
##END=
