##TITLE=1H_SA_sl.OH-2
 CDCl3, 8 sc, 
 1.9.2020
##JCAMPDX= 6.0         $$ Bruker NMR JCAMP-DX V2.0
##DATA TYPE= NMR FID
##DATA CLASS= NTUPLES
##ORIGIN= UXNMR, Bruker Analytische Messtechnik GmbH
##OWNER= root
$$ XWIN-NMR		Version 3.5
$$ Tue Sep  1 11:15:18 2020 Russian Standard Time (UT+4h)  she@DPX200
##.OBSERVE FREQUENCY= 200.1315066352
##.OBSERVE NUCLEUS= ^1H
##.DELAY= (6, 6)
##.ACQUISITION MODE= SIMULTANEOUS
##.ACQUISITION SCHEME= undefined
##.AVERAGES= 8
##.DIGITISER RES= 18
##SPECTROMETER/DATA SYSTEM= spect
##.PULSE SEQUENCE= zg30
##.SOLVENT NAME= CDCl3
##.SHIFT REFERENCE= (INTERNAL, CDCl3, 0, 15.7039)
##AUDIT TRAIL= $$ (NUMBER, WHEN, WHO, WHERE, WHAT)
$$ ##TITLE= Audit trail, XWIN-NMR		Version 3.5
$$ ##JCAMPDX= 5.01
$$ ##ORIGIN= Bruker BioSpin GmbH
$$ ##OWNER= she
$$ F:/spectra/data/she/nmr/H-F/1/audita.txt
$$ ##AUDIT TRAIL=  $$ (NUMBER, WHEN, WHO, WHERE, WHAT)
(   1,<2020-09-01 11:14:08.98 +0400>,<she>,<DPX200>,
      <created by zg, POWCHK disabled, PULCHK disabled
       configuration hash MD5:
       00 E9 B6 7A A2 85 ED C7 34 08 36 98 17 FE 4E 26
       data hash MD5: 16K
       F7 9C AC BC 22 4C 6C 88 D7 31 21 DE F6 89 BD 22>)
$$ ##END=
$$ 
$$ hash MD5
$$ 35 99 B9 C4 5F 03 2C F4 1D 0E 10 00 17 35 BC 17
##$RELAX= 
##$RELAX= 
##$RELAX= 
##$RELAX= 
##$RELAX= 
##$RELAX= 
$$ Bruker specific parameters
$$ --------------------------
##$DU= <F:/spectra>
##$EXPNO= 1
##$NAME= <H-F>
##$PROCNO= 1
##$TYPE= <nmr>
##$USER= <she>
##$AMP= (0..31)
100 100 100 100 100 100 100 100 100 100 100 100 100 100 100 100 100 100 
100 100 100 100 100 100 100 100 100 100 100 100 100 100 
##$AQSEQ= 0
##$AQ_mod= 1
##$AUNM= <au_zg>
##$AUTOPOS= <>
##$BF1= 200.13
##$BF2= 200.13
##$BF3= 200.13
##$BF4= 200.13
##$BF5= 200.13
##$BF6= 200.13
##$BF7= 200.13
##$BF8= 200.13
##$BYTORDA= 1
##$CFDGTYP= 0
##$CFRGTYP= 5
##$CHEMSTR= <none>
##$CNST= (0..31)
1 1 145 1 1 1 1 1 1 1 1 1 1 1 1 1 1 1 1 1 1 1 1 1 1 1 1 1 1 1 1 1 
##$CPDPRG= <>
##$CPDPRG1= <>
##$CPDPRG2= <>
##$CPDPRG3= <>
##$CPDPRG4= <mlev>
##$CPDPRG5= <mlev>
##$CPDPRG6= <mlev>
##$CPDPRG7= <mlev>
##$CPDPRG8= <mlev>
##$CPDPRGB= <>
##$CPDPRGT= <>
##$D= (0..31)
0 1.2 0 0 0 0 0 0 0 0.06 0 0.03 0 0 0 0 0.0002 0 0 0 0 0 0 0 0 0 0 0 0 
0 0 0 
##$DATE= 1598944448
##$DBL= (0..7)
120 120 120 120 120 120 120 120 
##$DBP= (0..7)
150 150 150 150 150 150 150 150 
##$DBP07= 0
##$DBPNAM0= <>
##$DBPNAM1= <>
##$DBPNAM2= <>
##$DBPNAM3= <>
##$DBPNAM4= <>
##$DBPNAM5= <>
##$DBPNAM6= <>
##$DBPNAM7= <>
##$DBPOAL= (0..7)
0.5 0.5 0.5 0.5 0.5 0.5 0.5 0.5 
##$DBPOFFS= (0..7)
0 0 0 0 0 0 0 0 
##$DE= 6
##$DECBNUC= <off>
##$DECIM= 32
##$DECNUC= <off>
##$DECSTAT= 4
##$DIGMOD= 1
##$DIGTYP= 9
##$DL= (0..7)
0 120 120 120 120 120 120 120 
##$DP= (0..7)
150 150 150 150 150 150 150 150 
##$DP07= 0
##$DPNAME0= <>
##$DPNAME1= <>
##$DPNAME2= <>
##$DPNAME3= <>
##$DPNAME4= <>
##$DPNAME5= <>
##$DPNAME6= <>
##$DPNAME7= <>
##$DPOAL= (0..7)
0.5 0.5 0.5 0.5 0.5 0.5 0.5 0.5 
##$DPOFFS= (0..7)
0 0 0 0 0 0 0 0 
##$DQDMODE= 0
##$DR= 18
##$DS= 0
##$DSLIST= <SSSSSSSSSSSSSSS>
$$ [...]
##$SUBNAM2= <"">
##$SUBNAM3= <"">
##$SUBNAM4= <"">
##$SUBNAM5= <"">
##$SUBNAM6= <"">
##$SUBNAM7= <"">
##$SUBNAM8= <"">
##$SUBNAM9= <"">
##$SW= 16.880792210976
##$SWIBOX= (0..15)
0 0 2 0 0 0 0 0 0 0 0 0 0 0 0 0 
##$SW_h= 3378.37837837838
##$TD= 16384
##$TD0= 1
##$TE= 0
##$TE2= 300
##$TE3= 300
##$TEG= 300
##$TL= (0..7)
0 120 120 120 120 120 120 120 
##$TP= (0..7)
150 150 150 150 150 150 150 150 
##$TP07= 0
##$TPNAME0= <>
##$TPNAME1= <>
##$TPNAME2= <>
##$TPNAME3= <>
##$TPNAME4= <>
##$TPNAME5= <>
##$TPNAME6= <>
##$TPNAME7= <>
##$TPOAL= (0..7)
0.5 0.5 0.5 0.5 0.5 0.5 0.5 0.5 
##$TPOFFS= (0..7)
0 0 0 0 0 0 0 0 
##$TUNHIN= 0
##$TUNHOUT= 0
##$TUNXOUT= 0
##$USERA1= <user>
##$USERA2= <user>
##$USERA3= <user>
##$USERA4= <user>
##$USERA5= <user>
##$V9= 5
##$VALIST= <valist>
##$VCLIST= <CCCCCCCCCCCCCCC>
##$VD= 0
##$VDLIST= <DDDDDDDDDDDDDDD>
##$VPLIST= <PPPPPPPPPPPPPPP>
##$VTLIST= <TTTTTTTTTTTTTTT>
##$WBST= 1024
##$WBSW= 4
##$XGAIN= (0..3)
0 0 0 0 
##$XL= 0
##$YL= 0
##$YMAX_a= 312282
##$YMIN_a= -224865
##$ZGOPTNS= <>
##$ZL1= 120
##$ZL2= 120
##$ZL3= 120
##$ZL4= 120
##$ABSF1= 10
##$ABSF2= 0
##$ABSG= 5
##$ABSL= 3
##$ALPHA= 0
##$AQORDER= 0
##$ASSFAC= 0
##$ASSFACI= 0
##$ASSFACX= 0
##$ASSWID= 0
##$AUNMP= <proc_1d>
##$AZFE= 0.1
##$AZFW= 0.1
##$BCFW= 1
##$BC_mod= 2
##$BYTORDP= 1
##$COROFFS= 0
##$CY= 11.3945322036743
##$DATMOD= 1
##$DC= 2
##$DFILT= <>
##$DTYPP= 0
##$F1P= 16.9975609425685
##$F2P= -3.02152046262296
##$FCOR= 0.5
##$FTSIZE= 0
##$FT_mod= 4
##$GAMMA= 1
##$GB= 0.15
##$INTBC= 1
##$INTSCL= 1
##$ISEN= 128
##$LB= 0.24
##$LEV0= 0
##$LPBIN= 0
##$MAXI= 10000
##$MC2= 0
##$MEAN= 0
##$ME_mod= 0
##$MI= 1.114404
##$NCOEF= 0
##$NC_proc= 0
##$NLEV= 6
##$NOISF1= 3.799351
##$NOISF2= 2.8
##$NSP= 1
##$NTH_PI= 0
##$NZP= 0
##$OFFSET= 15.70392
##$PC= 1
##$PHC0= -9974.31
##$PHC1= 12.60092
##$PH_mod= 1
##$PKNL= yes
##$PPARMOD= 0
##$PSCAL= 0
##$PSIGN= 0
##$REVERSE= no
##$SF= 200.130013532006
##$SI= 16384
##$SIGF1= 3
##$SIGF2= 2
##$SINO= 400
##$SIOLD= 16384
##$SREGLST= <1H.CDCl3>
##$SSB= 0
##$STSI= 0
##$STSR= 0
##$SW_p= 3612.71676300578
##$SYMM= 0
##$S_DEV= 0
##$TDeff= 0
##$TDoff= 0
##$TI= <>
##$TILT= no
##$TM1= 0
##$TM2= 0
##$TOPLEV= 0
##$USERP1= <user>
##$USERP2= <user>
##$USERP3= <user>
##$USERP4= <user>
##$USERP5= <user>
##$WDW= 1
##$XDIM= 8192
##$YMAX_p= 0
##$YMIN_p= 0
$$ End of Bruker specific parameters
$$ ---------------------------------
##NTUPLES= NMR FID
##VAR_NAME=  TIME,          FID/REAL,        FID/IMAG
##SYMBOL=    X,             R,               I
##VAR_TYPE=  INDEPENDENT,   DEPENDENT,       DEPENDENT
##VAR_FORM=  AFFN,          ASDF,            ASDF
##VAR_DIM=   8192,          8192,            8192
##UNITS=     SECONDS,       ARBITRARY UNITS, ARBITRARY UNITS
##FACTOR=    0.000296,      1,               1
##FIRST=     0,             0,               0
##LAST=      2.424536,      0,               0
##MIN=       0,             -224865,         0
##MAX=       2.424536,      312282,          0
$$ Real data points
##PAGE= N=1
##DATA TABLE= (X++(R..R)), XYDATA
$$ [...]
2255A826k227j377R29K374K7j332j962J144K837q43k090n24J342J253j53k433
2271a209n12K031J112j120j955M23J153J243j657j442O20J576K16j797o56M38
2287a536J374L47j421q92J560O78n19j03j108J385Q95r45l45l45P24K27o06o46
2305a276M50j30O33q17k18Q86n21oM26n37L77O58r07Q52n4p87Q71o9m1M03q80
2326f87J88K61L03L30l34N3Q86m67M21m8o10J143j42m89j88l42o0L22l20m79j85
2347d44N1O80p58m3k42J30J542j251o47M11M14K80k67j647O29J241r9r36j135
2366b091J312J049J79j074p59J526J510o59j437M32P43J641j200k117M80J435
2382I70J250k116j552R75J589M05j659j734J578K494j216j255j158J267K400j116
$$ plain form
2255 1826 -401 -1778 -849 1525 1552 220 -1742 -598 2239 1396 -694 -1218 124 1377 1224 -1209
2271 -1209 -1721 310 1422 302 -1653 -1230 -77 1166 -491 -1933 -1313 263 479 -1318 -1974 -1536
2287 -1536 -162 185 -1236 -2128 -568 110 -409 -512 -1620 -235 660 -285 -630 -975 -251 -24 -630 -1276
2305 -1276 -826 -956 -323 -1140 -1358 -472 -993 -999 -573 -1110 -733 -75 -982 -130 -184 -971 -100 -169 -210 193 -687
2326 -687 -499 -238 65 395 61 114 1000 533 954 906 296 1439 1297 808 620 278 218 540 220 -259 -444
2347 -444 -393 287 -471 -514 -756 -626 916 -335 -982 -571 -157 123 -144 -1791 -1162 79 -20 -956 -2091
2366 -2091 -779 270 449 -625 -1384 142 1652 993 -444 -12 731 2372 1172 -945 -465 970
2382 970 2220 104 -1448 -473 1116 1521 -138 -1872 -294 2200 984 -271 -1429 -162 2238 1122
2398A122k362k39J538J689r86k387L4K071J582j078k563J291K132R13r55k250
2414d48P36K948J79k522j117j11L237J78l404j453J784K367k92l094j240K777
2430E25K189r48l180o48L005J933k050l034p5L276J564l028k707J223L320J096
2446B461k901k304J891L910K32l382j282J929L439o94l420j457K962K730k049
2461B065l086m71L266J997j624l692M76L611J003j909l114O22L160R84l045k868
2477b625J572K924R8l214j979J867L465j55l587j067K764L169j036l513q56L655
2493A482K451k328l217j31L669K112l032l118P72M296P63l049k767J802L842L72
2509C919l479k268K532L174o88l790j830K742L213j939m014k88L270K418k099
$$ plain form
2398 1122 -1240 -1479 59 1748 762 -1625 -1591 480 2062 984 -1579 -288 1844 2757 1802 -448
2414 -448 288 3236 3415 893 -224 -335 2902 3080 -324 -1777 7 2374 2082 -1012 -2252 525
2430 525 2714 1766 -1414 -2062 943 2876 826 -2208 -2283 993 2557 -471 -3178 -1955 1365 2461
2446 2461 -440 -2744 -853 3057 3289 -93 -1375 554 3993 3299 -121 -1578 1384 4114 2065
2461 2065 -1021 -1492 1774 3771 2147 -1545 -1069 2542 3545 1636 -1478 -856 2304 3288 243 -2625
2477 -2625 -1053 1871 1969 -1245 -3224 -1357 2108 1953 -1634 -2701 63 3232 2196 -1317 -2173 1482
2493 1482 3933 1605 -1612 -1743 1926 4038 1006 -2112 -1340 2956 3719 670 -2097 -295 3547 3919
2509 3919 440 -1828 704 3878 3190 -600 -2430 312 3525 1586 -2428 -2716 554 2972 873
2524H73l303j63L952J899k554l150R32L888P36k835k802J301L642K91l482k083
2540b858K359L020k35l242j693K943L175j358l627l01K525K850k223l551J87L323
2556A294J550k572l260Q04L729J048k900l104K166L513j02k445k491K513L103
2571B846J9l729j080K508K249n05l940k73L217K276j621l398K53L272J346j933
2587A507k661Q0L686M03k830j832L22L250J46l088j922J818K543k53k646j892
2603c369K476K308o27k938n42K390J639j101k833J30K547J683k199k284J189K277
2619G46J354k251j780J260L142m89j635j606J686K328m09k439j578K483J842q73
2635A781k409p05K246J484j289k375J83K063J108j716j793J81J705J157k309j140
$$ plain form
2524 873 -2430 -2593 1359 3258 704 -2446 -1514 2374 3110 275 -2527 -1226 2416 2707 -775 -2858
2540 -2858 -499 2521 2286 -956 -2649 294 3469 2111 -1516 -1817 708 3558 1335 -2216 -2029 1294
2556 1294 2844 272 -2988 -2184 1545 2593 -307 -3411 -1245 2268 2166 -279 -2770 -257 2846
2571 2846 2865 -864 -1944 564 2813 2308 -1632 -1905 1312 3588 1967 -1431 -1178 2094 3440 1507
2587 1507 -1154 -1074 2612 3015 185 -1647 -1325 1925 2071 -1017 -2939 -1121 1422 1169 -1477 -3369
2603 -3369 -893 1415 788 -2150 -2692 -302 1337 236 -2597 -2467 80 1763 -436 -2720 -1531 746
2619 746 2100 -151 -1931 -671 2471 1982 347 -1259 427 2755 2346 -93 -1671 812 2654 1781
2635 1781 -628 -1333 913 2397 1108 -1267 -1084 979 2087 371 -1422 -1241 464 1621 -688 -1828
2651a828R07J460K62j550j307R20J863k93j645n94J476J517o31j481n42J553J409
2668A496p75j743L1J415Q64n46k074Q85J084N06j242r03J45J530M65j766l61M08
2686e81J286k64j269o2O24J245m96j772K64J156N17n83j035M9J612ll67o74K14
2705a39O80L83n47n73L49P01J47q73j7K05L48o5o35O6K53J31j96k03j16J09L51
2726C59m40j51J47m6n3M9K95n17O00k0k49Oo6m5J58M2O8n6m34O33k45R8K76o54
2750b45L73P2P3P7o96o1R37l78mk42k11L37K32l40n70J82Q91r7p45j40M56M05
2772C06M77j438J03Q52M83n35r67L42Q05N51q39p69K98J175K29r90m57M82R57
2791A065%j458l96J007O41n71r87n18J516K60o55q75k29J299N90q72j330N03J414
$$ plain form
2651 -1828 -921 539 801 -749 -2056 -1136 727 434 -1211 -1805 -329 1188 557 -924 -1466 87 1496
2668 1496 721 -1022 -991 424 1288 742 -1332 -447 637 1143 -99 -1002 -857 673 1138 -628 -989 -581
2686 -581 705 441 -828 -890 -266 979 483 -1289 -1025 131 648 65 -970 -921 691 688 321 -353 -139
2705 -139 541 924 377 -196 153 854 1001 128 111 316 664 599 -36 30 283 414 218 15 -101 8 359
2726 359 -81 -232 -85 -131 -184 -135 160 -357 243 223 -26 -20 -86 -131 27 69 137 81 -353 280 35 133 409 -245
2750 -245 128 200 273 350 -346 -407 530 152 148 -94 -305 32 264 -76 -646 -464 427 330 -415 -555 -99 306
2772 306 783 -655 -552 300 783 248 -719 -377 428 979 140 -629 -331 844 1073 83 -374 108 1065
2791 1065 1065 -393 -789 218 859 288 -699 -1217 299 559 -96 -971 -1200 99 689 -183 -1513 -1010 404
2810D04K20j022j094O30J222M41j703m43O58J428M4j420m41P29J962m47j966r1
2828h89J455R52l73k033k84K118O89j202j811Q2K049P53j602j568M95K050L49
2845A230k089j180J302J364M75k429r37J663J588o87j683r40K149J741j276j803
2861a512j25K216J023j323j412J25K285P90j948j771J090J885M03j819j741J488
2877c46J861Lk294q67J626J922n60k248p57J527J948j561j764j46J671J518j398
2894A35k115K05K437O16j435j751M38K378O10j943j740J499K233m07j787j416
2910b043J501K135k24k386r79J980J897j181k537n8K108J778j867k119O86K003
2926F94R16j733k067N45L018n3k082j525J077K484K01k489j023J995J366J16k356
$$ plain form
2810 404 624 -398 -1492 -862 360 801 -902 -1345 -687 741 785 -635 -1076 -347 1615 1168 -798 -889
2828 -889 566 1518 1145 -888 -1172 946 1635 433 -1378 -1296 753 1506 -96 -1664 -1169 881 1230
2845 1230 -859 -2039 -737 627 1102 -1327 -2264 -601 987 300 -1383 -2323 -174 1567 291 -1512
2861 -1512 -1637 579 1602 279 -1133 -1008 1277 2067 119 -1652 -562 1323 1726 -93 -1834 -346
2877 -346 1515 1518 -776 -1643 -17 1905 1345 -903 -1660 -133 1815 254 -1510 -1656 15 1533 135
2894 135 -1980 -1775 662 1278 -157 -1908 -1470 908 1518 -425 -2165 -666 1567 1160 -627 -2043
2910 -2043 -542 1593 1369 -1017 -1996 -16 1881 700 -1837 -1895 213 1991 124 -1995 -1309 694
2926 694 1610 -123 -2190 -1645 1373 1320 -762 -2287 -1210 1274 1475 -1014 -2037 -42 1324 1440 -916
2943i16q15K084J773p46k704o6K343J212j322k062J80K441R46k162j602L57K237
2960A178P10k290j576J080K109o8k158j514K173J484n66j958j309K124J747j221
2976e5k050p4J932J736j559k047O83J845J268j886j831J102J678P22j807j489
2992a832J337K141k12j767r99J163K144o17j777o62J308J561p85j768m67J957
3008G25J092j087j977J58J642P13r11j836M07K002N35j627j227O55J929K61k001
3025e47r23J181K047o83j615n65J394J236m96j918q0J633N70m87j575O4J493P05
3043A434r35j464M22J519L0r17j365Q02J401O2j697l29O95J268k46j477r1R60
3061G2J002p09r27j08R64P12m53j184j53J569L06m66j148L41J051N72j025q59
$$ plain form
2943 -916 -1731 353 2126 1380 -1324 -1390 953 2165 843 -1219 -1039 1402 2348 186 -1416 -1059 1178
2960 1178 1888 -402 -1978 -898 1211 1143 -1015 -2529 -356 1128 562 -1396 -2705 -581 1166 -55
2976 -55 -2105 -2179 -247 1489 -70 -2117 -1434 411 1679 -207 -2038 -936 742 1464 -343 -1832
2992 -1832 -495 1646 1434 -333 -1332 -169 1975 1358 -419 -1081 227 1788 1003 -765 -1232 725
3008 725 1817 730 -1247 -1089 553 1266 355 -1481 -1074 928 1463 -164 -1391 -736 1193 1454 -547
3025 -547 -1470 -289 1758 1075 -540 -1105 289 1525 1029 -889 -969 664 1234 747 -828 -764 729 1434
3043 1434 499 -965 -543 976 1006 89 -1276 -474 927 989 -708 -1037 -342 926 680 -797 -888 72
3061 72 1074 365 -562 -670 294 1006 553 -631 -784 785 1091 625 -523 -182 869 1441 416 -443
3079d43R24L24L35q38m74O20P82q2j064m54P51Q97o57o51l73O11N84n76k17m00
3099d01Q26L19m64o46m1J044j89o36k25M37K21L77p33k88N64R7n9j17j4K49J70
3120D91j51j66M7J34L71l95k99J62K75M2l66j42J87O6K68o7n41K02J18O3J06k43
3142A62J5J73J17l78j42L21m6j47L62J00n05L05J18l19K54n3j78l9L08l34J28
3163B22M6O5K49j32k65n19Q41k6j8l81j55L85K40pp42J26R02q1m38k05j43Q75
3185H39J28q03m87N37P39j88q03r7L74R27m77q27l6N21P29o02q52q9J263M8p22
3206A22m81K45P75K69q61j026Q98L24M17p60n34N93O30j06q71j04P88M83n57l86
3226a42n16Q88J084r38o71%R40P48q69j121L49J483Rq88j137O95J360L88j457
$$ plain form
3079 -443 481 805 1140 302 -172 448 1230 1148 84 -370 381 1278 621 -30 -403 208 792 216 -1 -401
3099 -401 425 744 280 -366 -407 637 448 -188 -413 24 245 622 -111 -399 165 262 203 86 72 321 491
3120 491 340 174 221 355 726 331 32 194 469 511 145 3 190 256 524 457 -84 118 236 299 405 162
3142 162 177 350 467 89 -53 268 222 75 437 537 32 337 455 136 390 337 159 120 428 94 222
3163 222 268 333 582 450 185 -334 507 481 463 82 -73 312 552 545 -197 -71 831 750 312 107 -36 839
3185 839 967 164 -323 214 953 765 -38 -135 239 1166 689 -138 -174 347 1076 474 -378 -467 796 844 122
3206 122 -359 -114 661 930 69 -957 -59 265 682 -78 -612 -19 611 505 -366 -470 318 801 244 -142
3226 -142 -658 230 1314 376 -295 -295 645 1393 524 -597 -248 1235 1244 356 -781 -86 1274 1662 205
3245B05n77N84Q85K19j633j41Q83P67k5j603n72J511P11m74j475q2J422R73j172
3264D06j368K48J560M79j340r79O83J644l27j043q76R79R22K47j381j088J629
3281C95Q88k43j708k04J095J145p76j404p7J496O61r05j202n7J665P68j596j206
3299a265P69J491J23j225j075O60J605N9j343r82J605J117m78j484o54J735J197
3316A855r61j720M18J131J263j360j560O68J361O62j851r07P49J330M18j547j161
3333a212J024J541o86j393o13Q79J685p64j427l25J417Q98n18j971K75J700R45
3350A455r46j735J96J554N99r83j259K94K025q9j488q70R45J631k23j302p86J077
3368I5J339m62j539l76J428Q73p80j628k57J852O13j033j488K81J819M74j145
$$ plain form
3245 205 -372 212 1097 1316 -317 -458 425 1192 1167 -436 -1008 503 1214 740 -735 -817 605 1578 406
3264 406 -962 -714 846 1325 -15 -994 -311 1333 1006 -37 -913 66 988 1235 -146 -1234 395
3281 395 1283 1040 -668 -872 223 1368 592 -812 -889 607 1268 363 -839 -896 769 1537 -59 -1265
3299 -1265 -496 995 1118 -107 -1182 -522 1083 1142 -201 -1183 422 1539 1061 -423 -1077 658 1855
3316 1855 894 -826 -408 723 1986 626 -934 -266 1095 1757 -94 -1001 -252 1078 1496 -51 -1212
3333 -1212 -188 1353 667 -726 -1339 -460 1225 461 -966 -1291 126 1024 506 -1465 -1190 510 1455
3350 1455 509 -1226 -1030 524 1123 140 -1119 -825 1200 1111 -377 -1247 -302 1329 1106 -196 -982 95
3368 95 1434 972 -567 -943 485 1358 578 -1050 -1307 545 1158 125 -1363 -1082 737 1211 66
3385F6j142R57R95L41j364r82Q89J033M37j943n67J253J208j81j512q01J375J294
3403A356o74j272k98J352P01m37j518J06J307N75j263j139L86J457M28j576n16
3420a025L34J059O44j641n54Q87J057j79j343l76R17J193q37r75l29J209O47o27
3438F1q63J06J152N29m56j440P65Q54N23r90j185R55N96K12j214n66J049P28m26
3457C90r88P5O04O46l32j053J33N84N68m95p42l7R25K75p24p60J91R18Q0o56l62
3478g60N25N27K43o99l28N68N23j0q14j60L96P64n13o74J59J0O14k97p54L98Q57
3499E75M8p33n98J96R37K3o37m33J88O16k37p05m5M23N29P6p66k0L66o8M54o35
3521d46L06L20N4m1o52L29L05k08J0l45j36N15J43l45l8N9J06K62k52n6L43q0
$$ plain form
3385 66 -1076 -119 876 1217 -147 -1129 -240 793 1230 -713 -1280 -27 1181 1000 -512 -1313 62 1356
3403 1356 682 -590 -888 464 1165 728 -790 -684 623 1198 -65 -1204 -818 639 1067 -509 -1025
3420 -1025 -691 368 1012 -629 -1183 -296 761 582 -761 -1137 -220 973 136 -839 -1168 41 688 61
3438 61 -802 -696 456 985 529 -911 -146 708 1231 241 -944 11 607 819 -395 -961 88 816 390
3457 390 -598 -523 81 727 395 -658 -525 59 627 132 -610 -647 278 553 -171 -931 -740 178 258 -398 -760
3478 -760 -235 292 535 -164 -492 76 599 589 -225 -385 11 775 262 -412 -253 -243 371 74 -680 -282 575
3499 575 623 -110 -708 -512 425 448 -189 -622 -434 182 -55 -760 -805 -382 147 223 -543 -563 -197 -265 189 -446
3521 -446 -140 180 234 193 -459 -130 175 -33 -23 -368 -504 11 154 -191 -229 -170 -64 198 -54 -110 233 153
3543A53l1j07o9K96m3o8l00l4N2j66L59k08J51r0K93l35J29r5j09K48m16K61j05
3566b34J87k80R9J21k56M0K8j06L62k38j11J16N0K82l27l03K13J89J91m96j69
3587f42L51M0J25l08J79O7P9M6j93l01M19L24k10l80j43O04L56m32n43K25K52
3608h5J57N9o27M40K79m2m38j85L94J54L28n49m68N13N73m66m95j06O25K81l49
3629gm41RN15K29n46n64L16N85L46l84q07M54O66M6n66p46M33P86Kp85n98P29
3651c28O38k19o04m17O35Q32n26q07K04M23O58m51p84n7R79L46q10n07L93P38
3671C36K20p57o39O88P88j41r18k98N13Q78l54j028J11Q11N34n33r08q0J093M88
3691H04o25j051K82R30K49o79q44L01R60K31r06p59L91J336r9j172m81Q21J101
$$ plain form
3543 153 122 15 -54 242 199 131 -169 -203 -151 -317 42 -166 -15 -105 188 -147 -18 -113 -222 26 -390 -129 -234
3566 -234 -47 -327 -228 -107 -363 -323 -295 -401 -39 -277 -388 -272 -222 60 -267 -570 -357 -168 23 -473 -642
3587 -642 -291 -251 -126 -434 -255 -188 -109 -63 -256 -557 -138 186 -24 -404 -547 57 413 -19 -562 -337 -85
3608 -85 72 131 -496 -56 223 181 -257 -442 -48 106 434 -115 -583 -70 503 37 -458 -564 61 342 -7
3629 -7 -448 -439 76 305 -241 -805 -489 96 442 58 -749 -295 371 417 -149 -895 -462 324 326 -459 -1057 -328
3651 -328 310 91 -513 -930 -295 537 11 -796 -592 -169 489 38 -746 -803 176 522 -288 -795 -402 336
3671 336 556 -201 -840 -152 636 495 -423 -721 -208 670 316 -712 -601 210 744 211 -697 -777 316 804
3691 804 179 -872 -590 340 589 -90 -934 -633 327 558 -348 -1107 -716 620 521 -651 -1132 -311 790
3710G90j08j423k59R26P65j04j337j27J108J84l02q78K45Q78N04q83r68O75R62
3729F48Q7j159m04O58Q64k98p91n03O51O01Oq84n36J059Q19o45j294R6R84P73
3749G32n80j189R1J122N09q47r48N47P92N52j224m33P11P90J04j028n78N27J021
3768F71r1r60l94J051L08k91o69o28R59Q69n22j077K13R76K41n16j016K23J128
3787D75L97j407n03M24Q71L32j260m93P83R27l58o71m48O55J122p00r91P9N40
3806b26Q10o72p13J36P43K64m35q56L19R26M27q55o42N93O56M52j277l92Q12K25
3826B95L26j000m61N09P43j96p59k68P92Q51l58r68J11P00L81o98p31K25Q93M20
3846H07p58q09M47P81p7o38k73M53Q46N9j273k9O56O31m29q69O2N16N13m12r52
$$ plain form
3710 790 682 -741 -1000 -74 691 587 -750 -877 231 415 113 -765 -520 358 862 -21 -989 -314 648
3729 648 735 -424 -828 -170 694 396 -395 -898 -247 354 360 -524 -1060 -1 818 173 -1121 -1025 -41 732
3749 732 152 -1037 -946 176 685 -162 -1110 -563 229 781 -443 -876 -165 625 729 -299 -877 -350 671
3768 671 580 -380 -774 277 585 294 -375 -1003 -44 825 303 -774 -561 415 656 140 -876 -653 475
3787 475 872 -535 -1038 -614 257 589 -671 -1164 -381 546 188 -483 -931 -276 846 146 -845 -766 -226
3806 -226 584 -88 -801 -665 78 342 -93 -949 -630 296 723 -132 -774 -181 475 927 -350 -742 70 295
3826 295 621 -379 -840 -331 412 216 -543 -811 -19 832 474 -494 -383 317 698 0 -731 -506 387 807
3846 807 49 -760 -313 468 391 -247 -520 -67 779 838 -435 -464 192 823 394 -475 -413 103 616 204 -748
3867g48K42O43Q7k06o21J1R73j30m15l55J76O79q3m57l52M24K67K53p22l22L12
3888c44P20J2q20j63O79M98k20o19K35L14L99k42p25J92M08O7l62n84K46L50J68
3909B09m25j23L29R3K44m52l25Q70J01k60m25K7J79Q8J9o71L29O9M24j47M1j58
3931C6J53L33l45q0j19J95K55l5Jj08M7k04o9j2j41J93l5jj30o1J26J36l5J77
3955B77l35J6M07o20K30P5L1q6m8j87K80R2j95NJ45O7q6K06L9J0kk6q2O5r4j59
3981B5K56p5j09K65l92r0L45l4P5P7k99K36N5p9R0m32L98j25k23j4J85J34j88
4004H1k76P7L58j16j58j20Q2L64K6j83k19J62J64l0l14K5qJ98K37n42L5K51O3
4027A57R1l59J00J26L56k25n33J56M53K68n47k26K6O08j58m21j75L06K60K91n54
$$ plain form
3867 -748 -506 137 224 18 -603 -592 381 251 -164 -519 -343 336 253 -204 -556 -132 135 388 -334 -656 -344
3888 -344 376 388 -432 -595 84 582 362 -257 -22 292 691 449 -276 -84 324 391 29 -555 -309 41 209
3909 209 -216 -339 -10 83 327 -125 -450 420 521 261 -164 -137 42 130 149 -522 -193 -124 300 153 194 36
3931 36 189 522 177 97 -22 173 428 393 394 286 333 129 60 48 -93 100 65 64 -66 -127 -1 135 100 277
3955 277 -58 -42 365 -255 -25 50 81 -5 -53 -240 40 132 -63 -58 87 154 68 274 313 323 321 295 213 278 184 25
3981 25 281 206 97 362 -30 -120 225 191 266 343 44 280 335 256 346 -86 312 187 -36 -50 135 269 81
4004 81 -195 -118 240 124 -34 -154 -72 292 318 135 -84 78 242 212 -102 -77 -85 113 350 -192 -157 94 157
4027 157 248 -111 -11 115 471 246 -287 -131 322 590 43 -183 -157 451 293 -128 -303 3 263 554 0
4048@m59N12L98j15l33J0J07K75J71r43J25Q5N89k72n62j6N14N68p28k91J43O33
4070D11q4k62j01K5P80l06n81l29O70M54j14l96m14M13M73l31l83j08O29K30m72
4091B04k44k32O94K51o97k94O6N70K86o77n25J50Q75n1l68m67P8J010k83p45k27
4112f26N82N46j21p16j88Q01L54n33n54O5O12N95q96k73K33M69M83p46n98O52
4132A41M96o8m94o40O08P21k98p65r4M94M34j25o16k20O01O86l94q30Q5N86L83
4153F91l16r38J64O39K69m55p73J86R49K21r13k20K89R43n05m72m62O51O33l91
4173A90n80m3N64O09k65j130kP38P85m95r92L42P10M04n95q03L39O34N08j267
4193c49k18M11O07K7p74k18L44P07j64p92k60P90L68j49q24k6P64M05r7j003m1
$$ plain form
4048 0 -459 53 451 336 3 13 120 395 566 -377 -252 -167 422 150 -412 -428 86 654 -74 -365 -222 411
4070 411 327 65 -36 -11 769 463 -118 -447 223 677 563 167 -247 166 639 308 -75 -183 446 676 204
4091 204 -40 -272 422 673 -24 -318 -252 318 604 -73 -598 -448 427 376 8 -459 -381 629 346 -399 -626
4112 -626 -44 502 381 -335 -523 278 632 99 -455 -390 222 817 -79 -352 -119 350 833 87 -511 141
4132 141 637 569 75 -565 43 764 466 -299 -393 101 535 410 -206 -426 175 861 467 -363 -278 308 691
4153 691 375 -563 -399 240 509 54 -719 -533 416 637 -276 -496 -207 736 231 -241 -703 -52 581 190
4173 190 -390 -433 131 740 475 -655 -657 81 866 371 -621 -279 431 835 240 -563 -224 410 918 -349
4193 -349 -567 -156 451 478 -296 -514 -170 537 373 -419 -679 111 479 330 -494 -520 244 649 552 -451 -492
4214d92R23J5l45o50N18M72J56n59n30L61L33K28p02r3K74N58M4q39j68P68L12
4235E84l77l41n30J118J24o66k37j36O51O71q14n80L50Q33k14m11n70P04K61R9
4255E19n26n13M95N89j92n85J6R1N66k10o33J02L76K46k83m63O9O30K39o34k5
4276a26l25Q32J9n19k28O3N47Q2o38n7L47Q7K10o93J86N58L75l56o36J82O61j15
4298D56k67m15K80J66m2k01j36J3O32l6k64j31j41N99l81k3n1L44R7k05k44k57
4320b07J59Q8K1j76n4K03Rj3j5j49K83J90m05j17K34K11j87k14l6J61k1j51Q3
4343a03R6J26K46j65l08K50O5O0k37J86j29K42k00K47j64j40q4L68m50LJ45n7
4365cL76l11q8k8K51J13m67J30K90j03l2M0m14K06R8k25Q3p2K31P9l6m6J60j73
$$ plain form
4214 -492 431 446 101 -549 -31 441 597 38 -492 -131 202 430 -272 -365 -91 467 511 -328 -496 272 584
4235 584 207 -134 -664 454 578 -88 -325 -461 190 861 47 -533 -183 650 436 25 -545 159 420 519
4255 519 -7 -520 -25 564 372 -213 -197 -106 460 250 -383 -281 95 341 58 -405 -336 294 533 -101 -126
4276 -126 -451 381 400 -119 -347 -284 263 345 -293 -350 -3 84 294 -399 -213 345 720 364 -272 -90 571 456
4298 456 189 -226 54 220 178 -23 -159 -146 486 450 186 55 -86 513 132 109 58 402 499 294 50 -207
4320 -207 -48 40 61 -115 -169 34 43 30 15 -134 149 339 -66 -183 51 262 75 -139 -175 -14 -35 -186 -103
4343 -103 -7 119 365 200 -108 142 207 267 30 216 87 329 129 376 212 72 -12 356 -94 -91 54 -3
4365 -3 373 62 -26 -54 197 310 -157 -27 263 160 128 168 -246 -40 58 -167 -84 -156 75 154 118 72 232 59
4389E9j65j19L04j64J19j57P9QP0k37M5M7L87l45J82k84K5K45Q9k30q4J53k0j55
4413a48k58K81J5J74k79j25K23QL9j60n6M13J34r9k39j77L90j24j30j74J13K39
4435F0L03m02j15l00N05L5j8k37K1O11m3l96k72L84L6K70n16l27L12J14L8l30
4457b67K8L47J42k63l76K19K9L18k05n17M3L34M34l93m09K91M22r0r7m30K84N80
4479D24k22l26j65L37J55q2n64J12L65M20l88l68OL71L11m21m33K03M05K78m79
4500f1k16L6N95J1n29k57J99N40k24k97l52M39L70j68l77o4K10L83nl53l50O28
4522A58J54j42n74J45M08M30n80n09P6R66l27m97m0%N32J57q25P1N41J91k35o75
4544e75o2N42L11k72m98N5M40L31m2p72K31O76k3k13o87K53O16L04q98j30J85
$$ plain form
4389 59 -106 -225 79 -85 34 -123 -44 -36 34 -203 -158 -111 276 -69 113 -171 -146 99 188 -42 -126 27 7 -148
4413 -148 -406 -125 -110 64 -215 -340 -117 -109 -70 -230 -286 127 261 162 -77 -254 136 12 -118 -292 -179 60
4435 60 363 -39 -154 -454 51 86 68 -169 -148 463 420 24 -248 136 172 442 -74 -401 -89 25 63 -267
4457 -267 -239 108 250 -13 -389 -170 -141 177 -28 -545 -502 -168 266 -127 -536 -245 177 87 -10 -440 -156 424
4479 424 202 -124 -289 48 203 121 -443 -331 34 454 66 -302 -296 75 386 -35 -468 -265 140 418 -61
4500 -61 -277 -241 354 365 -164 -421 -222 318 94 -203 -555 -116 254 86 -291 -355 -145 238 233 -120 -470 158
4522 158 312 170 -404 -259 149 579 -1 -510 -434 532 205 -292 -332 -332 200 357 -468 -397 144 335 100 -575
4544 -575 -637 -95 216 -56 -554 -499 -59 272 230 -542 -311 365 342 129 -558 -305 311 615 -283 -413 -228
4565b28N89L2p15k09J96P10l09l33o8N34L62l33p38l09Q19O10m54n78O6N43J1
4586A98k69k08k99J044Q0p02n96Q43L54l08n51o7L45N80j89p15j43O98N75n63
4606A07m43p1O06K05l53l11j28O16J99m98l39K20M05M05n08m44M51J02J53o34
4626b60k05O13J71q6l95k45O0R42m31m54j82N88K05k83l95j75N28M29m14l12J4
4647b87N22J37l64k43J43K79K46o76L4K90M25n0n01m69O63J80j9n59J68L46K97
4668E62l90l87K12L54Q2l31j39m03N76L00k63m01L23L20L7n01J48j29M26j62l77
4689a43K10N2NLl75L05j14N52n50j33o1O0M50l56q2N3R9K44l31l2P6L13p5k25
4713e5k69K83M13o7k24n08M59L36l42l12L54P8J47k04o9J7K35J23k92j48J39P0
$$ plain form
4565 -228 361 393 -322 -531 -335 375 66 -267 -335 199 561 228 -510 -819 0 610 156 -422 -356 187 198
4586 198 -71 -279 -578 466 546 -156 -752 91 445 137 -414 -481 -136 444 255 -460 -603 95 670 107
4606 107 -336 -407 199 404 51 -260 -388 228 427 -71 -410 -190 215 620 112 -332 119 221 374 -260
4626 -260 -465 148 319 233 -162 -407 -347 595 164 -290 -472 116 321 38 -357 -532 -4 425 11 -301 -287
4647 -287 235 372 8 -235 -92 187 433 -243 -209 81 506 456 -45 -514 149 329 310 -249 -81 265 562
4668 562 172 -215 -3 351 433 102 -37 -440 136 436 173 -228 95 415 452 -49 99 -30 396 234 -143
4689 -143 67 119 124 127 -248 57 -57 495 -55 -188 -249 -189 261 -95 -177 -124 -25 219 -112 -144 -68 245 170 -55
4713 -55 -324 -41 372 305 81 -427 32 368 26 -286 68 146 293 89 20 37 272 395 103 -45 94 164
4735A64Pj6l02K61k8j56N7j01J03PM3k42N5M49k03k15K91l33j6K66J50j93m9j77
4759a78J74L05l17j42M02N6j31l35K48J2j83J34j5K65m05M2J20M1j98N4j2P6r8
4782h5N6J59N5k39j66K96Q4l14K22k08l6J64L71q2k52j82J89j88L31Jj60R7J14
4805B27R9j69Q8k04N1J15k42r5K47k10K32k57r3J70M15l09l18L13L4M3l1k51j2
4828a57L37K5j43k55K64j26J51n7l78M26l2K45m47J0R7L62j83k05N3K66K5q0j37
4851F1o7Q8o3M17n92k8L12l4ql50L35J2K0o2l11L0L61J6j88o9j2K21J3l96j43
4876d37J84N26Q5l82l79L03L41j18l22j66K29L26M7j58k59K53K79l33j71J82J37
4897A67J65m23P1J5O0L55k85k32Q1L38r4l45p0LO28l1o55oJ34M07j19o16J46K72
$$ plain form
4735 164 171 155 -147 114 86 -70 -13 -114 -11 -4 39 -203 -148 301 98 -117 174 -159 -175 91 241 48 -1 -178
4759 -178 -4 301 -16 -158 244 300 169 -166 82 94 -89 45 30 295 -110 -68 52 93 -105 -51 -63 13 -85
4782 -85 -29 130 185 -54 -220 76 160 -154 68 -140 -176 -12 359 277 25 -157 32 -156 175 176 16 113 227
4805 227 326 157 245 41 92 207 -35 -130 117 -93 139 -118 -211 -41 374 65 -253 60 94 137 106 -145 -157
4828 -157 180 205 62 -193 71 -55 96 39 -339 87 55 300 -147 -137 -40 322 139 -66 -13 253 278 198 61
4851 61 -6 82 19 436 -156 -184 128 94 86 -264 71 83 103 41 -270 -240 121 137 -51 -120 -132 89 102 -294 -437
4876 -437 -253 273 358 -24 -403 -100 241 123 -199 -365 -136 190 237 79 -180 73 352 19 -152 30 167
4897 167 332 -91 -20 -5 55 410 125 -107 -26 312 218 -127 -197 -194 434 403 -252 -258 -124 283 164 -452 -306 -34
4921c4K37q4m16K97K0J15j19j39l15N21J95l43l69K37O65m4n59q0M05M57n91j27
4943g1l33M56L76k61o48N1Q07J35l64n55J85O44R6o77p1K36L83l07j26l07J55
4964a96N14J3m92k08K0O19j6l02l64L47N60k92n08M8O11k5k78k24K1N05M5k26
4986A72p04L48N17Q7n19m10K11M42M7l06l46N68L31j36o64J24L26r6m6k50j91
5007d95N65J76l07l28J51K14J70k08j42J37M02k25q9m10L44L41j44r9l73N73J74
5028D27m21k00o9K97M16m78k43pN57L75m78n09K6M87J17l17j99j15N24K08n47
5049a49l26L55M14l48j68j02L86M11j38l42m18N37P5j34l64P4L99J20j17k04k13
5070b52L93J16k85j78J48J97j61j32L5r0O38l16k8l54J48L14o8k66l65J72M42
$$ plain form
4921 -34 203 119 -297 0 20 135 16 -123 -438 83 278 -65 -434 -197 468 424 -135 -215 190 647 56 -71
4943 -71 -404 52 428 167 -481 -430 377 512 148 -407 -222 422 518 -159 -230 6 389 82 -44 -351 -196
4964 -196 318 331 -161 -369 -349 270 254 -48 -412 -65 495 203 -305 -257 354 329 51 -173 -152 353 398 172
4986 172 -532 -184 333 420 -99 -509 -298 144 191 -115 -461 107 438 302 -362 -238 88 -8 -54 -304 -495
5007 -495 70 246 -61 -389 -238 -24 146 -62 -204 -67 335 110 21 -389 -45 296 152 53 -320 253 427
5028 427 6 -194 -263 34 450 -28 -271 -278 279 654 176 -333 -307 180 297 -20 -219 -334 190 398 -149
5049 -149 -475 -120 294 -54 -222 -324 62 473 335 -7 -425 112 187 53 -311 -237 162 282 165 -39 -252
5070 -252 141 257 -28 -206 -58 139 -22 -154 -119 -209 429 113 85 -269 -121 193 125 -141 -506 -334 108
5091A08J57l60j77QL82P1l36k90O42J0j68k24J57K26R9m37k35L29J17M0k30j23
5113b34J15K15k74J2N0k5L10k04p5j15J30K98k93k13J89K32k30J89m18N4N03j41
5135G5l50L4K59j6J69m68M9M13j55j03k71J15K25J76j17k15J48j28K11j01o1O3
5157d8J27j03j14n3o0J69P3l4L3PJ06M1m19J41R9J5L1L3j7j57J26J6m1k57L46
5182F0p3P8N0k98J57R6j60oMpJ45k27l4J75j51K17J6k34J30K21k34l2M9J10J39
5207A91j28K9m9j59J09k06J90K58j88r5J12l2j57J24j64L7r8K19p1J13j63J32
5229Dk15J87Rr4J22k26r8L76j08j6j70M9K2J08k3k0j05J66M6j99R8O8p6L05l50
5254a40L5o6K63p4J11j73k19L62p2qj24J28J11qR8l90K25K13j79k33j09J87j5
$$ plain form
5091 108 265 -95 -272 -264 118 189 -147 -437 205 215 47 -177 -20 206 305 -132 -367 -38 79 119 -111 -234
5113 -234 -119 96 -178 -166 -116 -141 169 -35 -110 -225 -95 203 -90 -303 -114 118 -112 77 -341 -287 216 75
5135 75 -275 -241 18 2 171 -297 -248 165 10 -93 -364 -249 -24 152 35 -180 -32 -160 51 -50 -111 -48
5157 -48 79 -24 -138 -191 -251 -82 -9 -43 -10 -3 103 144 -275 -134 -35 -20 11 44 27 -130 -4 12 -29 -286 60
5182 60 -13 65 115 -183 -26 70 -90 -96 -92 -99 46 -181 -215 -40 -191 26 42 -192 -62 159 -75 -107 -58 52 191
5207 191 63 92 43 -116 -7 -213 -23 235 47 -48 64 32 -125 -1 -165 -128 -226 -7 -78 35 -128 4
5229 4 -211 -24 -15 -109 13 -213 -311 65 -43 -59 -229 -180 -158 -50 -73 -93 -198 -32 14 -185 -87 -19 -95 210 -140
5254 -140 -105 -171 92 18 129 -44 -263 99 27 19 -105 23 134 126 224 -166 59 272 93 -140 -249 -62 -77
5277g7O4j59R9k46O61n18k69M59K0J98k46j05o7K49j15k9k57J40J73O5l23n9L85
5300D3K91j05m28J29J5L53O9m33r6J53J26K2m91J40J91M09k85k08k64M14j63j47
5322b65j29J20J54L91l15k12K25J7K96m43o6j6K25M0j26l57M51K82m03J01p0K50
5344A50L42m00j05j15L65p9K9m03J48L96O4m41r8K36N3k4l6k17K35LJ35l56k21
5367c39K66M22k78k51l03N96pn8l87J72K65R7r3l79J60J05K11j52l28p7M59l8
5389F3j24j91K49N39l33j94k04J47M25L6p36L03j56L15r0l57K78K13J67l93r7
5410a40J4K96P8k50m67N79J67p9k26m79N39K58k44l48K01p7L98k67j43o0K91M04
5432D45p21K63n7K76J57l83k0J58J71p9l07k12L75m0K12m32P0k44O86k59l5l16
$$ plain form
5277 -77 -13 -172 -73 -319 342 -176 -445 14 34 232 -14 -119 -186 63 -52 -81 -338 -198 -25 40 -283 -342 43
5300 43 334 229 -199 -70 -55 298 367 -66 -162 -9 117 139 -352 -212 -21 388 103 -105 -369 45 -118 -265
5322 -265 -394 -274 -120 271 -44 -256 -31 -14 282 -161 -227 -243 -18 22 -104 -461 -10 272 -131 -30 -100 150
5344 150 492 92 -13 -128 237 158 187 -216 -68 328 392 -49 -147 89 142 118 82 -135 100 103 238 -118 -339
5367 -339 -73 349 71 -180 -483 113 106 48 -339 -167 98 195 102 -277 -117 -12 199 47 -281 -358 101 63
5389 63 -61 -252 -3 536 203 9 -195 -48 377 413 -323 -20 -176 139 49 -308 -30 183 350 -43 -140
5410 -140 -126 170 248 -2 -469 110 277 198 -28 -507 32 290 46 -302 -101 -178 220 -47 -190 -250 41 445
5432 445 -276 -13 -70 206 363 -20 -40 118 289 210 -97 -309 66 26 238 -194 -124 -368 318 59 24 -292
5454b92M64Nm37J54K56j98P3q9k01j53M86K15m27p1J15L77j77o5j64K36n9R0j18
5477B0j39J98L9j44j45N5J09L09l07o6n2N4L35j77j89Q6J3K73l84k20M39j67J63
5500A03j05p6oJ92N5l53J11q1K72J40q4j68J43j9j3l4J5J08q8j34j72L14QK11
5524C39l74j07J18J45J20j82Mj38M4L5j60n5K76P2j22k01J36k28L18J72l45Q5
5546d8J10kN3Nj62k28K01K53j88J47j10J81j86L9K23j67J39j47Kj73J1L1j3P4
5570D5N1J05k05o8k4L49m19L17k00NK29l23R7K15k78j03L14k84J89R7K3l1k48
5593a47J39j45J29J85J02k13L4k97L43j35j31L56l58J29K2Q9J18k66n7J24J48
5614A69k20L7Pn8L1K5l7M51m12J7r7J27l0L2lR5p9k09K31j59j45N58j68l7j08
$$ plain form
5454 -292 172 177 -260 -106 150 -48 25 -64 -265 -418 68 283 -144 -215 -100 277 100 35 -129 107 48 138 20
5477 20 -119 79 118 -26 -171 -116 -7 302 -5 -71 -123 -69 266 89 -100 -14 -1 272 -112 -332 107 -60 103
5500 103 -2 -78 -84 108 163 -190 -79 -160 112 252 168 0 143 124 111 77 92 200 112 -22 -194 120 128 339
5524 339 -35 -142 -24 121 241 59 63 -75 -31 4 -156 -211 65 137 15 -186 -50 -278 40 212 -133 -48
5546 -48 62 60 113 118 -44 -272 -71 182 -6 141 31 212 26 65 288 121 260 113 115 -58 -47 -16 -29 45
5570 45 96 201 -4 -72 -96 253 -166 151 -49 -44 185 -138 -41 174 -104 -207 107 -177 12 109 132 101 -147
5593 -147 -8 -153 -24 161 263 50 84 -213 130 -5 -136 220 -138 -9 13 102 220 -46 -103 21 169
5614 169 -51 -14 -7 -65 -34 -9 -46 405 -7 10 -87 40 10 42 39 134 55 -154 77 -82 -227 331 163 126 18
5639A8j62J2K08K1k14K7J63j32K08k73J20n3J74n5n4l5K47j74n3j5K2J32J0j52
5663a0J1L82n82K84k0n7J48k05J95j08p2J65j40m8p2n4K89k1k57J14J62k81L42
5686A65m36K45m4OK29k44J56r7l0l6Kj2Q9K49j98j50j96K18K05q7K7j49K9P0o5
5711e4k52K69K43j92j7k92K47L68k96o8n5j59M51p7Jm08L82j77L03j01k99L74
5733A91j36J09k21L55k76m6P2k22kJ53N4k49P7K8K69j02l2j79J73J3J06k91J55
5756aj87M48R3m50J66j5r4j7o5J30k06K41k62R0J44K04k74J80j5j76K13n4j79
5779h6q5M9K28M8k00M4j68K52Kq9Q1K5J14R8m97K22pN1L2r8n9J8J77k34Q6p6k6
5806i8R6l16L24k28K51j10K56k94R6K20r9r8j57L22j31q7l74L04k4J59L9k62J02
$$ plain form
5639 18 -144 -132 76 97 -117 -90 73 -59 149 -124 -4 -57 117 62 8 -27 220 46 -7 -22 0 132 142 -10
5663 -10 1 383 -199 85 65 8 156 -49 146 38 -34 131 -9 -57 -129 -183 106 85 -172 -58 104 -177 165
5686 165 -271 -26 -70 -64 165 -79 77 -20 -50 -86 -84 -96 -7 242 44 -106 -302 -84 121 34 61 -88 -59 11 -54
5711 -54 -306 -37 206 14 -3 -295 -48 320 24 -44 -99 -258 193 116 117 -291 91 -86 217 116 -183 191
5733 191 55 164 -57 298 22 -24 48 -174 -176 -23 31 -218 -141 -113 156 54 22 -157 16 29 135 -156 -1
5756 -1 -188 260 353 -97 69 54 -40 -57 -122 8 -198 43 -219 -129 15 219 -55 125 110 -66 147 93 -86
5779 -86 -171 -122 106 154 -46 -2 -170 82 84 -5 76 101 215 313 -184 38 31 82 114 16 -43 -25 152 -82 4 -72 -98
5806 -98 -2 -318 6 -222 29 -81 175 -119 -23 197 98 0 -157 165 34 -53 -427 -123 -147 12 51 -211 -109
5829a09J22K82k14k51J09rJ68%k02M3O6n8j19m8J39L50j54j98J03K4K83j59k56
5852h8j71N01j22k12p5L32j30L4k06P5j18K94k16N2p6J40J20j12J17l89K47K58
5874B55P5m08j48J22R6L2k43l1L99j52o9J09M6j13Q5Q4l58L95j96J29k19J76j33
5897f7J84j42L4J54l27J85n5r7K52l63J4K66j95P0L48m5j11j88j26K28J19k61
5919a23J23j48O2K28m3L7k12K82j82p3j2k05L31J2O0j61n7M8K0O1M6l2K7j41J41
5944H9k9r6J50J02m23J48J25J94j60k52L06j89j84J20K17q9K5p7j53L40Q0m22
5966a78L29k65r9K43J09j73J23o5j0j11J72L3O5j70p3n0P6N0K7m43M56J05QR1
5990B50j97j78r9N8o3L05j06l8j03J1J48j1j08J51Oj35J87l12j3L47k64J58J74
$$ plain form
5829 -109 13 295 81 -170 -61 -70 98 98 -104 -61 5 -53 -172 -220 -81 269 115 -83 20 44 327 168 -88
5852 -88 -259 242 120 -92 -167 165 35 69 -137 -62 -180 114 -102 -50 -126 14 134 22 139 -250 -3 255
5874 255 330 -78 -226 -104 -8 24 -219 -250 149 -3 -72 37 83 -30 55 139 -219 176 -20 109 -110 66 -67
5897 -67 117 -25 9 163 -164 21 -34 -131 121 -242 -228 38 -157 -87 261 216 105 -83 -209 19 138 -123
5919 -123 0 -148 -86 142 99 136 -76 206 24 -49 -61 -266 65 77 137 -24 -81 -33 -13 48 94 62 89 -52 89
5944 89 60 -36 114 216 -207 -59 66 260 100 -152 154 -35 -219 -99 118 29 54 -23 -176 164 244 -178
5966 -178 151 -114 -213 30 139 -34 89 24 14 -97 75 108 173 3 -70 -120 -44 6 33 -410 46 151 159 250
5990 250 53 -125 -224 -166 -229 76 -30 -68 -171 -160 -12 -23 -131 20 26 -109 78 -234 -247 100 -164 -6 168
6013A68J99m69Q5k2K18k30K47k41K13J12l46q6j0L07k03P2k34J68P9j08J09Q5
6035A13q7Q1k36K33m4%l20J06l9J39p6J25k9K15r1k3j08%o6J08M8m2k29J64N8
6060@r4J9j02J17J41k5q3j74m3L04l9k29K29J2J18j70j10M3j20K10n1o5p5q9M13
6085A37J04l80pK12N6k57j27K34r5m1J81k91R3k1R5J70k57J57j51L13p9r9O6K27
6109B40o9j30j5M9r3J86l38O7N3K69k48J07J14pl92Q0K46J57j8l25O5k24J16R5
6133a5j2m3o3J65N4j83q8L16L3q1l11L90j00p8R8l00L94j82O2j12J47r8N3J15
6157A61j60j83J69k0m8L8n8K27j35K41k57R0l3j05K26m0l53J50J57N3j23q4j32
6180b19L24j39N7j38l7K39J6l13K39j26K63k38l9K85j38Q0r1l5K5j71L68k27l31
$$ plain form
6013 168 367 -102 -17 -39 179 -51 196 -45 168 280 -66 -152 -162 145 -58 14 -220 -52 27 -81 28 113
6035 113 26 107 -129 104 60 60 -260 -154 -193 -54 -130 -5 -34 181 90 67 -41 -41 -107 1 49 7 -222 -58 0
6060 0 -94 -75 -177 -60 81 56 -27 -201 -244 60 21 -208 21 33 151 -19 -129 -86 -206 4 -47 -112 -187 -276 137
6085 137 241 -139 -146 66 122 -135 -262 -28 -123 -164 17 -274 -181 -202 -107 63 -194 -37 -188 125 46 -53 13 240
6109 240 171 41 26 75 -18 168 -170 -103 -50 219 -29 78 192 185 -207 -127 119 276 258 -67 -2 -226 -110 -15
6133 -15 -27 -70 -133 32 86 -97 -185 131 164 83 -228 162 62 -16 82 -218 176 -6 56 -56 91 -7 46 161
6157 161 1 -182 -13 -33 -81 -43 -101 126 -9 232 -25 65 32 -73 153 113 -240 -90 67 120 -3 -87 -219
6180 -219 105 -34 23 -115 -152 87 103 -210 29 -97 166 -72 -111 174 36 116 25 -10 15 -156 212 -15 -346
6203c46K50P4J16k12J32L02r6j80J51m6j34j04R5J14l05K67o2Q1l7j11R8K3n6
6226A4j55L23p7l5j25J98q2K74l40J65l01J59M9k21K80k12L8J47k79J19J0K01
6248A50Q7j99j99K25m1n3R8K9m0l7P8j03k01OK21j54J24P8k39J46QL8N2J4L2j4
6274A06j24J5o2k1J28r0j28K55Q7k86N8K55j56r2pN0j8j33J91k1J04n6L7j52R2
6299C2m9M5N7j45k4Q7n7j99K04J5P8k8j18q3j6J90j21L96m30J55Q5K4k66M5K64
6324A41j03J69j83J22j98k4J09o7r0K89j30P9Kl5k31K57O6j76k77K42R6j04j39
6347a85J63m0j14K28k6L0R2j82rR1l78L42p5NP3j55O9K52k09K19j31k88J22k4
6371a30K33l8R0k28j7K55l79N8J44R6j70J01J11k2k04J43k19J8L5J2K52j15j73
$$ plain form
6203 -346 -96 -22 94 -118 14 316 220 40 191 145 11 -93 2 116 -189 78 16 97 60 -51 47 70 14
6226 14 -141 182 105 70 -55 143 61 335 -5 160 -141 18 67 -154 126 -86 -48 99 -180 -61 -51 150
6248 150 237 38 -161 64 23 -30 68 97 57 20 98 -5 -206 -200 21 -133 -9 69 -170 -24 -16 22 74 88 120 106
6274 106 -18 -3 -65 -86 42 -48 -176 79 166 -120 -62 193 37 -55 -62 -12 -30 -163 28 7 111 55 92 -60 32
6299 32 -17 28 85 -60 -84 3 -54 -253 -49 -34 44 16 -102 -185 -201 -11 -132 264 -166 -11 74 98 -168 -123 141
6324 141 38 207 24 146 -52 -76 33 -34 -124 165 35 114 116 81 -150 107 173 -3 -280 -38 58 -46 -185
6347 -185 -22 -62 -176 52 26 56 148 -34 -43 48 -330 12 -63 -58 15 -140 -71 181 -28 191 60 -228 -106 -130
6371 -130 103 65 155 -73 -90 165 -214 -156 -12 84 -86 15 126 104 -100 43 -176 -158 -123 -111 141 26 -147
6394a47J46o6pM27k58k07K59k16m8M7K36lj31m9j32R2J05q8K41j54p6N4n8L08
6418B75n09M26l15R6mN1j47l0J53K2q3j9O6N7J10R3k57l7j36J43O1O7J97j83L2
6443A29j94J04M2q4J26j95P6J76k64J2J72J3k48Q8k1K54j02k65n2L76k3p5j76
6466a31M09j67qr8m3q5K24o7j62R8K00o9k93K31j30N5m8K01k07K36J29k29J4N2
6490A12k21J53k20j66J10K61J27r0k55K61oo8m3J63o2n8q8J09j8O8or8R2k85j
6515b29K88j50K64j74n1K05k97jK75m0N1q1k10J0k6K42k02o5J08J50J22k25O5
6538B9K28l56K67q2M3l72K18o3M22m4k79j35m8J41O3k56K13O7j89l2L35j46N3
6561G7q1q0K8mn9K15j13j02J67J12j39K5p0Q2J00k67L20l89J74l10M51j93pM8
$$ plain form
6394 -147 -1 -67 -74 353 95 -112 147 -69 -117 -70 166 163 32 -17 -149 -57 48 -40 201 47 -29 25 -33 275
6418 275 -234 192 -123 -27 -31 20 -127 -157 -4 18 -65 -84 -18 39 149 242 -15 -52 -188 -45 16 83 280 97 129
6443 129 -65 39 81 -3 123 -72 4 180 -84 -72 100 113 -135 -47 -68 186 84 -181 -233 143 120 45 -131
6466 -131 278 111 103 5 -38 -123 101 34 -128 -30 170 101 -192 39 -91 -36 -84 117 -90 146 275 46 60 112
6490 112 -109 44 -176 -342 -232 29 156 66 -189 72 66 -2 -45 118 56 -2 -90 19 1 69 63 -35 57 -228 -229
6515 -229 59 -91 173 -1 -52 153 -144 -145 130 90 141 60 -150 -140 -166 76 -126 -191 -83 67 189 -36 29
6538 29 257 -99 168 86 129 -243 -25 -88 334 290 11 -124 -172 -31 32 -224 -11 56 -133 -165 170 24 77
6561 77 -4 -84 -56 -60 -119 96 -17 -119 48 160 21 46 -24 58 158 -109 211 -178 -4 -314 137 -56 -63 -15
6585a5k11K15J41N5j96L1J01r0l25L49j46Q9n6J01J06o0j44o2K91j66p5o1J56
6608B8j33K35k7r6P1o4J58K9j18j5M1p3J31k39J47N9j75J73k02J00J56j63J31
6631A54k59J3m3j11L05J68l69J09N9K8l7P3k17P6K8J07n3j82K35j09O6r0J57j39
6655c1k58L60r2J77k68l7j22j50M91K1J26l08J65j1k61J87j40J75N1k9j93R4j35
6678a88M60n77J28K28K3r0j13J88J68k67K2M1J99m52K91J46j23j1O9j70o7K35
6700A40m4q8q2qJ51j30L7j00R7J98l05K95j1m6k15K91o9k34L8J44o8k9L32j87
6724A07j25P3j24R4K50j04k57oJ34J85k83l4R1J58P8k75N1j80J50L09l90O0J55
6747A17n0J45n8m79L61R4n2j65K39N9k26Q4J0p3j36J38mk07J99p4m3J62O5k97
$$ plain form
6585 -15 -226 -11 130 185 -11 20 121 31 -294 55 -91 -2 -58 43 149 89 -55 -117 174 8 -67 -128 28
6608 28 -105 130 103 7 78 14 172 201 83 68 109 36 167 -72 75 134 -41 132 -70 30 186 23 154
6631 154 -105 -92 -135 -246 59 227 -142 -33 26 54 17 90 -127 -51 -23 84 31 -151 84 -25 41 -49 108 -31
6655 -31 -289 71 -21 156 -112 -149 -271 -421 70 91 217 -91 74 63 -198 -11 -151 24 75 46 -147 -53 -188
6678 -188 272 -305 -177 51 74 -16 -129 59 227 -40 -18 23 222 -230 61 207 84 73 142 -28 -95 140
6700 140 96 8 -74 -82 69 -61 -24 -124 -27 171 -134 161 150 104 -111 180 111 -123 -85 59 -9 -38 294 107
6724 107 -18 55 -69 25 275 171 -86 -92 42 227 -56 -90 1 159 237 -38 13 -167 -17 292 -98 -38 117
6747 117 67 212 154 -325 36 130 78 -87 152 211 -15 69 79 6 -130 8 4 -203 -4 -78 -121 41 106 -191
6771a91O6J91q4J47k38J92j57K05o1j11R4J1j54J70j19j53J36j25K84K3M0l19
6793a53L7J42j41K56j64j47K90J29j81K7J0J34k26J61k18O3N4j46R8J6q0m9K34
6816A46l10J10r7O9r1J71m3J18k78K18k37J97J05l8K4k77L05m37K95J80k32K23
6838A21j6no9m2R1k36J44J07Q9lj41o8P0J5p1K62j30l29K00l6J39qj3N5k98O8
6864a04L52k82n9R1J67j23m4q6P7p6P3j01j71J77K22k12P0J0%n3p0L9m3Q3J52
6889H9k1j97N2o7J32R2K05m72J43m7j46J62RJ48j20K7q5j08N5L38j71ll49L65
6913C1n3j4M1m2O4p7K35k70k1j15J21J03k01K03J03n1o6n6O4M3J28K0k63J9J55
6938A01j00j82K28j02K8r9o5J37R0K75l48N4J07J45k00Q0l34K23n5N0l2K29j3
$$ plain form
6771 -191 -125 66 -18 129 -109 83 -74 131 70 -41 53 64 -90 80 -39 -192 -56 -181 103 126 166 -153
6793 -153 -116 26 -115 141 -23 -170 120 249 68 95 105 239 13 174 -44 19 73 -73 25 41 -39 -88 146
6816 146 -164 -54 -151 -82 -173 -2 -45 73 -205 13 -224 -27 78 40 64 -213 92 -345 -50 130 -102 121
6838 121 105 100 31 -11 80 -156 -12 95 184 181 40 -28 42 57 -14 248 118 -211 -11 -47 92 84 71 126 -172 -104
6864 -104 248 -34 -93 -2 165 42 -2 -88 -11 -87 -14 -115 -286 -109 113 -99 -29 -19 -19 -72 -142 -103 -146 -63 89
6889 89 68 -129 -77 -144 -12 80 285 -187 -44 -91 -237 -75 -66 82 -38 -11 -96 -204 -149 189 18 15 -334 31
6913 31 -22 -36 5 -37 27 -50 185 -85 -106 -221 -100 3 -198 5 108 57 -9 -65 -1 42 170 190 -73 -54 101
6938 101 1 -181 47 -55 -27 -126 -191 -54 36 311 -37 17 124 269 69 149 -185 38 -17 33 1 230 217
6961B17k36K6K02l50K61k94K61k05J22k0O7J50l07K14qo3m0o0L2K18k22or9K87
6985A47k6j38j50J1K71L8j56l13L56J60l16K18J13k86P1L3j5j46K20j77J01j72
7007a56R7R6K25m91O1J12P6j13N3J17j78L47l4j74j13q3J86K7j29j11K75j98K8
7030h0J41l9j75J91K6L4r6Po7j7M3n5J21p1n4J30J08k67J18j14J63RJ07o9j2j65
7056h3r7J88K04j00j77J32P2j82O2j30l3J59n2j0J75j32m3rj33m7L23k59K83k08
7080i7n7j56L60l2n6J52r7o4l8J92j91J22j13L7k19M04k08Q2j80Q6j31L42K6k51
7104h7Pj13M01k95O9j73P7J94L3J04l93J43J52j22k72L62O4J22k32j71J21m1J00
7127E0j37Nj3J82r3j45J34j63J54J59j50l0O7P4j00q7l4K1J56j83R0q2R9j60L11
$$ plain form
6961 217 -19 7 209 -141 120 -174 87 -118 4 -16 51 201 -106 108 100 37 -3 -63 -31 187 -35 -41 -140 147
6985 147 121 -17 -167 -156 115 153 -3 -316 40 200 -116 102 215 -71 0 33 18 -128 92 -85 16 -156
7007 -156 -59 37 262 -229 -168 -56 20 -93 -40 77 -101 246 212 38 -75 -158 28 55 -74 -185 90 -108 -80
7030 -80 61 22 -153 38 64 98 2 9 -58 -75 -32 -87 34 -37 -91 39 147 -120 -2 -116 47 56 163 94 82 -83
7056 -83 -180 8 212 112 -65 67 139 -43 19 -111 -144 15 -37 -47 128 -4 -47 -56 -189 -236 87 -172 111 -97
7080 -97 -154 -310 50 18 -38 114 17 -47 -85 107 -84 38 -75 -38 -257 147 -61 21 -159 -73 -204 138 164 -87
7104 -87 -80 -193 208 -87 -18 -191 -114 80 113 217 -176 -33 119 -3 -275 87 151 273 41 -130 -9 -50 50
7127 50 -87 -82 -95 87 -6 -151 -17 -180 -26 133 -17 -47 20 94 -6 -93 -127 -106 50 -133 -43 -125 -26 -186 125
7152A25k01L00j56N7k01q4K76J68k15k28J15k1K11j52j11o5L42k09Lo6N0K29r2
7175G5j8j07j08K66j66M8p6J31N2j0j29o0J29J02qo9J8o4J44j07O4M9j54J48k94
7200a44o8K17j11K5M3J57j37L5J35l11K17j16P6M2j15Q4o3O2l2k33K09j38J1o
7224a61M18k06O2k65L26R2l14M6OjJ4J66N6j15l09M34k23r4Q9jj85L58k25K59
7248B27j26l35K14O3Qj39q1J42j40K40j86K5K8l4p8R9j6o3J40j57K5J75l7Q0O5
7273A39J9k4k64L73k61r7J91l40M47j00r5Mo3q0O0J90k47L48j25l03L69j41Q6
7296H6m8O4Pp7R4p7n9J43k28K15j10P4k3K8l14L59J1l08J77n7J06j6l66L63J12
7321A56k00P3o9o7K26k34R2N3O2j04l5K67m75M4K26J57j4l39J63O6O4j63j86J14
$$ plain form
7152 125 -76 224 68 125 -76 -160 116 284 69 -159 -44 -65 146 -6 -117 -182 160 -49 -46 -112 -62 167 75
7175 75 57 -50 -158 108 -58 -10 -86 45 97 87 -42 -102 27 129 121 52 70 6 150 43 107 156 2 150 -144
7200 -144 -212 5 -106 -81 -38 119 -18 17 152 -159 58 -58 18 60 -55 29 -34 28 -4 -237 -28 -166 -155 -161
7224 -161 257 51 113 -152 174 266 -48 -2 4 3 17 183 239 124 -185 249 26 -68 21 20 -165 193 -32 227
7248 227 101 -234 -20 43 51 -88 -169 -27 -167 73 -113 -88 -60 -94 -172 -73 -89 -152 -12 -169 -144 31 -6 74 139
7273 139 158 134 -130 243 -18 -115 76 -264 183 83 -12 -8 -71 -151 -91 99 -148 200 75 -228 141 0 86
7296 86 38 102 109 32 126 49 -10 133 -95 120 10 84 61 89 -225 134 145 -163 14 -43 63 47 -319 44 156
7321 156 -44 29 -40 -107 119 -115 -23 30 92 -12 -47 220 -255 -211 15 172 158 -181 -18 48 112 -51 -237 -123
7345a23L27j91Q2Q8k29Q6rj19J67ok4P6j26K27j51o9j9K29l83L6J10O7L8Pr0K4
7371B5l8p2J09l9P2J14l37k9K01j43K45j03m2J25n1RQ1l22L76j25p6L0j9j06J78
7396F3k4j61J08K8j26J11k8Q4q9L0J70k74j57K05l1o9L87k18r7j40N9K53J4k80
7420a82J41j20K47j58J30J04jm1M1k97l5J69N4j26J72k95K87k6l22K48j62K78
7442A06j87J36j14q6J6KJ43k35K18m4K67j33k01nK26j71k0j3j9L71M2l08L3K7
7466E1J5j22j33J70j60K30k6L7l58L35Jj58J4N5L5Q5j85Q9J6P2q5Q3j33P5m5J22
7492H0K4j22o6K47j34l94O22o4j81l8m9j46L14pl89J62K29P3j70K07n29M52j65
7515d4j1L9k6k0j03J54k58K64P6K2P6k68k8J92j5k9j92K12N7j42m1k52J92Q1J63
$$ plain form
7345 -123 204 13 95 183 -46 40 31 -88 79 73 49 125 -1 226 75 6 -13 216 -167 -131 -21 46 84 91 1 25
7371 25 -13 -85 24 -15 57 171 -166 -195 6 -137 108 5 -37 88 37 46 127 -195 181 56 -20 10 -9 -115 63
7396 63 39 -122 -14 14 -112 -1 -29 55 -34 -4 166 -108 -265 -60 -91 -160 227 9 -88 -228 -169 84 98 -182
7420 -182 -41 -161 86 -72 58 162 161 120 161 -136 -171 -2 52 -74 98 -197 90 64 -258 -10 -172 106
7442 106 -81 55 -59 -145 -129 -127 16 -219 -1 -45 222 89 -112 -117 109 -62 -82 -95 -114 257 299 -9 24 51
7466 51 66 -56 -189 -19 -179 51 25 62 -296 39 40 -118 -104 -49 -14 71 -114 -25 -9 63 -22 61 -72 3 -42 80
7492 80 104 -18 -84 163 29 -365 257 193 12 -26 -75 -221 93 86 -303 -141 88 161 -9 198 -331 121 -44
7515 -44 -55 -16 -42 -62 -165 -11 -269 -5 71 93 169 -99 -127 65 50 21 -171 41 98 -44 -85 -337 -145 -64 99
7540I9j83l0J39q5o0M4J4R4M9k4O9P0j61J21r4k21J40k1N3K6k14J16L58j61m32
7565b94J89M85l30m50K65J06k4J26J26k86j87K27J54n5k5j5k71L03j68R7j02J5
7587a14J09q5R9K7J94l0m3j96j50L3L70l97P0J53k51O1J84J97j99K76n11N4L22
7610A73j00j53J72M7k01J84n0o7L5j33J29J42l51K08m4K34j00K5j33N2j23n5j49
7633b58N3M40m02J02j00J63l1J31j37NL8j93K65r5j3O7q5j09n8J38Q1J16nk32
7657a19N0L56l60nJ24o4q5J18K7k17K08m6j17K50k98J96M2m16L57o3J91k52K32
7680A09k74Q0K26j53J28j79J38p6j23J19j39M06j19J58l78P2J99j98L7J05J9j53
7702DJ64o0j73l1K62k14K32j91J95L5k25j39K72n3l6J8j85K37Q1p7n7j5j7j50
$$ plain form
7540 99 -84 -114 25 -60 -120 -76 -62 32 81 57 126 196 35 156 62 -159 -19 -40 13 39 -175 -59 299 138 -294
7565 -294 -105 380 50 -400 -135 -29 -53 73 199 -87 -274 -47 107 52 27 12 -259 44 -124 -27 -129 -114
7587 -114 -5 -90 9 36 230 200 157 -39 -189 -156 214 -183 -113 40 -211 -150 34 231 32 308 -203 -149 173
7610 173 73 -80 92 139 -62 122 72 5 40 -93 36 178 -173 35 -9 225 125 150 17 69 -54 -109 -258
7633 -258 -205 235 -167 -65 -165 -2 -33 98 -39 -34 4 -189 76 -19 -32 35 -50 -159 -217 -79 2 118 113 -119
7657 -119 -69 287 -73 -78 46 -18 -103 15 42 -175 33 -13 -130 120 -178 18 60 -356 1 -62 129 -123 109
7680 109 -165 -85 141 -12 116 -63 75 -1 -124 -5 -144 262 143 301 -77 -5 194 -4 33 138 157 4
7702 4 168 108 -65 -96 166 -48 184 -7 188 223 -2 -141 131 78 42 60 -125 112 193 116 59 44 27 -123
7726a23J87L7r0k42M69j53j78J97k93K78p1r6K6j4N8L7l16K38J75j71l2j10QK56
7750G7j28J27J5q6j17J3J80k74K99j38K45l63O5K06j17M1n9J29Q4n2k48K08j86
7773g9J05J29j46m7p4K28j10m4K95j84J71j82k63K55j81K71m6l24L25J12l73J99
7795C7o3j8J48j08k8K79k67K2n4J93j84J23j26j12O0L3N4L6P9j39J79j27j34P
7819a10P3J20N0j25q4k04L03r9J11k7J06j85K87rk04q5J30Q8Rk17P7l9j7%Q2Q
7845C9K91j6l01q5R5q8K8n9K76m01M30k67N5q6K31R5l26J84P1p8k17n1pjM36j26
7871A22o8J31j40J61J44l33q8K13K4l3j73P3K8o4k40Q9J91j39J83P7j23r1q6M37
7895B95l29q4r9K22R3qr1j64J64o8L9o6n3Q1n6l3K16Q0k73R5j1m6J90k11O2P1
$$ plain form
7726 -123 64 101 11 -231 238 85 -93 104 -189 89 18 -78 -52 -66 -8 29 -287 -49 126 -45 -77 -187 -179 77
7750 77 -51 76 91 5 -112 -99 81 -193 106 -32 213 -150 -85 121 4 45 -14 115 199 147 -101 107 -79
7773 -79 26 155 9 -38 -112 116 6 -38 257 73 244 62 -201 54 -127 144 98 -226 99 211 -162 37
7795 37 -26 -44 104 -4 -32 247 -20 2 -52 141 -43 80 -46 -158 -98 -65 -11 25 104 -35 144 17 -117 -110
7819 -110 -37 83 133 8 -76 -280 23 -76 35 8 114 -71 216 207 3 -82 48 136 145 -72 5 -34 -51 -51 31 39
7845 39 330 314 13 -72 23 -65 -37 -96 180 -221 209 -58 -3 -89 142 237 -89 95 166 88 -129 -180 -187 -188 248 122
7871 122 54 185 45 206 350 17 -71 142 166 133 -40 33 61 -3 -243 -154 37 -102 81 158 35 -56 -142 295
7895 295 -34 -118 -217 5 98 90 -1 -165 -1 -69 -30 -96 -149 -68 -124 -157 59 139 -134 -39 -50 -96 94 -117 -55 16
7921A6k08K32l8m9j56L15J14j59k90J61nK40qj8k38L16m8l03J46j43J40M7j41
7944g7K3j10N2L1J88j12j50K95l85j12L05J58p5R2o5J9q9J94o9m7j56lL34l21
7968h0L36l88j07L24o3j12K14o9l9j16R5j47P8L22l33K61k28J20qk06O4J9J27
7991F4j06k03J75K0K6K29j25o6j92J39J31k0Kj03L7jO7J67l55R0l7J94k17QK37
8016A61n9j02l9J46q3R8r1N1n9J56q1j88Ln3J52K6m5OK18k89P1N2p3o4R9J03P4
8043A90k72Q3j22J7R5J41k98J39L5j01K44r9j38J82j03j13L4P1K1k9m1q3j8J04
8067f1J28q2J06j20K76k29J58k9m5l32L32j76L03j99m0N1l2Jo5J24L5k53J20J74
8091A45j67J06l23L7P0L91k71J94l7n4l7j17m7J30J91l38P8m6J38L6j69J30J08
$$ plain form
7921 16 -192 40 2 -47 -203 112 226 67 -223 -62 -67 173 165 147 -91 225 177 -126 20 -123 17 64 -77
7944 -77 -54 -164 -112 -81 107 -5 -155 140 -245 -357 -52 106 31 123 58 77 -12 182 113 66 -90 -93 241 -80
7968 -80 256 -132 -239 85 22 -90 124 55 16 -100 -5 -152 -74 248 -85 176 -52 68 60 -146 -82 -63 64
7991 64 -42 -245 -70 -50 -24 205 80 14 -178 -39 92 72 74 -29 8 7 74 241 -114 -24 -61 133 -84 -76 161
8016 161 102 0 -39 107 24 122 31 82 23 179 98 -90 -87 -140 12 38 -7 -1 217 -72 -1 51 -22 -86 13 116 190
8043 190 -82 1 -121 -104 -9 132 -166 -27 8 -93 151 52 -86 96 -7 -120 -86 -15 6 -23 -64 -147 -165 -61
8067 -61 67 -15 91 -29 247 18 176 147 102 -230 102 -74 229 30 -10 41 9 10 -55 69 104 -149 -29 145
8091 145 -22 84 -239 -202 -132 259 -12 182 145 91 54 -63 -110 20 211 -127 -49 -95 43 79 -90 40 148
8114A48j28J9j27K06j12Q4j80K31q1j11O3J44m76L43M6J64k57n7K31k25p7K98
8136A46j82m6K07l64K08k9J65j41J22k38R5K34q9pn2k01J98q9J20j20K52L5l14
8159i0J9n8K40k08J36l13K56kK08j38j85K94l23L72k45J57j76L3n4m9J52jP0m25
8183c30L69O9k03K43l04m5qM39
$$ plain form
8114 148 20 39 -88 118 6 90 -90 141 60 -51 12 156 -320 23 69 233 -24 -81 150 -75 -152 146
8136 146 -36 -82 125 -239 -31 -60 105 -36 86 -152 -57 177 88 81 29 -172 26 -63 57 -63 189 224 -90
8159 -90 -71 -129 111 -97 39 -274 -18 -20 188 50 -135 159 -164 208 -37 120 -56 -23 -77 -126 26 25 95 -330
8183 -330 39 108 -95 148 -156 -201 -209 230
8191B30
$$ Imaginary data points
##PAGE= N=2
##DATA TABLE= (X++(I..I)), XYDATA
0@%%%%%%%%%%qJ6j6J6k4L2m0M8n6P2q8J04j20J44j71J96k28K67l09L55m07M66
32B49n30N98o75P61q55R60j074J197j334J484j645J822k017K229k461K715k992
49a568L294l628L997m405M860n368N937o583P325q183R188j0390J1854j3679J6034
64H685j9200K3702l0669M2977p1138K55289J02636l04699R1697j2354J52176l3172
76B05930k42770j3641J64150M4482n6410j78131K1165J54749N2062r7359j31695
87g7468L8912J44754J9260j21926r8816O8114J11108J9723j34556p1731J01779
98h47J14570j2242j02461m5041J13094J10508l7983j05497l1783J29669P4044
109B06031p4310r6807l1853J28442N9254j03422r1888J2095J19412M8464j15163
$$ plain form
0 0 0 0 0 0 0 0 0 0 0 0 -8 8 -8 8 -16 16 -24 24 -32 40 -48 56 -64 80 -91 105 -123 144 -165 190 -217 249
32 249 -281 317 -358 403 -452 508 -566 631 -703 781 -864 958 -1059 1170 -1291 1424 -1568
49 -1568 1726 -1902 2095 -2310 2550 -2818 3119 -3464 3861 -4322 4866 -5524 6330 -7349 8685
64 8685 -10515 13187 -17482 25495 -45643 209646 312282 7583 99280 86926 239102 205930
76 205930 -36840 -50481 113669 158151 101741 -76390 -55225 99524 151586 54227 -77468
87 -77468 -38556 106198 125458 3532 -95284 -27170 83938 103661 -30895 -102626 -847
98 -847 113723 101481 -980 -46021 67073 177581 139598 34101 2318 131987 206031
109 206031 131721 34914 3061 131503 190757 87335 -4553 7542 126954 175418 60255
120F0255q0075M7840J10191L5622j35042o3734P1195Q2704K574j34222n0400Q2784
132B9692P9194l2045j25193j9627J06561O1172m4555r3076l524J23599M0342o6449
144E6091p5603J3499J13505J7094r0078o9374M0215Q3362j038q7979n6365O0279
156C608P8278j6222q7031k6744O7593P1033l1710p9354j4378O1719O5699n8722
168C3769p2110P393N2266N3700n2915p8022L0729P2930J9263l7217n9027L0849
180A608Q2026O808n4724m7242M4091O2737q118o6790l6052M3864N1082j5797p6119
193a2626j3961N3987L5847k4103o1718j0661O6423L0629n3508l7605k268N1570
205B2006K4042n8873l8517J5802M9614M961n1101k6625L2326L7440O916l8755
$$ plain form
120 60255 -19820 28020 138211 173833 38791 -24943 46252 128956 131530 -2692 -53092 29692
132 29692 108886 76841 -48352 -67979 38582 99754 55199 -37877 -41401 82198 122540 56091
144 56091 -19512 -6013 107492 124586 34508 -34866 5349 88711 87673 -306 -56671 3608
156 3608 81886 65664 -21367 -48111 19482 90515 58805 -20549 -34927 26792 92491 33769
168 33769 -38341 -30948 21318 75018 22103 -55919 -25190 47740 67003 29786 -29241 1608
180 1608 83634 90442 35718 -11524 32567 95304 87186 20396 -15656 28208 79290 63493 -12626
193 -12626 -26587 27400 63247 39144 -22574 -33235 33188 63817 10309 -27296 -29564 22006
205 22006 46048 -12825 -51342 -35540 14074 19035 -32066 -58691 -26365 11075 17991 -20764
217b0764k3818M8116L1296q361k7758r280L1679L2083j3987l9931P793K5520J6682
230D9270j3175l0359P59L1813J3794k4940j8147K920K8588L560k1531k0495J397
243C454L0633p157k9104j0316Q204J2476L846l0049j4183K9447N117m514j4870
256a7016o490K0370J3649j1423j2581L901J3326R849j8290r76L012M097J2314
269A3742j7667k505J4170l179n09M200j0867R789N097j3049R808m539p58j307
283B426m337N666k683o752j490l83L658O118j7584J848J0866p77L110j0137j160
298a1611J1281J0871j0154r103N978J0604O901r063r994K011K1270j571j2300
311E120o326J700J9656m03j5611j2517J1196J6478l645k1673n919J0678J1984
$$ plain form
217 -20764 -44582 3534 34830 26469 -1289 -10569 21110 53193 39206 -725 7068 32588 49270
230 49270 36095 5736 6495 38308 52102 27162 9015 11935 40523 44083 22552 2057 3454
243 3454 34087 26930 -2174 -12490 -4286 8190 12036 -18013 -32196 -2749 2368 -2146 -17016
256 -17016 -23506 -3136 10513 -910 -13491 -9590 3736 13585 -4705 -5681 -2669 1428 13742
269 13742 -3925 -6430 7740 4561 4052 8252 -2615 7174 12271 -778 9030 4491 3733 2426
283 2426 -1911 3755 1072 -5680 -7170 -7553 -3895 2223 -15361 -13513 -2647 -3424 -314 -10451 -11611
298 -11611 -330 10541 387 -8716 -2738 7866 14767 5704 -4290 -2279 18991 17420 5120
311 5120 -1206 494 20150 19747 4136 -8381 2815 19293 15648 -6025 -11944 -1266 10718
324A0718L860l4813m633K4157N641n828k5547j0632L0365J5507k5972j8041k061
337c7279L1042J6413l1300j6632P001L5208J2245l7120j8518K7327K5676K842
349A6905l2018k6492M2075K4767j6763k7562j4748L5003L0309k4641l5330L652
361b4843L2365K6144l2451l2406J3063K8291K1332l6881l4620K2374L2957K254
373A7579l0838l0869K2457M3638p749l4742k1209L1213L8897j0479l8398j6450
385c6950L9363L3715j9393m5478m494L9404K6943k5352n0348M835M8408J9071
397B9724m0886l7341J2202M8444J6505n1381l4883K7235M8495n001m9162k9003
409f5052L1110N1441j9479n5498j1460M3629L8632k0549n4040L037N3890K9892
$$ plain form
324 10718 14578 -20235 -24868 -711 4930 -898 -26445 -37077 -6712 8795 -17177 -35218 -37279
337 -37279 -6237 10176 -21124 -37756 -30755 4453 16698 -20422 -38940 -11613 14063 16905
349 16905 -15113 -41605 470 25237 8474 -19088 -33836 1167 31476 6835 -28495 -24843
361 -24843 7522 33666 1215 -31191 -18128 10163 31495 -5386 -40006 -17632 15325 17579
373 17579 -13259 -44128 -21671 21967 14218 -20524 -41733 -10520 28377 17898 -20500 -36950
385 -36950 2413 36128 16735 -28743 -33237 6167 33110 7758 -42590 -37755 10653 29724
397 29724 -11162 -48503 -36301 12143 28648 -22733 -57616 -30381 18114 13113 -36049 -65052
409 -65052 -33942 17499 -1980 -57478 -68938 -25309 13323 -7226 -61266 -58229 -4339 25553
421B5553k6295n3992K1448N5336J2018k9390m8684K0619O2313k057m7453k3043
433c3627J9139N4486L0n7316j6089L4592M4880j3300n1765j5501M0503L4795k4360
446A6467n2271j4442N0069K3131l5475m4278o267M9769K9597m5684m2517K0773
458e1128M3948K5479m6643m1474L4486M7028J1709n5397l3659M4483M4090o004
470A6918n0147k9941N3998M9943k9393m4834j0219N4937M2418l5872m8679L025
482b7846N8010K2270m4665m7326J4841N1848P929n0571m1109K6960M8754j349
494A7746n1243k3199L0063M8192n761n7843o270L6553L4498j3202n2060q075M3784
507f817K8974k7476m2179Q31M6156K4010k8665m0517J4447M9847J3499l0640l9400
$$ plain form
421 25553 -742 -54734 -33286 22050 34068 4678 -44006 -23387 38926 36869 -10584 -33627
433 -33627 -14488 39998 40028 -17288 -33377 1215 46095 32795 -18970 -34471 6032 40827 16467
446 16467 -35804 -50246 -177 22954 -12521 -56799 -63066 -13297 16300 -29384 -71901 -51128
458 -51128 -7180 18299 -28344 -69818 -35332 11696 23405 -31992 -65651 -21168 22922 16918
470 16918 -33229 -63170 -9172 40771 11378 -33456 -43675 11262 53680 17808 -30871 -27846
482 -27846 30164 52434 7769 -39557 -24716 27132 35061 -15510 -56619 -29659 19095 17746
494 17746 -33497 -56696 -26633 21559 15798 -42045 -48315 -11762 22736 9534 -42526 -50601 -6817
507 -6817 22157 -5319 -47498 -46667 -511 23499 -5166 -45683 -31236 18611 32110 1470 -37930
520c7930K2263M4080K016l6496l8094K7745M3414j4566m1472j9637K5106M5165
532B1594j7568m6944p19L1874L5009k1662m2319L338M0902K2509l3167l5348J0280
545c2221L9674J0640l3009l0641J9996M1122K361l5994j8860L1297L0631k6l6949
558a1979j7577L7395K3713j5870l4309r078K8469K2354k4750l5183J076L0683
570e056J4875k6710k4497M029L2331J1728k9720k2293J5472K9399j783k2920k2326
583d7471J5342L3695q468k8707p369J9689K6599l875l1112K380K6166K0848p567
596A0150l0360Q232K5230J2212j3084k9656P261L1289j633k1883j3842K193K9165
609A5274J025k7649r386J2822K0137l817k2469r269J7654J1384p112k1455p837
$$ plain form
520 -37930 -15667 28413 30429 -6067 -44161 -16416 26998 12432 -29040 -48677 -23571 21594
532 21594 4026 -42918 -43637 -11763 23246 1584 -40735 -37397 3505 26014 -7153 -42501 -32221
545 -32221 7453 18093 -14916 -45557 -25561 15561 17922 -18072 -36932 -5635 24996 24970 -11979
558 -11979 -29556 7839 31552 15682 -18627 -27705 764 23118 -1632 -36815 -35739 -5056
570 -5056 9819 -16891 -41388 -37359 -5028 6700 -23020 -45313 -29841 -442 -2225 -25145 -47471
583 -47471 -32129 1566 -6902 -35609 -42978 -23289 3310 -565 -31677 -29297 -3131 17717 10150
596 10150 -20210 -11978 13252 25464 12380 -17276 -10015 21274 19641 -2242 -16084 -13891 15274
609 15274 16299 -11350 -20736 -7914 12223 8406 -14063 -23332 -5678 5706 -1406 -22861 -30698
622c0698K0214N290j0004j3828l809J6225J1969j5312r250Q510Q753J2153j0499
635a0286j1079R524J0828K908r204p030M909J1179j322p573p702P875J2373n846
649d46n727k635N699R634j785j2290J905Q067j74j25j0557j167P493J538n858
664f428m762K701M439J029l551O00N85O634r08l415M666j571J515L72o60m17J584
681B413k272k356M361K49l031k419M614l41K627l054n918Q144J683k656m917j246
697d119L674L523n296n624r03O038N623j1893j304L289L526Q162r530p297J0350
712a781O518j535k100j0270Q647J2065o643n160o647Q941J1636p548q699n27O440
727C337J3679o526j8060Q409P208P651l824k1291O390J6495J79r655j3519K474
$$ plain form
622 -30698 -10484 -5194 -15198 -29026 -32835 -16610 -4641 -19953 -29203 -20693 -11940 213 -10286
635 -10286 -21365 -11841 -1013 1895 -7309 -14339 -9430 1749 427 -7146 -14848 -6973 5400 -446
649 -446 -6173 -8808 -3109 6525 4740 -7550 -5645 2422 2248 2123 -8434 -9601 -2108 -570 -6428
664 -6428 -11190 -8489 -4050 -3021 -6572 -5972 -5387 1247 339 -3076 1590 19 1534 1906 1246 829 2413
681 2413 141 -2215 2146 2395 -636 -3055 1559 1218 3845 791 -5127 3017 4700 2044 -2873 -4119
697 -4119 -445 3078 -2218 -7842 -8745 -2707 2916 -8977 -10281 -6992 -3466 4696 -4834 -12131 -1781
712 -1781 4737 3202 1102 -9168 -521 11544 4901 -259 -6906 2035 13671 6123 -2576 -3103 3337
727 3337 17016 10490 -7570 839 8047 15698 11874 -9417 -3027 13468 13647 3992 -9527 -7053
741g053K1674j926j5954q854O804K2907o053j8713m000J2171J7822n390k4349
754a0914o79K1623Q424q419k1326J330K2905Q388j5619j9564R329K0867M296j7990
768B651j5441R988K3346p77k3235q699J2174K1234n558k2216q429J6222K0185
781B1445j1077k2250k273J8008J5232q342k7250J775K7060O719j1669k2858L469
794a2011K8251P770k0909j9518J0102K7796M074k7748j2462J2285K7570J475l4510
807g835q321K2717K0289n863k9145j1038L1000J9049j8934k4927l422L1364J4158
820B9092k3493k4967N864L1336Q687k8428k0675J5623K5260O477l0542j8755K4626
833A05K4339n124k8528r888K2549K5229j1887l0346j917K6294J8567j6906k6310
$$ plain form
741 -7053 14621 12695 -3259 -12113 -5309 17598 11545 -7168 -11168 1003 18825 13435 -10914
754 -10914 -11593 10030 18454 10035 -11291 -9961 12944 21332 5713 -13851 -4522 16345 20641 2651
768 2651 -12790 -2802 20544 19767 -3468 -12167 7 21241 15683 -6533 -14962 1260 21445
781 21445 10368 -11882 -14155 3853 19085 10743 -16507 -14732 12328 19047 7378 -15480 -12011
794 -12011 16240 24010 3101 -16417 -6315 21481 25555 -2193 -14655 -2370 25200 26675 -7835
807 -7835 -16156 6561 26850 20987 -8158 -19196 11804 30853 11919 -13008 -16430 14934 29092
820 29092 5599 -19368 -13504 17832 26519 -1909 -22584 -6961 18299 24776 -5766 -24521 105
833 105 24444 19320 -9208 -19096 3453 28682 16795 -13551 -15468 10826 29393 12487 -13823
846a3823N9L0364J3309k0746k5080O093L1618M802k1102k2887R723L2404J006
859B5740k9754j5174J5723K5217J105l3656j3310K4591K3134p691l1519o192K5764
872C978K3572j5675k9611n85L0030J9028k3653k5621O043L0452J2732k6956k6054
885b2320J7450K9526R31k4644k2982K1730L0140o621k9200j2796K4731K3169j0043
898A9071l0341o701K6593K0498j8294k7470J637K5178J6290k1003k4458N127K9866
911A5993R097k4612j7547Q001K8203N824k6797j5808J5694K3979K13k6675j3189
924a7624K1130K0808l352k9342p120K6188J4778q430k6513l866K7346J4357j9573
937H787k2857L580K4426J0494k2859k1434Q665K7200P32k4160j4425J2598K5783
$$ plain form
846 -13823 -13764 16600 29909 9163 -15917 -9824 21794 26596 5494 -17393 -7670 24734 25740
859 25740 -4014 -19188 -3465 21752 22857 -10799 -24109 482 23616 15925 -15594 -21786 3978
872 3978 27550 11875 -17736 -18321 11709 30737 7084 -18537 -12494 17958 30690 3734 -22320
885 -22320 -4870 24656 25587 943 -22039 -309 29831 23210 -5990 -18786 5945 29114 19071
898 19071 -11270 -17971 8622 29120 10826 -16644 -15007 10171 26461 5458 -19000 -13873 15993
911 15993 25090 478 -17069 -9068 19135 24959 -1838 -17646 -1952 22027 22240 -4435 -17624
924 -17624 3506 24314 20962 -8380 -15500 10688 25466 17036 -9477 -13343 14003 28360 8787
937 8787 -14070 -10490 13936 24430 1571 -19863 -11198 16002 16734 -7426 -21851 -9253 16530
950A6530m352k3478j1002J9112K1884r773k2488l885K0162J6505j0402k4798L642
963a2343K2072R840j2893j8638M871K1181J0115k0258j3999J1104J6183O019j9896
976C358j3926J4008J6197k259j8318j2568J7429J4023q459j3754j2864J9815J5592
989A8274j5983j2815l281J4191J5170j4849j8672O431J4420Q606j4410j6535R283
1002a0170J5120N718j6513j2640J2135J6229j691j4080p248J0187J8145o777j5875
1015g460j338J1096J1909p029j5841P49J3873N068o960j5344M240J3481J65n961
1029F48j3017M418J5464k875r217n269K328J2397L64j3538j108M520R165j110
1043C170j0862o31N847Q645k769r660p0Q741L873k314p600j555J0020K425m687
$$ plain form
950 16530 12178 -11300 -22302 -3190 18694 8921 -13567 -17452 2710 19215 8813 -15985 -12343
963 -12343 9729 19569 6676 -11962 -7091 14090 24205 3947 -10052 1052 17235 23254 3358
976 3358 -10568 3440 19637 17378 -940 -13508 3921 17944 9485 -4269 -17133 2682 18274
989 18274 2291 -10524 -13805 386 15556 707 -17965 -11534 2886 11492 -2918 -19453 -10170
1002 -10170 4950 10668 -5845 -18485 -6350 9879 8188 -5892 -13140 -2953 15192 8415 -7460
1015 -7460 -8798 2298 14207 7178 -8663 -7914 5959 11027 4067 -11277 -7037 6444 6609 648
1029 648 -12369 -7951 7513 4638 -4579 -9848 -7520 4877 5241 -8297 -9405 -4885 4280 3170
1043 3170 -7692 -8323 -2476 6169 3400 -6260 -6330 2411 6284 3970 -3630 -5185 4835 7260 2573
1058B573o880J903O897O91l989o096K161O822K18p940q42J781L319J935q677k97
1074f421M807N00j419k835j829M118J634l219m16k110N185o81l141K893j953K048
1090b839K415l406L48M296l405K580Q57k737L617j774J22J967r88j73n91m75K181
1107A995m27k535J767k251K709Q39m898J356J549m15N29j353l419M538P78k334
1123a572j584j753L719J688j688l166l97M454L015m480k653J969J949M906n139
1138g32n332M376M627O0n241l400K974P537k243p108k317O544N249l464o519k641
1154g630R443M659o475q021J695R615J503o603p835L437J0284Q40j1152l797O711
1169c326O593J788j1776l996J0085P072l911r170k229Q853P678o556q571q83J0265
$$ plain form
1058 2573 -4307 -2404 4493 5184 1195 -4901 -2740 4082 4300 -3640 -4482 -2701 618 2553 -6124 -6421
1074 -6421 -1614 -1114 -2533 -5368 -7197 -3079 -1445 -4664 -5080 -7190 -2005 -2686 -5827 -2934 -4887 -2839
1090 -2839 -424 -3830 -3482 814 -2591 -11 846 -1891 1726 -48 74 2041 1053 880 289 -186 1995
1107 1995 1568 -967 800 -1451 1258 2097 -2801 -1445 104 -311 218 -1135 -4554 -16 762 -1572
1123 -1572 -3156 -4909 -1190 498 -1190 -4356 -4753 -299 2716 -1764 -4417 -2448 -499 4407 -732
1138 -732 -6064 -1688 2939 2999 -2242 -5642 -2668 4869 2626 -4482 -6799 -255 4994 1530 -4989 -7630
1154 -7630 1813 6472 -3 -8024 -6329 3286 4789 -1814 -9649 -6212 4072 4912 -6240 -10037 -3326
1169 -3326 3267 5055 -6721 -10717 -632 6440 2529 -6641 -8870 -17 7661 1105 -7466 -8349 1916
1184A916O025q661p169J224R893M940q662r689O664Q955J238o968j0750P321J1378
1199G655j644j0354o844Q118J1247l134j2770l102Q599J2243o857j3851J191R999
1213D96R565p953j4281J862J5685L685j1042j0940L527J5815K345j3183j0518
1226a4937R423J3965j680j3571p381J1605J2506l790j6118k698J3502R094p066
1239B854j3935n52J3395R718j1910j2534M433J2776O010j1518j2293O016J5557
1252H017M46j2582q914P198J4609j911j3510p686J1016J3357m393j5037l384J1901
1266h73J0975m185j7579L77J4850P310p881j4339N61J6465O934j3369j1320L784
1280h290J6807L370j5484q910O963J6428q2j7286p090J2128J2188k616j6015o341
$$ plain form
1184 1916 7941 -720 -7889 -6665 3228 8168 -494 -10183 -3519 5436 6674 -294 -11044 -3723 7655
1199 7655 6011 -4343 -11187 -3069 8178 5044 -7726 -10828 -2229 10014 3157 -10694 -9503 496
1213 496 10061 2108 -12173 -10311 5374 9059 -1983 -12923 -9396 6419 8764 -4419 -14937
1226 -14937 -5514 8451 6771 -6800 -14181 -2576 9930 6140 -9978 -12676 826 9920 2854
1239 2854 -11081 -11633 1762 11480 -430 -12964 -8531 4245 10255 -1263 -13556 -7540 8017
1252 8017 8463 -4119 -13033 -5835 8774 6863 -6647 -14333 -3317 10040 5647 -9390 -12774 -873
1266 -873 10102 5917 -11662 -11285 3565 10875 2994 -11345 -10784 5681 12615 -754 -12074 -8290
1280 -8290 8517 11887 -3597 -12507 -5544 10884 10802 -6484 -13574 -1446 10742 8126 -7889 -14230
1294a4230J5907J0155p852j4231j064J4411R373j0294j5067M509J4081N777j2530
1307a055j2164O699J3619K926j3689j0169R307J4060k550j1989p444Q931J4762
1320A1244n122j3752l364J0688J0801n598j3424k564J3898Q673q800j3254K362
1333h212J2404P075r946j2818N701J2939M584j2866r429P191J2479J449j4071
1346c520q011J0874J2158m445j2026n033J1300J1900p436j2749o00J2520P136
1359A2068p700j2159J906J2936M087r503j1325N854J1380M02r073q505N650J2893
1373H911j928j1718k411N069J1396k296j3326NO738Q341m102j2188R52Q834M533
1388F810l555j1336N98J3370J72n139p152M61J2737J174r755m934L915Q348J705
$$ plain form
1294 -14230 1677 11832 3980 -10251 -11315 3096 12469 2175 -12892 -8383 5698 11475 -1055
1307 -1055 -13219 -6520 7099 10025 -3664 -13833 -4526 9534 6984 -5005 -12449 -3518 11244
1320 11244 6122 -7630 -10994 -306 10495 4897 -8527 -11091 2807 11480 2680 -10574 -8212
1333 -8212 4192 11267 1321 -11497 -5796 7143 11727 -1139 -10568 -3377 9102 10551 -3520
1346 -3520 -11531 -657 11501 7056 -4970 -10003 1297 13197 5761 -6988 -7588 4932 12068
1359 12068 4368 -7791 -5885 7051 11138 1635 -9690 -3836 7544 7946 -1127 -9632 -3982 8911
1373 8911 6983 -4735 -7146 -2077 9319 7023 -6303 -6298 440 8781 4679 -7509 -6557 2277 6810
1388 6810 3255 -8081 -7483 5887 6059 920 -6232 -5771 6966 8140 -1615 -6549 -2634 5714 7419
1403G419j0737m708O722P315k18j0693k617Q980N832l213p343k524R829O129p618
1418B555n344j06P643M496p270o432K360Q279R50o967m348M162O061J553p556
1433C6l262O348L206r6o739k485N621K879k404o332j494N670K210l771l184j529
1449e326N444L731n578j684L90M177K459l957l722K518L778j11l084l095L478
1464e82K570R7k640k145M108K910j386j595K5J566L349j887k907J934O6Q71j700
1481B654j980M55J106j09j175o86Q14J016j481J179o48pJ198j190r3L93m63j565
1499e82J385q13m51P38j800R69J565l43p51J071N22J830J23j522J065O49J441
1516E096j176k252J226M66R8j2k414o05M055j316r23l17j258L647Q08k791j405
$$ plain form
1403 7419 -3318 -8026 -1304 6011 5793 -4900 -7517 1463 7295 4082 -3261 -5785 4044 10173 2555
1418 2555 -2789 -2895 4748 9244 1974 -4458 -2098 6181 7131 164 -4184 -22 6039 7592 36
1433 36 -3226 3122 6328 6232 -507 -2992 2629 5508 3104 -3228 -4722 948 3158 -613 -3797 -5326
1449 -5326 118 3849 -1729 -3413 -3023 1154 3613 -344 -4066 -1548 2230 2119 -965 -4060 -582
1464 -582 1988 2085 -555 -2700 1408 4318 2932 1337 1362 2928 6277 4390 1483 3417 3483 4354 2654
1481 2654 674 1129 2235 2126 951 265 1079 2095 614 1793 1145 1138 2336 1146 1053 1446 983 -582
1499 -582 803 -10 -461 277 -1523 -554 1011 668 -83 988 1510 3340 3463 1941 3006 3655 5096
1516 5096 3920 1668 2894 3360 3458 3446 1032 427 4482 3166 2243 1926 668 4315 5123 2332 927
1533I27J025J367Q72l762j604J631R55J035m780j081L513J869p66k408j522M635
1549A906M281l805k682M85M018K535l529m245J394N371K20m330l908L508N279
1564F498q9m412l403N351N242k389n471j121M775M557l265q017J411N526K310
1579G503m835n400O55O786K437o562m005L001P063K08n944l793L613O755j132
1594F350p368k708N467M288r55p133l106P454M955l193o842k09P006M974m024
1609D956p965J271P710L419o495o852J871Q161K145q447n865M217R053l43p901
1624a065m220N690R361k448r735k139Q284N838l321r576j771J0642L857o127q354
1639e084J548R487M147p964o772L407R263K719j0194m471M879P449Q69j0160n378
$$ plain form
1533 927 1952 3319 4191 429 -1175 456 1411 2446 -2334 -3415 98 1967 1201 -1207 -2729 1906
1549 1906 6187 2382 -300 185 4203 6738 3209 -1036 358 5729 5949 1619 -2289 1219 6498
1564 6498 6409 1997 -1406 3945 9187 6798 1327 206 4981 9538 6273 -1744 -333 5193 7503
1579 7503 2668 -2732 -2077 4709 7146 584 -3421 -420 6643 6851 907 -2886 727 7482 6350
1594 6350 -1018 -3726 1741 6029 5074 -2059 -5165 2289 7244 4051 -2791 -3000 4006 8980 4956
1609 4956 -3009 -1738 5972 9391 2896 -3956 -2085 6076 8221 -226 -6091 -1874 7179 6836 -1065
1624 -1065 -5285 405 9766 7318 -2417 -4556 3728 9566 6245 -3331 -5102 5540 9397 3270 -5084
1639 -5084 -3536 5951 10098 2134 -4638 -1231 8032 10751 557 -3914 965 8414 9283 -877 -6255
1654f255Q014O684l432p396m975Q749O978m910p895k303R231O234o569p873Q54
1669d864Q547N242q098r067M854P595L163p688q579O367R928k97r040m871O560
1684b48R968k502r552l399Q321Q720n591r604j187R107O330o627j0314J541J0321
1699E284L472p593q610L367R895J990r603p025O127Q496o02r483n024O380Q769
1714E840l059r792j799P306P826m522q884o3Q327O554n908q629K165Q556M221
1729H139n588r498L925J0012M04o253p149M047J0187m77q956m613N311Q730j954
1744F267r941k388O029P530l017j1354K17Q070L982m407q937K36R931L090p734
1759b426o545K237R219J827p790n972M898Q640k55q479m013P034O213q54q536
$$ plain form
1654 -6255 1759 8443 5011 -2385 -7360 1389 8367 3457 -4438 -6741 2490 8724 2155 -5718 -4864
1669 -4864 3683 8925 827 -8240 -3386 4209 7372 -316 -8895 -2528 7400 7103 -1937 -6808 -248
1684 -248 9720 7218 -2334 -5733 2588 11308 5717 -3887 -5074 4033 10363 3736 -6578 -5037 5284
1699 5284 8756 1163 -7447 -4080 5815 7805 -1798 -8823 -2696 5800 5198 -4285 -9309 -2929 5840
1714 5840 2781 -7011 -8810 -1504 6322 1800 -7084 -7147 1180 7734 1826 -6803 -4638 3918 8139
1729 8139 2551 -6947 -3022 6990 7394 1141 -6008 -1961 8226 7749 -1207 -5820 -509 8221 6267
1744 6267 -3674 -6062 -33 7497 4480 -6874 -6657 1413 5395 988 -7949 -7713 2218 5308 -2426
1759 -2426 -8971 -6734 2485 4312 -3478 -9450 -4552 4088 3833 -4646 -8659 -1625 4588 3734 -4802
1774d802k841Q116N672l837p107p65O703N700n178p250J196P428L198o049n166
1789d982J397P736J611o628m475L185O484J19o434m243M698O433j111p581k088
1804e879N831M512j314p059q66O319L671l618n916N31N939L083n370n200J491
1819c845O210J341o072l518K237N909M38n717l376M610M880k081l717l171M442
1834a430M816l044m920m56M090L250k595m927J243M093K875l189l995K688L471
1849A970J916l171l762K212M393n76l595j910J131M441q91m172j379L272K359
1864B238r08l262j319M105J677j465l464k40L603N27k296k271K51K544J287l271
1880b264j300K039J814Q51k040r92J394K969j358j443K03M70J610j136j988L10
$$ plain form
1774 -4802 -7643 473 6145 2308 -4799 -5564 1139 6839 1661 -5589 -4393 3035 6233 184 -4982
1789 -4982 -3585 4151 5762 -866 -5341 -2156 4328 4447 -1987 -6230 -1532 4901 3790 -3791 -5879
1804 -5879 -48 4464 3150 -3909 -4775 1544 5215 1597 -4319 -3788 2151 5234 -136 -5336 -3845
1819 -3845 2365 3706 -2366 -5884 -3647 2262 2700 -3017 -6393 -1783 3097 1016 -2701 -5872 -1430
1834 -1430 3386 342 -4578 -5034 -944 2306 -289 -5216 -3973 120 2995 -194 -4189 -1501 1970
1849 1970 3886 715 -3047 -835 3558 2982 -613 -2523 -1392 3049 2158 -2014 -3393 -121 2238
1864 2238 1330 -1932 -3251 854 2531 1066 -2398 -2638 965 1492 -804 -3075 -2824 -280 1007 -2264
1880 -2264 -3564 -1525 289 1140 -900 -1892 -498 2471 1113 -330 -127 343 1953 817 -1171 -861
1896h61J038k5p45r19J61R79k52N03j483P44J243j204P24m95p09R49j54j269O16
1915a159n48k30K94m40P35l12K54P37K63L82Q18p19R05Q40j385J192p59o35J443
1934A676j040q46N36l99N88M59j393L98N93Q80L79j958O41M43M73k16k243p63
1952a792K179j69j824n41r56K621M20j976q25J230L019L7j949j361K328K288n47
1969B182k989r41K947P01j099k966r4L179J600k818k292J523L230J028l196j614
1985a619J127L662k56m227j175J998K202r90l577j503L380K390j918k508o73M092
2001D05K207j709k922J42L864J733k909l401R61L301K110m633l187K868L054J089
2017B973l774k967L102M699p82l983k394L392M687k652m398k225L824M371l969
$$ plain form
1896 -861 177 152 -593 -1512 -1351 -372 -624 -121 -1604 -860 383 -821 -97 -592 -1301 -352 -506 -1775 -1159
1915 -1159 -1707 -1937 -1643 -2083 -1348 -1660 -1406 -669 -406 -24 794 75 980 1820 435 1627 868 233 1676
1934 1676 636 -210 326 -73 515 974 -419 -21 572 1452 1831 -127 514 957 1430 1214 -1029 -1792
1952 -1792 387 218 -1606 -2147 -3103 -482 -62 -2038 -2863 -1633 1386 1423 -526 -1887 441 2729 2182
1969 2182 -807 -1748 1199 1900 801 -2165 -2259 920 2520 -298 -2590 -1067 2163 3191 -5 -1619
1985 -1619 -492 3170 2914 -1313 -2488 -490 1712 722 -2855 -4358 -978 1412 -506 -3014 -3687 405
2001 405 2612 903 -2019 -1877 1987 3720 811 -2590 -1629 1672 3782 -851 -4038 -1170 1884 2973
2017 2973 -801 -3768 -666 4033 3251 -732 -3126 266 4953 2301 -2097 -4322 -498 3873 -96
2032i6m868N90M194K495k816n908K540N735Q90l441m277K758N558J33n048l110
2048d671L310N207j370n486j142K880N417j785o187N18M742L092j665n303l81
2063b824N921J900l751n046N26N495P79m238m442J707N567J47n097k971L126M944
2079A743Q33o244k439M175N110j903n637j113M066M835l228n769K72N878L149
2094C728l233m948Q15P188J876m547m426K534O309J61n415l987L450N299j68p155
2110b519j918M557L484p64o126j537N936K986k987m959n86N481K990m637m474
2125e073L09N638J610n172l242J710N105J304n219l112L724M740j37m199k951
2140d965M137M528j277n390j740N244L306k107n324o11N114L637m085m357O58
$$ plain form
2032 -96 -4964 -4374 -180 2315 -501 -6409 -3869 1866 2756 -685 -4962 -2204 3354 3487 -1561 -4671
2048 -4671 -1361 3846 2476 -3010 -4152 -1272 4145 2360 -3827 -3309 1433 4525 2860 -2443 -2824
2063 -2824 3097 4997 1246 -3800 -3274 2221 3000 -1238 -5680 -3973 1594 1741 -3356 -6327 -3201 1743
2079 1743 2576 -3668 -6107 -1932 3178 1275 -4362 -5475 -1409 3426 198 -5571 -5299 579 3728
2094 3728 495 -4453 -3638 3550 5426 879 -3547 -1013 5296 5457 42 -3945 -495 4804 4636 -2519
2110 -2519 -4437 120 3604 2840 -3286 -4823 1113 4099 1112 -3847 -4433 1048 4038 -599 -5073
2125 -5073 -4764 874 2484 -2688 -5930 -4220 885 2189 -3030 -6142 -2418 2322 2185 -2014 -4965
2140 -4965 -828 3700 2423 -2967 -4707 537 3843 1736 -3588 -4199 915 4552 467 -3890 -3232
2155c232N172K426l984m536J592N807K95m598l265K588M692m5n177k790M569L947
2171C461j507m698j451M806L611k097m763N6M420K864l507l885P20M130K417m504
2187G3l964K507L500R13l874l140K444M541j068l387k627K825L919j453m066j711
2203d568L296L535k163l973J78K953K604j967m145J498L556J501k342k936J031
2218a942L831J570l747j899J966L479P1l645j272K353L218j062l353j021L308
2233A855J470q82k843j106L443J404k316k444L43K572P75k043k666J100K394P01
2249A757k413j841J329J718O78k621p56J680K286q40j764m81J141K356q77k015
2265f63q0J639J409r04j830m19K651L67j156j730O19J752K58j447j355J147J375
$$ plain form
2155 -3232 1940 4366 382 -4154 -2562 3245 3540 -1058 -4323 -1735 2957 2912 -2265 -5055 -486 3461
2171 3461 1954 -2744 -4195 611 4222 2125 -2638 -2582 1838 4702 1195 -2690 -1970 2160 4577 73
2187 73 -3891 -1384 2116 3029 -845 -3985 -1541 3000 1932 -1455 -4082 -1257 2662 1209 -2857 -4568
2203 -4568 -1272 2263 100 -3873 -3695 -742 1862 -105 -4250 -2752 804 2305 -37 -2973 -1942
2218 -1942 1889 3459 -288 -2187 -221 3258 3329 -316 -1588 765 3983 2921 -432 -1453 1855
2233 1855 3325 2443 -400 -1506 1937 3341 1025 -1419 -1076 1496 2271 228 -2438 -1338 1056 1757
2249 1757 -656 -2497 -1168 550 1228 -1393 -2149 -469 1817 977 -787 -1268 -127 2229 1352 -663
2265 -663 -743 896 2305 1401 -429 -848 1803 2170 1014 -716 -97 1655 1913 466 -889 258 1633
2282A633L52j949o18R25R65k39j625l85J240P97r53m28n26J041J212j361k36L83
2300B28M40N98m77m85P34P8J96n45p57P87j4l78M30o57oQ09o45Q6N70r77N60J91
2322G66n77N97p18M10n9k65K11m93l84J070j68m94R00p44J008M94r05O01k30M16
2342A436L75l67o35K63M00K80p20p03M46k17R60r60j057R34P68J68q52p22M26
2361B23J553r42p66j225J128J270j461p23q38J494J195j085j536R04J407Q81n70
2378I09k256J306J987L74j457j489J544J152J52j939j228J277K829j870j909O9
2394e49J377K409j762k262L36K246M89q27k489J42K444M2j362k499J305K362k08
2411A194j634j526J272K878K38l018k99J392K316P6l283r86K437J994j111l211
$$ plain form
2282 1633 1985 36 -582 343 1308 1069 -556 -941 299 1096 143 -285 -811 230 1442 81 -155 228
2300 228 668 1266 789 304 1038 1116 1312 767 10 797 783 405 835 178 172 981 336 422 992 15 575 766
2322 766 189 786 68 478 419 154 365 -128 -512 558 390 -104 796 52 1060 1554 649 1250 1020 1436
2342 1436 1811 1444 809 1072 1472 1752 1032 329 775 558 1518 558 -499 435 1203 1371 519 -203 223
2361 223 1776 834 68 -1157 -29 1241 -220 -943 -1781 -287 908 -177 -1713 -809 598 1479 909
2378 909 -1347 -41 1946 2320 863 -626 918 2070 2222 283 -945 332 3161 1291 -618 -549
2394 -549 828 3237 1475 -787 -451 1795 2284 1457 -1032 -890 1554 1596 234 -2265 -960 1402 1194
2411 1194 -440 -1966 -694 2184 2422 -596 -895 497 2813 2889 -394 -1380 1057 3051 1940 -1271
2427a271l95K750J730j845k613m6L867R73k817k327P19L156Q17l258k784K200
2443a144K811l41l179k249K609L010j016l410o37L135K476j374l212L96K763K602
2459C240k233k954L99L189J263k226l047R06M116Q2k833j797J438L449L32l235
2475H9k025K532L000p38l702j479K262K811j194m089p48L229K220k004l347j60
2491c343L645K034l085k830J114L793J008l358l020J690M195l00l485k122K617
2506a447L227n62l759j018L432K877j438l497j46L101K445k087l864O15L613J249
2522B741l259l076J281L465J001l375k129J610L920n48l084j750K242L510j140
2537A409l356j279L049K470j229l221q60L433K561k423l141N23L065J940k374
$$ plain form
2427 -1271 -1666 1084 2814 969 -1644 -1690 2177 3150 333 -1994 -1275 1881 2698 -560 -3344 -1144
2443 -1144 1667 1326 -1853 -4102 -1493 1517 501 -2909 -3546 -411 2065 691 -2521 -2125 638 3240
2459 3240 1007 -1947 -1548 1641 2904 678 -2369 -1463 2653 2735 -98 -1895 -457 2992 3324 89
2475 89 -1936 596 3596 2858 -844 -2323 -61 2750 1556 -2533 -3281 -52 2168 164 -3183 -3343
2491 -3343 302 2336 -749 -3579 -2465 1328 2336 -1022 -4042 -2352 1843 1543 -1942 -4064 -1447
2506 -1447 1780 1218 -2541 -3559 -127 2750 1312 -2185 -2331 770 3215 1128 -2736 -2121 1492 2741
2522 2741 -518 -3594 -2313 1152 2153 -1222 -3351 -1741 2179 1631 -1453 -3203 -961 2549 1409
2537 1409 -1947 -3226 -177 2293 1064 -2157 -3017 416 2977 554 -2587 -2064 1001 2941 567
2552E67l423J454K977J089k956k715J587L435k00l464k068K048L320r40l125j373
2568c787K475L107j348l693j63L176K084j978l125j36L816J188k230k789Q70L414
2584H81P89k889j759J528L169O68l390r63J528K855k86l093j294K689K017j244
2600A206k822r85K845J956j922k586N0K812J270k143k460O67K739P68k567k208
2616c380J631K168M23k724j549J782K477k65k595p51J454K605q26k430l44K473
2632A49K174k020j741m2K218J043j532k261R79K278K72j672j762J355J735L98
2648A571j998j664J848J399l95k028o46J210J816j221j696j93J149J400j092j541
2664b081p8J646J217j250j459N16J714J97o65j463N38J838l08j121p83J040J142
$$ plain form
2552 567 -2856 -1402 1575 2664 -292 -3007 -1420 2015 1815 -1649 -3717 -1669 1651 711 -2414 -3787
2568 -3787 -1312 1795 447 -3246 -3409 -233 1851 -127 -3252 -3388 428 1616 -614 -3403 -2533 881
2584 881 1670 -1219 -2978 -1450 1719 2387 -1003 -1966 -438 2417 2131 -962 -2256 433 2450 1206
2600 1206 -1616 -2601 244 2200 278 -2308 -2258 554 1824 -319 -2779 -2112 627 1395 -1172 -3380
2616 -3380 -1749 419 842 -1882 -3431 -1649 828 563 -2032 -2783 -1329 1276 450 -1980 -2324 149
2632 149 2323 303 -1438 -1480 738 1781 249 -2012 -1033 1245 1517 -155 -1917 -562 1173 1571
2648 1571 -427 -2091 -243 1156 761 -1267 -1913 -703 1113 -108 -1804 -1997 -848 552 -540 -2081
2664 -2081 -2159 -513 704 -546 -2005 -1489 225 422 -243 -1706 -1168 670 362 -759 -1542 -502 640
2681F40R0j649k21P74J171j91j891N76P15P94l39j651O09Q21J99p41r82J84J551
2700D59j33j314m5K70Q33j48m75l34M46P94m16m12r1N67KP8n22M7L59n9j8k15
2722c27k14K11P20p49QL2q8J57l00J08k41K13j36j25J29j95K94j46J62n26K93
2743g20o7J09J04r1J23l11K06K06k6J33k1l95R16K4o83L38j84P52j85o50j60N45
2765c7L67o15r7m24O21K74M1r91j3J114K52q93o97L52Q90N71j513l88P48M36L86
2786C84j192j95Q51Q32O3j403j24J160N31n98q37l20J209P75j237j009M36J246
2804E72k7r23j088P49J315j90j436k86P96R29k41j395n58J364J060o68j469j95
2822a691R87J366q47j425j04J863R65j003j207J10J693P67j468j148O60J999L97
$$ plain form
2681 640 730 -919 -1140 -366 805 614 -1277 -701 14 808 469 -1182 -573 248 447 -294 -1276 -1092 459
2700 459 326 -988 -1033 -763 70 -78 -553 -887 -441 353 -63 -475 -566 1 3 81 -441 -394 -35 -94 -112 -327
2722 -327 -541 -330 390 -359 -351 -319 -407 -250 -550 -442 -683 -470 -606 -731 -602 -797 -503 -649 -487 -1013 -720
2743 -720 -787 -678 -574 -665 -542 -853 -647 -441 -467 -334 -355 -750 166 190 -493 -155 -339 413 228 -422 -582 -37
2765 -37 330 -285 -382 -806 -185 89 130 -861 -874 240 492 -401 -1098 -746 144 715 -798 -1186 -438 -2 384
2786 384 -808 -1003 -152 680 743 -660 -784 376 907 309 -528 -848 361 1136 -101 -1110 -674 572
2804 572 545 -378 -1466 -717 598 408 -1028 -1314 -518 411 170 -1225 -1783 -419 641 -27 -1496 -1691
2822 -1691 -704 662 -185 -1610 -1714 149 1114 111 -1096 -986 707 1474 6 -1142 -482 1517 1914
2839A914j727j438J171J744rk134j165K400J053k47k187j033K570R27j321j764
2855a246j83J884J212k004j693O33J818Q83k001j354P91J957O76k186j507J518
2871h02J998j43j862j073J910J666q55j970o98J938J772j015k157n7J966J569
2887B187j537k138M22J704J125j407k164O60K604J23k174j465R06K540j85j945
2903g44j339J756K215o08k466o32K204J883j327k088j35K452J014j453k116M21
2919i63K547P23k037k180J421K102M90k430j259Q96K458k20k694n22J410J912
2935A654o26k498n42J899J593r77k160n24K867J012j401k103OK709R87k022j355
2952a481N69K115R13k400j517J513K122J40k385r68J688K251r50k329n01K039
$$ plain form
2839 1914 187 -1251 -80 1664 1655 -479 -1644 756 1809 1562 -625 -1658 912 1839 518 -1246
2855 -1246 -1429 455 1667 -337 -2030 -1397 421 1304 -697 -2051 -1260 697 1373 -813 -2320 -802
2871 -802 1196 1053 -809 -1882 28 1694 839 -1131 -1829 109 1881 866 -1291 -1348 618 2187
2887 2187 650 -1488 -1066 638 1763 356 -1808 -1148 1456 1579 -595 -2060 -1154 1386 1201 -744
2903 -744 -2083 -327 1888 1280 -1186 -1818 386 2269 942 -1146 -1281 1171 2185 732 -1384 -963
2919 -963 1584 2307 270 -1910 -489 1613 2103 -327 -1586 -690 1768 1548 -1146 -1668 -258 1654
2935 1654 1028 -1470 -2012 -113 1480 503 -1657 -2181 686 1698 297 -1806 -1800 909 1896 -126 -1481
2952 -1481 -912 1203 2116 -284 -1801 -288 1834 1974 -411 -1379 309 2560 1610 -719 -1220 819
2968H19J718j474j816l95K044J415j673j998M74J738R78j610k244J167K144l0
2984A257j417k020J666J912j20j686j452J741J863p64j994q0J196K064j382j680
3000h96j85J882J271r11j925Q9K444J45j293j555M77K120Q5j306j695J014K195
3017A956k18k057r30J182J662l34k109n91J395J570p98j962lJ336J395q06k102
3034a414M53J875L52j180j236K21K210m0j253j010R00J635k63j394n01Q15J051
3051A221r7j683j36R71R08k52j721K34J272O40q00j188pJ124Q83j100r43J5J172
3070E13N54j031n27J40J123J66j020p04J210P49m86m30p87R96N36k65q66j20J028
3089G79K37k20q33R7O30M63q68m45K13N40M35q22m03q8J221n06o63k16N51K49
$$ plain form
2968 819 2537 1063 -753 -1148 896 2311 638 -1360 -886 852 1830 220 -2024 -857 1287 1257
2984 1257 -160 -2180 -514 1398 1278 -408 -1860 -119 1744 980 -1014 -1094 102 2166 784 -896
3000 -896 -1081 801 2072 1161 -764 -675 1769 1914 621 -934 -457 1663 1748 442 -1253 -239 1956
3017 1956 1738 -319 -1249 -67 1595 1261 -848 -1439 -44 1526 728 -1234 -1237 99 1494 688 -1414
3034 -1414 -961 914 1266 86 -1150 -929 1281 1241 -12 -1022 -122 1513 1250 -144 -645 170 1221
3051 1221 1124 -559 -695 276 1184 932 -789 -555 717 1357 557 -631 -638 486 1369 269 -674 -659 513
3070 513 1067 36 -491 -351 772 938 -82 -786 424 1173 687 257 -530 466 1002 737 -129 -249 779
3089 779 1016 796 -37 60 690 1153 285 -160 53 593 1028 206 -197 -285 936 430 -233 -449 102 351
3109C51J39r93k17J046J3k81j67k41N20J53m56j65J52L92J41m04j3L22j0K42p4
3130D50k49OL22j22K29l5l12L19l2J47l20k32M52j53J89k02j4J84j68K1J70k74
3152C76j70L22l24J23n8l25M78j57P6k70k6K51K00k54l49L9O13J69o70j54p1N95
3174D14K8l04n90L52P03j54j98n76K25P42n78n73k4O79L46k38p29M7P71M42q25
3195d0n44L17O45M76o10n62L7J084m3p88k66K94R31m01m38n02P05P33l14r91k47
3216e24Q50P50o67p12J62M24N40m24j151L31Q58N08q82j055N78Q71N55j007o91
3235f86L1J469k10j064m73O99J205l03j103p18J142J398q39j284k11J298R37o28
3253F60j566j8J693L07j106j039J78J495N79j606q11Q40J039P2j520o09J174J170
$$ plain form
3109 351 490 -503 -720 326 339 58 -109 -350 170 323 -133 -298 -146 246 387 -17 -30 292 282 524 450
3130 450 201 207 529 407 636 601 289 608 576 723 403 171 623 470 659 457 443 627 459 480 650 376
3152 376 206 528 204 327 269 -56 422 265 341 71 45 296 496 242 -107 -68 545 714 44 -110 -181 414
3174 414 442 138 -452 -100 603 449 251 -325 -100 642 64 -509 -533 146 492 254 -475 -428 343 785 -40
3195 -40 -584 -267 378 854 244 -318 -281 803 760 -28 -294 0 931 530 92 -410 295 1028 714 -277 -524
3216 -524 326 1076 409 -303 -141 283 823 399 -752 -421 437 945 63 -992 -414 457 1012 5 -686
3235 -686 -655 814 604 -460 -933 -234 971 668 -435 -1153 -11 1387 548 -736 -947 351 1288 660
3253 660 -906 -924 769 1076 -30 -1069 -891 604 1183 -423 -1234 -394 645 717 -803 -1412 -238 932
3271I32j12j779k56R87J394n28j178q34J842O84q24j327L8J635N51o57j537L57
3289f12J291P45j460r27N19J477K14j501j002R19J329J16j698r86J154J628p67
3306D39j231o00J303J009q12q81n70J620J109j461j386P66J246M62j029j639J071
3323e84J324M98j625r53J170J486k37j534o65J212J409q56j533k24J012J539j016
3340D23j776K97J340P87q57j887M41J874r2p32j660Q79J707Q9j367j208J245J313
3358H16J00j910k35J125J028J08k042k05J487R22o54j202j49J526Q65j163j280
3375h63N8J830N28j641j043M86J638K10j685p55R18J311j25j526o58J210J148
3392A041l53j932q7J364Q25o22j522j0J436O71r91j067M90J323N65j361r04N98
$$ plain form
3271 932 820 -959 -1215 -228 1166 638 -540 -1374 468 1152 328 -999 -961 674 1225 568 -969 -612
3289 -612 679 1424 -36 -963 -444 1033 1247 -254 -1256 -337 992 1108 -590 -1576 -422 1206 439
3306 439 -792 -1392 -89 920 108 -773 -1343 277 1386 -75 -1461 -695 551 1013 -16 -1655 -584
3323 -584 740 1238 -387 -1340 -170 1316 1079 -455 -1120 92 1501 645 -888 -1112 -100 1439 423
3340 423 -1353 -1056 284 1071 214 -1673 -1232 642 550 -182 -1842 -963 744 833 -534 -1742 -497 816
3358 816 916 -994 -1229 -104 924 1032 -1010 -1215 272 1194 540 -662 -811 715 1580 417 -863
3375 -863 -805 1025 1553 -88 -1131 -645 993 1203 -482 -1237 -319 992 867 -659 -1317 -107 1041
3392 1041 688 -1244 -1331 33 858 236 -1286 -1296 140 811 -180 -1247 -757 566 1131 -230 -1134 -536
3410e36J487L14j319q49O86J037K65j528q05R60R86k9j279l31R06Q92l34j486
3428i63J09J047Q08q49j122J33J123Q19j293r69O54R02L91j256q35R63J019o0
3446F21o51q15Q79J222m38j086m81J273N42o71o99k28R25M31n10p09M9J030J70
3465H54r72m76M17Q25J93j066m21K19O54j95m16o51O09N23J06q32o85R83O96m03
3485c8n67j74R29L81o13l98Q9K88P01o34p89M70P45O7p21j99M45O08j22o93j3
3506b38L74O34n08n4l55J57P29l78r22K57M86L3m43kJ9N12j07k04m27K30M75M6
3528C14n98L1K55J65j03l55J18J44L1k25K37j15qL88j04j37j58J73J84k45k76
3549b84J96J34l95Q1J63j35k4J77K4j17O5RJ12o2J34J43q5j50q3L40m31j56K84
$$ plain form
3410 -536 951 1265 -54 -903 -217 820 1085 -443 -1248 -288 698 669 -610 -941 -35 857 523 -963
3428 -963 -854 193 1001 152 -970 -837 286 1105 -188 -1157 -503 399 790 -466 -1301 -338 681 621
3446 621 -30 -845 34 1256 818 -268 -749 524 1066 395 -304 -532 393 824 314 -395 -346 684 854
3465 854 -118 -594 -177 648 841 -225 -646 -427 227 32 -384 -1035 -426 97 203 -629 -1314 -331 365 -38
3485 -38 -605 -779 150 531 -82 -480 -391 -103 598 -36 -825 -355 390 457 -264 -463 -18 590 468 -225 -238
3506 -238 136 770 262 208 -147 10 739 361 -561 -304 182 215 -228 -230 -211 301 194 -10 -437 -207 268 314
3528 314 -284 -253 2 167 64 -291 -173 -29 2 -223 14 -101 -109 279 175 38 -120 53 237 -8 -284
3549 -284 -88 46 -349 -268 -105 -240 -264 -87 -63 -180 -115 -106 6 -56 78 221 136 -14 -97 243 -188 -344 -60
3572f0J28m2O1k58j3K67p5P9l78L26R2J16k28l64M26l8O7m82J20J32K67j81k42
3595b80j7K78K04k71l48K08N90J2n62j98L18N15q3o68J41L14J22M4l98m02O59
3616A78Q7p1l21m05Q73L8k58n39J78L76M78o40m39K22M04L90o77k52J65M71M3
3637C01k37l45J55O81k98k95l89L35P19l50o07l88Q16N23l95o57q3P30M35m54
3657A97p78K96L93O08o15o30K84P68n9o72l96M32Q84k25q59k37N97Q87n95o63
3677c83k11O17Q70n53r57J96R48K52m09q44J91J151j43o30o96L16R34J16p41o94
3697f70L69R86J84j329l24M93R01j37j002m37R86P03m13j150NR80O36m65j132
3716h16j05J363L01r41p34M25J162Qj010p31Q04R98K07j335l0Q91N57m35j125
$$ plain form
3572 -60 68 26 87 -171 -184 83 8 87 -291 35 127 243 15 -349 77 39 106 -376 -256 -124 143 -38 -280
3595 -280 -297 -19 185 -86 -434 -226 364 376 -186 -384 -66 449 366 -302 -161 153 275 319 -79 -481 178
3616 178 265 194 -127 -532 341 379 121 -418 -240 136 614 -26 -465 -243 161 551 -126 -378 -213 258 301
3637 301 64 -281 -126 555 257 -38 -427 -92 627 277 -330 -718 98 621 226 -431 -514 216 651 197
3657 197 -581 -285 108 716 101 -529 -245 523 464 -208 -604 -172 712 487 -372 -609 -12 875 280 -383
3677 -383 -594 23 893 340 -617 -421 527 779 370 -474 -283 868 725 95 -601 -285 649 765 24 -670
3697 -670 -301 685 869 -460 -784 -291 610 473 -529 -966 20 723 310 -840 -835 145 781 316 -816
3716 -816 -921 442 743 -198 -932 -507 655 663 -347 -1078 -274 724 931 -404 -434 457 1014 579 -546
3735e46o9J052O98o97q19l3R37P30q26r10RJ146K94r94n32K62Q30R2j021m86N02
3756c81J180k73r51o52R08Q50k74r85r5P19Q64n69r96l9J011N80n32j192K56J003
3776D32M94j066p03M45J072Q0j135l81N82J209j89j005m73Q23N88j88o94p01P19
3795i1Q28o15n68k17Q52N76n10q00K7R52L21n91o84J94P53K85o41q68M06J224
3815H33l08r18l24Q82Q19m87p17m02J139J72l7r20l42R76K33r2r85J13O58N18
3835H11o42n63k22R99J87p20m31L82Q38k25n13o75R37O02m28q41j9K62R90o17
3855A12p05J20Q01L07k33j134L70O71M59m76n20J87M57J42n30l28J42O83j50p13
3875c38j80M35L24J33p15j22L85L97N2o75j15L74M94l07o02r5O72J3j21l94J00
$$ plain form
3735 -546 -615 437 1135 438 -381 -414 523 1253 427 -483 -474 672 966 -28 -560 -298 532 624 -397 -883 -381
3756 -381 799 526 -425 -1077 -169 681 407 -578 -673 46 910 341 -655 -694 317 897 365 -827 -571 432
3776 432 926 -140 -843 -398 674 754 -381 -762 -180 1029 840 -165 -638 185 773 585 -109 -810 -91
3795 -91 737 122 -446 -663 189 765 255 -545 -518 434 755 164 -520 -326 427 712 71 -797 -391 833
3815 833 525 -393 -717 165 984 497 -220 -622 517 689 652 -268 -610 366 599 507 -478 -365 293 811
3835 811 169 -394 -616 383 570 -150 -581 -199 639 414 -99 -774 163 765 337 -504 -523 -261 729 112
3855 112 -593 -473 328 635 402 -732 -362 309 768 292 -228 -41 416 558 28 -300 -158 525 375 -338
3875 -338 -518 -83 241 374 -341 -463 -78 319 371 -304 -419 -45 449 142 -460 -555 117 130 9 -385 -285
3896b85K38N66n20r5R3M13J65o32KK20K47j3m68j73L73J84n2k32j60K10J69j42
3918A08l26K16M69l33n8q7K20O9j35K6n89J99K25j90j85M6J70m7J95k8l9R9K73
3941B98k31k92K70k1M1J73n13J17J51J22m1j69k39L43N6N4j0M0Q3o0J87l04q4
3964b9J04J82l90K45j33n1j81pL70l51M7J69K52j61J83l29K1L61j42j78O0j5p9
3987e2no9l7p0K69Kj17m2N2L16j6o34N74P0j06k35j02j46M52Lk22l94K84M96k29
4012D2j29l75M47J78j17k11R7J92j4k2o56J70N04j85K1l26J63K76Pj91j17L0M17
4035B01k67J0p6J95J35J17l12k9j77P02j85o19J15L44O46m38n26l99Q51K50m03
4056A35l38m0N23J45m70n70O9O56K61o78l02M58K02On36k42L08Q01j98r20K15
$$ plain form
3896 -285 -47 519 -1 -96 -3 410 575 -57 -55 165 412 399 -69 -242 131 315 263 31 -129 81 250 108
3918 108 -218 -2 467 134 76 -11 209 278 143 169 -420 -221 4 -186 -371 -325 -155 -202 -7 -35 -74 25 298
3941 298 67 -225 45 24 65 238 -275 -158 -7 115 74 -95 -334 9 65 119 109 149 232 172 359 55 -29
3964 -29 75 257 -133 112 -21 -72 -253 -260 110 -241 -194 -25 227 66 249 -80 -59 302 160 -18 42 27 -52
3987 -52 -57 -126 -163 -233 36 38 -79 -121 -69 247 231 -403 171 241 135 -100 -202 -348 104 107 -115 -509 -225 271 42
4012 42 -87 -462 -15 163 46 -165 -68 124 110 88 -568 -398 106 -79 -58 -384 -221 55 62 -129 -246 -216 201
4035 201 -66 -56 -132 63 198 315 3 -26 -203 499 314 -305 -190 154 800 362 -164 -563 288 538 135
4056 135 -203 -243 280 425 -45 -615 -546 110 371 -307 -609 -151 51 57 -479 -721 -413 388 190 -730 -515
4077e15P38K41p00l06p3O68J88k61q01K75P50J86o93m54R4J309l99j40o37K43
4097b87O83k17l22k88L96N55j35p74n01Q02Q79n94l45l94O24P28q60n65J21O46
4117A52M21o10o72R0Q99j16k84o81N88M74K3q31m88J006O01m82o62j99O67O90
4137E86l69o44r0N44P90p92o97J14Q89J37m77l59j83Q45J80o74n93P15L88l8n18
4158b46m82N00J018n87p87l31O21Q32n66o72j09N47M44M1r28L02M63L84o16m99
4178f71K2Q91K32r61k79L93O47Oo23n45Q73M39K71r81m14O93N70j19r90J23M45
4199B2O39m36q19j00Q97N64o50o50J54O53K08o18m20M75M27j16l39l91K14Q14
4219E28n17k53j70K28O59m54m87k7L69L82m40l49j45P28L88n79k86j13Q34L09
$$ plain form
4077 -515 223 464 -236 -542 -615 53 241 -20 -821 -546 204 390 -303 -757 -663 646 247 107 -530 -287
4097 -287 396 179 -143 -431 -35 520 385 -389 -890 -88 791 197 -148 -542 82 810 -50 -615 -494 152
4117 152 573 -37 -709 -619 280 164 -120 -801 -213 261 284 -547 -1035 -29 572 90 -572 -771 -104 586
4137 586 217 -427 -517 27 817 25 -672 -558 331 468 -9 -368 -551 294 474 -200 -793 -78 310 272 -246
4158 -246 -728 -228 790 203 -584 -915 -294 538 -28 -700 -809 -262 182 223 -705 -403 60 444 -172 -671
4178 -671 -649 242 474 -487 -766 -373 274 280 -343 -888 -15 424 695 -286 -700 -7 563 444 -546 -423 22
4199 22 661 225 -594 -694 203 767 117 -533 -379 274 482 -136 -556 -81 346 230 -109 -500 -286 528
4219 528 11 -242 -412 -184 475 21 -466 -493 -124 258 -182 -531 -676 52 440 -139 -425 -538 296 605
4239F05r13m33N59K65j09k18m92K16P43N7m85n13O41L36j99m45l74O84P16l89
4259B52m47l3N81O4k95n26M06L22P7m80l89N06K37J95l91m15M77L86k12n59R3
4280a51K3N10j18n85j25M52N3j02l67Q5L48N6j13n15L44K38Q1l12k40J75K90J22
4302A49m60j27j09N98nk63k16K15M16Q4n16J3M80Mp6l10K3K68L31m16l53L45J60
4325B35Q8m65k09K86J73l4l65Q6R1M99l39k93o2K48k02L67m14P4P8L09j04k41
4347a94J85k87K67J56k23K57n4M7k16%K27r0q8n7j89R8L23k44J79l07q2L67J55
4370B30l16k39M45N6J27j92O0k14Q7k81J67o7k5j23P8k1K08J58k19k10O7M39j41
4393G4k37J47N8j66N4j17J91M6p3j36KM60k23p8M0q2j78M95l32L2K00o6J20o6
$$ plain form
4239 605 -308 -741 -182 83 -26 -244 -736 -520 223 280 -205 -718 -77 259 60 -385 -759 -75 641 252
4259 252 -195 -228 353 417 122 -404 2 324 401 -79 -468 38 275 470 79 -336 141 527 315 -244 -151
4280 -151 -128 382 264 -321 -446 6 59 -43 -410 -325 23 79 -34 -549 -205 33 114 -198 -438 -263 27 149
4302 149 -311 -438 -547 51 46 -217 -433 -218 198 282 -234 -221 259 263 187 -123 -100 168 499 83 -270 75 235
4325 235 323 -142 -351 -65 108 74 -291 -205 -114 385 46 -247 -309 -61 -263 104 -310 -236 -158 151 47 -194
4347 -194 -9 -296 -29 127 -96 161 107 154 -62 -62 165 75 -13 -70 -259 -161 162 -82 97 -210 -292 75 230
4370 230 -86 -325 120 176 303 111 171 -43 44 -237 -70 -137 -162 -285 -207 -228 -20 138 -81 -291 -224 215 74
4393 74 -163 -16 42 -124 -70 -187 4 50 -23 -159 -157 303 80 2 42 -40 -218 277 -55 -23 177 111 231 165
4417A65k02k19N44k73j57k20N50J06k75k27J54O3j9QM4k92J87K09m26r7N13j00
4439C6K4r0j84J58K3J00k14J3K05J34p7k25k42P23J36l62m40q5L89r2J31j64l30
4462d33Q18L0m82j49J90J97M65n73l36P0M70q8l04l61J42P56n95l40J88J96L52
4483B13k81j77l15O86L13l16m05J89N41j6k34o72L33M46%l40k74J39N16R7o20
4504a77j74O60K09j29o86Q0K87M19k68m53K8M85O0k69o40J83Q74j08o24k28M67
4525dM88j71m17l66L26N65j4r15J80K92N47j33q23j04P73K43n54l13n1N08K98
4546C55l13o10J29P77J87n61l47k9R83m43l28p9K82L99k5m61k92O24L44l30m31
4567a69j57O42L19k30p98J32L80M04k48o75M05M72J82n42n49L39P91j86o45j88
$$ plain form
4417 165 -37 -256 288 15 -142 -362 188 294 19 -208 -54 9 -10 -2 42 -250 -63 146 -280 -377 136 36
4439 36 60 -30 -214 -56 -33 67 -147 -134 71 205 128 -97 -339 384 520 158 -282 -367 22 -70 61 -103 -433
4462 -433 385 415 -67 -216 -26 171 636 63 -273 -203 267 179 -125 -486 -344 412 -183 -523 -335 -139 213
4483 213 -68 -245 -560 126 439 123 -282 -93 448 432 198 -474 -141 305 305 -35 -309 -170 346 443 -177
4504 -177 -351 309 518 389 -297 -217 70 489 221 -232 -204 281 341 72 -568 -385 489 381 -243 -471 -4
4525 -4 484 313 -104 -470 -144 421 407 -508 -328 -36 511 378 -445 -549 224 467 -87 -400 -451 57 355
4546 355 42 -568 -439 338 525 -36 -383 -412 571 128 -200 -279 3 402 377 -84 -376 248 592 262 -169
4567 -169 -326 316 635 405 -393 -261 119 523 275 -400 5 477 659 117 -432 -93 698 512 -133 -321
4587c21K65P15j74p36m0K78O54m09m58m3M54L18j29o64k6L53N55o69k28J0O08
4608C13J22m34l09qO94o5o05j62M41M99k20n16j38L99O54k15n19j56N80Q2j97
4629B40n00J03O00j7k12n14J43O63n1lo98J94O58l2o67k41K57N75J02p29l69N45
4651D7N46l21l77j13K88N37m16m06j33N43K91m83l33N6M12M60n67k56K15K54J33
4672C77m26l88L65O50q0m39j59K7N53m7o77K8Q0O91m71m5l86O20k9J0m63P8N36
4695D05k87K43m95J82J12L54l88l50J72M98j14m16p2N7N18J5o07l6L23K89j11
4716B92l19k81M06J55j98k10N2L43Q1l31k11J11L50n1K6l38L52j99J42N5lN8o3
4739B19J94n53K01k8P2p2j51lK87K86k46l22j60K47K03k67j37K43J19J79j98K3
$$ plain form
4587 -321 -56 659 485 -251 -291 -13 641 232 -226 -269 185 503 374 -290 -316 37 592 -77 -305 -295 313
4608 313 435 1 -308 -316 378 313 -292 -454 -13 486 266 -250 -388 11 665 450 -69 -225 355 437 240
4629 240 -260 -157 443 426 214 -300 -157 506 455 452 -246 -52 606 574 -93 -334 -77 498 600 -129 -498 47
4651 47 593 272 -105 -218 70 607 191 -215 -348 195 486 3 -330 -274 138 598 31 -225 -10 244 377
4672 377 -49 -437 -72 578 498 59 -100 -73 480 433 -244 -216 -136 555 84 39 -347 273 244 254 -209 -131 405
4695 405 118 361 -134 48 160 514 126 -224 -52 446 332 -84 -156 -99 419 434 -173 -209 114 403 292
4716 292 -27 -308 98 253 55 -155 -103 240 321 -10 -221 -110 240 189 215 -123 229 30 172 227 224 282 219
4739 219 413 -140 61 33 105 33 -118 -121 166 452 206 -116 -276 -29 174 -93 -230 13 132 311 113 136
4761A36k18mM22k23j44O3R4j62Q7k09K57N4Km02K86j87J73k0J1K7k88M01r3J4
4785G7k38L11o0J1j7M5r5K7m0Q5m3j90R3JJ32k07j32K50j6k1J73k38N4J17J79
4810B58n5l56K45r6J65R4j73l3L80n02L8P7O3N7k0l51K29K25k45J16l87q5L51
4833ek42K63m56J77n4M07k76j5R9P5J43l48q4J12Q1M7O2l8K1K09j30k06r0M01
4857A53o1J2l55j05M51K22l33j97J24L68j82N7k25P6J73M8n06NK24K19j77j92
4879b01K55k66N57n53J59p9J51L09m57k14K08M01l8l00o2J58M0N2k61p1L32j48
4901b8Q2m15K63M14l4K09n78j24J78K65J29n71j94N20L47l60l06L2K81M6k85k41
$$ plain form
4761 136 -82 -86 336 113 -31 32 126 -36 51 -158 99 153 155 -247 39 -148 25 5 16 43 -245 156 63 77
4785 77 -161 150 90 101 84 129 34 61 21 106 63 -127 -34 -33 99 -108 -240 10 -6 -27 146 -92 -38 79 258
4810 258 203 -153 92 -4 161 255 82 49 429 -73 -35 42 105 162 142 -209 20 245 0 116 -271 -356 -5
4833 -5 -247 16 -440 -263 -317 90 -186 -201 -102 -27 116 -232 -316 -204 -123 -76 -14 -52 -31 178 48 -158 -248 153
4857 153 92 104 -251 -356 95 317 -16 -213 -89 279 97 154 -71 5 178 226 -280 -275 -51 168 -9 -201
4879 -201 54 -212 345 -208 -49 -128 23 332 -125 -339 -131 270 232 -68 -130 28 68 120 -141 -212 120 -28
4901 -28 54 -361 -98 316 282 491 -87 -211 -33 232 361 -210 -404 116 463 103 -203 -171 110 156 -129 -370
$$ [...]
8191G7
##END NTUPLES=NMR FID
##END=
