##TITLE=1H_SA_sl.FeOH
 CDCl3, 8 sc, 
 27.10.2020
##JCAMPDX= 6.0         $$ Bruker NMR JCAMP-DX V2.0
##DATA TYPE= NMR FID
##DATA CLASS= NTUPLES
##ORIGIN= UXNMR, Bruker Analytische Messtechnik GmbH
##OWNER= root
$$ XWIN-NMR		Version 3.5
$$ Tue Oct 27 10:36:21 2020 Russian Standard Time (UT+4h)  she@DPX200
##.OBSERVE FREQUENCY= 200.1315066352
##.OBSERVE NUCLEUS= ^1H
##.DELAY= (6, 6)
##.ACQUISITION MODE= SIMULTANEOUS
##.ACQUISITION SCHEME= undefined
##.AVERAGES= 8
##.DIGITISER RES= 18
##SPECTROMETER/DATA SYSTEM= spect
##.PULSE SEQUENCE= zg30
##.SOLVENT NAME= D2O
##.SHIFT REFERENCE= (INTERNAL, D2O, 0, 15.7039)
##AUDIT TRAIL= $$ (NUMBER, WHEN, WHO, WHERE, WHAT)
$$ ##TITLE= Audit trail, XWIN-NMR		Version 3.5
$$ ##JCAMPDX= 5.01
$$ ##ORIGIN= Bruker BioSpin GmbH
$$ ##OWNER= she
$$ F:/spectra/data/she/nmr/H-F/1/audita.txt
$$ ##AUDIT TRAIL=  $$ (NUMBER, WHEN, WHO, WHERE, WHAT)
(   1,<2020-10-27 10:35:04.67 +0400>,<she>,<DPX200>,
      <created by zg, POWCHK disabled, PULCHK disabled
       configuration hash MD5:
       00 E9 B6 7A A2 85 ED C7 34 08 36 98 17 FE 4E 26
       data hash MD5: 16K
       71 9E BD D1 3E 47 DD BD 4A 8C 87 B0 1D E3 A2 1F>)
$$ ##END=
$$ 
$$ hash MD5
$$ B2 22 C0 13 9E 53 17 D5 57 D9 1B C0 0B EC 54 A5
##$RELAX= 
##$RELAX= 
##$RELAX= 
##$RELAX= 
##$RELAX= 
##$RELAX= 
$$ Bruker specific parameters
$$ --------------------------
##$DU= <F:/spectra>
##$EXPNO= 1
##$NAME= <H-F>
##$PROCNO= 1
##$TYPE= <nmr>
##$USER= <she>
##$AMP= (0..31)
100 100 100 100 100 100 100 100 100 100 100 100 100 100 100 100 100 100 
100 100 100 100 100 100 100 100 100 100 100 100 100 100 
##$AQSEQ= 0
##$AQ_mod= 1
##$AUNM= <au_zg>
##$AUTOPOS= <>
##$BF1= 200.13
##$BF2= 200.13
##$BF3= 200.13
##$BF4= 200.13
##$BF5= 200.13
##$BF6= 200.13
##$BF7= 200.13
##$BF8= 200.13
##$BYTORDA= 1
##$CFDGTYP= 0
##$CFRGTYP= 5
##$CHEMSTR= <none>
##$CNST= (0..31)
1 1 145 1 1 1 1 1 1 1 1 1 1 1 1 1 1 1 1 1 1 1 1 1 1 1 1 1 1 1 1 1 
##$CPDPRG= <>
##$CPDPRG1= <>
##$CPDPRG2= <>
##$CPDPRG3= <>
##$CPDPRG4= <mlev>
##$CPDPRG5= <mlev>
##$CPDPRG6= <mlev>
##$CPDPRG7= <mlev>
##$CPDPRG8= <mlev>
##$CPDPRGB= <>
##$CPDPRGT= <>
##$D= (0..31)
0 1.2 0 0 0 0 0 0 0 0.06 0 0.03 0 0 0 0 0.0002 0 0 0 0 0 0 0 0 0 0 0 0 
0 0 0 
##$DATE= 1603780504
##$DBL= (0..7)
120 120 120 120 120 120 120 120 
##$DBP= (0..7)
150 150 150 150 150 150 150 150 
##$DBP07= 0
##$DBPNAM0= <>
##$DBPNAM1= <>
##$DBPNAM2= <>
##$DBPNAM3= <>
##$DBPNAM4= <>
##$DBPNAM5= <>
##$DBPNAM6= <>
##$DBPNAM7= <>
##$DBPOAL= (0..7)
0.5 0.5 0.5 0.5 0.5 0.5 0.5 0.5 
##$DBPOFFS= (0..7)
0 0 0 0 0 0 0 0 
##$DE= 6
##$DECBNUC= <off>
##$DECIM= 32
##$DECNUC= <off>
##$DECSTAT= 4
##$DIGMOD= 1
##$DIGTYP= 9
##$DL= (0..7)
0 120 120 120 120 120 120 120 
##$DP= (0..7)
150 150 150 150 150 150 150 150 
##$DP07= 0
##$DPNAME0= <>
##$DPNAME1= <>
##$DPNAME2= <>
##$DPNAME3= <>
##$DPNAME4= <>
##$DPNAME5= <>
##$DPNAME6= <>
##$DPNAME7= <>
##$DPOAL= (0..7)
0.5 0.5 0.5 0.5 0.5 0.5 0.5 0.5 
##$DPOFFS= (0..7)
0 0 0 0 0 0 0 0 
##$DQDMODE= 0
##$DR= 18
##$DS= 0
##$DSLIST= <SSSSSSSSSSSSSSS>
$$ [...]
##$SUBNAM2= <"">
##$SUBNAM3= <"">
##$SUBNAM4= <"">
##$SUBNAM5= <"">
##$SUBNAM6= <"">
##$SUBNAM7= <"">
##$SUBNAM8= <"">
##$SUBNAM9= <"">
##$SW= 16.880792210976
##$SWIBOX= (0..15)
0 0 2 0 0 0 0 0 0 0 0 0 0 0 0 0 
##$SW_h= 3378.37837837838
##$TD= 16384
##$TD0= 1
##$TE= 0
##$TE2= 300
##$TE3= 300
##$TEG= 300
##$TL= (0..7)
0 120 120 120 120 120 120 120 
##$TP= (0..7)
150 150 150 150 150 150 150 150 
##$TP07= 0
##$TPNAME0= <>
##$TPNAME1= <>
##$TPNAME2= <>
##$TPNAME3= <>
##$TPNAME4= <>
##$TPNAME5= <>
##$TPNAME6= <>
##$TPNAME7= <>
##$TPOAL= (0..7)
0.5 0.5 0.5 0.5 0.5 0.5 0.5 0.5 
##$TPOFFS= (0..7)
0 0 0 0 0 0 0 0 
##$TUNHIN= 0
##$TUNHOUT= 0
##$TUNXOUT= 0
##$USERA1= <user>
##$USERA2= <user>
##$USERA3= <user>
##$USERA4= <user>
##$USERA5= <user>
##$V9= 5
##$VALIST= <valist>
##$VCLIST= <CCCCCCCCCCCCCCC>
##$VD= 0
##$VDLIST= <DDDDDDDDDDDDDDD>
##$VPLIST= <PPPPPPPPPPPPPPP>
##$VTLIST= <TTTTTTTTTTTTTTT>
##$WBST= 1024
##$WBSW= 4
##$XGAIN= (0..3)
0 0 0 0 
##$XL= 0
##$YL= 0
##$YMAX_a= 560339
##$YMIN_a= -351920
##$ZGOPTNS= <>
##$ZL1= 120
##$ZL2= 120
##$ZL3= 120
##$ZL4= 120
##$ABSF1= 10
##$ABSF2= 0
##$ABSG= 5
##$ABSL= 3
##$ALPHA= 0
##$AQORDER= 0
##$ASSFAC= 0
##$ASSFACI= 0
##$ASSFACX= 0
##$ASSWID= 0
##$AUNMP= <proc_1d>
##$AZFE= 0.1
##$AZFW= 0.1
##$BCFW= 1
##$BC_mod= 2
##$BYTORDP= 1
##$COROFFS= 0
##$CY= 11.3945322036743
##$DATMOD= 1
##$DC= 2
##$DFILT= <>
##$DTYPP= 0
##$F1P= 15.9154993809931
##$F2P= -4.1035820241983
##$FCOR= 0.5
##$FTSIZE= 0
##$FT_mod= 4
##$GAMMA= 1
##$GB= 0.15
##$INTBC= 1
##$INTSCL= 1
##$ISEN= 128
##$LB= 0.24
##$LEV0= 0
##$LPBIN= 0
##$MAXI= 10000
##$MC2= 0
##$MEAN= 0
##$ME_mod= 0
##$MI= 1.114404
##$NCOEF= 0
##$NC_proc= 0
##$NLEV= 6
##$NOISF1= 3.799351
##$NOISF2= 2.8
##$NSP= 1
##$NTH_PI= 0
##$NZP= 0
##$OFFSET= 15.70392
##$PC= 1
##$PHC0= -10690.62
##$PHC1= 13.80088
##$PH_mod= 1
##$PKNL= yes
##$PPARMOD= 0
##$PSCAL= 0
##$PSIGN= 0
##$REVERSE= no
##$SF= 200.130013532006
##$SI= 16384
##$SIGF1= 3
##$SIGF2= 2
##$SINO= 400
##$SIOLD= 16384
##$SREGLST= <1H.CDCl3>
##$SSB= 0
##$STSI= 0
##$STSR= 0
##$SW_p= 3612.71676300578
##$SYMM= 0
##$S_DEV= 0
##$TDeff= 0
##$TDoff= 0
##$TI= <>
##$TILT= no
##$TM1= 0
##$TM2= 0
##$TOPLEV= 0
##$USERP1= <user>
##$USERP2= <user>
##$USERP3= <user>
##$USERP4= <user>
##$USERP5= <user>
##$WDW= 1
##$XDIM= 8192
##$YMAX_p= 0
##$YMIN_p= 0
$$ End of Bruker specific parameters
$$ ---------------------------------
##NTUPLES= NMR FID
##VAR_NAME=  TIME,          FID/REAL,        FID/IMAG
##SYMBOL=    X,             R,               I
##VAR_TYPE=  INDEPENDENT,   DEPENDENT,       DEPENDENT
##VAR_FORM=  AFFN,          ASDF,            ASDF
##VAR_DIM=   8192,          8192,            8192
##UNITS=     SECONDS,       ARBITRARY UNITS, ARBITRARY UNITS
##FACTOR=    0.000296,      1,               1
##FIRST=     0,             0,               0
##LAST=      2.424536,      0,               0
##MIN=       0,             -351920,         0
##MAX=       2.424536,      560339,          0
$$ Real data points
##PAGE= N=1
##DATA TABLE= (X++(R..R)), XYDATA
$$ [...]
$$ plain form
2573 -441 -660 2425 2883 879 386 732 2440 4148 359 -330 1904 2656 2238 -321 -1313 1120 2356
2590 2356 -312 -1170 -1333 1206 1845 -818 -1116 6 1595 1189 -699 -1556 1182 1592 -390 -1018 -1887
2607 -1887 322 1132 -1356 -1794 -512 202 584 -489 -1814 467 971 549 -227 -757 957 1030 20
2624 20 -394 -330 379 1094 -970 -1083 478 168 405 -195 -669 719 1631 -311 -725 580 450 1022 -357
2643 -357 -1525 -168 610 -418 -1434 -1617 -617 385 -849 -1427 -1994 -109 886 -928 -2188 -461
2659 -461 537 219 -951 -2405 -188 1260 -260 -1670 -1577 -52 1190 288 -2453 -976 1246 1139 68
2676 68 -2205 -225 1413 1093 -950 -2078 -537 1508 61 -2331 -1796 -758 1262 -512 -3192 -1474
2692 -1474 485 353 -1071 -1997 -1681 1152 459 -1506 -1669 -1085 1016 607 -1353 -1926 -513 617 916
$$ packed form
2573d41k19L085M58k004m93L46J708J708l789o89K234P52m18k559r92K433J236
2590B356k668q58j63K539O39k663k98J122J589m06j888q57K738M10j982o28q69
2607a887K209Q10k488m38J282P14L82j073j325K281N04m22p76n30J714P3j010
2624B0m14O4P09P15k064j13J561l10K37o00m74J388R12j942m14J305j30N72j379
2643c57j168J357P78j028j016j83J000J002j234n78n67J885R95j814j260J727
2659d61R98l18j170j454K217J448j520j410R3J525J242r02k741J477K222j07j071
2676F8k273J980J638l20k043j128J541K045j447k392N35J038K020j774k680J718
2692a474J959j32j424r26L16K833o93j965j63N84K101m09j960n73J413J130K99
$$ plain form
2709 916 -1422 -1436 420 918 675 -829 -1368 499 1784 305 -870 -1084 -299 2043 324 -1843 -1406
2726 -1406 716 1738 313 -1971 -1636 1792 1535 -424 -2364 -1131 2115 1569 -1046 -2735 -654 1916
2742 1916 1593 -2345 -2702 159 1786 1158 -2327 -2780 787 2498 33 -2737 -2185 759 2848 -583
2758 -583 -3467 -1898 1889 2361 -1205 -3434 -1456 2444 1929 -1224 -3996 -389 3655 1722 -2093 -3231
2774 -3231 142 4006 1845 -3550 -2787 1477 3440 742 -3836 -2669 2651 4221 -490 -3710 -1760
2789 -1760 3710 4039 -1882 -3980 -268 4596 3449 -2759 -3694 1592 4607 1586 -2870 -3544 2866 4859
2805 4859 255 -2973 -1905 3172 4599 -771 -3842 -318 3622 3320 -1078 -3580 158 3584 2305
2820 2305 -2052 -2826 767 3806 1230 -2115 -2171 689 3669 1155 -2487 -1626 1599 2955 1403 -1960
$$ packed form
2709I16k338j4J856M98k43j504n39J867J285j479j175k14P85K342j719k167M37
2726a406K122J022j425k284L35L428k57j959j940J233L246n46k615j689K081K570
2742A916l23l938l57K861J627o28l485m53L567J711k465k770N52K944K089l431
2758e83k884J569L787M72l566k229J978L900n15l153k772L607M044j933l815j138
2774c231L373L864k161n395P63M264J963k698m578J167N320J570m711l220J950
2789a760N470L29n921k098L712M864j147o208r35N286L015l021m456o74O410J993
2805D859m604l228J068N077J427n370l071L524L940l02m398k502L738L426j279
2820B305m357p74L593L039k576l345n6K860K980k514l642Q61L225J356j552l363
$$ plain form
2836 -1960 -1904 2592 3194 813 -1676 -1089 2754 3935 774 -2482 -476 3343 3971 -416 -2714 8
2852 8 3544 3509 -1153 -3018 381 4077 2413 -1687 -2977 519 4863 1805 -3124 -2294 1860 4273
2868 4273 1754 -3458 -2110 3384 4139 956 -3348 -1227 4344 4315 -206 -2899 44 4793 4467 -1242
2884 -1242 -2621 1402 5126 4174 -2059 -2848 2512 5366 2209 -2408 -2845 2686 5370 375 -3373 -2111
2900 -2111 3343 4497 -760 -4140 -989 3799 3424 -1546 -4665 436 4134 2244 -2465 -4015 1335
2915 1335 4319 1332 -3708 -2239 1790 4256 936 -3428 -1275 3285 3857 26 -2252 -335 3884
2930 3884 3564 -533 -1452 617 4069 2885 -288 -1156 1568 3695 2660 -114 -997 2239 3085 2081
2946 2081 -30 -767 1582 3261 1565 -760 -279 943 2844 1584 -1519 -555 1350 2652 1179 -1547
$$ packed form
2836a960N6M496O02k381k489N87L843J181l161l256K006L819O28m387k298K722
2852HL536l5m662j865L399L696j664m100j290L496M344l058m929Q30M154K413
2868D273k519n212J348N494P55l183m304K121N571k9m521k693K943M749l26n709
2884a242j379M023L724r52o233p89N360K854l157m617m37N531K684m995l748J262
2900b111N454J154n257l380L151M788l75m970l119N101L698j890m709j550N350
2915A335K984k987n040J469M029K466l320m364K153M560N72l831k278J917M219
2930C884l20m097r19K069L452j184l173q68K724K127j035k774q83L236Q46j004
2946B081k111p37K349J679j696k325M81J222J901j260l103R64J905J302j473k726
$$ plain form
2962 -1547 -1355 1823 2137 404 -1676 -1278 2571 2338 -145 -1769 -572 2534 2927 -1203 -2473 721
2978 721 2395 1937 -1343 -2514 1051 2898 644 -1908 -1920 689 2665 -426 -2424 -1216 1173 1934
2994 1934 -1141 -2386 -581 1508 1193 -978 -2401 -428 2009 563 -1034 -1334 561 2078 1376 -948
3010 -948 -887 1801 2341 1591 -414 38 1808 2560 869 -506 193 2098 2374 -56 -565 56 1753 1409
3028 1409 -836 -1049 534 1028 554 -639 -1636 396 766 -661 -1083 -1313 -276 -151 -868 -1596 -605 -192
3046 -192 -502 -765 -927 -244 -501 -286 -391 -551 61 -32 -683 21 501 -785 -174 74 -103 523 -555 -710
3066 -710 77 822 17 -733 -891 267 776 -563 -1219 -861 380 260 -827 -1653 -689 431 61 -1268
3084 -1268 -2278 -384 625 -736 -1461 -1554 -475 693 -337 -2160 -1032 76 575 -70 -1582 -863
$$ packed form
2962a547J92L178L14j733k080L98L849k33k483j624J197L106L93m130j270L194
2978G21J674m58l280j171L565J847k254k552j2K609J976l091j998J208K389P61
2994A934l075j245J805K089l15k171j423J973K437j446j597l00J895J517p02k324
3010i48O1K688N40p50k005M52J770P52j691j375O99J905K76k430n09O21J697l44
3028A409k245k13J583M94m74j193r97K032L70j427m22k30J037J25p17p28R91M13
3046a92l10k63j62O83k57K15j05j60O12r3o51P04M80j286O11K48j77O26j078j55
3066g10P87P45q05p50j58J158N09j339o56L58J241j20j087q26R64J120l70j329
3084a268j010J894J009j361p25r3J079J168j030j823J128J108M99o45j512P19
$$ plain form
3100 -863 766 743 -637 -927 -484 1011 1047 -295 -772 -324 1247 1092 -617 -1130 475 682 969 -884
3118 -884 -1961 259 931 -13 -1202 -2308 -842 1116 -610 -2247 -1609 -464 635 -909 -2293 -1252
3134 -1252 -216 409 -954 -2475 -1629 319 144 -875 -1943 -1496 1068 245 -1059 -1334 -584 1012 1635
3151 1635 -468 -1564 344 1386 1321 -310 -1272 166 1716 1175 -1065 -1665 116 2221 862 -1508
3167 -1508 -1609 531 2790 707 -2514 -1811 1289 2039 198 -2912 -1934 2371 2167 -1264 -3334 -1166
3183 -1166 2466 2250 -2301 -3444 245 3041 1542 -2821 -2812 1300 3125 236 -3431 -2587 2041 2999
3199 2999 -1212 -3386 -1231 2064 2509 -2010 -3748 -51 2845 1267 -1717 -3202 521 2896 663
3214 663 -2185 -2235 1314 2878 529 -2463 -1406 1595 2644 31 -2544 -250 2047 2137 -140 -1924
$$ packed form
3100h63J629k3j380k90M43J495L6j342m77M48J571j55j709n13J605K07K87j853
3118h84j077K220O72r44j189j106J466J958j726j637O38J145J099j544j384J041
3134a252J036O25j363j521Q46J948j75j019j068M47K564q23j304k75P50J596O23
3151A635k103j096J908J042o5j631r62J438J550n41k240o00J781K105j359k370
3167a508j01K140K259k083l221P03L100P50j841l110R78M305k04l431k070K168
3183a166L632k16m551j143L689K796j499m363RM112J825k889l667Q44M628R58
3199B999m211k174K155L295M45m519j738L697K896j578k984j485L723K375k233
3214F63k848n0L549J564k349k992J057L001J049k613k575K294K297R0k277j784
$$ plain form
3230 -1924 -281 2612 2042 -920 -1305 -3 2486 1938 -1079 -1407 506 2366 1466 -938 -1702 1025
3246 1025 2321 1272 -1298 -1760 1073 2237 721 -1444 -1392 1087 2874 184 -1995 -451 1366 2472
3262 2472 -13 -2294 -745 2331 2475 -284 -1975 -835 2687 2034 -934 -1854 183 2994 2010 -1082
3278 -1082 -2019 1058 3353 1874 -1721 -2054 2176 3415 617 -2074 -1727 2065 3429 -41 -3021 -732
3294 -732 2454 2837 -1527 -3459 -124 3202 1736 -2250 -3038 592 3630 423 -2747 -2519 1268 3654
3310 3654 -170 -3302 -734 2654 3291 7 -2951 285 3854 2540 -319 -1528 1266 3781 1895
3325 1895 -1097 -581 1631 3327 1394 -1742 -365 1928 2572 630 -1292 -494 2246 1670 -487 -1100
3341 -1100 -488 1731 1204 -1031 -1448 -601 515 780 -747 -1845 -380 985 676 -746 -1630 -91 1096
$$ packed form
3230a924J643K893n70k962l85J302K489n48l017l28J913J860r00k404p64K727
3246A025J296j049k570m62K833J164j516k165N2K479J787k690k179J544J817J106
3262B472k485k281J549L076J44k759j691J140L522o53k968r20K037K811r84l092
3278a082r37L077K295j479l595l33M230J239k798k691L47L792J364l470k980K289
3294g32L186L83m364j932L335L326j466l986p88L630L038l207l170K28L787K386
3310C654l824l132K568L388O37l284k958L236L569j314k859j209K794K515j886
3325A895k992N16K212J696j933l136J377K293O44j942j922P98K740n76k157o13
3341a100O12K219n27k235m17Q47J116K65j527j098J465J365l09j422q84J539J187
$$ plain form
3358 1096 782 -659 -1037 240 1414 763 -1124 -1050 227 1913 513 -1393 -1047 1469 2060 500 -808
3375 -808 -606 2311 2260 70 -1130 146 1783 1785 -424 -1867 568 1639 955 -1198 -1705 893 1823
3392 1823 467 -1071 -860 796 2303 86 -1606 -348 956 1717 -315 -2061 -372 1424 618 -549
3408 -549 -1745 -446 2064 813 -626 -1027 584 2521 973 -1275 -852 1096 1830 -36 -1977 -742
3424 -742 1164 730 -898 -2059 -734 1031 436 -1984 -1890 -370 622 -14 -2345 -1763 153 425 -1297
3441 -1297 -2290 -1572 -182 -113 -1661 -1969 -1050 395 124 -1052 -994 248 947 289 -97 -507 1122 1061 129
3460 129 -142 15 319 582 155 -812 -71 379 238 -94 -751 -265 254 53 -97 -602 -543 -28 -375 -956
3480 -956 -972 -1267 -360 -628 -1303 -793 -944 -600 -304 -857 -1155 10 -2 -110 -406 -492 266 191 -352 -473 -244
$$ packed form
3358A096l14j441l78J277J174o51j887P4J277J686j400j906L46K516N91j560j308
3375h08K02K917n1k190j200J276J637Kk209j443K435J071o84k153n07K598R30
3392A823j356j538K11J656J507k217j692J258J304P61k032j746J689J796q06j167
3408e49j196J299K510j251j439m01J611J937j548k248M23J948P34j866j941J235
3424g42J906m34j628j161J325J765n95k420R4J520R92o36k331N82J916K72j722
3441a297r93P18J390O9j548l08R19J445k71j176N8J242O99o58l86m10J629o1r32
3460A29k71J57L04K63m27r67P41M50j41l32o57M86N19k01j50n05N9N15l47n81
3480i56j6k95R07k68o75N10j51L44K96n53k98J165j2j08k96q6P58p5n43j21K29
$$ plain form
3501 -244 -231 163 -673 -653 -117 -158 -335 -753 -750 -120 -209 -339 -293 -486 -595 -29 -495 -627 -464 -618 -1028 -462
3523 -462 -926 -890 -773 -949 -604 -1005 -670 -330 -304 -307 -234 -251 20 283 -112 -262 114 -361 286 -277 -302 119
3545 119 488 -151 122 -151 204 1038 -206 -37 573 655 560 -305 -348 621 701 -392 -655 -942 417 68
3565 68 -1225 -943 -575 -6 -162 -1537 -1248 446 307 -496 -1094 -1095 798 258 -972 -1210 -370 559 293
3584 293 -1147 -1060 611 987 -52 -1058 -206 1347 1335 -49 -430 557 1563 1556 -698 -659 1167 1176 320
3603 320 -793 -755 972 1373 -613 -1120 -253 1126 1142 -387 -1053 103 1046 579 -616 -1376 338 1009
3621 1009 247 -698 -991 512 1405 246 -821 84 1087 1593 515 -870 562 1645 1376 331 -695
3638 -695 185 1313 904 -453 -47 465 1055 589 -948 -666 583 934 495 -757 -590 936 626 188
$$ packed form
3501b44J3L94q36K0N36m1j77m18LO30q9j30M6j93j09N66m66j32J63j54m10N66
3523d62m64L6J17j76L45m01L35L40K6lP3j7K71K63l95j50L76m75O47n63k5M21
3545A19L69o39K73k73L55Q34j244J69O10Q2r5q65m3R69Q0j093k63k87J359l49
3565F8j293K82L68N69j56j375K89J694j39q03n98jJ893n40j230k38Q40R29k66
3584B93j440Q7J671L76j039j006Q52J553j2j384l81R87J006pk254L9J826Rq56
3603C20j113L8J727M01j986n07Q67J379J6j529o66J156R43m67j195p60J714O71
3621A009p62r45k93J503Q93j159j067R05J003N06j078j385J432J083k69j045j026
3638f95Q80J128m09j357M06N12N90m66j537K82J249L51m39j252J67J526l10m38
$$ plain form
3656 188 -389 -758 785 782 -247 -905 -368 329 745 -86 -1202 -107 716 992 250 -907 112 1262
3674 1262 1200 -39 -659 -43 1800 1282 -397 -680 182 1858 1076 -789 -1041 1256 2112 1191 -744 -700
3692 -700 1685 2461 302 -1571 -399 2115 2330 -169 -1743 129 2274 1719 -1147 -1748 816 2655
3708 2655 1172 -1787 -1441 1184 2853 3 -1822 -996 1646 2781 -200 -2048 -53 2600 1538
3723 1538 -647 -1874 -42 2759 1245 -1250 -1665 673 2223 758 -2076 -1423 810 1881 399
3738 399 -1983 -951 1417 1625 -239 -1767 -944 1771 1338 -1048 -1504 -714 1189 1436 -1021 -1327 118
3755 118 1954 1694 -587 -1100 1221 2289 1187 -600 -1063 1526 2273 811 -1104 -895 1401 2472
3771 2472 179 -1384 -218 1793 1971 -170 -1416 -350 1714 1471 -781 -1766 -645 1565 857 -1552
$$ packed form
3656A88n77l69J543lj029o58N37O97M16q31j116J095Q23K76p42j157J019J150
3674A262o2j239o20O16J843n18j679k83Q62J676p82j865k52K297Q56r21j935M4
3692g00K385P76k159j873J172K514K15k499j574J872K145n55k866o01K564J839
3708B655j483k959L46K625J669k850j825Q26K642J135k981j848J995K653j062
3723A538k185j227J832K801j514k495m15K338J550j465k834O53K233J071j482
3738C99k382J032K368K08j864j528Q23K715m33k386m56P90J903K47k457l06J445
3755A18J836k60k281n13K321J068j102j787m63K589P47j462j915K09K296J071
3771B472k293j563J166K011J78k141j246J066K064k43k252r85J121K210p08k409
$$ plain form
3787 -1552 -2137 -626 1262 61 -1786 -2042 7 1040 247 -1792 -1776 835 1757 -119 -2005 -1397 928
3804 928 1813 -381 -2489 -869 1074 1522 -699 -2589 -593 2065 1261 -1143 -1843 42 2524 1234
3820 1234 -1531 -1819 511 2264 532 -2623 -1710 951 1510 -273 -2746 -1403 1468 1335 -849 -2255
3836 -2255 -989 1903 1655 -1616 -2072 -107 1717 1046 -1722 -2080 307 1221 285 -1583 -1541 870 1690
3853 1690 -21 -1228 -1166 1385 2091 -170 -1338 -644 1248 1489 -453 -1818 -434 1312 839 -981
3869 -981 -2050 -520 1151 814 -1459 -1550 -125 1166 462 -1884 -1844 145 1150 -82 -2075 -1708 308
3886 308 571 -576 -1675 -1258 769 1228 -905 -1390 -431 1092 922 -91 -1327 554 1445 806 -206
3903 -206 -925 214 1270 378 -509 -853 -298 1110 338 -1166 -814 -137 680 553 -1190 -773 348 685
$$ packed form
3787a552n85J511J888j201j847k56K049J033p93k039J6K611R22j876j886O08K325
3804I28Q85k194k108J620J943M48k221j890J996K658q04k404p00J885K482j290
3820A234k765k88K330J753j732l155R13K661N59j783k473J343K871j33k184j406
3836b255J266K892k48l271m56J965J824o71k768l58K387R14r36j868M2K411Q20
3853A690j711j207O2K551P06k261j168O94J892K41j942j365J384J746m73j820
3869i81j069J530J671l37k273r1J425J291p04k346M0J989J005j232j993L67K016
3886C08K63j147j099M17K027M59k133m85R59J523j70j013j236J881Q91o39j012
3903b06p19J139J056q92q87l44N55J408p72j504L52O77Q17j27j743M17J121L37
$$ plain form
3921 685 -48 -814 -1114 589 417 -406 -1495 -911 537 811 -597 -1119 -265 524 1252 -236 -631 502
3939 502 1282 1077 -143 -691 449 1343 474 -840 -835 478 951 106 -1020 -443 644 800 65 -861 -246
3958 -246 873 669 -485 -1026 -171 492 -90 -1232 -1127 -237 -14 188 -1199 -839 189 69 255 -505
3976 -505 -179 337 592 -63 135 119 135 855 -121 37 763 388 630 583 217 395 451 670 940 432 763
3997 763 774 771 779 625 203 202 656 105 338 -285 -450 272 133 -108 -146 -560 -116 235 -417 -539 -328 323 713
4020 713 -677 -840 -151 16 126 -892 -1010 135 791 -41 -593 -460 767 1403 323 -539 256 1412
4038 1412 968 336 -855 450 1465 626 -470 -757 473 953 -98 -1245 -480 549 1050 190 -1025
4055 -1025 133 674 553 -107 -655 -125 823 457 -678 -296 -267 574 743 -215 -111 352 562 822 413
$$ packed form
3921F85p33p66l00J703j72q23j089N84J448K74j408n22Q54P89P28j488l95J133
3939E02P80k05j220n48J140Q94q69j314NJ313M73q45j126N77J087J56p35r26O15
3958b46J119k04j154n41Q55O63n82j142J05Q90K23K02j387L60J028j20J86p60
3976e05L26N16K55o55J98j6J6P20r76J58P26l75K42m7l66J78N6K19K70n08L31
3997G63J1lQj54m22jM54n51K33o23j65P22j39k41l8m14M44L51o52j22K11O51L90
4020G13j390j63O89J67J10j018j18J145O56q32n52J33J227O36j080q62P95J156
4038A412m44o32j191J305J015q39j096k87J230M80j051j147P65J029N01q60j215
4055a025J158N41j21o60n48N30R48l66j135L82K9Q41J69r58J04M63K10K60m09
$$ plain form
4074 413 -203 769 898 994 551 -157 410 959 892 433 -573 -85 1265 693 -630 -754 141 989 721 -672
4094 -672 -954 28 1105 546 -1097 -1260 659 1078 -599 -1441 -878 675 853 -752 -1587 -662 920 1349
4112 1349 -1259 -1610 219 1278 771 -1160 -1214 553 1894 651 -1368 -989 678 1632 185 -1687
4128 -1687 -815 1329 1554 15 -1306 -393 1603 1294 -184 -1487 87 2107 991 -743 -1410 280
4144 280 1835 942 -1590 -1338 726 1476 338 -1378 -1132 674 1345 -214 -1366 -680 1009 1030 -872
4161 -872 -1625 -612 967 504 -951 -1925 -219 891 -72 -1231 -1694 -180 952 -22 -1288 -1036 -105
4178 -105 941 155 -1679 -852 212 765 67 -1446 -1046 269 753 -467 -1471 -820 624 1138 -186
4195 -186 -998 -372 1152 1424 -390 -1313 97 1428 980 -236 -1593 430 1728 759 -996 -1060 540
$$ packed form
4074D13o16R72J29R6m43p08N67N49o7m59j006M88J350n72j323j24Q95Q48k68j393
4094f72k82R82J077n59j643j63J919M19j677q42N63J553J78j605q35R25J582M29
4112A349k608l51J829J059n07j931n4J767J341j243k019L79J667R54j447j872
4128a687Q72K144K25j539j321R13J996l09j478j303J574K020j116j734o67J690
4144B80J555q93k532K52K064P50j138j716K46J806O71j559j152O86J689K1j902
4161h72p53J013J579m63j455r74J706J110r63j159m63J514J132r74j266K52R31
4178a05J046p86j834Q27J064N53o98j513M00J315M84j220j004O51J444N14j324
4195a86q12O26J524K72j814r23J410J331m48j216j357K023J298r69j755o4J600
$$ plain form
4212 540 1918 711 -1309 -904 955 1744 -195 -1612 -681 1163 1316 -957 -1792 -791 1286 697 -1727
4229 -1727 -1618 -371 1411 482 -1776 -1641 369 1095 244 -1469 -1259 814 1300 -322 -1364 -668 1201
4246 1201 1163 -509 -1164 -169 1226 1333 -582 -1269 91 1264 1044 -317 -1557 31 1681 212 -919
4263 -919 -1143 155 1251 -283 -1537 -931 448 815 36 -1465 -848 948 644 -182 -1817 -156 986
4280 986 535 -654 -1288 -29 954 343 -1291 -620 367 867 342 -921 -859 762 1038 -84 -549 -226
4298 -226 934 932 -229 -700 -270 634 889 133 -455 86 751 629 -78 -952 41 981 354 -761 -727 7
4318 7 653 146 -970 -494 -131 546 241 -807 -473 -36 466 197 -684 -1058 539 508 -57 -524 -551 761
4338 761 988 -261 -646 172 793 904 -396 -647 454 891 29 -520 -560 58 817 -148 -829 -498 288
$$ packed form
4212E40J378j207k020M05J859P89j939j417R31J844J53k273q35J001K077n89k424
4229a727J09J247J782r29k258J35K010P26q51j713K10K073M86j622j042O96J869
4246A201l8j672o55R95J395J07j915o87J360J173k20j361j240J588J650j469j131
4263i19k24J298J096j534j254O06J379L67p79j501O17J796l04q26j635J661J142
4280I86m51j189o34J259R83o11j634O71R87N00n25j263O2J621K76j122m65L23
4298b26J160kj161m71M30R04K55p56n88N41O65j22p07q74R93R40o27j115L4P34
4318GO46n07j116M76L63O77l05j048L34M37N02k69q81l74J597l1n65m67k7J312
4338G61K27j249l85Q18O21J11j300k51J101M37q62n49m0O18P59r65o81L31P86
$$ plain form
4357 288 612 -495 -567 -282 467 426 -400 -1064 -63 607 231 -397 -594 -45 781 245 -587 -297 535 789
4377 789 422 -439 -108 961 1017 417 -139 367 983 467 -173 -29 213 540 550 -742 -186 606 416 -6
4397 -6 -590 -171 468 348 -305 -476 -219 364 -6 -797 -890 -161 49 -321 -846 -724 171 -68 -521 -535 -297
4418 -297 358 304 -496 -214 402 64 114 -184 -36 835 254 89 218 334 523 445 93 270 936 385 570
4439 570 321 748 805 516 305 493 672 226 187 -7 498 388 118 -108 -69 310 37 -314 -311 197 66 139
4461 139 243 132 191 -69 -158 -186 158 36 -51 -153 86 324 55 -84 -96 270 686 169 -246 531 881 395
4483 395 -12 -136 205 668 -92 -306 -94 285 121 -165 -651 155 415 156 -313 -560 377 639 129 -279
4503 -279 -276 293 660 -103 -630 -56 444 529 -252 -513 508 1167 693 -261 120 457 959 626 -165 381 976
$$ packed form
4357B88L24j107p2K85P49m1q26o64J001O70l76o28j97N49Q26n36q32K90Q32K54
4377G89l67q61L31J069N6o00n56N06O16n16o40J44K42L27J0j292N56P92j90m22
4397fn84M19O39j20o53j71K57N83l70p91r3P29K10l70n25J22Q95k39m53j4K38
4418b97O55n4q00K82O16l38N0k98J48Q71n81j65J29J16J89p8l52J77O66n51J85
4439E70k49M27N7k89k11J88J79m46l9j94N05j10k70k26L9L79k73l51LN08j31P3
4461A39J04j11N9k60q9k8L44j22q7j02K39K38k69j39j2L66M16n17m15P77L50m86
4483C95m07j24L41M63p60k14K12L79j64k86m86Q06K60k59m69k47R37K62n10m08
4503b79LN69L67p63n27N74N00Q5p81k61J021O59m74r54L81L37N02l33p91N46N95
$$ plain form
4524 976 964 71 -333 -54 824 523 -376 -465 -4 968 278 -668 -700 331 757 104 -823 -552 408 312 -321
4545 -321 -949 -304 447 216 -1055 -758 -109 407 39 -792 -776 280 348 85 -674 -196 680 569 -266 -797
4565 -797 -119 673 437 -379 -240 40 110 465 -143 -263 475 734 257 -23 -45 439 711 291 49 176 254
4586 254 532 416 -326 -406 131 135 342 -440 -342 201 423 163 -376 -758 249 742 -216 -741 -711 173 108 -460
4608 -460 -1530 -532 260 248 -664 -1203 3 667 -140 -841 -864 30 742 -32 -990 -895 208 696 -469 -1473
4628 -1473 -504 320 239 -529 -1180 -383 716 307 -1017 -900 -231 769 324 -814 -1012 327 795 -268
4646 -268 -1021 -868 430 572 -189 -1037 -505 847 975 -553 -886 -26 683 837 -751 -1336 -79 583
4664 583 314 -996 -1273 -261 934 -309 -1335 -824 78 876 -210 -1313 -690 595 728 -472 -1758
$$ packed form
4524I76j2q93m04K79Q78l01q99q9M61R72o90r46l2J031M26o53r27K71R60r6o33
4545c21o28O45P51k31j271K97O49N16l68q31J6J056O8k63p59M78Q76j11q35n31
4565g97O78P92k36q16J39K80P0L55o08j20P38K59m77k80k2M84K72m20k42J27P8
4586B54K78j16p42q0N37MK07p82R8N43K22k60n39l82J007M93r58n25L0Q84o5n68
4608d60j070R98P92j2r12n39J206O64q07p01k3Q94P12p74r58R5J103M88j165j004
4628a473R69Q24q1p68o51P97J099m09j324J17O69J000m45j138j98J339M68j063
4646b68p53J53J298J42p61q48N32J352J28j528l33Q60P09J54j588n85J257O62
4664E83k69j310k77J012J195j243j026N11R02P98j086j103O23J285J33j200j286
$$ plain form
4681 -1758 -222 1113 296 -597 -1222 -394 940 262 -762 -837 9 939 491 -846 -698 215 859 168
4699 168 -1213 -572 333 292 -327 -1149 -750 291 463 -441 -926 -581 557 403 -620 -1026 -407 437 45
4718 45 -684 -1220 -149 640 -21 -849 -794 -151 787 493 -639 -652 335 732 83 -1221 -605 343 830 -213
4738 -213 -1108 -726 714 685 -646 -701 -196 622 704 -730 -987 216 958 239 -413 -997 256 1047 158
4757 158 -978 -828 266 842 -193 -1093 -660 373 860 -313 -992 -251 614 617 -438 -1271 -299 917
4775 917 316 -701 -1194 -270 1111 354 -766 -959 234 907 310 -919 -746 469 577 138 -1260 -591
4793 -591 864 556 -252 -942 -151 777 855 -893 -888 101 813 487 -794 -685 -23 705 -133 -843 -541 541
4813 541 719 -451 -555 -225 801 862 118 -271 21 948 551 93 -385 426 749 314 64 -87 -111 404
$$ packed form
4681a758J536J335q17q93o25Q28J334o78j024p5Q46R30m48j337J48R13O44o91
4699A68j381O41R05m1o19q22L99J041J72r04m85L45J138j54j023m06O19Q44l92
4718D5p29n36J071P89o61q28N5O43R38k94j132j3R87L97o49j304O16R48M87j043
4738b13q95L82J440k9j331n5N05Q18Q2j434k57J203P42p19o52n84J253P91q89
4757A58j136J50J094N76j035r00M33J033M87j173o79P41Q65Lj055q33R72J216
4775I17o01j017m93R24J381p57j120j93J193O73n97j229J73J215J08m39j398O69
4793e91J455l08q08o90P91R28P8j748NR89P12l26j281J09O62P28q38p10L02J082
4813E41J78j170j04L30J026O1p44l89K92R27l97m58m78Q11L23m35k50j51k4N15
$$ plain form
4833 404 797 -389 -167 -28 225 295 -276 -418 10 492 254 -203 -570 86 260 -80 -408 -663 -104 343
4853 343 -87 -986 -568 -146 333 50 -659 -554 610 413 -79 -661 -484 387 334 -397 -388 67 656 439 -313
4874 -313 -255 65 489 195 -405 -324 509 505 142 -262 -377 576 334 -162 -187 -144 181 466 6 -435 -184 367
4896 367 67 -578 -480 -30 260 -127 -241 -473 -223 319 -140 -225 -457 -209 42 -103 -351 -246 48 -175 -139
4917 -139 -161 -278 -15 -269 -158 310 -143 -119 32 -43 155 71 -129 -119 70 27 -432 -447 -106 144 25 -548
4939 -548 -552 -565 367 -177 -1010 -29 86 -6 -330 -545 -331 370 127 -480 -197 -128 720 -194 -787 -173 249 604
4961 604 107 -666 151 578 266 31 -406 -136 403 88 -410 -215 260 319 296 -241 -317 283 228 221 -384 -293
4983 -293 18 221 -268 -399 -564 86 241 -313 -666 -455 40 416 -52 -788 -430 54 -27 -53 -852 -606 70
$$ packed form
4833D04L93j186K22J39K53P0n71j42M28M82k38m57l67O56J74l40l28k55N59M47
4853C43m30q99M18M22M79k83p09J05J164j97m92n82J77Q71n3p31RM55N89k17p52
4874c13N8L20M24k94o00Q1Q33ml63m04j15R53k42m96k5M3L25K85m60m41K51N51
4896C67l00o45R8M50K90l87j14k32K50N42m59q5k32K48K51j45k48J05K94k23L6
4917a39k2j17K63k54J11M68m53K4J51p5J98q4k00J0J89m3m59j5L41K50j19n73
4939e48mj3R32n44q33R81J15r2l24k15K14P01k43o07K83O9Q48r14n93O14M22L55
4961F04m97p73Q17M27l12k35m37K70N39l15m98J95M75N9k3n37p6O00n5po05R1
4983b93L11K03m89j31j65O50J55n54l53K11M95L76m68p36L58M84q1k6p99K46O76
$$ plain form
5004 70 107 -562 -852 -251 -22 24 -551 -591 -149 454 130 -718 -624 162 433 259 -299 -348 168 650 -25 -508
5026 -508 -395 309 854 -121 -321 -137 537 699 118 -689 -88 701 557 -9 -675 -198 695 190 -379 -822
5046 -822 -239 668 338 -788 -708 38 590 357 -820 -714 630 590 -67 -822 -579 635 585 -196 -1244
5065 -1244 -426 398 536 -310 -861 -239 665 432 -634 -968 -41 875 -80 -875 -886 122 654 -276 -976
5084 -976 -612 456 653 -187 -1191 -334 541 366 -158 -919 -202 831 634 -696 -1019 144 767 691 -756
5103 -756 -643 368 704 227 -480 -607 354 752 475 -384 -408 530 996 -300 -634 -490 625 652 -256 -995
5123 -995 -435 811 506 -25 -1004 66 736 818 -360 -950 141 919 390 -616 -456 -50 659 70 -532
5142 -532 -364 304 623 97 -373 -653 582 714 -240 -477 -424 814 941 -291 -532 -173 307 564 -52
$$ packed form
5004G0L7o69k90O01K29M6n75m0M42O03l24q48R4P86K71j74n58m9N16M82o75m83
5026e08J13P04N45r75k00J84O74J62n81q07O01P89j44n66o66M77Q93n05n69m43
5046h22N83R07l30j126Q0P46N52k33j177J06J344m0o57p55K43J214n0p81j048
5065a244Q18Q24J38q46n51O22R04k33j066l34R27R16r55p95j1J008N32r30p00
5084i76L64J068J97q40j004Q57Q75j75n24p61P17J033j97j330l23J163O23p6j447
5103g56J13J011L36m77p07j27R61L98k77q59k4R38M66j296l34J44J115K7r08p39
5123i95N60J246l05n31r79J070O70Q2j178n90J091P78n29j006J60M06P09n89o02
5142e32J68O68L19n26m70k80J235J32r54k37N3J238J27j232k41L59M80K57o16
$$ plain form
5161 -52 -729 201 539 307 -296 -613 350 781 422 -676 -432 309 1237 430 -673 -590 440 743 -182 -772
5181 -772 -401 777 701 -248 -1015 -392 1171 801 -559 -807 160 1214 384 -542 -661 347 787 438 -364
5200 -364 -535 814 874 -46 -524 128 696 693 -280 -697 106 504 593 -380 -770 250 642 286 -361 -650 247
5221 247 605 -256 -380 -239 228 643 91 -632 -301 158 508 -64 -453 -262 188 329 -92 -430 -70 127
5241 127 228 -147 -390 4 201 85 -514 -324 -29 332 239 -65 10 190 453 -38 -295 53 364 463 221
5262 221 -349 96 296 457 508 -247 101 539 546 381 -236 154 426 506 4 90 -260 400 388 -517 4 54
5284 54 276 293 -442 -695 -45 212 -136 -453 -336 275 475 -13 -289 -450 402 157 -329 -691 -304 470 19
5305 19 -519 -576 352 294 -277 -417 -400 268 569 -23 -272 36 178 155 -374 -382 1 360 -63 -273 -197 255 359
$$ packed form
5161e2o77R30L38k32o03l17R63M31l59j098K44P41R28q07j103Q3J030L03r25n90
5181g72L71J178p6r49p67O23J563l70j360k48R67J054q30r26j19J008M40l49q02
5200c64j71J349O0r20m78O52N68lr73m17Q03L98Q9r73l90J020L92l56o47k89Q97
5221B47L58q61j24J41M67M15n52p23L31M59L50n72l89J91M50J41m21l38L60J97
5241A27J01l75k43L94J97j16n99J90K95L61r3l04P5J80K63m91k57L48L11R9k42
5262B21n70M45K00J61N1p55L48M38Pj65o17L90K72Q0n02Q6l50O60j2r05N21N0
5284E4K22J7p35k53O50K57l48l17J17O11K00m88k76j61Q52k45m86l62L87P74m51
5305A9n38n7R28n8n71j40J7O68L01n92k49L08J42k3n29qL83L59m23k10P6M52J04
$$ plain form
5328 359 21 -465 -90 496 141 -413 -133 213 408 -169 -221 -28 -7 247 162 -171 14 -67 -147 -191 -256 143
5350 143 294 -444 -49 66 89 287 -205 -395 -25 24 -182 -247 -173 227 127 -34 -61 52 -258 392 -137 -200
5372 -200 47 -192 187 -112 -21 200 98 -206 -119 -372 -30 64 -296 -86 -166 -611 -244 -277 -434 237 -323 -239
5394 -239 47 -298 -34 262 68 79 213 -71 151 188 -308 60 -197 129 -129 204 66 249 10 105 330
5415 330 -249 154 247 147 71 -108 -90 183 -236 -214 -289 10 56 -91 -369 -543 168 135 -10 -170 -308 -208
5437 -208 255 -13 -397 -222 342 -155 -463 -584 -333 -182 -15 -616 -577 214 64 -110 -566 -606 98 151 -434
5458 -434 -419 -271 3 15 -310 -719 -7 381 -94 -278 -483 288 575 105 -176 70 435 532 -6 -476 296
5479 296 346 210 -201 -647 62 332 177 -181 -605 -165 552 330 -210 -46 152 557 70 -364 -45 212
$$ packed form
5328C59l38m86L75N86l55n54K80L46J95n77n2J93K1K54q5l33J85q1q0m4o5L99
5350A43J51p38L95J15K3J98m92j90L70M9k06o5P4M00j00j61k7J13l10O50n29o3
5372b00K47k39L79k99R1K21j02l04Q7k53L42R4l60K10q0m45L67l3j57O71n60Q4
5394b39K86l45K64K96j94J1J34k84K22L7m96L68k57L26k58L33j38J83k39R5K25
5415C30n79M03R3j00p6j79J8K73m19K2p5K99M6j47k78j74P11l3j45j60j38J00
5437b08M63k68l84J75N64m97l08j21K51J51J67o01L9P91j50j74m56m0P04N3n85
5458d34J5J48K74J2l25m09P12L88m75j84k05P71K87m70k81K46L65R7n38m70P72
5479B96N0j36m11m46P09K70j55l58m24M40P17k22n40J64J98M05m87m34L19K57
$$ plain form
5499 212 313 -99 -152 -163 216 264 41 -379 97 362 580 -445 -214 241 492 261 -378 -585 147 364 6
5520 6 -587 -433 -25 309 -178 -552 -542 -52 507 -182 -416 -301 296 302 -90 -288 -25 566 203 19 -481 285
5542 285 465 -80 -194 -141 94 414 267 -267 -67 433 506 421 103 -21 505 282 -146 -214 -314 287 628
5563 628 -26 -219 -28 80 473 -76 -508 56 269 317 -315 -355 127 588 206 -565 -210 -111 588 -194 -752
5584 -752 -402 211 435 -70 -695 -163 723 349 -405 -300 -28 833 364 -636 -566 -52 395 336 -632 -336
5604 -336 513 483 36 -548 -164 498 573 -438 -387 160 433 202 -271 -632 214 417 25 -423 -694 271 684
5625 684 73 -595 -315 390 588 86 -433 -190 533 629 -239 -618 70 642 242 -20 -458 60 741 271
5645 271 -109 -298 79 588 92 -372 -126 -8 152 209 -496 -318 224 145 -407 -402 -169 287 388 -82 -408
$$ packed form
5499B12J01m12n3j1L79M8k23m20M76K65K18j025K31M55K51k31o39k07P32K17l58
5520Fn93J54M08L34m87l74J0M90N59o89k34J15N97Ol92j98K63N91l63j84n00P66
5542B85J80n45j14N3K35L20j47n34K00N00P3q5l18j24N26k23m28o8j00O01L41
5563F28o54j93J91J08L93n49m32N64K13M8o32m0M82M61l82p71L55R9O99p82n58
5584g52L50O13K24n05o25N32Q86l74p54J05K72Q61m69j000P0N14M47n9r68K96
5604c36Q49l0m47n84L84O62P5j011N1N47K73k31m73l61Q46K03l92m48k71R65M13
5625F84o11o68K80P05J98n02n19K43P23R6q68l79O88N72m00k62m38N18O81m70
5645B71l80j89L77N09m96m64K46J18J60N7p05J78N42p9n52NK33M56J01m70l26
$$ plain form
5666 -408 -270 160 281 -276 -482 -311 191 -60 -130 -632 -215 226 112 -274 -529 -177 163 110 -543 -261 253
5687 253 444 316 -259 -306 84 267 3 -541 -495 485 480 16 -395 -44 320 425 -224 -762 123 708 476
5708 476 -391 -640 78 654 41 -727 -500 387 328 -206 -578 -219 555 287 -275 -762 343 364 332 -545 -644
5729 -644 189 436 128 -622 -688 -59 252 -7 -498 -290 155 439 1 -557 -420 263 379 -262 -372 -407 385
5750 385 -87 -172 -406 69 -168 140 -109 -283 129 63 129 -302 -272 80 55 74 -85 -374 16 407 -152 -54
5772 -54 -142 -219 265 89 -323 -59 196 123 175 -137 -41 135 48 -157 -133 78 117 227 -52 -257 -115 88 383
5795 383 -283 -217 8 280 -96 -4 -266 -22 21 -46 -146 -320 45 331 -153 -230 -324 -22 286 -251 -237 -105
5817 -105 83 177 -257 -371 -145 67 -144 -229 -339 -143 -72 -242 -56 -217 -199 -113 25 -466 110 153 122 -250
$$ packed form
5666d08J38M30J21n57k06J71N02k51p0n02M17M41j14l86k55L52L40n3o53K82N14
5687B53J91j28n75m7L90J83k64n44M6R80nm64m11L51L64J05o49n38Q85N85k32
5708D76q67k49P18N76o13p68K27Q87n9n34l72L59P74k68n62m87J105K1l2q77r9
5729f44Q33K47l08p50o6O29L11k59m91K08M45K84m38n58J37O83J16o41j10l5P92
5750C85m72q5k34M75k37L08k49j74M12o6O6m31L0L52k5J9j59k89L90L91n59R8
5772e4q8p7M84j76m12K64K55p3N2l12R6J76q7k05K4K11L9J10k79k05J42K03K95
5795C83o66O6K25K72l76R2k62K44M3o7j00j74L65K86m84p7r4L02L08n37J4J32
5817a05J88R4m34j14K26K12k11q5j10J96P1j70J86j61J8Q6J38m91N76M3l1l72
$$ plain form
5839 -250 -160 -94 34 -118 -342 -264 -227 -3 -156 50 42 -11 -147 172 30 -65 283 193 -36 421 16 34 189
5862 189 195 154 189 -247 143 58 -157 27 106 -271 44 286 -132 -200 88 552 186 -149 -92 59 45 -50 -330
5885 -330 -375 183 11 -272 -82 -272 76 120 -92 66 103 -45 368 -16 -122 -150 -21 80 -227 -287 -241 266
5907 266 -7 -117 -226 -303 271 449 -55 1 -40 470 174 -236 -338 88 163 37 -545 -430 -46 69 -259
5928 -259 -372 -143 310 296 -262 -336 394 458 402 -167 -116 291 472 -61 -59 -178 10 306 82 -245 -156 327 646
5951 646 62 -232 248 511 361 148 -232 -184 226 345 -80 -708 -288 239 324 -374 -308 -164 193 190 -286 -260
5973 -260 -33 269 200 -220 -279 -26 382 138 -353 -387 67 595 -60 -258 -287 254 627 -49 -519 78 426
5994 426 507 11 -272 147 656 654 -85 -532 -205 546 331 -507 -346 195 605 196 -163 -251 220 548 112
$$ packed form
5839b50R0O6J28j52k24P8L7K24j53K06qn3j36L19j42r5L48r0k29M57m05J8J55
5862A89Om1L5m36L90q5k15J84P9l77L15K42m18o8K88M64l66l35N7J51j4r5k80
5885c30m5N58j72k83J90j90L48M4k12J58L7j48M13l84j06k8J29J01l07o0M6N07
5907B66k73j10j09p7N74J78n04N6m1N10k96m10j02M26P5j26n82J15L84J15l28
5928b59j13K29M53j4n58p4P30O4n6n69N1M07J81n33Kj19J88K96k24l27Q9M83L19
5951F46n84k94M80K63j50k13l80M8M10J19m25o28M20N27Q5o98O6J44L57lm76K6
5973b60K27L02o9m20n9K53M08k44m91l4M54N28o55j98k9N41L73o76m70N97L48
5994D26Q1m96k83M19N09kp39m47L27P51k15q38J61N41M10m09l59q8M71L28m36
$$ plain form
6015 112 -491 -249 466 347 -75 -566 -136 264 381 -326 -679 72 343 365 -240 -610 30 565 -89 -567
6035 -567 -376 401 734 79 -368 -218 126 524 55 -320 -61 545 382 -15 -446 23 524 470 -556 -538
6055 -538 39 634 162 -523 -366 265 366 95 -487 -485 89 168 22 -377 -323 152 671 185 -110 -335 144
6076 144 609 107 -469 -164 562 407 -13 -405 -115 284 546 6 -350 2 492 298 -319 -455 130 753
6096 753 375 -87 -610 114 654 200 -483 -701 17 495 81 -658 -564 247 88 -300 -724 -159 518 272
6116 272 -244 -756 -141 393 23 -191 -404 70 417 105 -492 -220 144 404 164 -553 61 131 362 -92
6136 -92 -483 -151 282 317 -122 -308 -179 598 288 -491 -241 -54 237 -16 -410 22 381 116 235 -190 -73
6157 -73 -71 298 23 -316 -142 351 408 82 -49 169 135 143 -149 -497 -176 -10 3 -48 -325 10 252 49 -67
$$ packed form
6015A12o03K42P15j19m22m91M30M00J17p07l53P51K71K2o05l70O40N35o54m78
6035e67J91P77L33o55m47J50L44L98m69l75K59O06j63l97m31M69N01n4j026J8
6055e38N77N95m72o85J57O31J01k71n82KN74P9j46l99N4M75N19m86k95k25M79
6076A44M65n02n76L05P26j55m20l92K90L99K62n40l56L52M90j94o17j36N85O23
6096G53l78m62n23P24N40m54o83k18P18M78m14p39R4Q11j59l88m24N65O77k46
6116B72n16n12O15N34l70k14k13M74L47l12n97K72L64K60k40p17O14P0K31m54
6136i2l91L32M33L5m39j86J29P77l10p79K50J87K91k53l94M32L59k65J19m25J17
6157g3KL69k75l39J74M93N7l26j31K18l4Qk92l48L21J66J3n1k77L35K42k03j16
$$ plain form
6180 -67 -19 -141 180 -134 -290 -493 -178 99 -143 -547 -518 -82 181 87 -201 -198 -99 108 42 -354 -401 5 350
6203 350 -429 -371 -277 155 112 -167 -294 -137 252 -166 155 -326 120 226 181 -213 -213 303 380 509 -39 66
6225 66 380 174 -80 -377 -8 105 -70 70 -263 -31 284 273 -161 136 -132 187 2 -108 58 245 -117
6246 -117 19 -35 -269 -198 201 163 -61 -122 -131 68 -182 6 378 133 44 -224 308 245 95 -137 -369 245 12
6269 12 -117 53 -258 -101 -386 29 -139 -104 181 -37 196 -60 3 -8 -48 52 -140 117 4 -64 173 23
6291 23 18 -17 -229 208 36 177 43 -148 144 140 412 -148 -214 -52 405 66 -282 146 169 307 219 -113 -93
6314 -93 114 189 34 -194 -66 179 156 -210 140 87 79 -56 -113 -299 -16 76 68 -208 -224 292 98 -33 -140 -127
6338 -127 -55 481 -91 -306 -35 29 159 -14 -207 -111 117 20 -87 -4 -77 208 -149 43 -338 5 244 248 1
$$ packed form
6180f7M8j22L21l14j56k03L15K77k42m04K9M36K63r4k88LR9K07o6l96m7M06L45
6203C50p79N8R4M32m3k79j27J57L89m18L21m81M46J06m5l94%N16P7J29n48J05
6225F6L14k06k54k97L69J13j75J40l33K32L15j1m34K97k68L19j85j10J66J87l62
6246a17J36n4k34P1L99l8k24o1rJ99k50J88L72k45q9k68N32o3j50k32k32O14k33
6269A2j29J70l11J57k85M15j68L5K85k18K33k56O3j1m0J00j92K57j13o8K37j50
6291B3nl5k12M37j72J41j34j91K92mK72n60o6J62M57l39l48M28K3J38q8l32K0
6314i3K07P5j55k28J28K45k3l66L50n3qj35n7j86K83R2qk76j6N16j94j31j07J3
6338a27P2N36n72k15K71O4J30j73j93R6K28r7j07Q3p3K85l57J92l81L43K39Mk47
$$ plain form
6361 1 -129 -89 95 158 -329 -115 100 355 -72 -300 -210 22 244 -165 -286 -122 99 153 -172 -28 70 228
6383 228 389 161 -79 325 440 172 -226 -287 78 431 227 95 -189 268 348 161 -447 -27 -154 252 -144
6404 -144 -300 -469 51 101 -143 -237 -464 162 406 262 -242 -250 127 -31 -501 -404 -47 129 -142 -425 -250 297
6426 297 242 -122 -121 -68 282 278 -258 -402 -283 75 253 -298 -18 121 545 107 -258 -477 -27 444 -1 -390
6448 -390 -228 201 110 -366 -303 47 156 84 -277 -212 -264 441 -84 90 212 -117 205 58 199 -131 -109 56
6470 56 302 -33 -245 96 91 87 -59 -101 100 208 187 -336 -111 97 80 26 -220 58 314 109 -230 -271 -76
6493 -76 -100 256 -66 -342 -55 56 -74 -373 -281 -25 190 4 -450 -124 -50 -7 -200 -469 -315 92 397 -17
6515 -17 -191 -206 303 342 -73 -317 -245 419 384 -4 -178 159 346 432 -137 -250 409 465 70 -325 -32 154
$$ packed form
6361Aj30M0J84O3m87K14K15K55m27k28R0K32K22m09j21J64K21N4l25J44R8J58
6383B28J61k28k40M04J15k68l98o1L65L53k04j32k84M57Q0j87o08M20j27M06l96
6404a44j56j69N20N0k44r4k27O26K44j44n04qL77j58m70R7L57J76k71k83J75N47
6426B97n5l64JN3L50mn36j44J19L58J78n51K80J39M24m38l65k19M50M71m45l89
6448c90J62M29r1m76O3L50J09p2l61O5n2P05n25J74J22l29L22j47J41l30K2J65
6470E6K46l35k12L41nmj46m2K01J08k1n23K25K08j7n4k46K78K56k05l39m1J95
6493g6k4L56l22k76K87J11j30k99R2K56K15j86m54L26P4M3j93k69J54M07L05m14
6515a7j74j5N09L9m15k44P2O64l5l88j74L37J87Q6n69j13O59N6l95l95K93J86
$$ plain form
6537 154 392 -100 -501 294 478 309 -192 -537 -4 325 144 -214 -219 171 453 -279 -355 -188 82 20 125
6558 125 -407 89 362 475 -118 -148 -133 70 141 -184 -217 -38 268 207 -117 -109 129 -20 166 -203 -180 268 -72
6581 -72 59 -134 -292 321 213 -216 -197 -188 212 354 -105 -113 66 81 283 -8 26 43 -39 83 283 -146 113
6604 113 322 327 -125 -141 524 347 346 -278 -347 278 361 246 -224 -122 413 368 -82 -400 83 30 165 -28 -339
6627 -339 -178 123 -60 -319 -494 -19 151 -69 -171 -310 12 55 -197 -388 -218 74 284 -123 -355 32
6647 32 76 323 -13 -357 -116 223 176 -21 -113 -131 293 203 -24 16 55 556 -23 -18 -350 231 -94 178 -307
6670 -307 -130 188 328 257 -342 42 205 162 -413 -31 123 250 118 -100 -233 52 161 169 -96 -339 -206
6691 -206 90 22 -366 6 296 246 -139 -367 217 142 397 76 -13 -18 22 -91 -266 -103 -174 74 -92 -353 -193
$$ packed form
6537A54K38m92m01P95J84j69n01l45N33L29j81l58nL90K82p32p6J67K70o2J05
6558A25n32M96K73J13n93l0J5K03P1l25l3J79L06o1l24QK38j49J86l69K3M48l40
6581g2J31j93j58O13j08m29J9RM00J42m59qJ79J5K02k91L4J7q2J22K00m29K59
6604A13K09Nm52j6O65j77jo24o9O25Q3j15m70J02N35m5m50l18M83n3J35j93l11
6627c39J61L01j83k59j75M75J70k20j02j39L22M3k52j91J70K92K10m07k32L87
6647C2M4K47l36l44K41L39m7j97r2j8M24r0k27M0L9N01n79Nl32N81l25K72m85
6670c07J77L18J40p1n99L84J63m3n75L82J54J27j32k18j33K85J09Qk65k43J33
6691b06K96o8l88L72K90n0l85k28N84p5K55l21q9nM0j13j75J63p1K48j66k61J60
$$ plain form
6714 -193 -57 102 68 -145 -171 -23 37 -48 -109 -443 -138 -153 -48 -113 -68 -36 -177 176 75 -143 -458 70 -1
6737 -1 -184 165 248 62 159 -206 110 97 271 -191 -57 -227 71 36 -144 -59 -51 -21 388 84 -54 24 -37 80
6761 80 -69 65 50 -135 -145 292 -270 241 79 -399 -195 93 167 -22 226 -170 14 -3 59 -12 54 99 356
6784 356 73 -52 -128 -182 65 67 -247 107 71 -157 -156 -28 -304 -66 -14 -26 -31 -151 -85 152 -132 19 100 -148
6808 -148 -292 -173 5 -66 -24 126 21 450 117 -99 -156 8 177 148 12 239 240 101 6 131 32 151 36
6831 36 104 42 339 173 118 28 14 491 74 -219 -257 91 146 -87 -177 -44 124 -49 -6 -302 -213 108 -79 -255
6855 -255 -351 -362 118 -404 -315 -255 -22 -124 33 -380 -109 -155 171 -149 -404 -148 132 187 -23 -201 -304 76
6877 76 -15 -40 -371 -65 19 -38 -170 -261 -151 64 291 -196 -180 26 155 317 17 -315 174 132 147 -66 -100
$$ packed form
6714a93J36J59l4k13k6J48O0q5o1l34L05j5J05o5M5L2j41L53j01k18l15N28p1
6737aj83L49Q3j86R7l65L16j3J74m62J34j70K98l5j80Q5QL0M09l04j38P8o1J17
6761H0j49J34j5j85j0M37n62N11j62m78K04K88P4j89K48l96J84j7O2p1O6M5K57
6784C56k83j25p6n4K47Kl14L54l6k28JJ28k76K38N2j2nj20O6K37k84J51Q1k48
6808a48j44J19J78p1M2J50j05M29l33k16n7J64J69k9j36K27Jj39r5J25r9J19j15
6831C6O8o2K97j66n5r0j4M77m17k93l8L48N5k33r0J33J68j73M3k96Q9L21j87j76
6855b55r6j1M80n22Q9O0K33j02J57m13K71m6L26l20k55K56K80N5k10j78j03L80
6877G6r1k5l31L06Q4n7j32r1J10K15K27m87J6K06J29J62l00l32M89m2J5k13l4
$$ plain form
6900 -100 -158 200 -10 -10 -147 -90 225 3 60 21 2 205 165 -96 -3 300 311 193 -249 -148 254 46 123 -46
6924 -46 -60 201 409 -214 -105 -118 236 254 -82 -383 88 152 26 -72 -411 332 265 21 -456 -301 98 77 -227
6947 -227 -525 -182 380 236 -234 -327 -77 131 -94 -338 -365 -94 536 -58 -227 -181 224 494 -89 -236 -80
6968 -80 228 284 6 -206 67 170 196 -179 -280 -158 167 124 -268 -504 83 100 332 -178 -410 301 94 -20
6990 -20 -155 -223 308 473 138 -338 -90 53 272 64 -198 38 401 227 60 -367 -124 156 226 -228 -423
7011 -423 -36 309 89 -102 -266 -53 307 197 -435 -93 -175 282 148 -422 -393 84 165 9 -293 -176 21
7032 21 502 60 -234 -239 -71 88 208 -19 -25 151 293 -29 -247 47 236 99 -165 -46 211 276 324 -599
7054 -599 -420 64 112 276 -556 -139 323 264 3 -379 -347 103 262 -184 -195 -279 24 19 -289 -243 102 159 240
$$ packed form
6900a00n8L58k10%j37N7L15k22N7l9j9K03m0k61R3L03J1j18m42J01M02k08P7j69
6924d6j4K61K08o23J09j3L54J8l36l01M71O4j26r8l39P43o7k44m77J55L99k1l04
6947b27k98L43N62j44m70r3K50K08k25k44k7K71O30n94j69M6M05K70n83j47J56
6968h0L08N6k78k12K73J03K6l75j01J22L25m3l92k36N87J7K32n10k32P11k07j14
6990b0j35o8N31J65l35m76K48J43K19k08k62K36L63j74j67m27K43K80P0m54j95
7011d23L87L45k20j91j64K13L60j10o32L42q2M57j34n70K9M77Q1j56l02J17J97
7032B1M81m42k94nJ68J59J20k27oJ76J42l22k18K94J89j37k64J19K57O5M8r23
7054e99J79M84M8J64q32M17M62n9k61l82L2M50J59m46j1q4L03nl08M6L45N7Q1
$$ plain form
7077 240 -317 -672 -21 65 -278 -332 -288 148 96 -45 -284 -354 151 105 -33 -571 10 276 118 -147 -100 -109 -51
7100 -51 184 -42 -217 -271 109 393 -121 -157 38 195 64 -265 -184 -94 379 163 -215 -74 -33 274 -243 3
7122 3 -100 38 167 -127 147 -129 227 4 75 144 -232 95 240 -113 21 351 343 130 -73 56 501 192
7144 192 0 -200 -193 -25 -107 222 -210 -102 120 -222 6 79 -42 177 63 88 259 -206 10 267 41 -136
7166 -136 18 182 -227 32 -64 -144 189 5 45 117 -55 371 325 -215 -28 181 74 204 -9 27 73 -79
7188 -79 -60 -196 -166 204 171 -62 -255 73 70 -141 -174 -150 21 -57 -157 -41 248 95 -40 -46 -18 -216 -149 -123 -110
7213 -110 139 -30 -185 -71 -98 -4 93 -67 -302 186 67 40 71 18 111 149 34 -270 -235 45 -99 -346 -50
7236 -50 -158 182 -113 -234 -68 34 -101 -280 -127 -201 131 -54 -202 -71 -175 97 183 -131 -67 219 96
$$ packed form
7077B40n57l55O51Q6l43n4M4M36n2j41k39p0N05m6j38n38N81K66j58k65M7rN8
7100e1K35k26j75n4L80K84n14l6J95J57j31l29Q1R0M73k16l78J41M1L07n17K46
7122Cj03J38J29k94K74k76L56k23P1O9l76L27J45l53J34L30qk13k03J29M45l09
7144A92j92k00PJ68q2L29m32J08K22l42K28P3j21K19j14K5J71m65K16K57k26j77
7166a36J54J64m09K59r6q0L33j84M0P2j72M26m6n40J87K09j07J30k13L6M6j52
7188g9J9j36L0L70l3k33j93L28lk11l3K4J71p8j00J16K89j53j35oK8j98O7K6J3
7213a10K49j69j55J14k7R4R7j60k35M88j19k7L1n3R3L8j15l04L5K80j44k47K96
7236e0j08L40k95j21J66J02j35j79J53p4L32j85j48J31j04K72Q6l14O4K86j23
$$ plain form
7257 96 -46 -45 -55 213 371 -70 -94 -344 107 314 194 57 212 290 153 39 -262 -55 61 -13 295 11
7279 11 162 190 3 -34 -1 -54 17 -59 -340 -217 -53 221 199 -86 -125 -126 207 -13 -19 26 159 44 -136 -191 100
7304 100 175 26 -177 -327 -257 77 -56 35 -270 -109 124 219 94 -194 59 31 59 -324 -43 -184 38 42 -295
7327 -295 -187 -78 -114 72 -256 -229 58 142 87 -130 -88 188 390 -131 -195 12 160 -15 -61 -67 55 206 1
7350 1 -40 57 228 419 227 -401 98 315 508 -11 139 -191 199 256 -219 196 116 230 268 -22 -134 -29
7372 -29 218 152 -10 -255 -153 100 156 -293 -70 -78 218 -96 -171 -112 -29 203 -34 -354 -139 -85 -43 196 -271
7395 -271 64 -74 66 44 -200 169 154 -85 -74 -232 112 81 -161 -427 103 -84 230 34 -136 -135 119 -6
7417 -6 -65 79 -114 -49 14 -235 -40 183 -64 198 95 55 138 253 266 127 -70 107 180 -51 106 -168 80
$$ packed form
7257I6j42Jj0K68J58m41k4k50M51K07j20j37J55P8j37j14l01K07J16p4L08k84
7279A1J51K8j87l7L3n3P1p6k81J23J64K74k2k85l9jL33k20oM5J33j15j80n5K91
7304A00P5j49k03j50P0L34j33R1l05J61K33R5j25k88K53k8K8l83K81j41K22Ml37
7327b95J08J09l6J86l28K7K87Q4n5k17M2K76K02n21o4K07J48j75m6oJ22J51k05
7350Am1R7J71J91j92o28M99K17J93n19J50l30L90N7m75M15q0J14L8k90j12J05
7372b9K47o6j62k45J02K53N6m49K23qK96l14p5N9Q3K32k37l20K15N4M2K39m67
7395b71L35j38J40k2k44L69j5k39J1j58L44l1k42k66N30j87L14j96j70JK54j25
7417fn9J44j93O5O3k49J95K23k47K62j03m0Q3J15J3j39j97J77P3k31J57k74K48
$$ plain form
7440 80 138 31 -109 117 98 52 54 -230 63 350 182 134 -96 10 123 -35 -238 -177 55 413 121 -234 -202
7463 -202 -7 -20 -134 -454 -286 110 56 -23 -236 -87 69 91 -290 -326 -227 167 120 -78 -58 68 261 305 -199
7486 -199 -332 325 289 -3 28 -33 402 134 175 -159 -55 140 427 237 129 108 327 155 -62 -189 153 325
7508 325 345 -130 83 79 260 248 -91 103 -76 -58 96 1 -89 341 85 -118 -61 55 65 218 -165 -100 268
7531 268 329 336 -312 65 88 77 247 -118 -258 185 77 -110 -134 -66 -11 73 -199 -137 -14 -107 149 -129 -245 40
7555 40 246 90 145 -81 112 362 -41 -280 46 179 220 12 -315 127 -22 43 114 -56 -36 -16 -48 -44 -179
7578 -179 159 30 119 -137 -51 -150 102 -25 -37 -34 33 23 -51 -39 -170 176 291 -43 111 -200 -40 122 -22
7601 -22 80 -48 -60 -56 -139 -291 -129 128 -9 44 -34 22 408 -110 -117 153 23 224 308 -29 156 -80 -17 38
$$ packed form
7440H0N8j07j40K26j9m6Kk84K93K87j68m8k30J06J13j58k03O1K32L58k92l55L2
7463b02J95j3j14l20J68L96n4p9k13J49J56K2l81l6R9L94m7j98K0J26J93M4n04
7486a99j33O57l6k92L1o1M35k68M1l34J04J95K87j90j08k1K19j72k17j27L42J72
7508C25K0m75K13mJ81j2l39J94j79J8J54r5r0M30k56k03N7J16J0J53l83O5L68
7531B68O1Po48L77K3j1J70l65j40M43j08j87k4O8N5Q4k72O2J23r3K56k78j16K85
7555D0K06j56N5k26J93K50m03k39L26J33M1k08l27M42j49O5P1j70K0K0l2Mj35
7578a79L38j29Q9k56Q6r9K52j27j2LO7j0p4J2j31L46J15l34J54l11J60J62j44
7601b2J02j28j2Mq3j52J62K57j37N3p8N6L86n18pK70j30K01Q4l37J85k36O3N5
$$ plain form
7625 38 -99 -244 189 193 141 47 -13 -43 -87 -59 -126 -83 -285 128 -336 -316 -103 215 85 -284 -165 46 146 37
7649 37 -216 222 8 -29 -130 -113 342 118 100 238 -30 -47 249 54 -56 -178 -124 -32 67 -51 77 83 52 28
7673 28 121 -137 17 0 228 159 -106 -11 227 -160 98 -162 -235 -32 61 123 -107 -187 50 -12 -52 -14 116 71
7697 71 -44 225 -134 -24 -337 -196 22 -86 -8 2 -399 -114 -93 339 -121 -160 126 161 69 259 108 177 67
7720 67 -20 -149 3 -103 97 149 20 167 96 293 -64 89 39 -28 325 128 189 42 145 -236 -55 143
7742 143 148 93 5 4 -69 76 87 -38 77 24 286 116 10 118 256 -25 11 -218 27 206 14 -135 98
7765 98 119 280 -96 -221 -270 74 -39 -168 -170 -150 326 -84 -248 -216 60 28 -22 -77 62 -136 -90 -81 -175 -63 214
7790 214 89 229 -97 92 211 419 -58 85 -2 99 107 -226 -93 -37 28 121 13 -152 141 251 -143 -97
$$ packed form
7625C8j37j45M33Mn2r4o0l0m4K8o7M3k02M13m64K0K13L18j30l69J19K11J00j09
7649C7k53M38k14l7j01J7M55k24j8J38k68j7K96j95j10j22N4R2R9j18J28Ol1k4
7673B8R3k58J54j7K28o9k65R5K38l87K58k60p3K03R3O2k30q0K37o2m0L8J30m5
7697G1j15K69l59J10l13J41K18j08P8J0m01K85K1M32m60l9K86L5r2J90j51O9j10
7720F7q7j29J52j06K00N2j29J47p1J97l57J53n0o7L53j97O1j47J03l81J81J98
7742A43Nn5q8jp3J45J1j25J15n3K62j70j06J08J38k81L6k29K45J79j92j49K33
7765I8K1J61l76j25m9L44j13j29kK0M76m10j64L2K76l2n0n5J39j98M6Rr4J12K77
7790B14j25J40l26J89J19K08m77J43q7J01Ql33J33N6O5R3j08j65K93J10l94M6
$$ plain form
7812 -97 -35 -10 105 -10 182 -85 -52 104 -20 -408 88 143 -90 16 -122 -181 257 29 -160 1 51 245
7834 245 -29 -189 139 97 87 120 -125 -200 140 121 -142 -252 5 -71 192 -139 -32 93 324 141 -160 -120
7856 -120 76 203 -16 -176 9 34 223 357 -123 -282 393 191 -157 -122 -114 197 -94 110 -5 39 170 240
7878 240 51 -247 -118 300 213 -27 -255 -3 217 283 -238 -158 152 279 123 -198 -338 11 159 110 -200
7899 -200 -33 -255 27 79 -319 3 28 221 -291 -152 -206 264 279 -294 -203 -64 332 -3 -162 37 -80 251
7921 251 -206 -223 -53 -44 125 -172 -52 -4 9 51 21 227 -164 297 196 -82 22 67 68 -67 -322 101 -53
7944 -53 226 359 -153 -135 24 297 -245 -128 91 75 99 294 -4 90 226 380 279 -174 -8 342 79 236
7966 236 -255 -41 -12 314 24 -40 114 55 135 -209 -135 5 239 157 -110 -135 -29 17 130 47 -238 -108 129
$$ packed form
7812i7O2K5J15j15J92k67L3J56j24l88M96N5k33J06j38n9M38k28j89J61N0J94
7834B45k74j60L28m2j0L3k45p5L40j9k63j10K57p6K63l31J07J25K31j83l01M0
7856a20J96J27k19j60J85K5J89J34m80j59O75k02l48L5QL11k91K04j15M4J31P0
7878B40j89k98J29M18q7k40k28K52K20O6n21Q0L10J27j56l21j40L49J48m9l10
7899b00J67k22K82N2l98L22K5J93n12J39n4M70J5n73R1J39L96l35j59J99j17L31
7921B51m57j7J70RJ69k97J20M8J3M2l0K06l91M61j01k78J04M5Jj35k55M23j54
7944e3K79J33n12J8J59K73n42J17K19j6K4J95k98R4J36J54j01m53J66L50k63J57
7966B36m91K14K9L26k90o4J54n9Q0l44P4J40K34q2k67k5J06M6J13q3k85J30K37
$$ plain form
7989 129 -142 -187 -104 -61 76 -27 -331 113 5 -71 -68 -99 65 -27 95 -101 -409 -172 180 -196 -349 45 -78
8012 -78 352 -31 -376 -152 69 218 89 -13 173 149 44 43 -207 -22 -72 -26 -94 14 -18 -132 13 -121 -264
8035 -264 154 209 -108 86 -133 -146 212 176 -227 -99 -56 -6 -12 0 17 -189 -387 -23 -44 -33 -95 293 -175 -243
8059 -243 -94 28 30 106 -153 -135 66 258 -125 -113 86 -202 84 -40 214 102 57 194 -65 -118 -129 229 41
8082 41 84 -7 -94 38 -186 70 -151 -91 61 -44 38 -60 138 -63 -61 -167 -106 -127 306 -197 -16 -106 34 -7
8106 -7 171 -19 80 211 117 292 200 -108 89 137 -48 12 -167 49 -98 246 25 -94 144 34 -114 81
8128 81 -26 -90 131 -89 -23 -201 110 -55 -68 81 -295 129 99 -210 32 -4 95 -59 -90 -218 -196 -26 147
8151 147 160 -34 71 50 -111 7 150 -113 27 111 5 3 15 37 12 164 -130 -195 40 232 37 -88 109
$$ packed form
7989A29k71m5Q3M3J37j03l04M44j08p6Ll1J64r2J22j96l08K37L52l76j53L94j23
8012g8M30l83l45K24K21J49j29j02J86k4j05jk50J85n0M6o8J08l2j14J45j34j43
8035b64M18N5l17J94k19j3L58l6m03J28M3N0oJ2J7k06j98L64k1J1o2L88m68o8
8059b43J49J22KP6k59J8K01J92l83J2J99k88K86j24K54j12m5J37k59n3j1L58j88
8082D1M3r1q7J32k24K56k21O0J52j05Q2r8J98k01Kj06O1k1M33n03J81r0J40m1
8106gJ78j90R9J31r4J75r2l08J97M8j85O0j79K16j47L44k21j19K38j10j48J95
8128H1j07o4K21k20O6j78L11j65j3J49l76M24l0l09K42l6R9j54l1j28K2J70J73
8151A47J3j94J05k1j61J18J43k63J40Q4j06kJ2K2k5J52k94o5K35J92j95j25J97
$$ plain form
8174 109 221 64 128 226 132 199 120 -221 -49 273 140 -75 152 -117 177 -202 21
$$ packed form
8174A09J12j57O4R8r4O7p9l41J72L22j33k15K27k69K94l79K23
8191B1
$$ Imaginary data points
##PAGE= N=2
##DATA TABLE= (X++(I..I)), XYDATA
$$ plain form
0 0 0 0 0 0 0 0 0 0 -8 8 -8 8 -16 16 -24 26 -37 42 -56 64 -80 90 -109 128 -152 175 -202 234 -269 309 -354
31 -354 402 -457 517 -583 655 -735 823 -922 1026 -1144 1270 -1407 1557 -1723 1903 -2097
47 -2097 2314 -2550 2808 -3093 3407 -3758 4145 -4582 5076 -5637 6282 -7035 7923 -8995
61 -8995 10312 -11980 14165 -17168 21564 -28638 41890 -75340 343863 560339 37726 150517
73 150517 147735 464837 381124 -54253 -13552 229461 291959 226753 -107204 -30125 251428
84 251428 239395 89868 -94775 -47203 220373 170944 -64555 -141103 -51871 81554 100308
95 100308 -144795 -193672 -15426 58142 60868 -76254 -134121 70416 141799 93575 17408
106 17408 -46989 127461 191968 82571 48567 -23310 107717 200782 46421 21109 22880
$$ packed form
0@%%%%%%%%qJ6j6J6k4L2m0N0o3P9r8J20j44J70j99K37k80L27l77M36n03N78o63
31c54P56q59R74j100J238j390J558j745J948k170K414k677K964l280L626m000
47b097M411m864N358n901O500p165P903q727R658j0713J1919j3317J4958j6918
61h995J9307k2292K6145l1333L8732n0202P0528j17230M19203K16476n22613J12791
73A50517k782L17102q3713m35377M0701K43013O2498o5206l33957P7079K81553
84B51428j2033j49527j84643M7572K67576m9429k35499p6548Q9232J33425J8754
95A00308k45103m8877J78246P3568K726j37122n7867K04537P1383m8224p6167
106A7408o4397J74450O4507j09397l4004p1877J31027R3065j54361k5312J771
$$ plain form
117 22880 95704 208848 83385 21396 78048 130308 213281 111588 21150 85494 117909
128 117909 162175 83879 -44337 20827 93669 77520 21861 -74521 -36439 88526 71873
139 71873 -18045 -63181 -18274 97110 93048 -38623 -64381 -883 84188 79674 -86575 -93365
151 -93365 20806 57590 43989 -94344 -114812 69751 94051 12155 -56840 -72896 108413
162 108413 144903 -3725 -43429 -13030 118475 141140 -24150 -57262 29108 108787 112942
173 112942 -33330 -67521 81121 123908 79064 -15566 -38322 108512 155401 48676 -22085
184 -22085 6376 102549 137603 15518 -45609 22134 86153 93226 -16841 -57928 34957 77099
196 77099 46702 -21591 -52913 37720 78248 3707 -32417 -36114 23027 51542 -25267 -50258
$$ packed form
117B2880P2824J13144j25463o1989N6652N2260Q2973j01693r0438O4344L2415
128A17909M4266p8296j28216O5164P2842j6149n5659r6382L8082J24965j6653
139G1873q9918m5136M4907J15384m062j31671k5758O3498Q5071m514j66249o790
151i3365J14171L6784j3601j38333k0468J84563K4300q1896o8995j6056J81309
162A08413L6490j48628l9704L0399J31505K2665j65290l3112Q6370P9679M155
173A12942j46272l4191J48642M2787m4844r4630k2756J46834M6889j06725p0761
184b2085K8461R6173L5054j22085o1127O7743O4019P073j10067m1087R2885M2142
196G7099l0397o8293l1322R0633M0528p4541l6124l697N9141K8515p6809k4991
$$ plain form
208 -50258 -32392 3877 16481 -42846 -57698 -20209 -13593 -2552 -28743 -56129 -6090 -7966
220 -7966 -14893 -6135 -32999 -11364 7178 -10085 860 -7570 -17758 14729 5421 7050 9369
233 9369 -19210 19220 30069 6393 15491 -5659 7508 50466 8385 -8441 9312 516 36213
246 36213 10552 -36193 -5493 4459 7912 -4403 -51394 -27676 6249 -15214 -22116 -54824 -44036
259 -44036 9900 -19276 -43181 -43347 -40601 2124 -3811 -55313 -39912 -15388 -2021 430 -45233
272 -45233 -35270 5064 10619 -400 -29244 -21258 23163 23350 -1036 -11364 -9577 31559 30117
285 30117 -8425 -6532 3086 23488 19226 -13923 -13891 7006 11729 2906 -21161 -17390 4348 -4807
299 -4807 -5000 -22738 -25900 -1239 -15821 -21317 -15621 -29025 -21722 -16293 -28267 -12342 -23770 -34487
$$ packed form
208e0258J7866L6269J2604n9327j4852L7489O616J1041k6191k7386N0039j876
220g966o927Q758k6864K1635J8542j7263J0945q430j0188L2487r308J629K319
233I369k8579L8430J0849k3676R098k1150J3167M2958m2081j6826J7753q796L5697
246C6213k5661m6745L0700R952L453j2315m6991K3718L3925k1463o902l2708J0788
259d4036N3936k9176k3905j66K746M2725n935n1502J5401K4524J3367K451m5663
272d5233R963M0334N555j1019k8844P986M4421J87k4386j0328J787M1136j442
285C0117l8542J893R618K0402m262l3149L2K0897M723q823k4067L771K1738r155
299d807j93j7738l162K4661j4582n496N696j3404P303N429j1974J5925j1428j0717
$$ plain form
313 -34487 -11548 -15055 -7951 -17639 -34326 -2316 8376 -9576 -14978 -27304 520 31371 -14790
326 -14790 -29119 -10273 8618 33092 -11155 -43134 4522 32128 19561 -12380 -44136 9321
338 9321 47376 1505 -32500 -41543 7308 42837 -20973 -61405 -28859 8130 25491 -29176
350 -29176 -75849 -14657 25399 8577 -34364 -64708 -8592 38163 -1773 -50030 -50106 -976 36657
363 36657 -12861 -56028 -32625 14079 38694 -10407 -46993 -7109 40887 41288 -2083 -31736
375 -31736 10090 56392 33651 -11108 -27640 16047 48588 16062 -23441 -26513 19369 45453
387 45453 7282 -27867 -8874 26014 44554 7281 -31775 666 28280 24646 -6796 -37162
399 -37162 -10386 19519 1720 -22668 -34776 -16088 21077 -656 -21467 -13959 -5394 27578
$$ packed form
313c4487K2939l507P104r688j6687L2010J0692j7952n402j2326K7824L0851m6161
326a4790j4329J8846J8891K4474m4247l1979M7656K7606j2567l1941l1756N3457
338I321L8055m5871l4005r043M8851L5529o3810m0432L2546L6989J7361n4667
350b9176m6673O1192M0056j6822m2941l0344N6116M6755l9936m8257p6M9130L7633
363C6657m9518m3167K3403M6704K4615m9101l6586L9884M7996M01m3371k9653
375c1736M1826M6302k2741m4759j6532M3687L2541l2526l9503l072M5882K6084
387D5453l8171l5149J8993L4888J8540l7273l9056L2441K7614l634l1442l0366
399c7162K6776K9905j7799k4388j2108J8688L7165k1733k0811P508Q565L2972
$$ plain form
411 27578 14819 -19743 -4047 7301 10760 15262 -22372 -23201 4252 -3560 2746 -19600 -32130
424 -32130 4156 11364 6244 -3109 -18279 15746 40032 12417 1845 -6689 16245 48333 10518
437 10518 -19512 -5684 22268 40768 12612 -25358 5025 52332 53016 22202 -4656 32956
449 32956 82197 65364 18891 5968 45760 84860 47052 -10510 1300 43005 65971 20847
461 20847 -32674 2221 52926 53135 3130 -30147 14565 60873 36353 -15018 -36692 13080
473 13080 48362 -4006 -46022 -45945 -1604 26115 -30260 -65006 -32176 9434 19450 -23930 -49430
486 -49430 -1259 34267 24753 -11705 -28633 18619 45253 17550 -12602 -12699 21127 47647 16883
499 16883 -14668 10671 39472 52137 31276 1789 29767 64692 53152 30323 11627 28667
$$ packed form
411B7578j2759l4562J5696J1348L459M502l7634q29K7453p812O306k2346j2530
424c2130L6286P208n120r353j5170L4025K4286k7615j0572q534K2934L2088l7815
437A0518l0030J3828K7952J8500k8156l7970L0383M7307O84l0814k6858L7612
449C2956M9241j6833m6473j2923L9792L9100l7808n7562J1810M1705K2966m5124
461B0847n3521L4895N0705K09n0005l3277M4712M6308k4520n1371k1674M9772
473A3080L5282n2368m2016P7M4341K7719n6375l4746L2830M1610J0016m3380k5500
486d9430M8171L5526r514l6458j6928M7252K6634k7703l0152r7L3826K6520l0764
499A6883l1551K5339K8801J2665k0861k9487K7978L4925j1540k2829j8696J7040
$$ plain form
511 28667 60866 31888 6899 1620 10529 38631 8566 -18753 -2796 6357 19751 6502 -24404
524 -24404 -2132 15806 8153 763 -20219 -5922 8933 -2453 -11766 -21427 -11008 1213 -5794
537 -5794 -12350 -9638 -4670 9521 12696 4255 6552 14292 23921 27674 21553 9142 19476 31958
551 31958 26763 16334 2780 15922 29862 24150 6880 -3689 19433 34167 18216 1861
563 1861 -3235 19225 38869 4975 -13638 -2886 14456 27701 -12627 -30083 -3156 13450
575 13450 15652 -20166 -36379 7743 23822 6117 -14930 -27633 18236 38891 -1253 -18686
587 -18686 -8953 23457 37356 -2211 -27250 3372 32563 27341 -6231 -26577 12946 42445
599 42445 17159 -13619 -16743 17914 45933 5358 -26327 -5120 17524 34371 -1486 -37767
$$ packed form
511B8667L2199k8978k4989n279Q909K8102l0065k7319J5957R153J3394j3249l0906
524b4404K2272J7938p653p390k0982J4297J4855j1386r313r661J0419J2221p007
537e794o556K712M968J4191L175q441K297P740R629L753o121j2411J0334J2482
551C1958n195j0429j3554J3142J3940n712j7270j0569K3122J4734j5951j6355
563A861n096K2460J9644l3894j8613J0752J7342J3245m0328j7456K6927J6606
575A3450K202l5818j6213M4122J6079j7705k1047j2703M5869K0655m0144j7433
587a8686R733L2410J3899l9567k5039L0622K9191n222l3572k0346L9523K9499
599D2445k5286l0778l124L4657K8019m0575l1685K1207K2644J6847l5857l6281
$$ plain form
611 -37767 -2030 24847 16948 -11505 -35001 -1416 29809 6093 -20202 -26519 5411 29203
623 29203 -1119 -22260 -16209 11459 26773 -1282 -23431 -6338 19402 21937 -1600 -19283
635 -19283 -757 22776 20666 -5651 -16000 6102 22633 17119 -6728 -13787 8531 26815 10095
648 10095 -12584 -7431 8584 22550 4888 -18617 -8341 10622 12781 -2802 -21810 -10156
660 -10156 11556 4421 -6405 -20797 -9790 15938 1087 -10111 -10373 -7531 11992 7524 -13389
673 -13389 -6729 -1307 4430 11033 -9836 -9686 2548 6818 10304 -3974 -11227 5066 13437 8475
687 8475 139 -14326 3905 20642 3609 -8754 -13414 321 19457 1471 -23880 -12273 5780
700 5780 14119 -1519 -27595 -11705 13021 11852 -10252 -27323 -7618 17851 6250 -19489 -24306
$$ packed form
611c7767L5737K6877p899k8453k3496L3585L1225k3716k6295o317L1930K3792
623B9203l0322k1141O051K7668J5314k8055k2149J7093K5740K535k3537j7683
635a9283J8526K3533k110k6317j0349K2102J6531n514k3847p059K2318J8284j6720
648A0095k2679N153J6015J3966j7662k3505J0276J8963K159j5583j9008J1654
660a0156K1712p135j0826j4392J1007K5728j4851j1198k62K842J9523m468k0913
673a3389O660N422N737O603k0869J50J2234M270L486j4278p253J6293Q371m962
687H475q336j4465J8231J6737j7033j2363m660J3735J9136j7986k5351J1607J8053
700E780Q339j5638k6076J5890K4726j169k2104j7071J9705K5469j1601k5739m817
$$ plain form
713 -24306 -3245 19501 1129 -26310 -19466 5359 16850 -3080 -24552 -15435 12191 15211 -10229
726 -10229 -24539 -8170 12532 8027 -14358 -26899 -3499 13594 -97 -17848 -20855 -956
738 -956 13451 -3172 -21397 -12824 3271 11321 -6377 -22151 -6444 5671 7585 -6732 -20020
751 -20020 -2329 13301 2253 -6372 -8943 -297 17649 2560 -9970 -761 5067 11200 2715
764 2715 -11194 -986 8573 2434 -384 -8845 -356 10174 -2493 -3401 -1382 223 7074 -2310
778 -2310 -9725 2967 807 -5136 -4084 -10958 -611 74 -12692 -8545 -2820 -775 -2806 -11084 -7104
793 -7104 6294 1359 -4908 -8922 -3112 10400 -88 -12393 -7814 2618 6791 -1427 -14163 -4396
807 -4396 12367 7987 -2081 -6360 6749 17929 11510 -1449 -1085 14466 18260 5898 -4163
$$ packed form
713b4306K1061K2746j8372k7439O844K4825J1491j9930k1472R117K7626L020k5440
726a0229j4310J6369K0702m505k2385j2541K3400J7093j3691j7751l007J9899
738i56J4407j6623j8225Q573J6095Q050j7698j5774J5707J2115J914j4317j3288
751b0020J7691J5630j1048q625k571Q646J7946j5089j2530R209N828O133q485
764B715j3909J0208R559o139k818q461Q489J0530j2667r08K019J605O851r384
778b310p415J2692k160n943J052o874J0347O85j2766M147N725K045k031q278L980
793g104J3398m935o267m014N810J3512j0488j2305M579J0432M173q218j2736R767
807d396J6763m380j0068m279J3109J1180o419j2959L64J5551L794j2362j0061
$$ plain form
820 -4163 1433 12384 14133 375 -5325 5600 12019 11729 357 -169 10301 12887 8825 2188
834 2188 823 9154 9032 -611 914 -1330 -645 3428 -4069 -2102 1045 -3350 5 4291 173 2636
850 2636 -346 -49 9834 2339 -2691 -3401 -2132 7495 -28 -14169 -7559 348 3035 -232 -17452
865 -17452 -7605 10637 6252 -2678 -12721 -3817 17143 10742 -10582 -12748 822 16880 7040
878 7040 -17028 -12395 7865 19843 5584 -14667 -5716 22529 26992 5615 -8862 3165 32305
891 32305 29750 -169 -11298 10308 32360 21773 -7959 -14833 14054 32356 14383 -14322
903 -14322 -10045 21307 32076 8710 -19165 -5811 25515 25617 -4390 -24431 -5906 23208 14630
916 14630 -18185 -26308 -4432 23175 7519 -24754 -18922 5104 23242 6237 -24476 -13132
$$ packed form
820d163N596J0951J749j3758n700J0925O419k90j1372n26J0470K586m062o637
834B188j365Q331j22r643J525k244O85M073p497J967L147m395L355M286m118K463
850B636k982K97R883p495n030p10J269R627p523j4141O610P907K687l267j7220
865a7452R847J8242m385q930j0043Q904K0960o401k1324k166J3570J6058r840
878G040k4068M633K0260J1978j4259k0251Q951K8245M463k1377j4477J2027K9140
891C2305k555k9919j1129K1606K2052j0587k9732o874K8887J8302j7973k8705
903a4322M277L1352J0769k3366k7875J3354L1326J02l0007k0041J8525K9114q578
916A4630l2815q123K1876K7607j5656l2273N832K4026J8138j7005l0713J1344
$$ plain form
928 -13132 15727 17427 -191 -20970 -12510 17626 13437 -7058 -17656 -6399 17704 14442 -7070
941 -7070 -11773 3510 18561 17445 -4300 -8963 8163 16663 13810 -2822 -13413 4078 17690
954 17690 7302 -5043 -13211 795 21182 8041 -8238 -11104 3344 22216 9295 -13617
966 -13617 -12506 5854 20425 5654 -22020 -13378 9813 18510 764 -24193 -10934 17928 22500
979 22500 -3856 -22260 -3355 25490 23515 -7758 -22993 2932 30668 15753 -14150 -21704
991 -21704 7120 31566 10247 -20650 -18341 15531 30297 5119 -24362 -14376 21234 26867 -4199
1004 -4199 -29717 -11765 21958 18211 -16165 -30716 -8992 22243 14552 -25169 -26894 1524 22199
1017 22199 11928 -25111 -23051 12255 23784 3827 -23254 -19144 17584 22863 -3868 -22188
$$ packed form
928a3132K8859J700j7618k0779Q460L0136m189k0495j0598J1257K4103l262k1512
941g070m703J5283J5051j116k1745m663J7126Q500k853j6632j0591J7491J3612
954A7690j0388j2345q168J4006K0387j3141j6279k866J4448J8872j2921k2912
966a3617J111J8360J4571j4771k7674Q642K3191Q697j7746k4957J3259K8862M572
979B2500k6356j8404J8905K8845j975l1273j5235K5925K7736j4915k9903p554
991b1704K8824K4446k1319l0897K309L3872J4766k5178k9481R986L5610N633l1066
1004d199k5518J7952L3723l747l4376j4551K1724L1235p691l9721j725K8418K0675
1017B2199j0271l7039K060L5306J1529j9957k7081M110L6728N279k6731j8320
$$ plain form
1029 -22188 -12821 21617 22404 -8859 -20013 -2447 22657 20484 -10031 -20743 5608 21979 11020
1042 11020 -13771 -20420 3694 19309 1824 -20829 -17306 2553 15047 -3917 -22502 -13489
1054 -13489 4140 11596 -6701 -22134 -9468 5819 5636 -7352 -20740 -9966 7142 2471 -9432
1067 -9432 -17523 -7967 6346 5422 -7791 -15805 -2980 9531 6875 -5611 -12933 -2890 13184
1080 13184 7122 -8797 -12931 -1768 13937 4996 -12179 -14217 497 14782 2952 -16855 -13531
1093 -13531 5711 12308 37 -19818 -13812 10259 10196 -8525 -20362 -11080 8366 8882 -15418
1106 -15418 -21826 -5199 8037 4842 -17268 -20032 305 9699 1219 -15617 -16627 5402 12859
1119 12859 -3494 -12341 -11643 6669 14998 -5643 -14363 -4744 8712 10899 -4150 -15517 -1493
$$ packed form
1029b2188R367L4438P87l1263j1154J7566K5104k173l0515j0712K6351J6371j0959
1042A1020k4791o649K4114J5615j7485k2653L523J9859J2494j8964j8585R013
1054a3489J7629P456j8297j5433J2666J5287j83j2988j3388J0774J7108m671j1903
1067i432q091R556J4313r24j3213q014J2825J2511k656j2486p322J0043J6074
1080A3184o062j5919m134J1163J5705q941j7175k038J4714J4285j1830j9807L324
1093a3531J9242O597j2271j9855O006K4071o3j8721j1837R282J9446N16k4300
1106a5418o408J6627J3236l195k2110k764K0337R394q480j6836j010K2029P457
1119A2859j6353q847O98J8312Q329k0641q720R619J3456K187j5049j1367J4024
$$ plain form
1132 -1493 12527 7839 -6036 -13237 2003 13402 5670 -9253 -10584 3470 12411 824 -13883
1145 -13883 -6894 3985 7347 -3432 -14388 -5231 7327 3816 -7066 -8666 -1623 8246 3363
1158 3363 -7307 -5385 3366 6497 -975 -4551 -3089 3217 2797 -3477 -3533 204 2737 -105 -1969
1173 -1969 364 3149 630 399 774 2302 4628 -2258 -1827 4719 2757 -981 -2762 -2238 5232 5397
1189 5397 -5081 -3043 2829 7734 5920 -3579 -1427 8464 10132 3623 -3479 -1472 11818 9190
1203 9190 -2517 -3213 458 10546 8640 -6079 -4428 7785 9610 6050 -3007 -4000 11030 10973 842
1218 842 -3900 -165 8739 7274 -3530 -5088 1517 5725 5236 -4778 -3884 4708 4971 3438 -1441
1233 -1441 -2219 4946 6674 -729 -450 390 963 3233 -481 -2034 -561 496 477 1881 1011 -135 1428
$$ packed form
1132a493J4020m688j3875p201J5240J1399p732j4923j331J4054Q941j1587j4707
1145a3883O989J0879L362j0779j0956R157J2558l511j0882j600P043R869m883
1158C363j0670J922Q751L131p472l576J462O306m20o274n6L737K533k842j864
1173a969K333K785k519k31L75J528K326o886M31O546j962l738j781N24P470J65
1189E397j0478K038N872M905j814r499K152R891J668o509p102K007J3290k628
1203I190j1707o96L671J0088j906j4719J651J2213J825l560r057r93J5030n7j0131
1218H42m742L735Q904j465j0804j558O605M208m89j0014Q94Q592K63j533m879
1233a441p78P165J728p403K79Q40N73K270l714j553J473J057j9J404q70j146J563
$$ plain form
1250 1428 2857 5190 2701 1536 1493 4961 7533 3159 -963 620 8032 7032 2327 -1001 1861
1265 1861 10541 11073 1957 -130 8410 12590 12533 2131 -1926 10844 15506 7869 -2282 -2271 9841
1280 9841 15847 3167 -6402 -1303 12253 16899 -417 -7941 3529 15240 13314 -3215 -11164
1293 -11164 5437 17674 4387 -9600 -10975 5335 16205 -311 -15581 -6668 10807 13437
1305 13437 -2620 -15561 -859 15084 10414 -6157 -14329 2936 15367 4461 -11070 -10980 4332
1318 4332 14148 1645 -13275 -4492 9648 13334 1220 -8418 -140 14148 13303 -872 -5156 2719
1332 2719 12705 9143 -2525 -5273 3907 11308 6734 -1707 -2876 6810 12217 8319 684 -803 8564
1347 8564 13111 7440 -59 -297 5508 11397 6346 -3726 -1194 6068 9999 6588 -2024 -1834 10719
$$ packed form
1250A428J429K333k489j165m3L468K572m374m122J583P412j000m705l328K862
1265A861Q680N32r116k087Q540M180n7j0402m057J2770M662p637j0151J1J2112
1280I841O006j2680r569N099J3556M646j7316p524J1470J1711j926j6529p949
1293a1164J6601J2237j3287j3987j375J6310J0870j6516j5270Q913J7475K630
1305A3437j6057j2941J4702J5943m670j6571q172J7265J2431j0906j5531R0J5312
1318D332R816j2503j4920Q783J4140L686j2114r638Q278J4288q45j4175m284P875
1332B719R986l562j1668k748R180P401m574q441j169R686N407l898p635j487R367
1347H564M547n671p499k38N805N889n051j0072K532P262L931l411q612J90J2553
$$ plain form
1362 10719 13073 6025 -858 -403 12502 13591 2617 -4608 -1447 10892 10961 -3550 -8557 143
1376 143 8815 9271 -5587 -10055 4272 11637 5683 -6271 -8245 4712 12937 1373 -11518 -7861
1390 -7861 4808 9336 -3021 -13888 -6849 7909 8508 -4106 -12513 -1588 13225 8596 -3407
1403 -3407 -9651 2291 15887 7028 -8136 -8316 4318 13146 4329 -11690 -8335 8448 12844 -174
1417 -174 -11181 -3830 11432 14365 -2836 -11020 685 12816 10249 -7112 -11515 2289 11259
1430 11259 3728 -10850 -12618 4875 10711 -2054 -10408 -8398 6796 11930 -3532 -11490 -2694
1443 -2694 7962 7281 -4910 -12578 -1586 7343 2079 -8368 -10981 -484 6954 217 -8870 -6774
1457 -6774 1516 8701 1360 -7972 -1489 4423 7228 2844 -6861 -2166 7272 4308 -240 -4564 -3045
$$ packed form
1362A0719K354p048o883M55J2905J089j0974p225L161J2339O9j4511n007Q700
1376A43Q672M56j4858m468J4327P365n954j1954j974J2957Q225j1564j2891L657
1390g861J2669M528j2357j0867P039J4758N99j2614q407J0925J4813m629j2003
1403c407o244J1942J3596q859j5164j80J2634Q828q817j6019L355J6783M396j3018
1417a74j1007P351J5262K933j7201q184J1705J2131k567j7361m403J3804Q970
1430A1259p531j4578j768J7493N836j2765q354K010J5194N134j5462p958Q796
1443b694J0656o81j2191p668J0992Q929n264j0447k613J0497P438o737r087K096
1457f774Q290P185p341r332O483N912K805m384r705M695R438k964m548m324J519
$$ plain form
1472 -3045 6679 4941 -1559 -3877 -209 6837 5736 -984 -3695 1416 7140 5543 -3656 -5655 1607
1487 1607 5300 1579 -5942 -7613 -477 5777 -1994 -8722 -5145 705 5532 -1778 -9275 -3488 4818
1502 4818 4501 -2632 -7934 -2844 5614 2977 -4562 -8730 -1329 5547 1534 -6784 -7364 1385 5756
1517 5756 2599 -6336 -5002 5885 7405 1747 -4185 -4327 5948 9575 -2323 -7144 -2716 4896
1531 4896 7323 -4617 -9919 -1152 7302 5306 -5418 -9252 2726 9813 3240 -6308 -7966 4686
1545 4686 10617 -1346 -10971 -5777 4596 7052 -4197 -14454 -3631 8265 4162 -5720 -9334
1558 -9334 852 11820 4877 -6562 -3938 6419 12157 2497 -7024 -807 7858 9797 178 -6808
1572 -6808 1553 11015 7199 -172 -2054 4514 12629 8126 -116 607 7871 10133 5134 -903 -1305
$$ packed form
1472c045R724j738o500k318L668P046j101o720k711N111N724j597r199j999P262
1487A607L693l721p521j671P136O254p771o728L577N850M827p310p497N787Q306
1502D818l17p133n302N090Q458k637p539m168P401O876m013q318n80Q749M371
1517E756l157q935J334J0887J520n658n932j42J0275L627j1898m821M428P612
1531D896K427j1940n302Q767Q454j996j0724l834J1978P087o573r548j658J2652
1545D686N931j1963r625N194J0373K456j1249j0257J0823J1896m103r882l614
1558i334J0186J0968o943j1439K624J0357N738r660r521O217Q665J939r619o986
1572f808Q361R462l816p371j882O568Q115m503q242P23P264K262m999o037m02
$$ plain form
1587 -1305 5996 6291 640 -3391 -1480 3856 4249 -125 -3344 26 3968 4979 -374 -2332 1340
1602 1340 3353 3513 -1051 -3650 -514 2891 210 -2582 -3083 -2365 3242 1649 -2324 -2051 1538 3592
1618 3592 3862 6 -1522 2968 4786 4208 -821 -1635 3002 4398 2610 -1170 -2379 3716 7123 1515
1634 1515 -148 1227 4960 9755 3267 -1455 3209 7466 6755 2292 -2675 1202 7680 4416 -609
1649 -609 -3454 1778 7328 3045 -2809 -1847 3070 6985 2826 -5579 -680 5263 4645 447 -5525 -1947
1665 -1947 6307 4192 -3723 -4176 666 6132 3693 -4101 -3059 3805 7159 1522 -4198 -1033 5846
1680 5846 5583 -953 -3990 -415 6332 3595 -3726 -3419 2940 4741 1232 -3694 -2791 5201 3958 -2211
1696 -2211 -2994 574 3729 2275 -3223 -2986 3368 3358 123 -2315 248 4815 3115 -666 -785 3231
$$ packed form
1587a305P301K95n651m031J911N336L93m374l219L370L942J011n353j958L672
1602A340K013J60m564k599L136L405k681k792n01P18N607j593l973K73L589K054
1618C592K70l856j528M490J818n78n029q14M637J396j788l780j209O095L407n608
1634A515j663J375L733M795o488m722M664M257p11m463m967L877O478l264n025
1649f09k845N232N550m283n854R62M917L915m159q405M899N943o18m198n972L578
1665a947Q254k115p915m53M842N466k439p794J042O864L354n637n720L165O879
1680E846k63o536l037L575O747k737p321L07O359J801l509m926R03P992j243o169
1696b211p83L568L155j454n498K37O354j0l235k438K563M567j700l781j19M016
$$ plain form
1712 3231 4743 2486 -2090 1402 5229 2381 1198 -668 1768 5839 2556 -1642 1807 3590 3849
1727 3849 2543 -1908 2114 4665 1972 -115 -1023 1376 3399 928 -2139 -423 605 3132 855
1742 855 -2499 850 1840 1820 1016 -1938 -837 3445 1361 -1162 -714 -1840 1612 1092 -2566 -2502 -287
1759 -287 1040 802 -1875 -2532 994 1307 970 -1816 -2047 518 1163 -701 -2942 -2468 -1572 642 -1996
1776 -1996 -4108 -1867 -1414 -201 -215 -2988 -3013 808 507 -436 -1987 -3343 537 1198 -1084 -3505 -3165
1793 -3165 189 2121 -1208 -4040 -1923 1774 4741 -91 -3996 702 5288 5067 592 -3879 470
1808 470 8208 3737 -2803 -3745 574 7378 2642 -6124 -4619 3172 6246 808 -7754 -4164 5315
1823 5315 5375 -2371 -9436 -3492 6015 3243 -7140 -9573 -2418 5073 1977 -10196 -9951 937 5525
$$ packed form
1712C231J512k257m576L492L827k848j183j866K436M071l283m198L449J783K59
1727C849j306m451M022K551k693k087r08K399K023k471l067J716J028K527k277
1742H55l354L349R90k0q04k954J101M282k084k523M48j126L452n20l658O4K215
1759b87J327k38k677o57L526L13l37k786k31K565O45j864k241M74Q96K214k638
1776a996k112K241M53J213j4k773k5L821l01r43j551j356L880O61k282k421L40
1793c165L354J932l329k832K117L697K967m832l905M698M586k21m475m471M349
1808D70P738m471o540r42M319O804m736q766J505P791L074n438q562L590R479
1823E315O0p746p065N944R507k772j0383k433P155P491l096j2173K45J0888M588
$$ plain form
1838 5525 -619 -9106 -7967 3895 7533 -2917 -8188 -4180 5754 6979 -3877 -8306 -1700 6407
1852 6407 4896 -4906 -8817 699 6941 2654 -5083 -7596 1835 7720 1414 -7054 -5222 2167 6725
1867 6725 1147 -8760 -5373 3448 5036 -1541 -8956 -5602 4429 4581 -4040 -8654 -4211 6010 4195
1882 4195 -5606 -7618 -1949 6333 4057 -6640 -7735 1023 5490 1257 -7066 -8331 1927 5625
1896 5625 -1671 -8313 -5954 1925 5637 -2020 -8570 -3497 3481 5018 -2436 -8080 -2543 4064 3806
1911 3806 -3504 -8778 -3332 5109 1850 -4984 -7853 -3054 5745 3247 -6042 -7173 586 6328 4017
1926 4017 -5814 -7170 2940 7834 1767 -7457 -6777 3144 8233 -1023 -9100 -5401 5056 9046 -2546
1941 -2546 -9442 -1375 8755 8506 -2850 -9286 1224 11288 5314 -5242 -8627 2114 10966 2343
$$ packed form
1838E525o144q487J139J1862L638j0450n271M008R934J225j0856m429O606Q107
1852F407j511r802l911R516O242m287p737k513R431N885o306q468J832P389M558
1867F725n578r907L387Q821J588o577p415L354J0031J52q621m614M443J0221j815
1882D195r801k012N669Q282k276j0697j095Q758M467m233q323j265J0258L698
1896E625p296o642K359P879L712p657o550N073O978J537p454n644N537O607k58
1911C806p310n274N446Q441l259o834k869M799Q799k498r289j131P759N742k311
1926D017r831j356J0110M894o067r224O80R921N089r256q077L699J0457L990j1592
1941b546o896Q067J0130k49j1356o436J0510J0064n974j0556l385J0741Q852q623
$$ plain form
1955 2343 -9442 -7383 4366 9068 877 -9956 -4843 7498 8843 -968 -9075 -1984 8926 7061
1969 7061 -4436 -8903 -1809 7616 3843 -8400 -8191 -214 6612 2444 -7915 -7400 3340 7247
1983 7247 617 -6350 -5241 4295 6316 -1691 -7829 -4803 3579 3719 -4138 -8788 -3478 3293 2772
1998 2772 -4395 -7254 -295 5266 2970 -3013 -4179 1084 6735 2761 -3870 -2802 1739 4911 1591
2013 1591 -4205 -2796 2875 4727 1312 -1922 -1338 4097 5625 2555 -1021 -292 4651 5418 1654 -2403
2029 -2403 -919 2011 4682 -258 -5100 -1667 2228 3332 -809 -5014 -1704 5302 3717 -1698 -4024
2044 -4024 -65 5959 3226 -3354 -5002 1038 5301 1796 -5499 -4650 2879 5376 1008 -5613 -2981
2059 -2981 5838 6182 -504 -3896 653 6646 6668 -1963 -4025 2957 6240 3811 -3012 -3577 3283 6679
$$ packed form
1955B343j1785K059J1749M702q191j0833N113J2341J345r811q107P091J0910j865
1969G061j1497m467P094R425l773j2243K09P977O826m168j0359N15J0740L907
1983G247o630o967J109R536K021q007o138L026Q382J40p857m650N310O771n21
1998B772p167k859O959N561k296n983j166N263N651l974o631J068M541L172l320
2013A591n796J409N671J852l415l234N84N435J528l070l576P29M943P67l764m057
2029b403J484K930K671m940m842L433L895J104m141m205L310P006j585n415k326
2044d024L959O024k733o580j648O040M263l505p295Q49P529K497m368o621K632
2059b981Q819L44o686l392M549N993K2q631k062O982L283k429o823n65O860L396
$$ plain form
2075 6679 1122 -3209 -980 4981 6470 10 -1809 1404 6132 5175 -675 -1779 3091 5302 1852
2090 1852 -788 -1380 2631 4129 -150 -1664 924 2531 2158 841 -597 2585 3065 1502 1273 1279 2527
2107 2527 1930 704 1129 2159 1221 629 -169 918 2410 -285 -527 1109 1942 1830 654 -715 1075
2124 1075 3638 536 -594 -482 818 1797 -18 -2989 -1739 540 193 -1126 -3836 -1282 1188 622
2140 622 -925 -2934 -379 2945 1591 -1545 -1063 118 2958 2347 -2936 -1856 1739 2576 433 -2288
2156 -2288 -2123 3110 3757 94 -803 304 4158 3816 -319 -621 1570 3371 3002 -712 -1918 1986
2172 1986 1532 450 -665 -1868 1249 1893 62 -102 166 481 2332 1353 49 890 535 2011 1732
2189 1732 -10 -936 -245 1280 1781 -695 -2359 530 2025 2255 -348 -2837 949 4130 1844 -2188
$$ packed form
2075F679n557m331K229N961J489o460j819L213M728r57n850j104M870K211l450
2090A852k640n92M011J498m279j514K588J607l73j317j438L182M80j563k29OJ248
2107B527n97j226M25J030r38n92p98J087J492k695k42J636Q33j12j176j369J790
2124A075K563l102j130J12J300R79j815k971J250K279l47j319k710K554K470n66
2140F22j547k009K555L324j354l136M82J181K840o11n283J080L595Q37k143k721
2156b288J65N233O47l663q97J107L854l42m135l02K191J801l69l714j206L904
2172A986m54j082j115j203L117O44j831j64K68L15J851r79j304Q41l55J476k79
2189A732j742r26O91J525N01k476j664K889J495K30k603k489L786L181k286m032
$$ plain form
2205 -2188 -2027 789 4297 468 -4719 -2982 1519 2899 -1905 -5759 -3704 3113 2389 -3481 -5992
2220 -5992 -1940 3971 1483 -4812 -6103 -669 3440 228 -6785 -6361 876 2032 -1623 -7033 -5607
2235 -5607 2699 3274 -3121 -6169 -2442 3250 4174 -3309 -5926 5 4599 3013 -3747 -5261 782
2250 782 5512 1402 -3942 -4564 2020 5957 -5 -4256 -2568 2643 5616 -36 -5975 -1858 3837
2265 3837 3213 -1672 -6512 -2333 3650 2331 -4234 -6606 -1447 3686 1329 -5808 -6004 -515 3690
2280 3690 391 -6061 -4994 1041 3405 -996 -5606 -4458 2393 3377 -2606 -4839 -2691 2583 3451
2295 3451 -2459 -5444 -840 2914 2228 -2185 -4972 -348 3351 1646 -2755 -3969 87 3472 1382
2310 1382 -3136 -2936 257 4189 1708 -3537 -2848 1583 3911 1353 -3469 -3190 3535 4743 323 -3405
$$ packed form
2205b188J61K816L508l829n187J737M501J380m804l854K055O817p24n870k511
2220e992M052N911k488o295j291N434M109l212p013M24P237J156l655n410J426
2235e607Q306N75o395l048L727N692R24p483k617N931M594j586o760j514O043
2250G82M730m110n344o22O584L937n962m251J688N211K973n652n939M117N695
2265C837o24m885m840M179N983j319o565k372N159N133k357p137j96N489M205
2280C690l299o452J067O035K364m401m610J148O851R84n983k233K148N274Q68
2295C451n910k985M604L754o86m413k787M624L699j705m401j214M056L385k090
2310A382m518K00L193L932k481n245O89M431K328k558m822K79O725J208m420l728
$$ plain form
2326 -3405 -2547 4340 5460 -161 -4450 -750 4734 5097 -1944 -5281 10 4854 2889 -4035 -5728
2341 -5728 630 5620 1055 -5458 -4674 1274 6081 -304 -6656 -3056 3163 4409 -1455 -6993 -2533
2356 -2533 4937 3053 -3444 -6432 -1558 5210 2283 -4352 -5045 888 6164 2367 -4757 -3421 3443
2371 3443 5594 1456 -5284 -2895 4565 4880 -1108 -4830 -1771 4951 5114 -2506 -4116 1357 5765
2386 5765 4626 -1890 -3093 3087 6492 2980 -2103 -2574 3717 5898 1025 -2821 -1567 3855 4826
2401 4826 -435 -3128 926 4514 4007 276 -1974 2040 5034 2877 -933 -1285 1566 4124 1728
2416 1728 -1999 -882 1445 3088 1330 -1274 -633 1854 3042 1317 -413 -525 2436 2579 917 -571
2432 -571 -1050 1400 2597 340 -2292 -1153 903 2526 563 -3072 -977 2815 3109 573 -1828 111
$$ packed form
2326c405Q58O887J120n621m289L700N484L63p041l337N291M844j965o924j693
2341e728O358M990m565o513P84N948M807o385o352L600O219J246n864n538M460
2356b533P470j884o497k988M874O768k927o635o93N933N276l797p124J336O864
2371C443K151m138o740K389P460L15n988l722L059O722J63p620j610N473M408
2386E765j139o516j203O180L405l512n083m71O291K181m873l846J254N422R71
2401D826n261k693M054L588n07l731k250M014K994k157l810l52K851K558k396
2416A728l727J117K327J643j758k604O41K487J188j725j730j12K961J43j662j488
2432e71m79K450J197k257k632J139K056J623j963l635K095L792K94k536k401J939
$$ plain form
2448 111 5060 3965 -267 -1666 1047 5691 3147 -1910 -1337 2806 5493 2458 -2632 -739 5231
2463 5231 5038 1706 -2005 434 6375 5257 -676 -2315 1929 5233 3183 -2864 -2893 2336 4045 747
2479 747 -3754 -2552 3005 3560 -705 -3444 -946 3699 3281 -2154 -2701 296 3235 1900 -2779 -3172
2495 -3172 982 3094 -159 -2839 -2147 1774 2771 -651 -2689 -617 2575 2303 -258 -2329 214 2603
2511 2603 891 -1110 -2867 183 1572 -374 -2519 -1854 -538 1347 -182 -2822 -661 746 1220
2526 1220 247 -1533 -986 1476 902 -886 -1334 -861 478 182 -1569 -1364 -890 381 86 -1169 -891
2543 -891 358 343 645 -77 -1101 747 241 -256 -54 -851 -1162 207 -406 -1307 -980 -1496 46 -93 -1246
2562 -1246 -1515 -723 551 141 -1152 -2112 440 620 -541 -2102 -2663 90 408 -1881 -3264 -1757 -618
$$ packed form
2448A11M949j095m232j399K713M644k544n057N73M143K687l035n090J893N970
2463E231j93l332l711K439N941j118n933j639M244L304k050o047k9N229J709l298
2479G47m501J202N557N55m265k739K498M645m18n435n47K997K939j335m679l93
2495c172M154K112l253k680O92L921R97l422k038K072L192k72k561k071K543K389
2511B603j712k001j757L050J389j946k145O65J316J885j529k640K161J407M74
2526A220r73j780N47K462n74j788m48M73J339k96j751K05M74J271k95j255K78
2543h91J249j5L02p22j024J848n06m97K02p97l11J369o13r01L27n16J542j39j153
2562a246k69P92J274m10j293r60K552J80j161j561n61K753L18k289j383J507J139
$$ plain form
2579 -618 616 -2359 -3610 -34 332 -199 -2075 -2638 -16 1415 -1549 -3044 -1659 -270 296 -2858
2595 -2858 -3567 -1201 -438 -1065 -2910 -3423 -776 -7 -2425 -2441 -2036 -828 -280 -2685 -3568 -1373 -1192 -1959
2613 -1959 -2528 -3617 -2095 -562 -2233 -2243 -2226 -706 -146 -1108 -1400 -498 129 517 -355 -1391 894 471
2631 471 -218 -690 -704 238 1010 -257 -1473 494 330 562 -320 -1320 295 855 -58 -1561 -1604 -627 -41
2650 -41 -1662 -2514 -2095 -1180 -397 -2714 -3495 -1424 -767 -1492 -2447 -2948 -1259 629 -1655 -2796 -2021 -677
2668 -677 4 -1497 -3606 -2068 475 -68 -1626 -2630 -472 1347 267 -1449 -1644 642 2490 634
2684 634 -1563 -138 1072 1890 804 -1939 3 2306 1681 -215 -970 315 2260 1996 -920 -556
2700 -556 435 2048 1050 -792 -809 579 1373 343 -1313 -1713 587 524 -390 -1195 -1962 -8 1130 -609
$$ packed form
2579f18J234k975j251L576L66n31j876n63K622J431k964j495J385J389N66l154
2595b858p09K366P63o27j845n13K647P69k418j6M05J208N48k405q83K195J81p67
2613a959n69j089J522J533j671j0J7J520N60r62k92R02O27L88q72j036K285m23
2631D71o89m72j4R42P72j267j216J967j64K32q82j000J615N60r13j503m3R77N86
2650d1j621q52M19R15P83k317p81K071O57p25r55n01J689J888k284j141P75J344
2668f77O81j501k109J538K543n43j558j004K158J819j080j716j95K286J848j856
2684F34k197J425J210Q18j086k743J942K303o25j896p55J285J945k64k916L64
2700e56R91J613r98j842j7J388P94j030j656m00K300o3r14q05p67J954J138j739
$$ plain form
2718 -609 -1910 -1278 -3 1167 -94 -2286 -1054 896 1589 -760 -2137 -1301 1645 1720 -764 -2085
2734 -2085 -541 2593 1535 -1235 -2105 566 2876 1409 -2060 -2182 1647 2466 529 -2204 -2058 1509
2750 1509 2842 -460 -2691 -895 1915 2814 -726 -2975 -601 2798 2370 -1343 -2582 66 3422
2765 3422 1659 -1373 -2365 806 4443 1663 -1880 -1753 2149 4162 1837 -2908 -1550 3605 4002 838
2781 838 -2955 -1062 4228 4233 -697 -3164 261 4569 3805 -2049 -3016 1375 5106 2779 -3028 -2795 2687
2798 2687 4801 748 -3479 -2598 3389 5001 -1358 -3718 -1084 3290 3521 -1529 -4156 -109 3938
2813 3938 1661 -2142 -3837 560 3355 995 -3007 -2909 1250 3415 509 -3099 -1740 1502 3373
2828 3373 590 -2804 -1002 2827 3108 502 -1795 -795 3350 3607 -30 -1102 26 3569 3674 394
$$ packed form
2718f09j301O32J275J170j261k192J232J950O93k349j377Q36K946P5k484j321
2734b085J544L134j058k770q70K671K310j467l469j22L829Q19j937k733J46L567
2750A509J333l302k231J796K810Q99l540k249K374L399m28l713j239K648L356
2765C422j763l032r92L171L637k780l543J27L902K013k325m745J358N155L97l164
2781H38l793J893N290Nm930k467L425M308p64n854r67M391L731k327n807K33N482
2798B687K114m053m227Q81N987J612o359k360K634M374K31n050k627M047M047
2813C938k277l803j695M397K795k360m002R8M159K165k906l608J359L242J871
2828C373k783l394J802L829K81k606k297J000M145K57l637j072J128L543J05l280
$$ plain form
2844 394 -1738 658 4239 3425 -118 -2141 1422 4262 2912 -1234 -2253 1512 4662 1747 -2608
2859 -2608 -1989 1328 4299 773 -4126 -1697 2234 3400 -38 -4046 -2510 3097 2553 -1996 -4278
2874 -4278 -1904 3173 1983 -2945 -4485 -552 3372 1938 -3881 -4235 1124 3345 1115 -4024 -3828
2889 -3828 2341 4285 29 -3654 -2138 3018 5020 -835 -4141 -336 3947 4275 -1398 -4081 299
2904 299 4934 2773 -2012 -3589 1432 4822 1296 -2798 -2944 1769 4597 243 -4357 -2387 2457
2919 2457 2857 -760 -4465 -1478 3147 2287 -2089 -3777 -545 2755 1825 -2441 -2665 555 2890 1218
2935 1218 -2162 -1850 930 2551 724 -1714 -1730 1305 1951 -253 -1571 -1752 622 1685 -317 -3027
2951 -3027 -1681 402 762 -452 -3342 -2176 435 116 -1558 -3542 -2453 236 248 -2132 -3471 -2711
$$ packed form
2844C94k132K396L581q14l543k023L563K840j350m146j019L765L150k915m355
2859b608O19L317K971l526m899K429L931J166l438m008J536N607n44m549k282
2874d278K374N077j190m928j540L933L924j434n819l54N359K221k230n139J96
2889c828O169J944m256l683J516N156K002n855l306L805M283L28n673k683M380
2904B99M635k161m785j577N021L390l526m094j46M713K828m354m600J970M844
2919B457M00l617l705K987M625q60m376j688L232L300r30m266k24L220K335j672
2935A218l380L12K780J621j827k438j6L035O46k204j318j81K374J063k002k710
2951c027J346K083L60j214k890J166K611l19j674j984J089K689J2k380j339P60
$$ plain form
2967 -2711 1084 791 -2967 -3108 -1272 1340 1090 -2638 -3482 371 1796 128 -2398 -2678 1223 2597
2983 2597 -122 -2673 -1393 1446 2469 -783 -3116 -601 1482 1949 -1206 -2811 66 1827 712
2998 712 -1682 -2533 -392 1925 -569 -2021 -1947 -244 915 -477 -2398 -2078 514 413 -1282 -2453
3014 -2453 -1880 346 392 -1265 -2460 -1076 358 579 -1672 -1815 -574 182 343 -2082 -1715 4 566
3031 566 -277 -1139 -1493 -222 1004 -1080 -1529 -849 -191 17 -1240 -1582 -888 -641 -1356 -1507 -1755 -1023 -985
3050 -985 -1458 -1320 -1653 -1442 -1247 -1690 -1383 -570 -1430 -1630 -475 -1190 -553 -1014 -1429 -294 243 -476 -1013
3069 -1013 -629 408 1031 -477 -829 59 1269 1225 -296 -714 519 1725 414 -198 -1110 132 1356
3086 1356 -645 -1617 -1310 65 373 -610 -2339 -938 304 -344 -863 -1926 -1165 253 33 -1447 -1918
$$ packed form
2967b711L795k93l758j41J836K612k50l728q44L853J425j668k526k80L901J374
2983B597k719k551J280K839J023l252k333K515K083M67l155j605K877J761j115
2998G12k394q51K141K317k494j452P4J703J159j392j921L20K592j01j695j171
3014b453N73K226M6j657j195J384J434K21k251j43J241P56J61k425L67J719N62
3031E66q43q62l54J271J226k084m49O80O58K08j257l42O94K47p15j51k48P32L8
3050i85m73J38l33K11J95m43L07Q13q60k00J155p15O37m61m15J135N37p19n37
3069a013L84J037O23j508l52Q88J210m4j521m18J233J206j311o12r12J242J224
3086A356k001r72L07J375L08r83j729J401J242o48n19j063P61J418k20j480m71
$$ plain form
3103 -1918 -690 239 151 -1549 -1611 -600 529 181 -1563 -1080 198 945 322 -458 -1612 502 1553
3120 1553 -310 -717 -892 350 1508 102 -1726 -743 703 1288 -80 -1680 -352 993 1091 -402
3136 -402 -1228 -435 1771 1068 -554 -993 -427 1466 1149 -1104 -995 436 1180 971 -611 -1574 1027 1689
3154 1689 686 -644 -1177 1015 2227 782 -1312 -1132 1056 2360 418 -1394 -917 1165 2630 316
3170 316 -2043 -762 2309 2354 -449 -2346 -987 3074 2085 -1575 -2992 20 2977 1411 -2643 -3156
3186 -3156 870 2849 283 -3288 -2467 1963 2732 -480 -3633 -1447 2513 2670 -1784 -3165 -18 2824
3202 2824 2284 -2288 -2955 1243 3377 1188 -1670 -1686 1710 3817 449 -1947 -665 2360 3601 378
3218 378 -1724 -181 2531 2468 63 -2162 361 3041 1791 -536 -1805 209 2706 1920 -1396 -1320
$$ packed form
3103a918J228R29q8j700o2J011J129l48j744M83J278P47o23p80j154K114J051
3120A553j863m07j75J242J158j406j828R83J446N85j368j600J328J345R8j493
3136d02q26P93K206p03j622m39N66J893l17k253J09J431P44k09j582r63K601O62
3154A689j003j330n33K192J212j445k094J80K188J304j942j812M77K082J465k314
3170C16k359J281L071M5k803j897J359M061r89l660j417L012K957j566m054n13
3186c156M026J979k566l571Q21M430P69l212l153K186L960J57m454j381L147K842
3202B824n40m572o67M198K134k189k858j6L396K107l368k396J282L025J241l223
3218C78k102J543K712o3k405k225K523K680j250k327j269K014K497p86l316P6
$$ plain form
3234 -1320 768 2115 1501 -1723 -1294 1279 2226 1067 -1172 -1290 1353 2374 328 -1476 -1468 1543 2426
3251 2426 -285 -1712 -1003 1538 1787 -592 -2703 -852 1211 1266 -938 -2920 -1058 1812 1140 -1896
3267 -1896 -2750 -461 2108 1055 -2267 -2279 342 2526 722 -2310 -2269 1573 2737 647 -2191 -1544
3283 -1544 2665 3446 -55 -2164 -918 2785 3390 -814 -2810 703 3319 2162 -1524 -3131 1151
3298 1151 3780 1274 -2442 -2272 1603 3892 296 -3499 -1258 2020 3095 -1104 -3924 -861 2504
3313 2504 1545 -1773 -3944 -507 3031 244 -2587 -2593 438 2558 50 -3199 -1916 1180 1566 -810
3329 -810 -3087 -1327 1415 799 -1070 -2717 -982 1566 856 -1513 -1502 -429 1128 1087 -1352 -1470 166
3346 166 802 144 -1147 -1740 -359 918 -433 -1442 -1732 -341 684 -133 -1637 -1752 249 1023 25
$$ packed form
3234a320K088J347o14l224M29K573R47j159k239j18K643J021k046j804QL011Q83
3251B426k711j427P09K541K49k379k111J851K063N5k204j982J862K870o72l036
3267a896q54K289K569j053l322j2K621K184j804l032M1L842J164k090k838O47
3283a544M209P81l501k109J246L703O05m204j996L513K616j157l686j607M282
3298A151K629k506l716J70L875K289l596l795K241L278J075m199k820L063L365
3313B504r59l318k171L437L538k787k831oL031K120k508l249J283L096L86k376
3329h10k277J760K742o16j869j647J735K548p10k369J1J073J557m1k439j18J636
3346A66O36o58j291n93J381J277j351j009k90J391J025q17j504j15K001P74r98
$$ plain form
3363 25 -1968 -1276 503 1416 -133 -1822 -1246 996 1315 -978 -1515 -765 1477 1586 -1195 -1368 549
3380 549 1883 1304 -771 -1520 858 1930 151 -1438 -1822 513 1197 -916 -2439 -1737 91 531 -1264
3397 -1264 -2855 -1148 5 88 -1747 -3119 -1243 707 -761 -2535 -2856 -1600 516 -894 -2812 -2262
3413 -2262 -741 691 -802 -2264 -1365 776 1063 -639 -2101 -516 1664 578 -914 -1743 -233 1392
3429 1392 303 -1800 -1603 302 956 -108 -1845 -1345 934 962 -974 -1750 -732 484 558 -1366 -1480
3446 -1480 -731 303 -417 -1960 -1647 -393 66 -1007 -1297 -1003 117 423 -571 -845 -14 356 597 112
3464 112 -627 117 346 -394 -22 -587 -125 409 -153 -291 -243 -225 266 -44 -335 22 -292 129 248 -697 -576
3485 -576 -390 -727 -529 -993 -1651 -503 -766 -1146 -1066 -1304 -985 -618 -867 -1109 -509 -745 -161 -339 -1108 -113
$$ packed form
3363B5j993O92J779R13j549j689N76K242L19k293n37P50K242J09k781j73J917
3380E49J334n79k075p49K378J072j779j589l84K335O84k113j523P02J828M40j795
3397a264j591J707J153Q3j835j372J876J950j468j774l21J256K116j410j918N50
3413b262J521J432j493j462Q99K141K87j702j462J585K180j086j492q29J510J625
3429A392j089k103J97J905O54j064j737N00K279K8j936p76J018J216P4j924j14
3446a480P49J034p20j543L13J254M59j073k90K94J120L06r94k74Q31L70K41m85
3464A12p39P44K29p40L72n65M62N34n62j38M8J8M91l10k91L57l14M21J19r45J21
3485e76J86l37J98m64o58J148k63l80Q0k38L19L67k49k42O00k36N84j78p69R95
$$ plain form
3505 -113 -182 -251 -337 -768 420 399 6 354 572 239 817 766 231 1070 961 908 942 750 434 862 174 354
3527 354 -125 -96 48 -250 -563 -528 -209 -438 -170 -416 -687 -242 -321 153 -340 -649 48 3 -579 -728 -354
3548 -354 -197 223 -659 -794 287 24 114 48 -176 802 1042 -122 -150 399 1009 1110 -520 -265 219 476
3568 476 13 -919 -1062 819 558 -624 -780 -406 881 597 -1038 -813 764 1148 16 -746 -647 821
3586 821 983 -692 -936 -281 1161 764 -639 -986 803 1461 856 -386 -237 1793 1631 671 -290 221
3604 221 1706 1620 -436 -796 534 1365 1049 -608 -811 765 1654 427 -489 -280 805 1542 -105 -872
3622 -872 -563 442 847 -1050 -1714 -888 291 -12 -696 -1938 -665 794 -139 -1247 -1430 -172 726
3639 726 428 -1319 -962 212 724 5 -1498 -553 697 773 -75 -1008 -313 953 1274 -142 -292 99
$$ packed form
3505a13o9o9q6m31J188k1l93L48K18l33N78n1n35Q39j09n3L4j92l16M28o88J80
3527C54m79K9J44k98l13L5L19k29K68k46k71M45p9M74m93l09O97m5n82j49L74
3548c54J57M20q82j35J081k63R0o6k24R78K40j164k8N49O10J01j630K55M84K57
3568D76m63r32j43J881k61j182j56L74J287k84j635K25J577L84j132p62R9J468
3586H21J62j675k44O55J442l97j403l47J789O58o05j242J49K030j62r60r61N11
3604B21J485q6k056l60J330Q31l16j657k03J576Q89j227r16K09J085P37j647p67
3622h72L09J005M05j897o64Q26J179l03o84j242J273J459r33j108j83J258Q98
3639G26k98j747L57J174N12p19j503R45J250P6q48r33O95J266L21j416j50L91
$$ plain form
3657 99 1111 1381 -166 -299 343 696 1007 61 -1170 337 1005 481 -333 -1003 303 1407 503 -759
3675 -759 -926 -177 1289 673 -975 -830 86 1304 565 -1647 -1106 994 1584 -195 -1503 -986 1352
3692 1352 1593 -844 -2048 -499 1492 1053 -1561 -2763 176 1626 356 -2233 -2474 550 1565 -369
3708 -369 -2772 -2013 770 1610 -1132 -3112 -840 1092 927 -1370 -2885 -357 2039 687 -1554 -1974
3724 -1974 175 2654 437 -2093 -1028 1232 2073 4 -2088 -1046 1565 1595 -316 -2021 -892 1994
3740 1994 1189 -779 -1838 -569 1632 1066 -1430 -1652 -168 1229 780 -1709 -2164 -53 1227 -20
3756 -20 -2074 -2085 346 1357 -138 -1953 -1592 746 1512 -891 -1967 -902 1138 1196 -738 -2335 -722
3773 -722 1450 717 -985 -2424 -208 1644 819 -1792 -1773 310 1688 536 -1824 -1893 29 1034 -238
$$ packed form
3657I9J012K70j547j33O42L53L11r46j231J507O68n24q14o70J306J104r04j262
3675g59j67P49J466o16j648J45R16J218p39k212N41K100N90j779j308N17K338
3692A352K41k437j204J549J991m39k614j202K939J450j270k589k41L024J015j934
3708c69k403P59K783Q40k742j980K272J932j65k297j515K528K396j352k241m20
3724a974K149K479k217k530J065K260Q41k069k092J042K611L0j911j705J129K886
3740A994q05j968j059J269K201n66k496k22J484J397m49k489m55K111J280j247
3756b0k054j1K431J011j495j815L61K338P66k403j076J065K040N8j934j597J613
3773g22K172p33j702j439K216J852q25k611J9K083J378j152k360o9J922J005j272
$$ plain form
3790 -238 -2039 -1906 185 913 -700 -2258 -2152 439 941 -1291 -2413 -1508 785 980 -1031 -2822 -735
3807 -735 1366 495 -1436 -2503 -695 1920 687 -2045 -1921 604 2407 443 -1864 -904 1417 2915
3823 2915 515 -1851 -528 2243 2161 -411 -1854 -420 2376 1201 -1335 -2142 -227 2006 1044 -1845
3839 -1845 -1926 729 1628 377 -2300 -1827 916 1316 -607 -1972 -1653 860 934 -1253 -2119 -1374 708
3856 708 1151 -1021 -2212 -420 1336 1283 -928 -1347 57 1916 837 -876 -1680 104 1442 475 -1427
3873 -1427 -1559 331 1310 221 -1432 -1071 1142 1494 -136 -1475 -660 1461 1298 -679 -1269 -534 1141
3890 1141 1259 -932 -1349 8 1119 431 -879 -895 489 1608 818 -65 -287 1006 1612 852 -439
3907 -439 16 893 1425 868 -719 -173 713 838 321 -904 -220 904 903 64 -547 -260 822 1119 -617
$$ packed form
3790b38j801J33K091P28j613j558J06K591N02k232j122R05K293J95k011j791K087
3807g35K101q71j931j067J808K615j233k732J24K525J803j964k307R60K321J498
3823B915k400k366J323K771q2k572j443J434K796j175k536q07J915K233r62k889
3839a845q1K655Q99j251k677M73K743M00j923j365L19K513P4k187q66P45K082
3856G08M43k172j191J792J756n3k211m19J404J859j079j713q04J784J338r67j902
3873a427j32J890R79j089j653L61K213L52j630j339Q15K121j63j977n90P35J675
3890A141J18k191m17J357J111o88j310j6J384J119p90q83k22J293O06p60j291
3907d39M55Q77N32n57j587N46Q86J25n17j225O84J124jq39o11K87J082K97j736
$$ plain form
3926 -617 -807 -335 654 749 -1101 -1505 -465 571 -129 -860 -1793 -214 608 -170 -1120 -806 421 1112 398
3945 398 -960 -410 409 1154 63 -999 118 941 1051 -54 -578 486 1423 1123 210 325 1162 2116
3963 2116 1182 151 253 883 901 489 -405 -201 661 357 36 -307 -560 211 336 -464 -476 253 -15 578
3983 578 -72 -248 237 -68 -22 -74 -474 -260 -30 -74 138 -245 -257 441 214 454 291 54 440 843 120
4004 120 390 364 -162 783 311 -412 -390 -472 27 125 -538 -760 -166 212 394 -679 -495 240 580 95 -864
4025 -864 -623 272 718 -572 -1066 -545 302 782 -706 -1059 -156 1022 561 -309 -550 661 1793 673
4043 673 -195 -186 1210 1508 607 -773 -152 899 984 134 -1123 -90 874 651 -163 -513 205 1001 436
4062 436 -714 -18 354 309 52 -737 -853 -408 -123 -499 -749 -867 -548 -235 -256 -712 -1338 -229 529 -117
$$ packed form
3926f17j90M72R89R5j850m04J040J036p00p31r33J579Q22p78r50L14J227O91p14
3945C98j358N50Q19P45j091j062J117Q23J10j105n24J064R37l00r13J15Q37R54
3963B116r34j031J02O30J8m12q94K04Q62l04l21l43k53P71J25q00j2P29k68N93
3983E78o50j76M85l05M6n2m00K14K30m4K12l83j2O98k27K40j63k37L86M03p23
4004A20K70k6n26R45m72p23K2q2M99R8o63k22N94L78J82j073J84P35L40m85r59
4025h64K41Q95M46j290m94N21Q47M80j488l53R03J178m61q70k41J211J132j120
4043F73q68RJ396K98r01j380O21J051Q5q50j257J033R64k23q14l50P18P96n65
4062D36j150O96L72m5k57p89j16M45K85l76k50j18L19L13k1m56o26J109P58o46
$$ plain form
4082 -117 -908 -1129 -47 495 453 -973 -724 -3 788 314 -891 -912 571 1214 -97 -734 -739 1026 1184
4101 1184 -314 -1214 -226 998 827 -841 -1513 -102 934 668 -1060 -1810 351 1130 51 -1544 -1581
4118 -1581 391 1344 -328 -1667 -663 844 1147 -453 -1794 -563 1246 1024 -757 -1540 -330 1673
4134 1673 704 -1338 -1407 -64 1660 249 -1586 -1381 454 1298 -18 -1701 -1357 937 1147 -798 -1583
4151 -1583 -1345 551 771 -1035 -2045 -511 676 514 -1220 -1669 395 1226 136 -1325 -1388 131 1160
4168 1160 -146 -1347 -1250 -143 1178 -714 -1558 -791 292 831 -56 -1463 -802 783 615 -323 -1404
4185 -1404 -475 726 890 -622 -1081 -364 771 475 -880 -1133 -279 986 870 -970 -1304 70 1487
4202 1487 603 -788 -1312 683 1546 93 -1147 -886 943 1572 266 -1869 -695 1198 1362 -422
$$ packed form
4082a17p91k21J082N42m2j426K49P21P91m74j205k1J483O43j311o37nJ765J58
4101A184j498r00R88J224j71j668o72J411J036k66j728p50K161P79j079j595l7
4118a581J972R53j672j339J004J507L03j600j341J231J809k22j781p83J210K003
4134A673r69k042o9J343J724j411j835K05J835Q44j316j683L44K294K10j945p85
4151a583K38J896K20j806j010J534J187j62j734m49K064Q31j090j461o3J519J029
4168A160j306j201R7J107J321j892q44P67J083N39q87j407O61J585j68r38j081
4185a404R29J201J64j512m59P17J135k96j355k53Q54J265j16j840l34J374J417
4202A487q84j391n24J995Q63j453j240K61J829O29j306k135J174J893J64j784
$$ plain form
4218 -422 -1763 -142 1451 1219 -878 -1649 101 1430 653 -1639 -1549 -63 1038 -211 -2354 -1595 384
4235 384 977 -850 -1800 -1489 616 648 -1237 -1926 -1107 667 200 -1333 -1904 -645 677 36 -1544 -1866
4253 -1866 -213 1015 233 -853 -1134 405 1421 -88 -811 -153 738 1632 220 -995 -135 1515 1275
4270 1275 -88 -985 -136 1316 993 -296 -928 54 1323 672 -831 -902 308 1024 322 -1172 -923 460
4288 460 373 -215 -1100 -1066 305 479 -1116 -1414 -600 308 327 -782 -1178 -430 613 150 -761 -817 -371 479
4308 479 -273 -621 -1016 -31 528 -91 -876 -686 -329 116 207 -1354 -699 43 210 15 -983 -893 277 323
4328 323 -454 -910 -575 292 521 -312 -674 -352 686 436 -453 -728 227 647 452 -65 -754 531 1076
4347 1076 -108 -564 -249 940 761 -99 -926 -34 452 550 -366 -1071 -23 423 129 -561 -851 -1 409
$$ packed form
4218d22j341J621J593k32k097p71J750J329p77k292R0J486J101j249k143P59J979
4235C84N93j827r50L11K105L2j885o89Q19J774m67j533n71J259J322o41j580l22
4253a866J653J228p82j086k81J539J016j509p23O58Q91Q94j412j215Q60J650k40
4270A275j363q97Q49J452l23j289o32R82J269o51j503p1J210P16p02j494K49J383
4288D60q7n88q85L4J371J74j595k98Q14R08J9j109l96P48J043m63r11n6M46Q50
4308D79p52l48l95R85N59o19p85J90L57M45R1j561O55P42J67j95r98R0J170M6
4328C23p77m56L35Q67K29q33l62L22J038k50q89k75R55M20j95n17o89J285N45
4347A076j184m56L15J189j79q60q27Q92M86R8r16p05J048M46k94o90k90Q50M10
$$ plain form
4366 409 -291 -779 -347 -129 294 -317 -1086 -636 52 12 -727 -1077 -852 314 -218 -955 -753 -546 23 130
4386 130 -670 -558 475 268 -102 -845 -493 345 229 -26 -362 64 475 651 -103 -55 820 674 595 -33
4406 -33 248 867 794 88 -19 229 690 407 -468 -172 74 28 107 -527 -267 570 20 -364 -151 -179 580 15
4428 15 -738 176 -127 2 -239 -393 -48 354 103 -292 -155 170 491 -88 176 345 478 247 18 188
4448 188 358 330 -198 71 21 -80 39 -399 -351 104 -40 -172 95 -187 7 -253 -696 -344 28 -124 -506
4469 -506 -476 -283 123 -136 -717 -364 -363 -50 -171 -595 197 426 -9 -208 -3 153 777 -68 -322 315 526
4490 526 562 -178 -436 98 673 -15 -407 -352 478 489 76 -498 72 451 552 -137 -724 3 417 -174 -469
4511 -469 -903 -311 314 -415 -932 -669 -72 18 -270 -1156 -289 111 108 -502 -632 -331 448 236 -587 -594 55 606
$$ packed form
4366D09p00m88M32K18M23o11p69M50O88m0p39l50K25J166n32p37K02K07N69J07
4386A30q00J12J033k07l70p43L52Q38j16k55l36M26M11J76p54M8Q75j46p9o28
4406c3K81O19p3p06j07K48M61k83q75K96K46m6P9o34K60Q37n50l84K13k8P59n65
4428A5p53R14l03J29k41j54L45M02k51l95J37L25L21n79K64J69J33k31k29J70
4448A88J70k8n28K69n0j01J19m38M8M55j44j32K67k82J94k60m43L52L72j52l82
4469e06L0J93M06k59n81L53JL13j21m24P92K29m35j99K05J56O24q45k54O37K11
4490E26L6p40k58N34N75o88l92N5Q30J1m13n74N70L79J01o89n87P27M14n91k95
4511d69m34N92O25p29n17K63N97R0k88q86Q67M00lo10j30L01P79k12q23pO49N51
$$ [...]
8191I0
##END NTUPLES=NMR FID
##END=
