##TITLE=1H_SA_sl.Et_3
 CDCl3, 8 sc, 
 1.9.2020
##JCAMPDX= 6.0         $$ Bruker NMR JCAMP-DX V2.0
##DATA TYPE= NMR FID
##DATA CLASS= NTUPLES
##ORIGIN= UXNMR, Bruker Analytische Messtechnik GmbH
##OWNER= root
$$ XWIN-NMR		Version 3.5
$$ Tue Sep  1 11:37:43 2020 Russian Standard Time (UT+4h)  she@DPX200
##.OBSERVE FREQUENCY= 200.1315066352
##.OBSERVE NUCLEUS= ^1H
##.DELAY= (6, 6)
##.ACQUISITION MODE= SIMULTANEOUS
##.ACQUISITION SCHEME= undefined
##.AVERAGES= 8
##.DIGITISER RES= 18
##SPECTROMETER/DATA SYSTEM= spect
##.PULSE SEQUENCE= zg30
##.SOLVENT NAME= CDCl3
##.SHIFT REFERENCE= (INTERNAL, CDCl3, 0, 15.7039)
##AUDIT TRAIL= $$ (NUMBER, WHEN, WHO, WHERE, WHAT)
$$ ##TITLE= Audit trail, XWIN-NMR		Version 3.5
$$ ##JCAMPDX= 5.01
$$ ##ORIGIN= Bruker BioSpin GmbH
$$ ##OWNER= she
$$ F:/spectra/data/she/nmr/H-F/1/audita.txt
$$ ##AUDIT TRAIL=  $$ (NUMBER, WHEN, WHO, WHERE, WHAT)
(   1,<2020-09-01 11:36:31.12 +0400>,<she>,<DPX200>,
      <created by zg, POWCHK disabled, PULCHK disabled
       configuration hash MD5:
       00 E9 B6 7A A2 85 ED C7 34 08 36 98 17 FE 4E 26
       data hash MD5: 16K
       BC 06 49 47 42 93 9A 9B EF 83 D2 19 0A DB 05 35>)
$$ ##END=
$$ 
$$ hash MD5
$$ 19 91 D8 62 5E 9C C5 20 09 C6 30 EC 67 5E DD 21
##$RELAX= 
##$RELAX= 
##$RELAX= 
##$RELAX= 
##$RELAX= 
##$RELAX= 
$$ Bruker specific parameters
$$ --------------------------
##$DU= <F:/spectra>
##$EXPNO= 1
##$NAME= <H-F>
##$PROCNO= 1
##$TYPE= <nmr>
##$USER= <she>
##$AMP= (0..31)
100 100 100 100 100 100 100 100 100 100 100 100 100 100 100 100 100 100 
100 100 100 100 100 100 100 100 100 100 100 100 100 100 
##$AQSEQ= 0
##$AQ_mod= 1
##$AUNM= <au_zg>
##$AUTOPOS= <>
##$BF1= 200.13
##$BF2= 200.13
##$BF3= 200.13
##$BF4= 200.13
##$BF5= 200.13
##$BF6= 200.13
##$BF7= 200.13
##$BF8= 200.13
##$BYTORDA= 1
##$CFDGTYP= 0
##$CFRGTYP= 5
##$CHEMSTR= <none>
##$CNST= (0..31)
1 1 145 1 1 1 1 1 1 1 1 1 1 1 1 1 1 1 1 1 1 1 1 1 1 1 1 1 1 1 1 1 
##$CPDPRG= <>
##$CPDPRG1= <>
##$CPDPRG2= <>
##$CPDPRG3= <>
##$CPDPRG4= <mlev>
##$CPDPRG5= <mlev>
##$CPDPRG6= <mlev>
##$CPDPRG7= <mlev>
##$CPDPRG8= <mlev>
##$CPDPRGB= <>
##$CPDPRGT= <>
##$D= (0..31)
0 1.2 0 0 0 0 0 0 0 0.06 0 0.03 0 0 0 0 0.0002 0 0 0 0 0 0 0 0 0 0 0 0 
0 0 0 
##$DATE= 1598945790
##$DBL= (0..7)
120 120 120 120 120 120 120 120 
##$DBP= (0..7)
150 150 150 150 150 150 150 150 
##$DBP07= 0
##$DBPNAM0= <>
##$DBPNAM1= <>
##$DBPNAM2= <>
##$DBPNAM3= <>
##$DBPNAM4= <>
##$DBPNAM5= <>
##$DBPNAM6= <>
##$DBPNAM7= <>
##$DBPOAL= (0..7)
0.5 0.5 0.5 0.5 0.5 0.5 0.5 0.5 
##$DBPOFFS= (0..7)
0 0 0 0 0 0 0 0 
##$DE= 6
##$DECBNUC= <off>
##$DECIM= 32
##$DECNUC= <off>
##$DECSTAT= 4
##$DIGMOD= 1
##$DIGTYP= 9
##$DL= (0..7)
0 120 120 120 120 120 120 120 
##$DP= (0..7)
150 150 150 150 150 150 150 150 
##$DP07= 0
##$DPNAME0= <>
##$DPNAME1= <>
##$DPNAME2= <>
##$DPNAME3= <>
##$DPNAME4= <>
##$DPNAME5= <>
##$DPNAME6= <>
##$DPNAME7= <>
##$DPOAL= (0..7)
0.5 0.5 0.5 0.5 0.5 0.5 0.5 0.5 
##$DPOFFS= (0..7)
0 0 0 0 0 0 0 0 
##$DQDMODE= 0
##$DR= 18
##$DS= 0
##$DSLIST= <SSSSSSSSSSSSSSS>
$$ [...]
##$SUBNAM2= <"">
##$SUBNAM3= <"">
##$SUBNAM4= <"">
##$SUBNAM5= <"">
##$SUBNAM6= <"">
##$SUBNAM7= <"">
##$SUBNAM8= <"">
##$SUBNAM9= <"">
##$SW= 16.880792210976
##$SWIBOX= (0..15)
0 0 2 0 0 0 0 0 0 0 0 0 0 0 0 0 
##$SW_h= 3378.37837837838
##$TD= 16384
##$TD0= 1
##$TE= 0
##$TE2= 300
##$TE3= 300
##$TEG= 300
##$TL= (0..7)
0 120 120 120 120 120 120 120 
##$TP= (0..7)
150 150 150 150 150 150 150 150 
##$TP07= 0
##$TPNAME0= <>
##$TPNAME1= <>
##$TPNAME2= <>
##$TPNAME3= <>
##$TPNAME4= <>
##$TPNAME5= <>
##$TPNAME6= <>
##$TPNAME7= <>
##$TPOAL= (0..7)
0.5 0.5 0.5 0.5 0.5 0.5 0.5 0.5 
##$TPOFFS= (0..7)
0 0 0 0 0 0 0 0 
##$TUNHIN= 0
##$TUNHOUT= 0
##$TUNXOUT= 0
##$USERA1= <user>
##$USERA2= <user>
##$USERA3= <user>
##$USERA4= <user>
##$USERA5= <user>
##$V9= 5
##$VALIST= <valist>
##$VCLIST= <CCCCCCCCCCCCCCC>
##$VD= 0
##$VDLIST= <DDDDDDDDDDDDDDD>
##$VPLIST= <PPPPPPPPPPPPPPP>
##$VTLIST= <TTTTTTTTTTTTTTT>
##$WBST= 1024
##$WBSW= 4
##$XGAIN= (0..3)
0 0 0 0 
##$XL= 0
##$YL= 0
##$YMAX_a= 254054
##$YMIN_a= -201458
##$ZGOPTNS= <>
##$ZL1= 120
##$ZL2= 120
##$ZL3= 120
##$ZL4= 120
##$ABSF1= 10
##$ABSF2= 0
##$ABSG= 5
##$ABSL= 3
##$ALPHA= 0
##$AQORDER= 0
##$ASSFAC= 0
##$ASSFACI= 0
##$ASSFACX= 0
##$ASSWID= 0
##$AUNMP= <proc_1d>
##$AZFE= 0.1
##$AZFW= 0.1
##$BCFW= 1
##$BC_mod= 2
##$BYTORDP= 1
##$COROFFS= 0
##$CY= 11.3945322036743
##$DATMOD= 1
##$DC= 2
##$DFILT= <>
##$DTYPP= 0
##$F1P= 16.9975609425685
##$F2P= -3.02152046262296
##$FCOR= 0.5
##$FTSIZE= 0
##$FT_mod= 4
##$GAMMA= 1
##$GB= 0.15
##$INTBC= 1
##$INTSCL= 1
##$ISEN= 128
##$LB= 0.24
##$LEV0= 0
##$LPBIN= 0
##$MAXI= 10000
##$MC2= 0
##$MEAN= 0
##$ME_mod= 0
##$MI= 1.114404
##$NCOEF= 0
##$NC_proc= 0
##$NLEV= 6
##$NOISF1= 3.799351
##$NOISF2= 2.8
##$NSP= 1
##$NTH_PI= 0
##$NZP= 0
##$OFFSET= 15.70392
##$PC= 1
##$PHC0= -9972.032
##$PHC1= 8.000919
##$PH_mod= 1
##$PKNL= yes
##$PPARMOD= 0
##$PSCAL= 0
##$PSIGN= 0
##$REVERSE= no
##$SF= 200.130013532006
##$SI= 16384
##$SIGF1= 3
##$SIGF2= 2
##$SINO= 400
##$SIOLD= 16384
##$SREGLST= <1H.CDCl3>
##$SSB= 0
##$STSI= 0
##$STSR= 0
##$SW_p= 3612.71676300578
##$SYMM= 0
##$S_DEV= 0
##$TDeff= 0
##$TDoff= 0
##$TI= <>
##$TILT= no
##$TM1= 0
##$TM2= 0
##$TOPLEV= 0
##$USERP1= <user>
##$USERP2= <user>
##$USERP3= <user>
##$USERP4= <user>
##$USERP5= <user>
##$WDW= 1
##$XDIM= 8192
##$YMAX_p= 0
##$YMIN_p= 0
$$ End of Bruker specific parameters
$$ ---------------------------------
##NTUPLES= NMR FID
##VAR_NAME=  TIME,          FID/REAL,        FID/IMAG
##SYMBOL=    X,             R,               I
##VAR_TYPE=  INDEPENDENT,   DEPENDENT,       DEPENDENT
##VAR_FORM=  AFFN,          ASDF,            ASDF
##VAR_DIM=   8192,          8192,            8192
##UNITS=     SECONDS,       ARBITRARY UNITS, ARBITRARY UNITS
##FACTOR=    0.000296,      1,               1
##FIRST=     0,             0,               0
##LAST=      2.424536,      0,               0
##MIN=       0,             -201458,         0
##MAX=       2.424536,      254054,          0
$$ Real data points
##PAGE= N=1
##DATA TABLE= (X++(R..R)), XYDATA
$$ [...]
2433B599n940j043M343L873l021n159n7N078L045l893m517P08N533J408m591m455
$$ 2599 -3341 -4384 -41 3832 811 -4348 -4405 673 3718 -175 -4692 -3984 1549 2957 -1634 -6089
2449f089J786N240K92m629l718L534M843k45m602k050M304M426j012n187n73M389
$$ -6089 -4303 937 1229 -3400 -7118 -3584 1259 1014 -3588 -5638 -1334 3092 2080 -3107 -3680 709
2465G09L545k243m937J44M518K896m002l867P98M816J654l893l247J659N020N93
$$ 709 4254 2011 -2926 -2782 1736 4632 630 -3237 -2439 2377 4031 138 -3109 -1450 3570 4163
2481D163m308l017K629M254p39m315k805L319K846j037m684j023L686L004j765
$$ 4163 -145 -3162 -533 3721 2982 -1333 -4138 -819 2027 990 -3694 -4717 -1031 1973 208
2496B08m136L74L590K825k582l694J073L653J485l447k560Q86M004O15l545k114
$$ 208 -3928 -3554 36 2861 279 -3415 -2342 1311 2796 -651 -3211 -2325 1679 2294 -1251 -3365
2512c365J591M227n99k994j860K764L552j119l413j262L001K271j562l730k91
$$ -3365 -1774 2453 1854 -1140 -3000 -236 3316 2197 -1216 -2478 523 2794 1232 -2498 -2789
2527b789L021J798j879l526J240K549J540k321k052J234K764J069k969j216J215
$$ -2789 232 2030 151 -3375 -2135 414 1954 -367 -2419 -1185 1579 2648 -321 -1537 -322
2542c22K967l57k366j571J860K559j175k323q72K680J268o36j827o61K485Q11
$$ -322 2645 2288 -78 -1649 211 2770 1595 -728 -1600 1080 2348 1712 -115 -776 1709 2520
2558B520j017k247L82J491P78j763j862P55J274K18j816j046Q89J704j60j535
$$ 2520 1503 -744 -362 1129 1907 144 -1718 -963 311 529 -1287 -2333 -1444 260 100 -1435
2574a435o77J142J807q32o77l37R70J234r16p05j09J135O33l73r49N28J009J26
$$ -1435 -2112 -970 837 5 -672 -1009 -39 1195 279 -426 -535 600 1233 860 -89 439 1448 1574
2592A574k83o78O27R00j77m79l48M03Q3k04n77j99J5M7k29n60j00J43l00j47K90
$$ 1574 1291 613 1240 2140 1963 1484 1136 1539 1622 1418 841 642 657 704 475 -85 -185 -42 -342 -489 -199
2613a99j40J72l28R6K76l24J04k67L34J24K35l53l87Q79J97J43o04M36O58O13
$$ -199 -339 -167 -495 -399 -123 -447 -343 -610 -276 -152 83 -270 -657 222 419 562 -42 394 1052 1665
2633A665k82q53O09M89M04q32o00L3J022J94r18q66L62J104k76p71r35Q70J384
$$ 1665 1383 530 1139 1628 2032 1200 600 633 1655 1849 931 65 427 1531 1255 484 -451 419 1803
2652A803n78j279o63J179Q41l43j681l12J689Q37p76k192M78J837J040j448j331
$$ 1803 1225 -54 -717 462 1303 960 -721 -1033 656 1493 717 -1475 -997 840 1880 432 -899
2669h99M77J905O21j898j192R11K505k12k174j120J035K462p12k124j078K132
$$ -899 -422 1483 2104 206 -986 -75 2430 2218 44 -1076 -41 2421 1709 -415 -1493 639
2685F39J548p90k295o39K412J482j283k969O24K469J266k182k387J048K594R60
$$ 639 2187 1397 -898 -1537 875 2357 1074 -1895 -1271 1198 2464 282 -2105 -1057 1537 2497
2701B497k582j747J340K768M63l206j318J711L135q48k598j371K384K938j519
$$ 2497 -85 -1832 -492 2276 2739 -467 -1785 -74 3061 2213 -385 -1756 628 3566 2047
2716B047l058q05L087K106j674l300q6L295J220k159l360J354K910J033k834k946
$$ 2047 -1011 -1816 1271 3377 1703 -1597 -1683 1612 2832 673 -2687 -1333 1577 2610 -224 -3170
2732c170J965L259K21l599j655J940L602m62l844j029K325L556j336l736q33L430
$$ -3170 -1205 2054 2275 -1324 -2979 -1039 2563 2101 -1743 -2772 -447 3109 1773 -1963 -2796 634
2748F34K724k221l501lL894J533k241l454P85L999R49k909l241J941L374P30l953
$$ 634 3358 1137 -2364 -2367 1527 3060 819 -2635 -1850 2149 3098 189 -3052 -1111 2263 2993 -960
2765i60k568K590L528J6m371j462K837L467j310l847n49L264K896k192l417n52
$$ -960 -3528 -938 2590 2606 -1765 -3227 -390 3077 1767 -2080 -2629 635 3531 1339 -2078 -2630
2781b630M317K316k936l290N63M310J002k865l211J579M009N19l542k871K844
$$ -2630 1687 4003 1067 -2223 -1660 2650 3652 787 -2424 -845 3164 3683 141 -2730 114
2796A14L126K3m043j989K878L112j160m371j001L334K852k065l859l03L796K491
$$ 114 3240 3263 -780 -2769 109 3221 2061 -2310 -3311 23 2875 810 -3049 -3352 444 2935
2812B935l010k955L22M269J560l340l045J388M157M47l100k952K459L374M19l794
$$ 2935 -75 -3030 -2708 1561 3121 -219 -3264 -1876 2281 2728 -372 -3324 -865 2509 2928 -866
2828h66j844L114L219q97l918p84L069L066k011m003p5L503J904k458k919p5L915
$$ -866 -2710 404 3623 2726 -1192 -1976 1093 4159 2148 -1855 -1930 1573 3477 1019 -1900 -1975 1940
2845A940J136l050k791J239L719O33l066k535K002L512k03l558j859K787K858
$$ 1940 3076 26 -2765 -1526 2193 2826 -240 -2775 -773 2739 2536 -1022 -2881 -94 2764
2860B764n71l774p44L026K249j439l258R5K872K140k206k999L66L258J566k987
$$ 2764 2193 -1581 -2325 701 2950 1511 -1747 -1652 1220 3360 1154 -1845 -1479 1779 3345 358
2876C58k391N83L450M60l102k142J316L407k40k877j850K204K777p05k724j212
$$ 358 -2033 -1450 2000 2460 -642 -2784 -1468 1939 1699 -1178 -3028 -824 1953 1248 -1476 -2688
2892b688K653K163o91l357r8K547J959j584k826N96K630J592k038k160O58K924
$$ -2688 -35 2128 1437 -1920 -2018 529 2488 904 -1922 -1326 1304 2896 858 -1302 -644 2280
2908B280O97k390j645J140K634k85k264j372J128K610q84k096j235K137J511j044
$$ 2280 2977 587 -1058 82 2716 2431 167 -1205 -77 2533 1649 -447 -1682 455 1966 922
2924I22k307l75K159J126j439k088O87J989O67j658j541P14J402J127j855j139
$$ 922 -1385 -1760 399 1525 86 -2002 -1315 674 1341 -317 -1858 -1144 258 1385 -470 -1609
2940a609O35K096L07j708n98R00J802l22j476l62J253J078q07j074m58J518O11
$$ -1609 -974 1122 1429 -279 -877 23 1825 1503 27 -335 918 1996 1189 115 -343 1175 1786
2957A786p70j407p3J311L04o89j267P77Q13q2p77p16N88N63K24j101l83M27Q80
$$ 1786 1016 -391 -464 847 1151 462 -805 -28 785 703 -74 -790 -202 361 585 -516 -899 -472 408
2976D08n26k61k22M14Q22o35j69k38O22L22k26j05k24M87K04j50k74n3M58l75
$$ 408 -118 -379 -601 -187 635 0 -169 -407 215 537 311 206 -18 469 673 523 249 196 654 279
2996B79J89l73M31l75Q5n2j88N35l52Q2l54M75m56J74n17M03J33m49mN8J43K95
$$ 279 468 95 526 151 236 184 -4 531 179 261 -93 382 -74 100 -417 -14 119 -330 -334 -276 -133 162
3018A62j81l33M65K43r1q3m33N48M41K60j004j97O15M04j20r96J11K87Q77p94
$$ 162 -19 -352 113 356 265 182 -251 297 738 998 -6 -203 412 816 696 -300 -189 98 975 181
3038A81o74J05Q13P23j230q29L84P07J94j041p47O74J212k93r56q07J256Q63l34
$$ 181 -493 -388 425 1148 -82 -911 -527 180 374 -667 -1414 -740 472 179 -777 -1584 -328 535 201
3057B01j537k82J289Q94l60j765M97J321Q33o60j910P39J677P22j443j177L93
$$ 201 -1336 -1618 -329 565 205 -1560 -1063 258 1091 431 -1479 -740 937 1659 216 -961 -568
3074e68K032K99j841r56R94J661j22j848p69J361J638j024j621o88J582J408p53
$$ -568 1464 1763 -78 -1034 -40 1621 1499 -349 -1118 243 1881 857 -764 -1452 130 1538 785
3091G85k092l08K004P90j046k192N99K156N31j508j891R90J862Q03k324j312J017
$$ 785 -1307 -1615 389 1179 133 -2059 -1460 696 1227 -281 -2172 -1182 680 1483 -841 -2153 -1136
3108a136K630l29k222j012J477K129p70j843r33J977J948j159k200n73K743J164
$$ -1136 1494 1165 -1057 -2069 -592 1537 767 -1076 -2009 -32 1916 757 -1443 -2016 727 1891
3124A891j602k112N34K211O74j646k102J178K252N23k557j617J635K330R4k602
$$ 1891 289 -1823 -1289 922 1596 -50 -2152 -974 1278 1801 -756 -2373 -738 1592 1686 -916
3140i16j103J561K341o16k431p68J905K592j613k273m26K374J915j769k508k43
$$ -916 -2019 -458 1883 1267 -1164 -1932 -27 2565 952 -1321 -1747 627 2542 773 -1735 -1978
3156a978L379O23j845k522P59L188M10k513k182J760K625Q4k817j493J860K584
$$ -1978 1401 2024 179 -2343 -1584 1604 2014 -499 -2681 -921 1704 1788 -1029 -2522 -662 1922
3172A922m96k885r64K211K160r50k996l74K768J808j672k613k42L299Q50j879
$$ 1922 1426 -1459 -2423 -212 1948 998 -1998 -2372 396 2204 532 -2081 -2323 976 1826 -53
3188e3k247N66K999N92k291k339J761K939q0k681j713K012K439k02l006j110K397
$$ -53 -2300 -1734 1265 1857 -434 -2773 -1012 1927 1847 -834 -2547 -535 1904 1702 -1304 -2414 -17
3205a7K093j004k822k79K344K031j849k512L20K639J102j965j972N98K843L93
$$ -17 2076 1072 -1750 -2029 315 2346 497 -2015 -1695 944 2046 81 -1891 -1293 1550 1943
3221A943k237j971J334K730k21k251j914K176K130n25k272j249K123K067o82l156
$$ 1943 -294 -2265 -931 1799 1578 -673 -2587 -411 1719 1194 -1078 -2327 -204 1863 1181 -1975
3237a975JK111J809j971k204L52K108J962k335k318N73K705P59k076j792J101
$$ -1975 -1974 137 1946 -25 -2229 -1877 231 2193 -142 -2460 -1887 818 1577 -499 -2291 -1190
3253a190K382J95k192j509J684K201k74k136j560K402J851q84k426j06J909J512
$$ -1190 1192 1387 -805 -2314 -630 1571 1297 -839 -2399 3 1854 970 -1456 -1562 347 1859
3269A859r87k371J48J893J560k008j456J77K194O08k133j358O03K258j39j757
$$ 1859 872 -1499 -1351 542 2102 94 -1362 -1185 1009 1617 -516 -1874 -1271 987 848 -909
3285i09j222J043K057l26j649j332J972J503o32j825l64J560J041o97j833M33
$$ -909 -2131 -1088 969 643 -1006 -2338 -366 1137 505 -1320 -1684 -124 917 220 -1613 -1180
3301a180J382J123j066j606K33J690Q70j475j187O27J805K79j519j041Q10J369
$$ -1180 202 1325 259 -1347 -1114 576 1446 -29 -1216 -589 1216 1495 -24 -1065 -255 1114
3317A114l78j124j038J241J150o75j146m86J202R83n00j656J60J319J06m64j067
$$ 1114 736 -388 -1426 -185 965 290 -856 -1342 -140 843 343 -1313 -1153 166 272 -192 -1259
3334a259M47O09Q14r72j078Q10P92M49j334m55N15J229j67o71m18L75R98m02l76
$$ -1259 -812 -203 611 -361 -1439 -629 163 612 -722 -1177 -662 567 400 -271 -689 -314 684 282 -94
3353i4o02O31P39o99n20l12P77L43l82m38o5R39m10j34l13K70L60K21n96j84j4
$$ -94 -696 -65 674 -25 -545 -857 -80 263 -119 -557 -622 317 -93 -227 -540 -270 90 311 -285 -469 -483
3374d83L96K08o90L03qN87l07L6r3K79L47l96K4N7K50j90n9N6j02j43j73o3J36
$$ -483 -87 121 -569 -266 -274 313 6 42 -51 228 575 179 203 260 510 320 261 317 215 72 -101 -164 -28
3397b8j97J17j04j0K0J25k89J18J10l2M9n10K85J0L60o08q0n9O43j30m06n4R2
$$ -28 -225 -108 -212 -222 -202 -77 -366 -248 -138 -170 -121 -631 -346 -336 24 -584 -664 -723 -80 -210 -616 -670 -578
3420e78P40J18l83m31M09P05Jn34l20L94L65Q8r85J2N62K46j57q07L69M27P01
$$ -578 162 280 -103 -534 -125 580 581 47 -273 121 486 574 -411 -399 163 409 252 -555 -186 241 942
3441I42q76l87K79N38M02q48q37M83P72J5q15o39N68P79k39p95l60R05R48n43
$$ 942 66 -321 -42 496 898 50 -787 -304 468 483 -332 -971 -403 376 137 -658 -1018 -113 835 292
3461B92j157J04J256N90l76j513J48J022O04r33j122M21R52Q22j367q44O60J414
$$ 292 -865 -761 495 1085 709 -804 -656 366 970 37 -1085 -664 288 1110 -257 -1101 -441 973
3479I73O5j657l57N02J469k82j357n42J103R39n96r88o67J081J203p59j225j16
$$ 973 1038 -619 -976 -474 995 713 -644 -1186 -83 856 260 -728 -1395 -314 889 130 -1095 -1211
3497a211J510R67j190j310P38J248P89j586r70P38J275K71j622p82R87J467k31
$$ -1211 299 1266 76 -1234 -496 752 1541 -45 -1015 -277 998 1269 -353 -1135 -148 1319 1088
3514A088j496q82J438J540o94j642l88J568J019j050j706L9J931P30j316j904
$$ 1088 -408 -1290 148 1688 994 -648 -1036 532 1551 501 -1205 -1166 765 1495 179 -1725
3530a725O89J759K71j324j515R82J897L17k052q74J080J765l32j879m92J210J798
$$ -1725 -1036 723 994 -330 -1845 -863 1034 1351 -701 -1575 -495 1270 938 -941 -1433 -223 1575
3547A575q55j869l44J361J483j103j524j66K321P08j182j787M80K140K40j311
$$ 1575 720 -1149 -1493 -132 1351 248 -1276 -1442 879 1587 405 -1382 -902 1238 1478 167
3563A67j933J255J621K19j806j007J022J573J54k222n21J373J645o17k005l53
$$ 167 -1766 -511 1110 1329 -477 -1484 -462 1111 1265 -957 -1478 -105 1540 923 -1082 -1435
3579a435J598J360r84j944k16K062R23j549j380K16J965M78j380j420O92J962
$$ -1435 163 1523 539 -1405 -1621 441 1364 -185 -1565 -1349 616 1094 -286 -1706 -1014 948
3595I48M91j981j326J402J738j8k033r15J706J451m38j968l02J445J333q13j893
$$ 948 1439 -542 -1868 -466 1272 1254 -779 -1694 12 1463 1025 -943 -1245 200 1533 720 -1173
3612a173J29J831R46j034j534J76J789M13j338j690R62J679J38j491j368J121
$$ -1173 -1044 787 1733 699 -835 -659 1130 1543 205 -1485 -523 1156 1294 -197 -1565 -444
3628d44J413l5j848q18J452J492m20k014k59J594Q24o35j678QJ508J142j226j467
$$ -444 969 934 -914 -1732 -280 1212 792 -1222 -1481 113 937 302 -1376 -1368 140 1282 56 -1411
3646a411N84J041Q04j211r02K02J690M37j495j038R20J414J6j248j028J077J241
$$ -1411 -827 214 1018 -193 -1095 -893 797 1234 -261 -1299 -379 1035 1051 -197 -1225 -148 1093
3663A093l14j411m83J511Q17n02j461j32J188R58p70j558K88J458O33j303r13
$$ 1093 779 -632 -1115 396 1213 711 -750 -882 306 1264 494 -1064 -776 682 1315 12 -901
3680i01L16J015M50j049j041O64J297j96q45p62P96J119k52j189l19J010L76j72
$$ -901 -585 430 880 -169 -1210 -546 751 555 -290 -1052 -256 863 611 -578 -897 113 489 317
3698C17j004l79J237O18n04j410N18P46N80q55n16J00R34M54j119k89R3R91R3
$$ 317 -687 -1066 171 789 285 -1125 -607 139 719 -136 -652 -552 382 836 -283 -572 -479 512 605
3717F05j137l70M31J324l19q80m20Q01N05m40p57p5Q35N44o23p77K23O93L80l03
$$ 605 -532 -902 -471 853 534 -346 -766 35 540 100 -657 -732 103 647 24 -753 -530 163 543 240
3737B40q08M73M63K55n60m15J78M27K94o45k06o8Q36k70k74k92N16K17m68l9l64
$$ 240 -568 -95 368 623 63 -352 -174 253 547 -98 -304 -372 464 194 -80 -372 144 361 -107 -146 -510
3758e10M93M82m30q8k64K62p7q1l36M63J21o6j85j96K62P4K74j32N7j12J5K37
$$ -510 -17 465 35 -53 -317 -55 -132 -213 -549 -86 35 -31 -216 -412 -150 -76 198 66 123 11 26 263
3780B63j01J21k31L11m87j41M28k41K65q9l8m5qq0R9m8K59l83jJ93m4p2M9k93
$$ 263 162 283 52 363 -124 -265 163 -78 187 98 60 15 7 -73 26 -22 237 -146 -147 46 2 -70 -21 -314
3804c14R6L25k87k97K10J12L45j78j60M4K52p1o9l02L54N85l96k41r7K4K12K13
$$ -314 -218 107 -180 -477 -267 -155 190 12 -148 -104 148 77 8 -294 60 645 249 8 -89 -65 147 360
3826C60k81k16K59P01l55l93l01N25M96k08n97n3L05M92l96q28K0M23M99q72j33
$$ 360 79 -137 122 823 468 75 -226 299 795 587 -10 -63 242 734 338 -490 -470 -47 452 -420 -553
3847e53J17N04M47o56o91M72Q77J47j034l36Q72M90k23j072J6N74L82n5p12m23
$$ -553 -436 68 515 -141 -832 -360 517 664 -370 -706 166 656 433 -639 -623 -49 333 278 -434 -857
3867h57R14O46k72j010K70J031L78p42o62O4P13K36q23o38N44Q45lj054m32O63
$$ -857 57 703 431 -579 -309 722 1100 358 -304 -240 473 709 -114 -752 -208 637 634 -420 -852 -189
3887a89J008j94r33m89J262M95l97j014l13J222K23l52j011K80Q34N24q84j171
$$ -189 819 625 -308 -797 465 960 563 -451 -764 458 681 329 -682 -402 432 956 72 -1099
3905a099P58Q66L15r24n60N74J083O5j179n10N81J138n59j083m80J154Q89q53
$$ -1099 -341 525 840 -84 -644 -70 1013 1078 -101 -611 -30 1108 549 -534 -1014 140 1029 176
3923A76r83j73J303N64n93j113j6J328O45r52j384O70J256J38j277o41N65J054
$$ 176 -807 -980 323 887 294 -819 -835 493 1138 186 -1198 -528 728 866 -411 -1052 -487 567
3941E67K12j415m91J055J193l93j363j03Q84J199n46j403q9J133O86j024r31J64
$$ 567 779 -636 -1127 -72 1121 728 -635 -738 146 1345 799 -604 -693 440 1126 102 -829 -665
3959f65J247L82j065q97M41J478n4q49q33O92J321q9j239p86R54Q84j57j347l15
$$ -665 582 964 -101 -998 -557 921 867 18 -815 -123 1198 1109 -130 -916 38 922 765 -582 -897
3978h97Q11Q55l45j329j0J227O54p02j040K21J289L15q12j103L01J252K72r39
$$ -897 -86 769 424 -905 -915 312 966 264 -776 -555 734 1049 237 -866 -565 687 959 20
3996B0j267R82R00J49j020n97N85J254l33r57m35P90J364p33j226j22Q35Q68q20
$$ 20 -1247 -265 635 784 -236 -833 -248 1006 673 -284 -719 71 1435 702 -524 -646 189 1057 237
4015B37j071l2J464K55q80j089M94J341L21q83r40O13R27J46j274o56P23J157
$$ 237 -834 -866 598 853 -27 -1116 -622 719 1040 157 -783 -170 757 903 -371 -1027 -304 853
4033H53j88j216k90Q50R46n75j098J99J009O28o44j063L69O52M47p37p26K36J001
$$ 853 665 -551 -841 9 955 380 -718 -519 490 1118 474 -589 -220 432 879 142 -584 -348 653
4052F53L03r51n39L83Q31J49j102o82P80P30K53j186m07P94N79k42q89j10P96
$$ 653 956 5 -534 -151 680 829 -273 -955 -175 555 808 -378 -785 9 588 346 -543 -653 143
4071A43N13n81q49P5O92P61o50o41M7Q99L13q34l39M61N60M47r03p51M78Q87l61
$$ 143 656 75 -774 -699 -7 754 104 -537 -490 409 722 -112 -451 10 570 1017 114 -637 -159 728 367
4092C67l92m51L99O26k04o07k73R99q8k04l91n55J023L04o26o09J62M89M01m42
$$ 367 -25 -476 -77 549 345 -262 -535 464 376 172 -219 -774 249 553 -73 -682 -520 -31 370 -72
4112g2o38M89M91j0n78l1P9Q72k75m46j23J5P53k52l53r3M18K42l51k68k7N67
$$ -72 -710 -221 270 260 -318 -349 -270 602 327 -119 -242 -227 526 274 -79 -172 246 488 137 -131 -158 409
4134D09J56k47m70J37K78L63m89m63N03K7J53m89n0K95R7J95p33J71J23M56k96
$$ 409 565 318 -152 -15 263 626 137 -326 177 204 357 -132 -182 113 210 405 -328 -157 -34 422 126
4155A26m89O8J55K93m59J68p2L13k22J60l51J76O8j82P2Q3K50l29J54K08j49p1
$$ 126 -363 -295 -140 153 -306 -138 -210 103 -119 41 -310 -134 -66 -248 -176 -93 157 -172 -18 190 41 -30
4177c0M1L07m31J86j60L84k97J48l0m1K25l67L33j09k1K7N4j38K44j19n07N03
$$ -30 11 318 -113 73 -87 297 0 148 118 77 302 -65 268 159 138 165 219 81 325 206 -301 202
4199B02Mn6p1L7R8k0r6n10M68j6N8J61o13K74Q6k9L3j50j2K94M2l98Q6j14L37
$$ 202 206 150 79 116 214 194 98 -412 56 40 98 259 -354 -80 6 -23 10 -140 -152 142 184 -214 -128 -242 95
4224I5J7N2o06M59L93k79k73k15L89K48r3m23n7L95L48l3p01K65M34L77o83m61
$$ 95 112 164 -442 17 410 131 -142 -357 32 280 187 -236 -293 102 450 417 -284 -19 415 792 109 -352
4246c52J89O85J21o97j27J22M18J90p28m84O08P33j03o02l31O82L90k81l55k13
$$ -352 -163 522 643 -54 -181 -59 359 549 -179 -663 -55 678 575 -27 -358 324 714 433 78 -135
4266a35M01K03k55n89l7O70L83p61m50K49O67K40n35m73J66R52k14o16l08K80
$$ -135 266 469 214 -375 -412 258 641 -120 -570 -321 346 586 51 -422 -256 696 482 -134 -442 -162
4286a62R89k42q80l66N76O90l18n63k2O10K92l75o17K90O65J66n39n29N25N44
$$ -162 827 585 -295 -661 -85 605 287 -276 -298 312 604 229 -388 -98 567 733 194 -335 190 734
4306G34O5o14p05M17P37Q1j050k66N77Q15k63o78l04N30Q40m92q73p7Q45L11k96
$$ 734 799 185 -520 -103 634 715 -335 -601 -24 791 528 -150 -454 76 916 424 -449 -526 319 630 334
4327C34r89K1P29O03o52j020L41J131j90m27n70L38O33M55q26m52Q88L70j86q23
$$ 334 -655 -634 95 698 46 -974 -633 498 308 -119 -689 -351 282 737 -89 -541 347 717 531 -292
4347b92k55M71P41k81p04l59P41Q48k93r14J5R96J68n99p00L3Q66K4m18o77M82
$$ -292 -547 -76 665 384 -320 -679 62 910 617 -297 -282 714 882 283 -417 -384 482 506 88 -589 -107
4368a07N38J97r10m16O01N21J24j087j29N10P78j1j361RP81O65q42n35j74R51
$$ -107 431 628 -282 -698 -97 424 548 -539 -668 -158 620 609 -752 -743 38 703 -139 -674 -848 103
4388A03L15n65m34J00Q61J63l97p92M03O73L22p08o89M14Q32k20o71k14N07O64
$$ 103 418 -147 -581 -481 380 543 146 -646 -243 430 752 44 -645 -231 601 381 -290 -504 3 667
4408F67k87r64j81P90O57n51p36J09Q69J55l90p50J92P28K19o51m92K15Q04J23
$$ 667 380 -584 -765 25 682 131 -605 -496 373 528 138 -612 -420 308 527 -124 -616 -401 403 526
4428E26q78m65K05P97K87p36k17M60M67K6q86J13N02K06l3j081M97J43L99l43
$$ 526 -352 -817 -612 185 472 -264 -481 -21 446 472 -414 -301 201 407 374 -707 -210 -67 332 -11
4448a1j70k2M46M42o32n99K09L73M95o46l86J77O42%p13k60N71M61j98n73k84
$$ -11 -181 -203 243 685 53 -546 -337 36 531 -115 -501 -324 318 318 -395 -655 -84 377 179 -394 -678
4469f78O15M66k07p84J97N47L07l41q54K67O10K57o37m40N43M36J13p22Q0J97
$$ -678 -63 403 196 -588 -391 156 463 122 -732 -465 145 402 -235 -675 -132 304 417 -305 -225 -28
4489b8N63m7m22l83L12M39k19l13l16N27K15k88l86J0M11L01m34n5n6L86j52m11
$$ -28 535 488 66 -317 -5 434 215 -98 -414 113 328 40 -346 -336 75 376 -58 -113 -169 217 65 -346
4511c46o9L0N26j12k33j44K51J45o1m8k71K27J26O5m68O6J94K27p6j91j84L27
$$ -346 -415 -385 141 29 -204 -348 -97 48 -13 -61 -332 -105 21 86 -382 -316 -122 105 29 -162 -346 -19
4533a9K34k71j24k2M02k49L4Q6j87L03P2m08j21m4L55n6pQ2k19J22j1j13j87J97
$$ -19 215 -56 -180 -202 200 -49 -15 71 -116 187 259 -149 -270 -314 41 -15 -22 60 -159 -37 -48 -161 -348 -151
4557a51J55k21QJ11K28l72K51J2K22k32m1K07j80J64j82pR2k36o7K00J20j12j99
$$ -151 4 -217 -209 -98 130 -242 9 21 243 11 -30 177 -3 161 -21 -28 64 -172 -239 -39 81 -31 -230
4580b30j5P8k0J39q8n4J86o5j06L10k90J18n1J6k3k62L9oM06j65N4l04K75M2K6
$$ -230 -245 -167 -187 -48 -136 -190 -4 -69 -175 135 -155 -37 -88 -72 -95 -357 -318 -324 82 -83 -29 -333 -58 -16 10
4605A0N1j25L14j68J06k72J49Q4kk91q0J92J54K1mk25j95N49k30r6k48J52N74
$$ 10 61 -64 250 82 188 -84 65 149 147 -144 -224 -32 122 143 139 -86 -281 268 38 -58 -306 -154 420
4628D20l31j24k06R7M39l9m22r0K96O4J05l18k07N52k9k90m30L14K80K42k46l77
$$ 420 89 -35 -241 -144 295 256 -166 -256 40 104 209 -109 -316 236 207 -83 -513 -199 81 323 77 -300
4650c00J14O43j90l82j70J30N33j47k68j74L04K43j24n22N1M96O9j08l83k51O96
$$ -300 -186 457 267 -115 -285 -155 378 231 -37 -211 93 336 212 -310 -259 237 306 198 -185 -436 260
4671B60J06j98o40L44N97j24m09p4o7N86J22p39P3j8L81N9m42l65O26L67k45l34
$$ 260 366 168 -472 -128 469 345 -64 -138 -205 381 503 -236 -163 -181 200 259 -183 -548 78 445 200 -134
4693a34l58O75M88n60n35J51O74j34j06l73o5M65J47m53k16J81M58K76p54l14
$$ -134 -492 183 671 111 -424 -273 401 267 161 -212 -277 188 335 -118 -334 -153 305 581 -173 -487
4713d87M69O19k55l84k31J36Q21l23n57j59L90O50p85j39J13N03Q4J4o25r6P00
$$ -487 -18 601 346 -38 -269 -133 688 365 -192 -351 39 689 -96 -235 -122 381 465 479 -146 -242 458
4734D58J02m46p10O25K48m4l08m59L28P96n02l80M2J20O35j84p19M3N64J54j25
$$ 458 560 114 -596 29 277 233 -75 -534 -206 590 88 -292 -250 -130 505 321 -398 -355 209 363 238
4755B38o76J01M76L59n88l43j94Q98J83o68l35M69P99r8p73k17L11N07k04o06
$$ 238 -438 -337 139 498 -90 -433 -627 271 454 -214 -549 -80 719 621 -152 -369 -58 449 245 -361
4775c61l60P12N90j94m45n15O06N17l15o30K43K74N95m44n84N6M69L57l94m36
$$ -361 -721 -9 581 387 -58 -573 33 550 235 -395 -152 122 717 273 -311 -255 214 571 177 -259
4795b59O6N58R7l39o29L08M79J33l40m00L82L42j3o06j19L88J82n2p33K86L06
$$ -259 -193 365 462 123 -506 -198 281 414 74 -326 56 398 385 -221 -340 48 230 178 -555 -269 37
4816C7L50m79m28J73M59J39k35k84j5O70j7l63n91L87M99j29m18k22O15K58j14
$$ 37 387 -92 -520 -347 112 251 16 -268 -283 387 370 7 -584 -197 302 173 -245 -467 148 406 292
4837B92k57m58M48L58m4l93n7K06K81k69m40K22L05K70m06m24M24J34J23n20j13
$$ 292 35 -423 25 383 339 -54 -111 95 376 107 -333 -111 194 464 58 -366 58 192 315 -205 -318
4858c18J23N85m8l10n30L86L00O9m24m11M59L35l13n55K94N39K96n34k26L3L14
$$ -318 -195 390 342 32 -498 -112 188 257 -167 -578 -119 216 -97 -652 -358 181 477 -57 -283 -250 64
4879F4J2o8l36N08K08J2m70o4j1M86k29j79k35L87J92j62k51j80M62L9j30j81
$$ 64 76 8 -328 180 388 400 -70 -134 -145 341 112 -67 -302 85 277 115 -136 -316 146 185 55 -126
4901a26P2L8MJ73j90j70N4J79j50j77L38O4J59l41Q9j74K81q5k5j0J00J62q1M0
$$ -126 -54 -16 -12 161 -29 -199 -145 34 -116 -293 45 109 268 -73 16 -158 123 38 13 3 103 265 184 224
4925B24p7J2j68J19k4j8O8J46j14j89Q4J37j62K40l72K19J6O3j74Oq5L8K5k12
$$ 224 147 159 -9 110 86 68 136 282 168 -21 63 200 38 278 -94 125 141 204 30 36 -49 -11 14 -198
4949a98LJ82N0k89J69M05l89K54j07k46L29M1p8k29L26J4M2m08j0M94l04J39k95
$$ -198 -195 -13 37 -252 -83 322 -67 187 80 -166 163 204 126 -103 223 237 279 -129 -139 355 51 190 -105
4972a05M07k93J08k57lL77k1k5k40J06k23K94k7k95J24J32P9Om13L60J52j32k81
$$ -105 302 9 117 -140 -143 234 213 188 -52 54 -169 125 98 -197 -73 59 138 144 -269 91 243 111 -170
4995a70K1RK45L2j7k11K12M9k61M5K27nQj01j25L3K75j32n8j47j06L73N8l49R6
$$ -170 -149 -140 105 137 120 -91 121 170 -91 -46 181 176 184 83 -42 -9 266 134 76 -71 -177 196 254 -95 1
5020Aj02M13P1m02k20N5L38J17m83J10J61K55m4k79k17J90L35j47l59J13K07J52
$$ 1 -101 312 383 -19 -239 -184 154 271 -212 -102 59 314 270 -9 -226 -36 299 152 -207 -94 113 265
5042B65R4o46L60pL22k53m83Q9K89K70n35j45K86L83j46k93m38L22Q01l55m14
$$ 265 359 -287 73 66 388 135 -348 -259 30 300 -235 -380 -94 289 143 -150 -588 -266 535 180 -234
5063b34j77N15R0k37l85k0O29J65l74n07L65K89K99m86q8K58q3K64m24k16M95
$$ -234 -411 104 194 -43 -428 -448 181 346 -28 -535 -170 119 418 -68 -156 102 19 283 -141 -357 138
5084A38J66R9o70J46K79K92j18o44j9N06K23j74m20J27M94j56k75l13K22L72j86
$$ 138 304 403 -267 -121 158 450 332 -312 -331 175 398 224 -196 -69 425 269 -6 -319 -97 275 89
5105H9K0l27J17M03j89l13n24P16N08m54k0l80K43M37k7n77M3LN60j64m65n1K60
$$ 89 109 -218 -101 302 113 -200 -724 -8 500 46 26 -354 -111 326 299 -278 -235 -232 328 164 -301 -352 -92
5128i2M75L6n01r0L35J07n30j79O0P90O9m89l24L64M60q0n71j56K74L95k26k77
$$ -92 383 419 -82 -172 163 270 -260 -439 -379 411 480 -9 -333 31 491 411 -160 -316 -42 353 127 -150
5150a50k56N66K42n29l46L27K63M68o48l16J73N60O6n48m87L83O00j2l32m47K85
$$ -150 -406 160 402 -127 -473 -146 117 585 -63 -379 -206 354 420 -128 -615 -232 368 356 24 -423 -138
5171a38N99j16m23k96J82M15o9n68Q7M33N9J29o89J08M55J25j54p91L46L52J89
$$ -138 461 345 -78 -374 -192 223 154 -414 -327 106 165 294 -395 -287 168 293 139 -652 -306 46 235
5192B35j28n85K78M08L06o19l08P7O53M5j74m38J51K78J56m94JJ34K51N0n41J75
$$ 235 107 -478 -200 208 514 -105 -413 -336 317 362 188 -250 -99 179 335 -159 -158 -24 227 277 -264 -89
5214h9N0M13l56l86L81R0N8l91K1J32L15J12k48m48L42N23m05k04l05M41O1R1
$$ -89 -39 374 18 -368 13 103 161 -230 -209 -77 238 350 102 -346 -4 519 114 -90 -395 46 107 198
5236A98k65o8N8K06O9m17J06J20L28n50J36J06K41R5l10l66N8J66K57m60k43J67
$$ 198 -67 -135 -77 129 198 -219 -113 7 335 -215 -79 27 268 363 53 -313 -255 -89 168 -292 -535 -368
5258c68M38J8r7j11J00L30l52j04k34K32L39j93k10M6K82j70L93m46j05J79J22
$$ -368 70 88 -9 -120 -20 310 -42 -146 -380 -148 191 -2 -212 -166 116 -54 339 -107 -212 -33 89
5279H9p2j04J87j9M35o38J46j54J54L50l19l71J70L24jj84k34K08L18k67q5Q3
$$ 89 17 -87 100 81 516 -122 24 -130 24 374 55 -316 -146 178 177 -7 -241 -33 285 18 -67 16
5301A6L84l75j76j05k35M47J50N8l12P5J1K01j70j2J30k5J39om09J35L1q8J46
$$ 16 400 25 -151 -256 -491 -44 106 164 -148 -73 -62 139 -31 -43 87 62 201 195 -214 -79 -48 -136 10
5324A0K03k22J77O8k54j68J77J70k25o0n4k8M52j72j87J39l9l6J12l38K55j55
$$ 10 213 -9 168 236 -18 -186 -9 161 -64 -124 -178 -206 246 74 -113 26 -13 -49 63 -275 -20 -175
5346a75L06k96J63O4j35n1o0k2r2K76N1N9o1l5J22n4m2J04r2O0j4nK94k58j80
$$ -175 131 -165 -2 62 -73 -124 -184 -206 -298 -22 29 88 27 -8 114 60 18 122 30 90 76 71 365 107 -73
5371g3Q9k0J12k70J79L5K61j74l85K44L7O5j21Q6l41K13l7J58p2k51M37k60L2
$$ -73 16 -4 108 -162 17 52 313 139 -246 -2 35 100 -21 65 -276 -63 -100 58 -14 -265 172 -88 -56
5394e6k72M55K2j33J8j08N9J72J1L2l26J8R7o3l5J87M3J4L5m85L05K35j04J2k69
$$ -56 -328 127 149 16 34 -74 -15 157 168 200 -126 -108 -11 -74 -109 78 121 135 170 -315 -10 225 121 133 -136
5419a36L46j22Q0k0l38N9K05K6k22p2K2K15K6j48k03L71k0K2k03k5K54M2k71l6
$$ -136 210 88 168 148 -190 -131 74 100 -122 -194 -172 43 69 -79 -282 89 69 91 -112 -137 117 159 -112 -148
5443a48K6K24J1j84k2l1K08J71q7k66K36r2K96l47j99J86L88k98p9j59N13J82
$$ -148 -122 102 113 -71 -93 -124 84 255 168 -98 138 46 342 -5 -204 -18 370 72 -7 -166 347 529
5465E29l61l62k0M25K1j58l25R2L07Q3l74m13L37L92o0p4l61L19J41J38l96l53
$$ 529 168 -194 -214 211 232 74 -251 -159 148 231 -143 -556 -219 173 113 39 -322 -3 138 276 -120 -473
5487d73L56L93p8m59K03K04O2M5m98Q8K23k0j35j55K6N26j15M1l81j6K66J64m81
$$ -473 -117 276 198 -261 -58 146 208 253 -245 -157 66 46 -89 -244 -218 308 193 234 -147 -163 103 267 -214
5510b14j43M85J05j00l96j5M44P0O9m44P7j79M87j23k82M1K69K33m58k91J33K03
$$ -214 -357 128 233 133 -263 -278 166 236 305 -139 -62 -241 246 123 -159 -118 151 384 -74 -365 -232 -29
5532b9N85l88m76L90j10L19l18j58K18J28L6k72k58L33L86j66l22l00L61K44J4
$$ -29 556 168 -308 82 -28 291 -27 -185 33 161 197 -75 -333 0 386 220 -102 -402 -41 203 217
5553B17m24m5K05Q9j33k11J75L20r2j83k31L32L40j81k67l61L94J53J38l35j23
$$ 217 -207 -252 -47 42 -91 -302 -127 193 101 -82 -313 19 359 178 -89 -450 -56 97 235 -100 -223
5574b23J30N24l81j96j28K71L39k19n25K4K73L21j76k62J32j22N06k08l39K76
$$ -223 -93 431 50 -146 -274 -3 336 117 -408 -384 -111 210 34 -228 -96 -218 288 80 -259 17
5594A7Q4J37k12l30J48L11M2l58j31M26J25J08o09J04k5O11l20n02L50J34K26
$$ 17 101 238 26 -304 -156 155 197 -161 -292 134 259 367 -242 -138 -163 448 128 -374 -24 110 336
5615C36k43l33J04L53kk60k37r4O25j02l11j9J08P1J14J4k67J52L32k83k03j33
$$ 336 93 -240 -136 217 215 -45 -282 -376 249 147 -164 -183 -75 -4 110 124 -143 9 341 58 -145 -278
5637b78L02J61l21M7Q0Q7J23j35k89q0O26P9m09o9j14M01k62J68m89K20M18j23
$$ -278 24 185 -136 -89 -9 78 201 66 -223 -303 323 402 -7 -76 -190 211 -51 117 -372 -152 266 143
5659A43l82M4l0M88l83q6j30K42M33m27N8k02K01K53j30j65j10L71R8k03l58M18
$$ 143 -239 -195 -225 263 -120 -206 -336 -94 339 -88 -30 -232 -31 222 92 -73 -183 188 286 83 -275 143
5681A43k49L52m6k47K65r1J51l19n5j3J6J2M7n4K06K01l88J80k70K51K0j71n0
$$ 143 -106 246 200 -47 218 127 278 -41 -96 -109 -93 -81 -34 -88 118 319 -69 111 -159 92 112 -59 -109
5704a09J0N1k32K80j47j96M17l76L77k24O8P3o2k08L15o5k9J35k9P2j34j0O0Q3
$$ -109 -99 -48 -280 0 -147 -343 74 -302 75 -149 -81 -8 -70 -278 37 -28 -57 78 49 121 -13 -23 37 120
5728A20j02l9R1Q9k43J03L53k76r2o4R2jM3k10k63L12q0N6J40m4M6j56J68J47
$$ 120 18 -21 70 159 -84 19 372 96 4 -60 32 31 74 -136 -399 -87 -167 -111 29 -15 31 -125 43 190
5752A90j74q1o7J73KL03k92k10J62J82k26j2P0j16J09J11j68Q1j36J03K13k0k75
$$ 190 16 -65 -132 41 43 346 54 -156 6 188 -38 -50 20 -96 13 124 -44 37 -99 4 217 197 -78
5775g8P7O1J67l83m2J38k2J12o7j7K2J6j97O9j53M64j52k7M0l15O07n06K7k09
$$ -78 -1 60 227 -156 -198 -60 -82 30 -37 -54 -32 -16 -213 -144 -297 167 15 -12 28 -287 320 -186 -159 -368
5799c68L33J65mj16j61K80m9K63n74n3L06P3r5l12N27j87LJ03k85J77o5n1n9K6
$$ -368 -35 130 126 10 -151 129 80 343 -231 -284 22 95 0 -312 215 28 31 134 -151 26 -39 -90 -149 -123
5823a23j5K11J38l97L2J53K46l63J37k51J46N83n21m4m1K17n4l1j08j4J79K57
$$ -123 -138 73 211 -186 -154 -1 245 -118 19 -232 -86 497 -24 -68 -109 108 54 23 -85 -99 80 337
5845C37j39m78P8K58J08j40j46P5L35k55N4k03k4N39j47m46q5L96K14l26k58O1
$$ 337 198 -280 -202 56 164 24 -122 -47 288 33 87 -116 -140 399 252 -194 -279 117 331 5 -253 -192
5867a92K75K4%m01K2N05K2k40k68M6M33J02n85K53o4J46J00j11k27J35L25j00
$$ -192 83 107 107 -294 -272 233 255 15 -253 -207 226 328 -257 -4 -68 78 178 67 -160 -25 300 200
5889B00m58K36j12O75n57k45k11N62J82p6l95L41j52M07m62l34L90K85o4k10m25
$$ 200 -258 -22 -134 541 -16 -261 -472 90 272 196 -199 142 -10 397 -65 -399 -9 276 212 2 -423
5910d23K08L79rl75N9J93J46qm84O4K73J81j63k41q2M47j2j76j21Q4j19M55k88
$$ -423 -215 164 155 -220 -161 32 178 170 -314 -250 23 204 41 -200 -282 165 153 -23 -144 -60 -179 276 -12
5933a2l71K40N19l01K3l79J68L32o4l63j21K19K51O2m57J78R7K84k95l00K51O2
$$ -12 -383 -143 376 75 98 -281 -113 219 155 -208 -329 -110 141 203 -254 -76 21 305 10 -290 -39 23
5955B3P2k3m88K10K80r1Kj17j44M68J81m64p5Q0J95k46K06m11M29K36j00k78j56
$$ 23 95 72 -416 -206 74 -17 -15 -132 -276 192 373 -91 -166 -86 109 -137 69 -342 87 323 223 -55 -211
5978b11K96J47m2l27L3L81k46K02l33l21L84L38k29l79K19K07J69k77k64MM04
$$ -211 85 232 190 -137 -104 277 31 233 -100 -421 -37 301 72 -307 -88 119 288 11 -253 -249 155
5999A55%k35l54L79J86Jk75j34K82J91k53k07L0L64K33m38l34N30R3O0k43k80
$$ 155 155 -80 -434 -55 131 132 -143 -277 5 196 -57 -264 -234 130 363 -75 -409 121 214 274 31 -249
6021b49J95M37k70m7m98M84J09l5k71J00L8J98n3l50k93O30J54j56k21j70L44
$$ -249 -54 383 113 66 -432 52 161 126 -145 -45 -7 191 138 -212 -505 125 279 123 -98 -268 76
6042G6L14l45R9o0J23J14j94j96Q0K01q8o8j85L71j10j11P2k42r2K71p9j4j41
$$ 76 390 45 144 84 207 321 127 -69 11 212 124 56 -129 242 132 21 93 -149 -241 30 -49 -63 -204
6065b04L1N12k95k37J68J28m3j11O6l2J49n7L8j63J28l5J45k18j60J9L48K7l29
$$ -204 -173 339 44 -193 -25 103 60 -51 15 -17 132 75 113 -50 78 43 188 -30 -190 -171 177 204 -125
6088a25l2K03K01j79k00LJ22M51m25R6k21L56k91k0K8J1Q9J14j07o4O6o1K4p8
$$ -125 -157 46 247 68 -132 -129 -7 444 19 115 -106 250 -41 -61 -33 -22 67 181 74 10 76 15 39 -39
6112c9k4K3L89k91j40R2J04j79j06K40R5j60K65j09p4J85q0k69n1n1n3J49L15
$$ -39 -63 -40 349 58 -82 10 114 -65 -171 69 164 4 269 160 86 271 191 -78 -129 -180 -233 -84 231
6135B31j52m8J73j88O6l1k2o9J1K37j51j9r2K42m0j58J2K0k1m8K11j97K01l33
$$ 231 79 31 204 16 82 51 29 -40 -29 208 57 38 -54 188 148 -10 2 22 1 -47 164 -33 168 -165
6159a65L17m8K9J1j01m6K98j37j10oo9J52j15p3q8K25o9Oj50J15R3J09k59p3m0
$$ -165 152 104 133 144 43 -3 295 158 48 42 -27 125 10 -63 -151 74 5 11 -139 -24 69 178 -81 -154 -194
6184a94P4K07k78l16L40K34P9l98j78L93K23j99j14j9P2L47k56J05n7j14K66j39
$$ -194 -120 87 -191 -507 -167 67 146 -252 -430 -37 186 -13 -127 -146 -74 273 17 122 65 -49 217 78
6206G8k71R0L13K0j88k78K72j29M51j80j05k3J9J18p1l51M14j4K7m05K11j1J04
$$ 78 -193 -103 210 230 42 -236 36 -93 358 178 73 50 69 187 116 -235 179 165 192 -213 -2 -13 91
6229I1Nl09N0L1K47Ol54O7L73K28l12k40Q2K82k34j13k4O1J33J00%n02L90r1L02
$$ 91 96 -213 -163 -132 115 121 -233 -166 207 435 123 -117 -35 247 13 -100 -124 -63 70 170 170 -332 58 -33 269
6254B69r0n17N42j0j22k9l55L87J52k40k41K98J09Oj41l49K36J90J57J4p24L57
$$ 269 179 -338 204 194 72 43 -312 75 227 -13 -254 44 153 159 18 -331 -95 95 252 266 -458 -101
6276a01L50k07L0l14L13O5M9l97j10L84K18r7k36J5K06J3R4k69k68L18m7J02m42
$$ -101 249 42 72 -242 71 136 185 -212 -322 62 280 183 -53 -38 168 181 275 6 -262 56 9 111 -331
6299c31J72L74Jl35k75J15M01R6m68J71K04J10j87k8n3j7K63P5m88q7K41N94n62
$$ -331 -159 215 216 -119 -394 -279 122 218 -250 -79 125 235 48 20 -33 -50 213 288 -200 -287 -46 548 -14
6322a4l22L28K5L23l21L2k29K35L71m10k50N0O22j75k26r7r6L93J22k44k28K77
$$ -14 -336 -8 17 340 19 51 -178 57 428 18 -232 -182 440 265 39 -58 -154 239 361 117 -111 166
6344A66m7K04p24K81J56k49N05m27k1J90J60q9l92J22K50J99m50k64L61J10L8
$$ 166 119 323 -401 -120 36 -213 292 -135 -156 34 194 105 -287 -165 85 284 -166 -430 -69 41 79
6365G9p2J9k53O48l47o8k13k3N33j08r0k68L5M02o8k38j94P4K93k44m0J28J23
$$ 79 7 26 -227 421 74 6 -207 -230 303 195 105 -163 -128 274 206 -32 -226 -152 141 -103 -143 -15 108
6388A08J3k62j28J19M07n0j13l78K06K10J44k92k58K25J81O8k05l12M71J04l01
$$ 108 121 -141 -269 -150 257 207 94 -284 -78 132 276 -16 -274 -49 132 200 -5 -317 154 258 -43
6409d3m4j50J42K71j44l09J78J24m2jk23L1K99K71j80k05k9J35l0j02N2J6J63
$$ -43 -87 -237 -95 176 32 -277 -99 25 -17 -18 -241 -210 89 360 180 -25 -54 81 51 -51 1 17 180
6432A80q7p7l69M58J52l32J9j03L35J41k44m24L36K17j16j13O4J15J17j27j46
$$ 180 93 16 -353 105 257 -75 -56 -159 176 317 73 -351 -15 202 86 -27 37 152 269 142 -4
6453dl41L67L4P2Jk88J3K43j23j41m3L67R9l16j3K64k05J81k51N5k28R3J32P7
$$ -4 -345 22 56 128 129 -159 -146 97 -26 -167 -210 157 256 -60 -73 191 -14 167 -84 -29 -257 -164 -32 45
6477D5j95K0L28j67j70M8l0K34j00k59J53J07j92J68K01l11K04o9Q9K2l3O4%j19
$$ 45 -150 -130 198 31 -139 -91 -121 113 13 -246 -93 14 -178 -10 191 -120 84 15 104 126 93 157 157 38
6501C8K28k43J44j12q3j19P2J21k60P5Q6J59m5l6n1N8m9OR6o8N6r4r0J97j46K64
$$ 38 266 23 167 55 -28 -147 -75 46 -214 -139 -53 106 61 25 -26 32 -17 -11 85 17 73 -21 -111 86 -60 204
6527B04j13m4n9P3J95m47J8J07J67r5k1J99k94K74j14j53J92j84lK67p1k61J65
$$ 204 91 47 -12 61 256 -191 -173 -66 101 6 -15 184 -110 164 50 -103 89 -95 -98 169 98 -163 2
6550BJ9O3j58%J34j75K06n7q7P6k6k43L95k02K76k75J66k8m1J86m93J73J45j03
$$ 2 21 84 -74 -74 60 -115 91 34 -53 23 -3 -246 149 -53 223 -52 114 86 45 231 -262 -89 56 -47
6574d7K13k45O9k80M18r8j24k53K14K87j98k27N2L3L27O4l46L1J16P8O6k35r8
$$ -47 166 -79 -10 -290 128 30 -94 -347 -133 154 -44 -271 -219 -186 141 205 -141 -110 6 84 150 -85 -183
6597a83K79J36k00j70L9J87J05k87J35j9J57j18J02j91k74L46L6l73J79j99M20
$$ -183 96 232 32 -138 -99 88 193 -94 41 22 179 61 163 -28 -302 44 80 -293 -114 -313 107
6618A07K67l83j73J98N5j64k14K27l1L61l12M5j06J56K73k35j26o5L44l4j67O1
$$ 107 374 -9 -182 16 71 -93 -307 -80 -111 250 -62 -17 -123 33 306 71 -55 -120 224 190 23 84
6640H4k79Q3L41k26j72M0J71J72l53K0L45k7J35p19J04J27K08k7m53L16J16j6
$$ 84 -195 -112 229 3 -169 -129 42 214 -139 -119 226 199 334 -385 -281 -154 54 27 -426 -110 6 -10
6662a0J32l35lJ75L8J10l02J28J29j77l3j16m0O79j23j99m28L04L34j00k18k40
$$ -10 122 -213 -216 -41 -3 107 -195 -67 62 -115 -148 -264 -304 375 252 53 -375 -71 263 163 -55 -295
6684b95L64J33k87m4j28K22L95n3m05k76L89K84m99p7J39M47k83j68O6J82kJ32
$$ -295 69 202 -85 -129 -257 -35 360 307 -98 -374 15 299 -200 -277 -138 309 26 -142 -76 106 104 236
6706B36k98j66K89L69m19km00L26J98L9j71j58L7L30j18k38J78J58J69j96k92
$$ 236 -62 -228 61 430 11 9 -391 -65 133 172 1 -157 -120 210 92 -146 32 190 359 163 -129
6727a29K55J22J0k34l64K83K19M2k42l2K78M7j38l4k05K06M13l81k96k6L42l8
$$ -129 126 248 258 24 -340 -57 162 204 -38 -70 208 255 117 83 -122 84 497 116 -180 -206 136 98
6749I8J05j16k26R5L67k11m49K79J23K12m83j15P9L75P2m55L65j30J46J13m86
$$ 98 203 87 -139 -44 323 112 -337 -58 65 277 -206 -321 -242 133 205 -250 115 -15 131 244 -242
6770b42j1N06J33j34m23J37K08N0j3l99j15J98L91r7n15O2K6M85l81P1L0J51J22
$$ -242 -253 253 386 252 -171 -34 174 224 211 -188 -303 -105 286 189 -326 -264 -238 247 -134 -63 -33 118 240
6793B40l10m3K55k0j64n6K2j23O37n57Pk91L99K15k61J42k47K26L88n31n4N9K4
$$ 240 -70 -113 142 122 -42 -98 -76 -199 438 -119 -112 -403 -4 211 -50 92 -155 71 459 -72 -126 -67 -43
6816d3K41o3m61K83L20p9l42j05K26N3Qm0l49K35K85k27o3j09Q9K40m1k44K15
$$ -43 198 135 -326 -43 277 198 -144 -249 -23 30 38 -2 -351 -116 169 -58 -121 -230 -141 99 58 -186 29
6839B9j88K14j45J67j04j39J73k17K88k3K3N3k31j03K3M71L2k07l39L03L5P0l67
$$ 29 -159 55 -90 77 -27 -166 7 -210 78 55 78 131 -100 -203 -180 291 323 116 -223 80 115 185 -182
6862a82M9O8L88m35q8M8MK72k26k2L09j41J36k25j8j44J23KO8j77L34k3o8o2p9
$$ -182 -133 -65 323 -112 -200 -152 -148 124 -102 -124 185 44 180 -45 -63 -207 -84 -82 -14 -191 143 120 52 -10 -89
6887h9P2L8J05j40n2O7%o0K13k4l3O1l12J20j72K6N0j1q2J83J38K5q8j92K47j52
$$ -89 -17 21 126 -14 -66 1 1 -59 154 130 97 158 -154 -34 -206 -180 -130 -141 -223 -40 98 123 35 -157 90 -62
6913f2J75q6P7L2k79L00K9l97J71j23qJ46L7K5Jj58K88k02q1J06n9J24q3j93l
$$ -62 113 27 104 136 -143 157 186 -211 -40 -163 -171 -25 12 37 38 -120 168 -34 -115 -9 -68 56 -27 -220 -223
6938b23L04r8P1m8Q9j15K69pk72j43J97JO6r5L0K88k96lj60K26j47K30j39Oq9
$$ -223 81 -17 54 6 95 -20 249 242 -30 -173 24 25 91 -4 26 314 18 15 -145 81 -66 164 25 31 -58
6963e8J82j85N8L5k4m4l30J22K84l24J56J90r5K05l16M03j54k81m3L93M4k95J67
$$ -58 124 -61 -3 32 8 -36 -366 -244 40 -284 -128 62 -33 172 -144 259 105 -176 -219 174 218 -77 90
6986I0k66J33J21L6m32N58q3Pj74j49K33j12J35p6l87M86k02J0J41k48L77j65
$$ 90 -176 -43 78 114 -318 240 157 164 -10 -159 74 -38 97 21 -366 120 -82 -72 69 -179 198 33
7008C3N3qk48L06J04k27k48K84J01qk54n6N6M7j95J66q9R0N96m72J2j9L16n1l32
$$ 33 86 78 -170 136 240 13 -235 49 150 142 -112 -168 -112 -65 -260 -94 -183 -93 503 31 43 24 340 289 -43
7033d3O0r7K19K3j83K6k19M79K6q6l16K57j15J47l16j68L29L1k3N6q0J3J14j85
$$ -43 17 -80 139 162 -21 5 -214 265 291 205 -111 146 31 178 -138 -306 23 54 31 87 7 20 134 -51
7057e1j08J40R1L6k4l98L64j01L65l26q4j54N81l18l05K54r7K58J34l51k64M13
$$ -51 -159 -19 72 108 84 -314 50 -51 314 -12 -96 -250 331 13 -292 -38 -135 123 257 -94 -358 55
7079E5J78l5k60j00L42R1k05m2j85K85k5O9m22J3L69J19j93k55J99M0K41j58m50
$$ 55 233 198 -62 -162 180 271 66 24 -161 124 99 168 -254 -241 128 247 54 -201 -2 38 279 121 -329
7102c29K94K48P2l02k28K27K56j15l0k65K28L91n17Kl23N21L22m27j85m5l3M45
$$ -329 -35 213 285 -17 -245 -18 238 123 93 -172 56 447 -70 -68 -391 130 452 25 -160 -205 -238 207
7124B07k61o5j47M54K5j95k24J31K82m7n01J68K32K27p7k37j71P5L95k45L0k40
$$ 207 -54 -119 -266 188 213 18 -206 -75 207 160 -341 -173 59 286 209 -28 -199 -124 271 26 56 -184
7146a84K36q7L06k23l07L31J06Pk55L6L12K0k92j93J27J65J5j34q4j03L15Jj1
$$ -184 52 -35 271 48 -259 72 178 185 -70 -34 278 298 6 -187 -60 105 120 -14 -98 -201 114 115 104
7169A04k15L2K63k56J80j05j45M91j49k68R6K19J18m16K9j47M83l50K2M0L5L1
$$ 104 -111 -79 184 -72 108 3 -142 349 200 -68 28 247 365 -51 -22 -169 314 -36 -14 26 61 92
7191I2j99Q6oj27J45L26q5k44o4R3l2K13l07Q3M5J6O1m14K78R8J53l27o9L20k12
$$ 92 -107 -21 -27 -154 -9 317 232 -12 -76 17 -15 198 -109 -26 19 35 96 -318 -40 58 211 -116 -185 135 -77
7216g7l6j03R7J63L33j59m15K2J98L10n55J29J28K91n12K14l04J59K79k14j55
$$ -77 -113 -216 -119 44 377 218 -197 -175 23 333 -222 -93 35 326 -186 28 -276 -117 162 -52 -207
7237b07L02j8K9p6K22k84K91k11k30K38J16j5k42K01p9M4j31L9Pk28M87o0K3m43
$$ -207 95 77 106 30 252 -32 259 48 -182 56 172 157 -85 116 37 81 -50 -11 -4 -232 255 195 218 -225
7261b25J60K31q0M8m3j04j86L54P8k71j3J01j46q1J67j63K64l61L12k42Q8K55
$$ -225 -65 166 86 134 91 -13 -199 155 233 -38 -51 50 -96 -177 -10 -173 91 -270 42 -200 -112 143
7283A43m7k30k0M6K69l96J90k36L10P4j50J8K1J61k95L3O3J29k24K47j61q7J37
$$ 143 96 -134 -154 -108 161 -235 -45 -281 29 103 -47 -29 -8 153 -142 -109 -46 83 -141 106 -55 -142 -5
7306eM0n5N4j38J71j25J57j50p7K97k32J21r2J81o2k31J82nJ30j67K0l77M15J70
$$ -5 35 -20 34 -104 67 -58 99 -51 -128 169 -63 58 -34 147 85 -146 36 31 161 -6 14 -363 52 222
7330B22m76K24k81M72q3j96K37l75O4K36O1l38L40P8l21K72j57P1J09l50N3K18
$$ 222 -254 -30 -311 161 78 -118 119 -256 -192 44 105 -233 107 185 -136 136 -21 50 159 -191 -138 80
7352H0J47l00R4R3q6m6J03k80N3J58j07K0J43k23J17k1j10J6J26j59L04j93j23
$$ 80 227 -73 21 114 28 -18 85 -195 -142 16 -91 -71 72 -151 -34 -55 -165 -149 -23 -182 122 -71 -194
7375a94J13K7j5L0j11J25J55J50j90q7O6K06k47K39l20K09J66j48k5nj75J87m8
$$ -194 -81 -54 -69 -39 -150 -25 130 280 90 3 69 275 28 267 -53 156 322 174 149 144 -31 156 108
7398A08k56j29L39K82l15k36L58l64L97n8j28j53Q6M98l87l66L98Q2q0L6k1k8
$$ 108 -148 -277 62 344 29 -207 151 -213 184 126 -2 -155 -69 429 42 -324 74 156 76 112 91 63
7420F3J29j20l8n9j46L89k6m47jL87R5m8k62J2M37l88J44n37J44L65Q2j06q0J8
$$ 63 192 72 34 -25 -171 218 192 -255 -256 131 226 178 -84 -72 365 -23 121 -416 -272 93 175 69 -11 7
7444GL27k52j29l41N53q3L8l20k72N80P4J01k09k9Q8l0K22m71R9K74N5k29l17
$$ 7 334 82 -47 -388 165 82 120 -200 -472 108 182 283 74 45 133 103 325 -146 -47 227 282 53 -264
7467b64J56L80p6K61l71l60N28J99o12k24L13J84L3j62J1L3J40k21N1k88K37K3
$$ -264 -108 272 196 457 86 -274 254 453 -159 -383 -70 114 147 -15 -4 29 169 -52 -1 -289 -52 -29
7489b9K02m36J59J42K50l39j03j19M08l9j54j49j9L52L9k54j44K36J33J21l87
$$ -29 173 -263 -104 38 288 -51 -154 -273 135 96 -58 -207 -226 126 165 -89 -233 3 136 257 -130
7510a30J38j26K48p4P2j99J74M8o3n6l79L99J01p8j90j38O01Rj63l54J67%J48
$$ -130 8 -118 130 56 128 -71 103 151 88 32 -347 52 153 75 -115 -253 348 357 194 -160 7 7 155
7533A55k34k17J51M07o7k31j2J8J97k34K2o9L39J0k27l4j78K11K23j88j32m0J84
$$ 155 -79 -296 -145 262 195 -36 -48 -30 167 -67 -45 -114 225 235 8 -26 -204 7 230 42 -90 -130 54
7556E4J23j53l57K58K22M0n15n1M36P2ok56j71L85J97k02k34Q3O5K77j88p8j24
$$ 54 177 24 -333 -75 147 187 -328 -379 57 129 123 -133 -304 81 278 76 -158 -75 -10 267 79 1 -123
7579a23J47K9k4k49K14o7K77n6l16L3J28K94l57q7J16L03j18j71k96J16L03K04
$$ -123 24 53 29 -220 -6 -73 204 148 -168 -135 -7 287 -70 -157 -41 262 144 -27 -323 -207 96 300
7601C00p18J55K28J51m2k4j75P1P8m4j63J4K18K0o7P6J8J87j62k20J40k56L25
$$ 300 -418 -263 -35 116 74 50 -125 -54 24 -20 -183 -169 49 69 2 78 96 283 121 -99 41 -215 110
7624A10l2k58N4K16J68j30l98J43J01J52p6p6r4M70m31L04j39l71K52o2J49k1
$$ 110 78 -180 -126 90 258 128 -270 -127 -26 126 50 -26 -120 350 -81 223 84 -287 -35 -97 52 31
7646C1j21J33r3K58l92J60J31L5j61k60L86j12J54l55K70Rj32O4KJ2J77m6j92
$$ 31 -90 43 -50 208 -184 -24 107 142 -19 -279 107 -5 149 -206 64 73 -59 5 7 19 196 150 -42
7669d2l62J32L28l9j85Q4k4K65j69p4m8o6K36J18k24k23K02k83J80J72O4k9M8
$$ -42 -404 -272 56 17 -168 -84 -108 157 -12 -86 -134 -200 36 154 -70 -293 -91 -374 -194 -22 42 13 61
7692F1mn4q6l3J51j62J79o1O3K40m51M10j43r8J8q2K70l84P8M0K27o9j23k2L16
$$ 61 57 3 -83 -116 35 -127 52 -9 54 294 -157 253 110 12 30 -52 218 -166 -88 -48 179 110 -13 -35 281
7717B81n9k65m1k7N4Q8j60J86k35L22l47J21p5J6R2P4j37R9j56NJ30qj58J55N7
$$ 281 222 -43 -84 -111 -57 31 -129 57 -178 144 -203 -82 -157 -141 -49 25 -112 -13 -169 -164 -34 -42 -200 -45 12
7742A2N0j31q1L11j62J86l06J1J54P1j04K28j50k38K36Q9q5k52K13j43J91j24
$$ 12 62 -69 -150 161 -1 185 -121 -110 44 115 11 239 89 -149 87 176 91 -161 52 -91 100 -24
7764b4r1Q7O4q6J44j06j38K20q7j95k9K47J64P4l99J19M9K13k58j41N6N40l52
$$ -24 -115 -28 36 -50 94 -12 -150 70 -17 -212 -241 6 170 244 -155 -36 13 226 -32 -173 -117 423 71
7787G1j53k15M04K3J68m73LP9L52k25r7J06k7J71j50k52j3L85K0k47o8K6J18J29
$$ 71 -82 -297 107 130 298 -175 -172 -93 259 34 -63 43 16 187 37 -215 -228 157 177 -70 -138 -112 6 135
7811A35n9m10K62J66J49k46j40n8L27J42k45k45J5O09k42j90j47J69M24m03k37
$$ 135 76 -334 -72 94 243 -3 -143 -201 126 268 23 -222 -207 402 160 -30 -177 -8 416 13 -224
7832b24J72P8K39k81k53L11kK38k10j47po3K91j09k24OM63j91l57j8K49K54j98
$$ -224 -52 26 265 -16 -269 42 40 278 68 -79 -86 -149 142 33 -191 -185 278 87 -270 -288 -39 215 17
7855A7K8k39J95K03L7m22j53L43L58p1n46J74J13p4J0l38J94M51k53k86K76K3
$$ 17 45 -194 1 204 241 -181 -334 9 367 296 -250 -76 37 -37 -27 -365 -171 280 27 -259 17 40
7877D0O3J48m48K35j54L33k62k75R6J08K76J40m27J23J54j2k80L1k29L25K69m97
$$ 40 103 251 -197 38 -116 217 -45 -320 -224 -116 160 300 -127 -4 150 138 -142 -111 -340 -15 254 -243
7899b43J15J53L10l41j46PO6K24k11q8J13J91J87j79l54J86j9K78Q3l58O9L9J56
$$ -243 -128 25 335 -6 -152 -145 -79 145 -66 -154 -41 150 337 158 -196 -10 -29 249 332 -26 43 82 238
7922B38m25P0j48M57j20k04k25J48L29p3j0l45P2J80K36l32j67O1N86k19j83k4
$$ 238 -187 -117 -265 192 72 -132 -357 -209 120 47 37 -308 -236 -56 180 -152 -319 -258 328 109 -74 -98
7944i8J44Q8n53M63j32J76K43k21k34j26J76L49l62j31J51J37K0J04l35L00l9
$$ -98 46 134 -419 44 -88 88 331 110 -124 -250 -74 275 -87 -218 -67 70 90 194 -141 159 120
7965A20r0j42j80L06J26j5l67o1L91J95j69m22Q0L13J11k56k76L25n1K61O7l78
$$ 120 30 -112 -292 14 140 125 -242 -303 88 283 114 -308 -228 85 196 -60 -336 -11 -62 199 266 -112
7987a12QM8K84k72j22K17K7j06L2j73J35m5O9m8k67L61LM7j27m3K09K1j47k15
$$ -112 -104 -56 228 -44 -166 51 78 -28 4 -169 -34 -79 -10 -58 -325 36 39 86 -41 -84 125 146 -1 -216
8011b16L58j51O5j83l7J24J76j78J70n22L17K08M9l99J27J82o8K87l40M5j61J58
$$ -216 142 -9 56 -127 -164 -40 136 -42 128 -394 -77 131 180 -219 -92 90 22 309 -31 14 -147 11
8033A1j22o0N6M5K01j5j55K50r6ol31K11k52L58j30l4J61k32K12j22J35j94N7
$$ 11 -111 -171 -115 -70 131 116 -39 211 115 109 -222 -11 -263 95 -35 -69 92 -140 72 -50 85 -109 -52
8056e2l7J63r1QQ0J94j64j96J59J38qr2l55K51R0J2q9LJ41k9jj44l14J78K7q7
$$ -52 -89 74 -17 -9 71 265 101 -95 64 202 194 102 -253 -2 88 100 11 14 155 126 125 -19 -333 -155 -128 -215
8082b15K20J3j65J53o6M6n7J76k02J1J37j45M68k42k45p5J77M7M3k04K04J18m95
$$ -215 5 18 -147 6 -60 -14 -71 105 -97 -86 51 -94 374 132 -113 -188 -11 36 79 -125 79 197 -298
8105b98L72j89K5K7O6OK9J93l69K5j45L33l9j77J45j83J20L2J12Q5J7k51J04m
$$ -298 74 -115 -90 -63 3 9 38 231 -138 -113 -258 75 36 -141 4 -179 -59 -27 85 170 187 -64 40 36
8129C6k1j20J08m0N0j57L2L43n9l72J92N5J35P9m00K38j13J09j88K22j93J63J99
$$ 36 15 -105 3 -37 13 -144 -112 231 172 -200 -8 47 182 261 -139 99 -14 95 -93 129 -64 99 298
8152B98m7j68M0k26R2Q7r2J00k2j8j07n4j09L50l5j41k5K26J0j75j90K47j8K34
$$ 298 251 83 123 -103 -11 76 -16 84 62 44 -63 -117 -226 124 89 -52 -77 149 159 -16 -206 41 23 257
8176B57l60l7R4Q8Ok39J59r7J24M16p60L27J94P3j55
$$ 257 -103 -140 -46 42 48 -191 -32 -129 -5 411 -349 -22 172 245 90
8191I0
$$ Imaginary data points
##PAGE= N=2
##DATA TABLE= (X++(I..I)), XYDATA
0@%%%%%%%%%%qJ6j6J6j6K3l1L2m0N1n9P2q8J04j20J43j68J93k24K57k93L34l80
$$ 0 0 0 0 0 0 0 0 0 0 0 -8 8 -8 8 -8 15 -16 16 -24 27 -32 40 -48 56 -64 79 -89 104 -120 137 -156 178 -202
33b02M30m87N50o20O97p78Q68r66J072j192J321j459J613j782J965k167K386k628
$$ -202 228 -259 291 -329 368 -410 458 -508 564 -628 693 -766 847 -935 1030 -1137 1249 -1379
51a379K896l189L518l887M300m767N303n924O651p518Q574r891J1587j3868J7113
$$ -1379 1517 -1672 1846 -2041 2259 -2508 2795 -3129 3522 -3996 4578 -5313 6274 -7594 9519
66I519k2138L1041n1545J88121R9056k18774K0730L2896J20801o9445j51590k2183
$$ 9519 -12619 18422 -33123 154998 254054 35280 56010 88906 209707 140262 -11328 -33511
78c3511J04774O4250m1436j67037J9494J39355L0884p1742j15559K2657J33473
$$ -33511 71263 135513 94077 -72960 -53466 85889 116773 45031 -70528 -47871 85602
89H5602K1656j04465r0753M7748J13881K4516j32635m8901P7103J08182Q862j19282
$$ 85602 107258 2793 -87960 -40212 73669 98185 -34450 -83351 -6248 101934 110796 -8486
101h486l0258J08933R1034k4822r9323l6815J22077O8537p1732q7685k9266J19590
$$ -8486 -38744 70189 161223 136401 37078 263 122340 190877 119145 31460 2194 121784
113A21784M7537r4989p7251Q763J01419M6496r9310p6083N4460Q3132K8226j03610
$$ 121784 169321 74332 -2919 5844 107263 153759 54449 -21634 32826 115958 144184 40574
125D0574o9229P3163O7754o319r7504n5613P1041P6897l9179q5229k4639P4816
$$ 40574 -28655 44508 112262 105943 8439 -47174 23867 100764 61585 -23644 -48283 26533
137B6533Q0487n5288p3225N983P5418N9976n4907q2936K1500P7336K2677n7915
$$ 26533 107020 51732 -21493 -15510 59908 119884 64977 -17959 3541 80877 103554 45639
149D5639q6370L5310P8143n443n8562o2528M0950Q2605j1489o8988k9741M3967
$$ 45639 -40731 -5421 72722 67279 8717 -53811 -12861 69744 58255 -10733 -40474 3493
161C493P7484k1064q1452n691M6755N4625k8879p6813P28N9444L5855l1701o1470
$$ 3493 80977 59913 -21539 -27230 19525 74150 45271 -31542 -30814 28630 64485 32784 -28686
174b8686Q097P7761J8446l7146m0861J5962P0582R771n0765l2709K1863M8976
$$ -28686 -20589 57172 75618 38472 -2389 13573 84155 93926 43161 10452 32315 81291
186H1291M860o7562k5666L3970L0839k965o3180j5672M2723K5395j4725m5579
$$ 81291 86151 18589 -7077 26893 57732 54767 -8413 -24085 18638 44033 29308 -16271
198a6271j4989M8507K4088l5595l0599r698M3952J6913m1762k3713M395L5907
$$ -16271 -31260 17247 41335 5740 -24859 -34557 9395 26308 -15454 -39167 -34772 1135
210A135J4863l2777k5345K8190K9148R683k3097k1707L6284K2716n74k0928j3977
$$ 1135 15998 -16779 -42124 -13934 15214 24897 1800 -19907 16377 39093 38519 17591 3614
223C614K3618K4736j3855k4294p75J1854K5320k1416k0156P562Q651J7251j5860
$$ 3614 27232 51968 38113 13819 13044 24898 50218 28802 8646 16208 24859 42110 26250
236B6250j8641N534J5326m68q738k1028M606J7723j3811k983j5462M026J3962
$$ 26250 7609 13143 28469 28001 19263 -1765 2841 20564 6753 3770 -11692 -7666 6296
249F296o951o530l060M979R558L545j4203J0375J188K443P187j2165P677j311
$$ 6296 -655 -7185 -10245 -5266 4292 7837 -6366 4009 5197 7640 14827 2662 10339 9028
263I028K49K192k385l675M968l560k154J0764j1906M648l762J302R498j1019k815
$$ 9028 9277 11469 9084 5409 10377 6817 4663 15427 3521 8169 4407 5709 15207 4188 1373
278A373O84L169K353j489j7372P835Q224k033k19j9044J2510J3076j567q229p522
$$ 1373 2057 5226 7579 6090 -11282 -3447 4777 2744 2525 -16519 -4009 9067 7500 -729 -8251
293h251P935J9318n73k0070K614O082K2932o272k4945M922J3648J5309j0193k2437
$$ -8251 -316 19002 18429 -1641 973 7055 29987 23715 -1230 3692 17340 32649 22456 19
307A9j437K6424N600j3965k1878j691L3774j335k0534j9548O591K9291J95k9648
$$ 19 -1418 25006 30606 16641 -5237 -6928 26846 25511 4977 -14571 -7980 21311 21506 -8142
321h142j6086J6927K2719L124l8734j0573K6688J9678m420l6986o323L2635K1787
$$ -8142 -24228 -7301 15418 18542 -20192 -30765 -4077 15601 11181 -25805 -32128 507 22294
334B2294j7435k9253l717L8369K2701l1105k3481L601M0002J6051l6402k6305
$$ 22294 4859 -24394 -28111 10258 32959 1854 -21627 -18026 21976 38027 1625 -24680
346b4680J6000L5565P270l7517l0845L0722L2152l426l7793k4391L7334L2899
$$ -24680 -8680 26885 34155 -3362 -34207 -3485 28667 25241 -12552 -36943 391 33290
358C3290j4300l8473j1833L5640L5238k5661m1405J104L5759L0272l3711m0653
$$ 33290 18990 -19483 -31316 4324 39562 13901 -27504 -26400 9359 39631 5920 -34733
370c4733J1494M1271J8335l3068l8594J9985M9911M534l5944l3705K8058M9433
$$ -34733 -23239 18032 36367 3299 -35295 -15310 34601 39135 3191 -30514 -2456 46977
382D6977p891m4271k4651L1416M3006j5393n4993j1056L6295L6460k2374n6994
$$ 46977 39086 -5185 -29836 1580 44586 29193 -25800 -36856 -561 35899 13525 -43469
394d3469J728M4444K7545l0113m9670O664N2064J6722m0158m1009J1854N7158
$$ -43469 -41741 2703 30248 135 -49535 -42871 9193 25915 -14243 -55252 -43398 13760
406A3760M529m6830l0722K3570N4726j8m9229k1816M0544M6584l740n3166j3514
$$ 13760 18289 -28541 -59263 -35693 19033 19015 -30214 -52030 -11486 35098 31358 -21808 -35322
419c5322N1694L5202j6782n4076o298N1902K9041l4690m9038K661N1441K5892
$$ -35322 16372 51574 34792 -19284 -25582 26320 55361 20671 -28367 -25706 25735 51627
431E1627m9866l9289J4801N1745J5223n4267l4960K6082M8811j701n3162l4895
$$ 51627 1761 -37528 -22727 29018 44241 -10026 -44986 -18904 29907 28206 -24956 -59851
443e9851L8227M3749j6093n0260k5112M8728L9073k2237m7393o673N1456L6877
$$ -59851 -21624 22125 6032 -44228 -69340 -20612 18461 -3776 -51169 -57842 -6386 30491
455C0491k8156m8843J1732M7723K8200l8641m6261K0728M5612J5693m5559l7908
$$ 30491 2335 -46508 -34776 12947 41147 2506 -43755 -23027 22585 38278 -7281 -45189
467d5189K4854N2053P4m6123k6713L1335N3173j5298m5994j8721L6355M2319k3396
$$ -45189 -20335 31718 31792 -14331 -41044 -9709 43464 28166 -17828 -36549 -194 42125 18729
480A8729n1863j0260M3511K7791k6126n3276M715M8940J8862k7200m4968J6394
$$ 18729 -33134 -43394 117 27908 1782 -51494 -46779 2161 21023 -6177 -51145 -34751
492c4751N0847J4575l7334l2597K0232M8077N801m9063k1083K2470M2365m651
$$ -34751 16096 30671 -6663 -39260 -19028 29049 34850 -14213 -35296 -12826 29539 24888
504B4888m9581j5419L2392L6804j3287m3811j0951M3955K6418k2222l9386o450
$$ 24888 -24693 -40112 -7720 29084 15797 -28014 -38965 4990 31408 9186 -30200 -36650
516c6650M5786J6498l1103l8313M092M1399J2414l7157l2631K0343L7190J1040
$$ -36650 9136 25634 -5469 -43782 -39690 1709 14123 -23034 -55665 -35322 1868 12908
528A2908l8456k1701K9462L6599K794l7818j5314L1789L3774j2852l5156j0287
$$ 12908 -25548 -47249 -17787 18812 21606 -16212 -31526 263 34037 21185 -13971 -24258
540b4258L1771K8393k2644l1096k890L4079K1800k4855l0021P741L2838J1131
$$ -24258 7513 35906 13262 -17834 -20724 13355 35155 10300 -19721 -11980 20858 31989
552C1989k5781l1426J4310K7642N12k9365k7172J6866K6654p082l0622j4735J9315
$$ 31989 6208 -25218 -10908 16734 17246 -12119 -39291 -22425 4229 -2853 -33475 -48210 -28895
565b8895K8047j0147k8408k344K1340K5756j2819k7283K823K5015J5350j4947
$$ -28895 -848 -10995 -39403 -41747 -20407 5349 -7470 -34753 -31930 -6915 8435 -6512
577f512k4570N697K7221O353j4045j9825R802K7862L486j6676j3025J2952K2328
$$ -6512 -31082 -25385 1836 8189 -5856 -25681 -15879 11983 15469 -1207 -14232 -1280 21048
590B1048J075k2863q108J2052J4694l752k4822n981J2599J0942q605j9045l715
$$ 21048 22123 -740 -8848 3204 17898 14146 -10676 -16657 -4058 6884 -1721 -20766 -24481
603b4481J6788Q851j1499j1326j940J8511N757j2647r642J595J4954K916j3566
$$ -24481 -7693 1158 -10341 -21667 -23607 -5096 661 -11986 -21628 -20033 -5079 -2163 -15729
616a5729r495Q291Q847L190j2100o768J2477O763K483j0091k885J0584P316m463
$$ -15729 -25224 -16933 -8086 -4896 -16996 -23764 -11287 -4524 -2041 -12132 -15017 -4433 2883 -1580
630a580p258j477M872P284r789m888r76L522M921q032l387J984N258J72j139m235
$$ -1580 -8838 -10315 -5443 1841 -7948 -12836 -13812 -10290 -5369 -13401 -16788 -14804 -9546 -9374 -10513 -14748
646a4748M316M388l125K097m549L605J446k258r0J04M03l23J112j464N690l455
$$ -14748 -10432 -6044 -9169 -7072 -11621 -8016 -6570 -8828 -8918 -8814 -8411 -8734 -7622 -9086 -3396 -6851
662f851J011K306n6N168n139l68J684L085j552l941m851L066N173o627k337n466
$$ -6851 -5840 -3534 -3590 1578 -3561 -3929 -2245 840 -712 -4653 -9504 -6438 -1265 -7892 -10229 -15695
678a5695O661M405n494m971r46Q206L526m170j0048N520O589L146o323j1029Q263
$$ -15695 -9034 -4629 -10123 -15094 -16040 -7834 -4308 -8478 -18526 -13006 -6417 -3271 -9594 -20623 -12360
693a2360P804J972r685o506P560J2719j557j2119j379P501J5021o819j2794j38
$$ -12360 -4556 -2584 -12269 -18775 -11215 1504 -53 -12172 -13551 -6050 8971 2152 -10642 -10780
707a0780J0087J1280r576j4421j37J5701M630j0007j5128L256J8465R42j0857
$$ -10780 -693 10587 1011 -13410 -13547 2154 6784 -3223 -18351 -15095 3370 4312 -6545
720f545j4343P374J8007R72j6782j0079J1133J5512k19k1568n199J3741J4664
$$ -6545 -20888 -13514 4493 5465 -11317 -21396 -10263 5249 5030 -16538 -21737 -7996 6668
733F668l892k1160k576J7741J4124j0355j7682j085K2012J0810j5386j5848J483
$$ 6668 2776 -18384 -20960 -3219 10905 550 -17132 -18217 3795 14605 -781 -16629 -15146
746a5146K4092O202j9222j6323Q448K1998K944k2208j5170J5925J9155n50k4158
$$ -15146 8946 15148 -4074 -20397 -11949 10049 12993 -9215 -24385 -8460 10695 10145 -14013
759a4013j1665K0461J8081o508k5330n819K1775J8222j4215k2848p69K2978J6154
$$ -14013 -25678 -5217 12864 6356 -18974 -24793 -3018 15204 989 -21859 -22628 350 16504
772A6504j9099k1269M532K5556J0629k0839k1040J1307K6762L096k1889j9506
$$ 16504 -2595 -23864 -19332 6224 16853 -3986 -25026 -13719 13043 16139 -5750 -25256
784b5256J7211K5401k810k4906j4503K0715K4172q843k8291n985K1772K1520j4061
$$ -25256 -8045 17356 14546 -10360 -24863 -4148 20024 11181 -17110 -23095 -1323 20197 6136
797F136k9385P26K4530J7284j9027k6884N003K8954J0099k2958k2654R642L1353
$$ 6136 -23249 -22523 2007 19291 264 -26620 -21617 7337 17436 -5522 -28176 -18534 12819
810A2819K660k4706j9094J5375K9159k323k7661j3592K1632K4163n566l0302o776
$$ 12819 15479 -9227 -28321 -12946 16213 13890 -13771 -27363 -5731 18432 12866 -17436 -24212
823b4212K5396J9642j0363l0321q63K7141J6411j8155k6495L084K8769J1828k5216
$$ -24212 1184 20826 10463 -19858 -20721 6420 22831 4676 -21819 -18735 10034 21862 -3354
836c354k1027P349K9837N390k7247j7699J3645K9524j443k7650j5128K2273K3730
$$ -3354 -24381 -17032 12805 18195 -9052 -26751 -13106 16418 14975 -12675 -27803 -5530 18200
849A8200o250k7693j1359K7292J9263j1076k8467l386K7707J7195j7350k6441
$$ 18200 11950 -15743 -27102 190 19453 8377 -20090 -23476 4231 21426 4076 -22365
861b2365N131K5103J5033k3067k2889R832K5734Q228k6509j8674J2784K6600j116
$$ -22365 -17234 7869 22902 -165 -23054 -13222 12512 20740 -5769 -24443 -11659 14941 13825
874A3825k5454j5619J6898K6216q149k4400j0971K2976K1619j1485k5385l592
$$ 13825 -11629 -27248 -10350 15866 7717 -16683 -27654 -4678 16941 5456 -19929 -23521
886b3521K5582J5358j3090k7022M740K5228J1513j7387k3821J0403K4592P404
$$ -23521 2061 17419 4329 -22693 -17953 7275 18788 1401 -22420 -12017 12575 19979
898A9979k1714j6866J2551K5419J238k4096j0940J3049K4568n801k4740p961J6854
$$ 19979 -1735 -18601 -6050 19369 20607 -3489 -14429 -1380 23188 17387 -7353 -15314 1540
911A540J9313j0516k3526m684K1667J2286j2171k2190o8K4039P227j4054k0076
$$ 1540 20853 10337 -13189 -17873 3794 16080 3909 -18281 -18349 5690 12917 -1137 -21213
924b1213N765K2066N187j8696j5240J0167J8859L922k1884r598J3189J8379p38
$$ -21213 -15448 6618 11805 -6891 -22131 -11964 6895 10817 -11067 -20665 -7476 10903 10165
937A0165k0885n205J6092J6535o729j6877l989J7906J2750j1768j4909j763J8409
$$ 10165 -10720 -15925 167 16702 9973 -6904 -10893 7013 19763 7995 -6914 -8677 9732
950I732Q309j3397j5088L759J6452M779j3490j3835Q411J4061K121j5167j0112
$$ 9732 18041 4644 -10444 -6685 9767 14546 1056 -12779 -4368 9693 11814 -3353 -13465
963a3465J0443J2602j771j5176o186J0461J2764n906j3119k159J0782J1795q380
$$ -13465 -3022 9580 7809 -7367 -13553 -3092 9672 3766 -9353 -11512 -730 11065 2685
976B685j0964N86J2688P615q086j1025L372J2584L055q061j0708N820J0993J8
$$ 2685 -8279 -7693 4995 12610 4524 -6501 -3129 9455 12510 4449 -6259 -439 10554 10572
990A0572r500p300O188R226r73j0792l333N626P962k758j0554r73N578O207m530
$$ 10572 1072 -6228 -40 9186 8213 -2579 -5912 -286 7676 4918 -5636 -6609 -1031 5176 646
1005F46q658m38P743K903n045n457R1Q747Q84m132l297J993O963P26m365k240
$$ 646 -8012 -8450 -707 2196 -2849 -8306 -8215 532 1416 -2716 -6013 -4020 2943 3669 -696 -2936
1021b936M025L705J091n201p23L824J784N87n012N36K618J706k082k158r8J549
$$ -2936 1089 4794 5885 684 -39 3785 5569 6156 1144 1680 4298 6004 3922 1764 1666 3215
1037C215J310l400K37j542J312q5k351N46j162K85j197Q28q95P85j374p11K630
$$ 3215 4525 1125 1362 -180 1132 1047 -1304 -758 -1920 -1635 -2832 -2004 -2899 -2114 -3488 -4199 -1569
1054a569r58J506k908P99K639O71q51k053J479K335K607m867L96Q04L680J358
$$ -1569 -2527 -1021 -3929 -3130 -491 180 -671 -2724 -1245 1090 3697 -1170 -774 30 3710 5068
1070E068o022j07K157M332j730m469k054N153L250l815l393l037P616J949m241
$$ 5068 -954 -1061 1096 5428 3698 -771 -2825 2328 5578 1763 -1630 -4667 2949 4898 657
1085F57n466J42O963J809m864o908M402N385K336p275n602O156N965J363q898
$$ 657 -4809 -4667 2296 4105 -759 -7667 -3265 2120 4456 -2819 -8421 -2265 3700 5063 -3835
1100c835l413N988Q659k613q461k199O866R125o385p817j176Q916P041p584q710
$$ -3835 -7248 -1260 7399 4786 -3675 -5874 992 10117 3732 -4085 -5261 3655 10696 3112 -5598
1115e598Q08J1335L166p457j0228M511J1944M50q637r735P858J0692o48j1771
$$ -5598 -4790 6545 9711 2254 -7974 -3463 8481 8931 294 -9441 -1583 9109 8461 -3310
1129c310o398Q742J0881k577j4109j970R412J0855n628j3563l5J1827Q769q286
$$ -3310 -9708 -966 9915 7338 -6771 -8741 671 11526 5898 -7665 -7700 4127 12896 4610
1143D610j2252O65J5239N048j0650j1149L238J6119J872j2428j0170P131J5229
$$ 4610 -7642 -6977 8262 13310 2660 -8489 -5251 10868 12740 312 -9858 -2727 12502
1156A2502k04j5087p739J1182J2220j820j7099m478J3450J1153o207j6548j445
$$ 12502 12298 -2789 -10528 654 12874 11054 -6045 -10523 2927 14080 7873 -8675 -10120
1169a0120J4530J0259j0700j4475J193J6246P723j3636j2584M725J7148L756j4667
$$ -10120 4410 14669 3969 -10506 -9313 6933 14656 1020 -11564 -6839 10309 14065 -602
1182f02j1485Q933J6280J13j5509r894J2694J4396k827j6552o645J4860J3328
$$ -602 -12087 -3154 13126 13239 -2270 -12164 530 14926 12099 -4453 -11098 3762 17090
1195A7090o640j7247k012J5364J1949j1005j6277J810J5978R511j4293j4960M803
$$ 17090 10450 -6797 -8809 6555 18504 7499 -8778 -6968 9010 18521 4228 -10732 -5929
1208e929J7594M456j5502j3299Q461J8066p77j5207j1150J1809J6733l987j6986
$$ -5929 11665 16121 619 -12680 -4219 13847 13070 -2137 -13287 -1478 15255 11268 -5718
1221e718p492J4798J3676n608j8725k583J5695J1773q837j8290J677J6870R314
$$ -5718 -13210 1588 15264 9656 -9069 -11652 4043 15816 6979 -11311 -9634 7236 16550
1234A6550j2774j5300M032J8270N178j5372j2294O241J9135Q83j6804r771R898
$$ 16550 3776 -11524 -7492 10778 15956 584 -11710 -5469 13666 14549 -2255 -12026 -2128
1247b128J7271k784j7249p843J4457J3497n240j7815m092J6934J0171q191j7554
$$ -2128 15143 12359 -4890 -12733 1724 15221 9981 -7834 -11926 5008 15179 6988 -10566
1260a0566Q92J6759Q389j2194j5444M647J6682O559j6112j1568P081J6374K742
$$ -10566 -9674 7085 15474 3280 -12164 -7517 9165 15724 -388 -11956 -4875 11499 14241
1273A4241j6970q894R419J6273k353j5672p356J3189J3391o170j4196n274J5566
$$ 14241 -2729 -11623 -2204 14069 11716 -3956 -11312 1877 15268 9098 -5098 -10372 5194
1286E194J0162q320j4768n01J5299P582r984j5124M465J4075N207j2760j2126
$$ 5194 15356 7036 -7732 -8233 7066 14648 4664 -10460 -5995 8080 13287 527 -11599
1299a1599P492J3352K569j4565q519Q141J4211k013j4610n370R591J3117n652
$$ -11599 -4107 9245 11814 -2751 -11270 -3129 11082 9069 -5541 -10911 -1320 11797 6145
1312F145j3433l201J1816J0112p090j2480q71J3739O680p847j2205K690J3383
$$ 6145 -7288 -10489 1327 11439 4349 -8131 -9002 4737 11417 3570 -8635 -5945 7438
1325G438L739q951j0807N624J2014J988j1090p638O872J0972K25j2634l948P302
$$ 7438 11177 2226 -8581 -2957 9057 11045 -45 -7683 -811 10161 10386 -2248 -6196 1106
1339A106J0643k698j2095k062Q702Q539n117j0617j312J0834M948o961q711O06
$$ 1106 11749 9051 -3044 -5106 3596 12135 7018 -3599 -4911 5923 10871 3910 -4801 -4195
1353d195J0798K758p626p777L415R601J619q820o208N662P652N38r808l969O457
$$ -4195 6603 9361 1735 -6042 -2627 6974 8593 -227 -6435 -773 6879 7417 -2391 -6360 97
1368I7O397j864q475k120O677O027l994o387q22O976N274n385n072P02P233K637
$$ 97 6494 4630 -3845 -5965 712 6739 2745 -3642 -4464 2512 7786 2401 -2671 -1969 5264 7901
1384G901n271n183K437O274O51m544m709M477M285l9m527l231M460M500j186m940
$$ 7901 2630 -2553 -116 6158 6809 2265 -2444 2033 6318 6279 1752 -1479 2981 7481 6295 1355
1400A355r67L412L518k539m379j03K371K642l207l273R1L252J210k267k210N32
$$ 1355 388 3800 7318 4779 400 297 2668 5310 2103 -1170 -1079 2173 3383 1116 -1094 -562
1416e62M213m95j132j928J355K300n49j615q14J140P63M53k092M83O57P52P72
$$ -562 3651 3156 2024 96 1451 3751 3202 1587 773 1913 2676 3129 1037 1520 2177 2929 3701
1433C701j609J411J30P82m40K53j34k55k04n77R20j685K5j247L36Q49j185n96
$$ 3701 2092 3503 3633 4415 3975 4228 4094 3839 3635 3058 3978 2293 2318 1071 1407 2256 1071 475
1451D75o27K072L64j05j921P30K133J12p15k784J555J455O34k525k058J388K781
$$ 475 -152 1920 2284 2179 258 988 3121 3233 2518 -266 1289 2744 3378 853 -1205 183 2964
1468B964O21l645l44J754M216p32l602l78K320L909k115l998j220M195K031l205
$$ 2964 3585 -60 -404 1350 5566 4834 1232 854 3174 7083 4968 970 -250 3945 5976 2771
1484B771m528r34O120Q01l279m368J396O119J126m418m217L454N019J029o671
$$ 2771 -1757 -2691 3429 4230 951 -3417 -2021 4098 5224 806 -3411 43 5062 6091 -580
1499e80l002M322M472m05p490j744M928N924l005n869j026O704N806m607n764
$$ -580 -3582 740 5212 4807 -2683 -4427 501 6425 3420 -2449 -3475 3229 9035 4428 -1336
1514a336k89P979L311o152o730J419Q171R41o642p259M374P539q4p718n440O556
$$ -1336 -1625 6354 9665 3513 -3217 -1798 6373 7314 672 -6587 -2213 5326 5242 -2476 -7916 -1360
1530a360P331r23r238k770P115P303m140r729q19P428O496o103q900J155R023
$$ -1360 5971 5048 -4190 -6960 155 7458 3318 -6411 -7230 198 6694 591 -8309 -7154 1869
1545A869M917p151p393L274J0537K481p512o893M805J0407l00q547o917O945R014
$$ 1869 6786 -365 -7758 -4484 6053 8534 1022 -5871 -1066 9341 9041 494 -6423 522 9536
1560I536k164j0643m027Q160P918l219j1374j052Q983P446n692j0666O94R955
$$ 9536 7372 -3271 -7298 862 8780 5561 -5813 -6865 2118 9564 3872 -6794 -6100 3855
1574C855N263q657r411J466J1433K514r995p829M119J1760Q04j0182o330P879
$$ 3855 9118 461 -8950 -7484 3949 6463 -3532 -11361 -7242 4518 5322 -4860 -11190 -3311
1588c311J0670j057j0722m628R581Q667l043j1930k474J0383P593n672j1837M12
$$ -3311 7359 6302 -4420 -9048 533 9200 6157 -5773 -8247 2136 9729 4057 -7780 -7368
1602g368J1058O443q270r807K457J1788M577j0307q841M259J1719J192j1411q035
$$ -7368 3690 10133 1863 -7944 -5487 6301 10878 571 -8270 -4011 7708 8900 -2511 -10546
1616a0546O601J0944j948j1725n684R586R406l465j1408k718J0963Q191n643j1378
$$ -10546 -3945 6999 5051 -6674 -12358 -2772 6634 3169 -8239 -10957 6 8197 2554 -8824
1630h824M61J1149O391q234j0659K973J0970M514r800q997M854J1616K275j0698
$$ -8824 -8363 2786 9177 943 -9716 -6743 4227 8741 -1059 -10056 -5202 6414 8689 -2009
1644b009o769O375J1969j540j0805n118Q086R803l996j1073l769R769P437m882
$$ -2009 -8778 -2403 9566 8026 -2779 -7897 189 9992 5996 -5077 -8846 923 8360 3478
1658C478j1816l01J0842N541o326j0748K944J0366L979q651q357M177J0475J846
$$ 3478 -8338 -8639 2203 7744 1418 -9330 -6386 3980 7959 -692 -9049 -4872 5603 7449
1672G449j0645o069N406J0306p87j0558m436P089R859l249r599l432R605P246
$$ 7449 -3196 -9265 -3859 6447 5660 -4898 -9334 -2245 7614 4365 -5234 -8666 939 8185
1686H185m651r696j404J0125M678n705r515J095R564L518p304q263L832Q690K821
$$ 8185 3534 -6162 -7566 2559 7237 1532 -7983 -6888 2676 6194 -1110 -9373 -5541 3149 5970
1701E970q813o249N445Q354R47r505l950O200Q315k386q614k650P291P409m659
$$ 5970 -2843 -9092 -3647 4707 5654 -3851 -7801 -1601 6714 4328 -4286 -6936 355 7764 3105
1716C105p180j455Q626N043n078p494P90Q390L273o009p562L603P160J415o856
$$ 3105 -4075 -5530 3096 8139 3061 -4433 -3643 4747 8020 2011 -5551 -1948 5212 6627 -229
1731b29o162M164O332J56p777l804M566O241j742p381j818M810N775l354o598
$$ -229 -6391 -2227 4105 4261 -3516 -7320 -2754 3487 1745 -5636 -7454 -2644 3131 -223 -6821
1746f821m11N602M446m012n405L20O808K406m070m671J996O169R09m012m155L403
$$ -6821 -7232 -1630 2816 -1196 -6601 -6281 527 2933 -1137 -5808 -3812 2357 3266 -746 -4901 -1498
1762a498N329J66m961k456L993L783k72n396j204L514L372j537n278k3L345K742
$$ -1498 3831 3997 -964 -3420 573 4356 4084 -1312 -2516 998 4370 2833 -2445 -2468 877 3619
1778C619l128l733l72M301J284l396k473K21M113L30k528k689J785L031R0k827
$$ 3619 491 -3242 -3614 687 1971 -1425 -3898 -3677 436 766 -1762 -4451 -2666 365 455 -2372
1794b372j852K543J651Qk894j066K552J613o40k178L2J833J759j413j436J14J586
$$ -2372 -4224 -1681 -30 -22 -2916 -3982 -1430 183 -457 -2635 -2603 -770 989 -424 -1860 -1746 -160
1811a60J269j935j046L22J123k24j051p81L42J153l31j44q63J158M26J63m52k26
$$ -160 1109 -826 -1872 -1550 -427 -651 -1702 -2483 -2141 -988 -1319 -1463 -2326 -1168 -742 -579 -1031 -1257
1829a257R01m89L63k70N47o08j79m11J56Q86j195k23J87J098j7p74n53Q02J283
$$ -1257 -356 -845 -482 -752 -205 -813 -992 -1403 -1247 -361 -1556 -1779 -1592 -494 -511 -1285 -1838 -1036 247
1848B47q44p07j449J544Q19j543j476o43K128K09r65k291J205J768J127j157k121
$$ 247 -597 -1304 -2753 -1209 -390 -1933 -3409 -4052 -1924 -1715 -2680 -4971 -3766 -1998 -871 -2028 -4149
1865d149K036J885J480l155j068J611K737l79k998j295J550L599j631k927q60
$$ -4149 -2113 -228 1252 -1903 -2971 -1360 1377 998 -2000 -3295 -1745 1854 223 -2704 -3564
1880c564L057L004k350k701k07M160J314k391m127N35M095l5k987m417J854L676
$$ -3564 -507 2497 147 -2554 -2761 1399 2713 322 -3805 -3270 825 790 -2197 -6614 -4760 -1084
1896a084M67m168l065L403L944L86m876j371L625M445j120n908o9L945L948l477
$$ -1084 -617 -4785 -7850 -4447 -503 -117 -4993 -6364 -2739 1706 586 -5322 -5391 -1446 2502 -975
1912i75m648l59N202L023m217l829O94O727J675l966m293K110N995M66n222m809
$$ -975 -5623 -5982 -780 2243 -1974 -5803 -5109 1618 3293 -673 -4966 -2856 3139 3605 -1617 -6426
1928f426L723M982o63o329l826M953M488j498o922j064N637N077l141o220L26
$$ -6426 -2703 2279 1616 -4713 -8539 -3586 902 -596 -7518 -8582 -2945 2132 -1009 -7229 -6903
1943f903O324M367n540n228J027O510K523o142n149K451P496O94n517n006M801
$$ -6903 -579 3788 -1752 -6980 -5953 557 3080 -3062 -8211 -5760 1736 2430 -3087 -8093 -3292
1958c292P133j95o377l629O074N695j959p300k397N785M783l718q149n90O620
$$ -3292 3841 3646 -2731 -6360 -286 5409 3450 -3850 -6247 -462 4321 603 -7546 -8136 -1516
1973a516M268n027o984J654P480L095o115n847K700Q079R98o780n177M156P696
$$ -1516 2752 -2275 -9259 -7605 -125 2970 -3145 -8992 -6292 1787 2785 -3995 -9172 -5016 2680
1988B680j207p489l801N719O963j983p450j852P678N787k924p584p0P812M170
$$ 2680 1473 -6016 -9817 -4098 2865 882 -6568 -8420 -742 5045 2121 -5463 -5533 2279 6449
2003F449m992p304R54P258L003p058o352K569Q019J228p505m465M076Q064j22
$$ 6449 1457 -5847 -4893 2365 5368 -1690 -8042 -5473 2546 3774 -3731 -8196 -4120 3944 3822
2018C822p542l591N573O936k273p765k757O968N170l680p845m71P456M367m265
$$ 3822 -3720 -7311 -1738 5198 2925 -4840 -7597 -629 4541 861 -6984 -7455 1 4368 103
2033A03p097J620P574L826o170n776L193P168J914p550n111L049P461p61p243
$$ 103 -6994 -5374 2200 6026 -144 -5920 -2727 4441 6355 -1195 -6306 -3257 4204 3443 -3800
2048c800l804M404P072k351o693k819O526N784k946p178p83O858M172l915p481
$$ -3800 -7604 -3200 3872 1521 -5172 -7991 -1465 4319 1373 -5805 -6588 270 4442 527 -6954
2063f954R08O506L251n401o287K857O991K422o146m229L906P174N44o482k590
$$ -6954 -6046 460 3711 -1690 -7977 -5120 1871 4293 -1853 -6082 -2176 4998 5542 -940 -3530
2078c530L985O795j946o755k007M614N333l152o619j413O518L558l549o128K58
$$ -3530 455 7250 5304 -1451 -3458 1156 6489 3337 -3282 -4695 1823 5381 1832 -4296 -4038
2093d038O556K381m105o052J957N955J139n614n051K993M793Q62o219k798L471
$$ -4038 2518 4899 794 -5258 -3301 2654 3793 -1821 -6872 -3879 914 1776 -4443 -7241 -3770
2108c770N725n99n798j206M350N310k146n024p85N033L858l203m588j55N695J797
$$ -3770 1955 1356 -4442 -5648 -1298 4012 1866 -3158 -3943 1090 4948 1745 -2843 -2998 2697 4494
2124D494l162m425J173N390J030l869l552L148L967M13m619k717L291L089l93
$$ 4494 1332 -3093 -1920 3470 4500 631 -2921 227 4194 4607 -12 -2729 562 3651 3258
2139C258n282j394K919L514k022m270l90K994L217k719l076J26L969K005k742
$$ 3258 -2024 -3418 -499 3015 993 -3277 -3667 -673 2544 -175 -3251 -3125 844 2849 107
2154A07k831J000L730M34k105l000J550L230L34k447k402K344K538k79k786j073
$$ 107 -2724 -1724 2006 2440 335 -2665 -1115 2115 2449 2 -2400 -56 2482 2203 -583 -1656
2170a656K614J755m66l204j45J828J849j600k605K24J706J108j930j525J98K880
$$ -1656 958 2713 2247 -957 -1102 726 2575 975 -1630 -1406 300 1408 -522 -2047 -1849 1031
2186A031J58j759j138Q87K264l16r97r14J396Q49K34j691k34J268M35J57j586
$$ 1031 1189 -570 -1708 -821 1443 1127 130 -784 612 1461 1695 4 -230 1038 1473 1630 44
2203D4K34J056K30m30q03J18O92M37j260j39k73L60K8j025M58p85L59n19Q8J51
$$ 44 278 1334 1564 1134 331 449 1141 1578 318 179 -94 266 294 -731 -273 -1058 -699 -1218 -1130 -979
2223i79l26R3l56N21K20N6n40L76O77J98j23n35P21P00Q40q94l06J81J096N65
$$ -979 -1305 -1212 -1568 -1047 -827 -771 -1311 -935 -258 -60 -183 -718 3 703 1543 649 343 524 1620 2185
2243B185j253j49L02J459n12j135q44J462J064j189j166q16K292K47q73k141J2
$$ 2185 932 783 1085 2544 2032 897 53 1515 2579 1390 224 -592 1700 1947 1074 -1067 -1055
2260a055K075K93j714k096J275J404N18k225j297J482J830O92k932q60J937K588
$$ -1055 1020 1313 -401 -2497 -1222 182 700 -1525 -2822 -1340 490 1182 -1750 -2610 -673 1915
2276A915p05k705n54K189K681k154k091o85K890J839k187k619K81L448J042k238
$$ 1915 1210 -1495 -2049 140 2821 667 -1424 -2109 781 2620 433 -2186 -1905 1543 2585 347
2292C47k748J010L833J63k712k699K341K906K5l939j706K799L129n89m415l94
$$ 347 -2401 -1391 2442 2605 -107 -2806 -465 2441 2466 -1473 -3179 -380 2749 2160 -2255 -2649
2308b649K854L575j770l881K56L521K999k680l257N1M425J332l529l229Q63M541
$$ -2649 205 3780 2010 -1871 -1615 1906 4905 2225 -1032 -981 3444 4776 1247 -1982 -1119 3422
2324C422K18l497l370K503L954N3m244k599L617L521o28n505j253L903L272k168
$$ 3422 3640 143 -3227 -724 3230 3283 -961 -3560 57 3578 2950 -2555 -3808 95 3367 1199
2340A199n490l32M423L234l381m197O24N288K444l988l559J706N772R48m383l312
$$ 1199 -4291 -4623 -200 3034 -347 -4544 -3920 1368 3812 -176 -3735 -2029 3743 4691 308 -3004
2356c004K590N006km929l095M047M159j115n169j896M925L474j621n649m12N171
$$ -3004 -414 4592 4590 -339 -3434 613 4772 3657 -1512 -3408 1517 4991 3370 -2279 -2691 2480
2372B480L122l417n107M49M590K797m914m401J167N557J113m818l428K547N987
$$ 2480 5602 2185 -2922 -2473 2117 4914 0 -4401 -3234 2323 3436 -1382 -4810 -2263 3724
2387C724j31m638l042M183N130j217n179k016M849M129k542n592q07M908L338
$$ 3724 3593 -1045 -4087 96 5226 4009 -1170 -3186 1663 5792 3250 -2342 -3149 1759 5097
2402E097k989n449J008N137K374l785m687J676N156J705n104m290K476N439m37
$$ 5097 2108 -3341 -2333 2804 5178 1393 -3294 -1618 3538 5243 139 -4151 -1675 3764 3327
2417C327n492k963L176N133r07n223j943M492M748j468n509o56N400L403k259
$$ 3327 -2165 -5128 -1952 3181 2274 -2949 -4892 -400 4348 2880 -2629 -3285 2115 5518 3259
2432C259n567J92N426K490l696m936J674N090J899m844l881K629N646L06n320
$$ 3259 -2308 -2116 3310 5800 2104 -2832 -1158 3932 5831 987 -2894 -265 5381 5687 367
2447C67k490L095N030j393n177k496L942L850k416n122j494N005L077k927m747
$$ 367 -2123 972 6002 4609 -568 -3064 878 4728 2312 -2810 -4304 701 3778 851 -3896
2462c896K10N261K452l187m293J451M923J885m159l887K422M432R27m928k404
$$ -3896 -3686 1575 4027 840 -3453 -2002 2921 4806 647 -3240 -818 3614 4541 -387 -2791
2477b791K778M540n80m310j460L503M170j849l746j031L779L006k740l987o81
$$ -2791 -13 4527 3947 -363 -1823 1680 5850 4001 255 -776 3003 6009 3269 -718 -1399
2492a399M496J541k855m372R70M008J058k960l487K093L768O01l782k111K620
$$ -1399 3097 4638 1783 -2589 -1619 2389 3447 487 -3000 -907 2861 3462 -320 -2431 189
2507A89L436j95m208j148K200L503j377l957m78L107K804j967k963M7L859J425
$$ 189 3625 3430 -778 -1926 274 3777 2400 -1557 -2035 1072 3876 1909 -1054 -1007 2852 4277
2523D277j944k834M83L613M92k042l041R28K910K56l060j900J854K394L10l405
$$ 4277 2333 -501 -18 3595 4087 2045 -996 -68 2842 3098 38 -1862 -8 2386 2696 -709
2539g09j071K288K559l26l143k54J877K258j513j990l07K268J583k080j953N00
$$ -709 -1780 508 3067 2741 -402 -656 1221 3479 1966 -24 -331 1937 3520 1440 -513 -13
2555a3K553O65j465j676P43K753J17j629j785J664J269k10j869j175J165J124
$$ -13 2540 3205 1740 64 807 3560 3677 2048 263 1927 3196 2986 1117 -58 1107 2231
2571B231k73k412j86R45J023p09j545K96R11R62j192o26j88J396L89j123r55M89
$$ 2231 1958 -454 -640 305 1328 619 -926 -630 281 1243 51 -575 -763 633 1022 -101 -1056 -567
2589e67J153k38m22j47L38R93K70n90j86J299J94J38l97lP97K13l50p71K21K97
$$ -567 586 348 -74 -221 117 1110 1380 790 604 1903 2097 2235 1838 1835 2632 2845 2495 1724 1945 2242
2609B242j36m12r4P6j48p0j22K15l25J8m36J4N26n35m60l34N16n1m29p52M15M52
$$ 2242 2106 1694 1600 1676 1528 1458 1336 1551 1226 1244 808 822 1348 813 353 19 535 484 55 -697 -282 170
2631A70L70m30r79J065N29J83m94n58N50Q61M54j333m16O76J169l24j348j25J006
$$ 170 540 110 -869 196 725 908 414 -144 406 1267 1721 388 -28 648 1817 1493 145 20 1026
2650A026R65n91j294m27J597P26q78j424nK051J00j059j625N89J697J89j608j633
$$ 1026 1991 1400 106 -321 1276 2002 1124 -300 -305 1746 1846 787 -838 -249 1448 1637 29 -1604
2668a604J604J411K58k120q55J565J719j74k274p4J341K109j085k577J63J946
$$ -1604 0 1411 1669 -451 -1306 259 1978 1804 -470 -544 797 2906 1821 -756 -593 1353
2684A353J718j672k133l09L132O18j840k154N95K487P64k490k192J736K317o0
$$ 1353 3071 1399 -734 -1043 2089 2707 867 -1287 -692 1795 2559 69 -2123 -387 1930 1870
2700A870k801j543K231K177k58l501n60K342K312j257l074P4K471K341k159k812
$$ 1870 -931 -2474 -243 1934 1676 -1825 -2385 -43 2269 1012 -2062 -1988 483 2824 665 -2147
2716b147K64L579J233k793k222Q54L733M02k800k503J908L311n31k724k203K485
$$ -2147 -1883 1696 2929 136 -2086 -1232 2501 2903 103 -2400 -492 2819 2288 -436 -2639 -154
2732a54K969p64l397j314K810K416j175l705j81L245K225k179l519Q19L072K118
$$ -154 2815 2051 -1346 -2660 150 2566 1391 -2314 -2495 750 2975 796 -2723 -1904 1168 3286
2748C286k906l110J080L803R34l131k561J460M130Q3l474k170K523L546q05l795
$$ 3286 380 -2730 -1650 2153 3087 -44 -2605 -1145 2985 3068 -406 -2576 -53 3493 2688 -1107
2764a107j599L365K612j267m117n60L448K471k090m179L98L666K030l249k945
$$ -1107 -2706 659 3271 2004 -2113 -2673 775 3246 1156 -3023 -2625 1041 3071 -178 -3123
2779c123Q88L754J577m037k461J624L978K22l645k246K359M002q59l529j687L197
$$ -3123 -2235 1519 3096 -941 -3402 -1778 2200 2422 -1223 -3469 -1110 2892 2033 -1496 -3183 14
2795A4L402j285l938q02L842K631k143l912K22L898J813l035l591J022L660J486
$$ 14 3416 2131 -1807 -2609 1233 3864 1721 -2191 -1969 1929 3742 707 -2884 -1862 1798 3284
2811C284l757k635J247L850L43l615k394K144L953m99l914j667L017L280j251
$$ 3284 -473 -3108 -1861 1989 2332 -1283 -3677 -1533 2420 1921 -1993 -3660 -643 2637 1386
2826A386m227r11L907K467j849l584r5L946K067k148l967J098L909J460l024l162
$$ 1386 -2841 -3752 155 2622 773 -2811 -2906 1040 3107 959 -3008 -1910 1999 3459 435 -2727
2842b727J613L573N47l684k111J788L335k72l700j316K315L195j048l673q03L137
$$ -2727 -1114 2459 3006 -678 -2789 -1001 2334 2062 -1638 -2954 -639 2556 1508 -2165 -2968 169
2858A69K286j627l545k31L499J662k031l419P43L369J050k482k758J614K982J061
$$ 169 2455 828 -2717 -2948 551 2213 182 -3237 -2494 875 1925 -557 -3315 -1701 1281 2342
2874B342l153j817J899K967Ml556j160K107K908j185k948r32K208K481j649k891
$$ 2342 -811 -2628 -729 2238 2242 -1314 -2474 -367 2541 1356 -1592 -2524 -316 2165 516 -2375
2890b375l54K814J773j916k617J00L190Q38j917k661J354K597J98k275j666J793
$$ -2375 -2729 85 1858 -58 -2675 -2575 615 1453 -464 -3125 -1771 826 1024 -1251 -2917 -1124
2906a124J723N20k457q22J729K160j58k741m06K056J978j018k386M8J822J519
$$ -1124 599 1119 -1338 -2160 -431 1729 1571 -1170 -1576 480 2458 1440 -946 -898 924 2443
2922B443j671k021J65K325O88j738k061P20K159Q7j458j887J205J612o2j614j723
$$ 2443 772 -1249 -1084 1241 1929 191 -1870 -1150 1009 1096 -362 -2249 -1044 568 506 -1108 -2831
2939b831J605J278k2k150q0J070J177l17j853M11R50J083q43j011M09J455K68
$$ -2831 -1226 52 30 -2120 -2200 -1130 47 -270 -2123 -1712 -762 321 -522 -1533 -1124 331 599
2956E99r27p32L00J504j5r28p86N73J265J12j014p93Q47N14J14j139j57R89k16
$$ 599 -328 -1060 -760 744 729 -199 -985 -412 853 965 -49 -842 5 519 633 -506 -663 326 110
2975A10n3q64k02N08N70o34k55o7K7Q21q46J29j31M42K87k49r1p2M55j45J5m34
$$ 110 57 -807 -1009 -501 69 -565 -820 -887 -860 -39 -885 -756 -887 -445 -158 -407 -498 -570 -115 -260 -245 -679
2997f79K51L95m42O1j36L56k56J25k09K14jr3q4j09L40m45P0k69K73k7p52K71
$$ -679 -428 -33 -475 -414 -550 -194 -450 -325 -534 -320 -321 -414 -498 -607 -267 -712 -642 -911 -638 -665 -1417 -1146
3019a146K15L31l83p5m14N82J83k45k05k00O58P04n96p13N17O97L15m01r23M97
$$ -1146 -931 -600 -983 -1058 -1472 -890 -707 -952 -1157 -1357 -699 5 -591 -1304 -787 -90 225 -176 -1099 -602
3039f02R55M3p33m53L86J043nj093l48M69J203o95r72l60Q22J068q49j206m35
$$ -602 353 396 -337 -790 -404 639 634 -459 -807 -338 865 170 -802 -1162 -340 728 -121 -1327 -1762
3058a762J423N83q41j540O34J452J62q36j437P13J425M28k001o38J161J555m3
$$ -1762 -339 244 -597 -2137 -1503 -51 111 -725 -2162 -1449 -24 404 -1597 -2235 -1074 481 438
3075D38j851o02J310J677n59j911k57J334J686j212j573l81K168J121j685j386
$$ 438 -1413 -2015 -705 972 413 -1498 -1755 -421 1265 53 -1520 -1901 267 1388 -297 -1683
3091a683J19K300M85j747j777J003K029J62j472j876J228K070j44k340j055J920
$$ -1683 -1564 736 1221 -526 -2303 -1300 729 891 -581 -2457 -1229 841 697 -1643 -2698 -778
3107g78J754l50k714k27J703J781p74k493N3J804J554j685j804M49K362P28k114
$$ -778 976 626 -2088 -2315 -612 1169 395 -2098 -2045 -241 1313 -372 -2176 -1727 635 1363 -751
3124g51j494N08K958J26k267j517J495K218l4k536j527K227J928o54k570o61K313
$$ -751 -2245 -1737 1221 1347 -920 -2437 -942 1276 1242 -1294 -2821 -594 1334 680 -1890 -2551 -238
3141b38J945j298k999M10K189J911k036k361K57K801J231k483k044P59L192K77
$$ -238 1707 409 -2590 -2180 9 1920 -116 -2477 -2220 581 1812 -671 -2715 -1956 1236 1513
3157A513k393j564J351K609l50k277j602K060K283q42k642q39K508J675o06l023
$$ 1513 -880 -2444 -1093 1516 1166 -1111 -2713 -653 1630 788 -1854 -2693 -185 1490 884 -2139
3173b139m03K738J530j784k502N04K307J246k334j991R67K674Q14k564j694J344
$$ -2139 -2542 196 1726 -58 -2560 -2056 251 1497 -837 -2828 -1861 813 1627 -937 -2631 -1287
3189a287K946m48k734j212J911K582q94k553r45K418K058j194k710j58K670J425
$$ -1287 1659 1211 -1523 -2735 -824 1758 864 -1689 -2634 -216 1842 648 -2062 -2220 450 1875
3205A875j568k607N76K518J220j895k711J135K362Q53k616j700J319K712P8k660
$$ 1875 307 -2300 -1724 794 2014 119 -2592 -1457 905 1758 -858 -2558 -1239 1473 1551 -1109
3221a109j396J837K402r08k263j087K235K268j244k448k55K257J446j418k607
$$ -1109 -2505 -668 1734 826 -1437 -2524 -289 1979 735 -1713 -1968 289 1735 317 -2290
3236b290M03K483J071j750k363P57K426Q59k381j842J270K360j8k159j198J376
$$ -2290 -1887 596 1667 -83 -2446 -1689 737 1596 -785 -2627 -1357 1003 985 -1174 -2372 -996
3252i96K082k11k761p78K057K129j305k033m01J978J517j001k182l6K536O05j063
$$ -996 1086 875 -1886 -2664 -607 1522 217 -1816 -2217 -239 1278 277 -1905 -1941 595 1200 137
3269A37k009O18K327O57j989j147R44J809M15k255j003J176J956o8k403n82J365
$$ 137 -1872 -1254 1073 1730 -259 -1406 -462 1347 1762 -493 -1496 -320 1636 1568 -835 -1417 -52
3286e2J725p73k132m68J669J382j304j533O3J834O67j156j672K55J967N64j531
$$ -52 1673 900 -1232 -1700 -31 1351 47 -1486 -1423 411 1078 -78 -1750 -1495 472 1036 -495
3303d95j559J155J509L6j647p32R50J581j06j805l89J241J678p70j654K70Q72
$$ -495 -2054 -899 610 646 -1001 -1733 -783 798 692 -1113 -1502 -261 1417 647 -1007 -737 135
3320A35J051q60j285N1J396M52r17j102L80J354j6n33j411R02R63Kq32r41R49
$$ 135 1186 326 -959 -908 488 940 23 -1079 -699 655 639 106 -1305 -403 560 562 -270 -1211 -262
3339b62P62n3j192l40R11O21q7j068j0O10Q43m68p38r3J036N10j002j09j13Q24
$$ -262 500 447 -745 -1085 -174 447 360 -708 -718 -108 735 267 -471 -564 472 982 -20 -129 -242 582
3359E82J43n94k91p1J009n29j82m86M40L70l51l09j86L77L9o2m93K30J00K13r8
$$ 582 725 131 -160 -231 778 249 67 -419 21 391 40 -269 -455 -78 -39 -101 -594 -364 -264 -51 -149
3380a49m88L6J90M19m34L18j33J47K15l72K83j58N60j47p5j07J98j42k62L90m8
$$ -149 -637 -601 -411 8 -426 -108 -241 -94 121 -251 32 -126 434 287 212 105 303 161 -101 289 241
3401B41o5K8m25K07K17l0n63M75o2M52p00m1J58J75L15q20lL3M05j88l16k73N37
$$ 241 176 204 -221 -14 203 173 -390 85 23 475 -225 -266 -108 67 382 -438 -441 -408 -3 -191 -507 -780 -243
3424b43M00k90m98j15J042J11j43n06q6R47J12m03q80K83P31K47p29o31O92Q40
$$ -243 157 -133 -631 -746 296 407 264 -242 -328 619 731 328 -552 -269 462 709 -20 -651 41 881
3444H81Q2j062n11P99Q27l05j018j14M07R58p85n89l70J131K64p41q67R8J405
$$ 881 963 -99 -610 189 1016 711 -307 -421 -14 944 159 -430 -800 331 595 -146 -1013 -915 490
3463D90L72r00j120O07J338K50j162p63N03J298k91j064p48R97P94K69j376k38
$$ 490 862 -38 -1158 -551 787 1037 -125 -888 -385 913 622 -442 -1190 -193 601 870 -506 -744
3481g44O75J372o46j214j5R32R64j017q84j23J600L94j203j280M14J715j99p75
$$ -744 -69 1303 657 -557 -572 360 1324 307 -577 -700 900 1294 91 -1189 -775 940 741 -34
3499c4j400R55J484O7j460r42J349R87K6j684n90J406J261o80j565k96J643J114
$$ -34 -1434 -479 1005 1072 -388 -1330 19 1006 1032 -652 -1242 164 1425 745 -820 -1116 527 1641
3517A641j067j787M09J585J053j496j588Q53J771L31j569j414R63J683k28j570
$$ 1641 574 -1213 -804 781 1834 338 -1250 -397 1374 1705 136 -1278 -315 1368 1140 -430
3533d30j140J398J736o10j835o39J730J212p31j682n58K098J187j087j824J78
$$ -430 -1570 -172 1564 954 -881 -1520 210 1422 691 -991 -1549 549 1736 649 -1175 -997
3549i97J403J320k012j148K59J782P30j827j143J045J853J10j545r52J088J781
$$ -997 406 1726 -286 -1434 -1175 607 1337 -490 -1633 -588 1265 1375 -170 -1122 -34 1747
3565A747l28j869p34J566J428m67j950n86K047R65q74k100M77J635P76j204j396
$$ 1747 1419 -450 -1184 382 1810 1343 -607 -1193 854 1819 945 -1155 -678 957 1733 529 -867
3582h67L42J812R10j866j182M76J946N5j932r90Q44J859j98j879p53J444J394
$$ -867 -525 1287 2197 331 -851 -375 1571 1626 -306 -1296 -452 1407 1209 -670 -1423 21 1415
3599A415n04j878p27J563J709j031j798K88J347J287j471j439M19J394R25j352
$$ 1415 911 -967 -1694 -131 1578 547 -1251 -963 384 1671 200 -1239 -820 574 1499 147
3615A47j569J017J696M11j739j053Q70J924k07j936o38J309J678p63j661p99J927
$$ 147 -1422 -405 1291 1702 -37 -1090 -220 1704 1497 -439 -1077 232 1910 1147 -514 -1313 614
3632F14J283q36j974J86J511O77r22j420L82J743L74j431j527R20J465K69j663
$$ 614 1897 1061 -913 -727 784 1461 539 -881 -499 1244 1618 187 -1340 -420 1045 1314 -349
3649c49r59J260J230k1j726n75J042J336m29j344n75J504R76m96j656n4J461O55
$$ -349 -1308 -48 1182 1161 -565 -1140 -98 1238 809 -535 -1110 394 1370 874 -782 -836 625 1280
3667A280p83j382N21R88O38q53j348N91J521K89j342j105O51J410o7j133m00O98
$$ 1280 497 -885 -364 624 1262 409 -939 -348 1173 1462 120 -985 -334 1076 1009 -124 -524 174
3685A74J067p66j067k05Q86J242p38r35k07J186M18q66r55J65J114M05n54r90
$$ 174 1241 475 -592 -797 89 1331 593 -342 -549 637 1055 189 -766 -601 513 918 364 -626
3703f26L69R46O0o51p72P47O86Q0j028l78P96O73l59j001J8M90O29k90n04r8P81
$$ -626 -257 689 749 98 -674 73 759 839 -189 -567 229 902 543 -458 -440 50 679 389 -115 -213 568
3724E68N07o60n42q0Q91J08l92o88R8R22n2o66k98M64K81K23p06k87Q69J63k70
$$ 568 1075 415 -127 -207 684 792 400 -288 -190 732 680 14 -284 180 461 684 -22 -309 560 723 453
3745D53l58M0L37J32q4o55K18J16N61n55r3k83N91J25m46RqL75o7l19q5N4M53
$$ 453 95 135 472 604 520 -135 83 199 760 205 112 -171 420 545 99 108 100 475 408 89 4 58 511
3768E11l16k52j26L31k8k5r5l77P92l34K08l49L27k87K87r5k2J26j2Q3Jj54j49
$$ 511 195 -57 -183 148 120 95 0 -377 415 81 289 -60 267 -20 267 172 150 276 264 347 348 194 45
3791D5K58j92N3N16m16K01j12J86P7K74o74K65P2k09K52n76J93K04k12O7n10K00
$$ 45 303 111 164 680 264 465 353 539 616 890 216 481 553 344 596 20 213 417 205 272 -238 -38
3813c8K90J15l52l24L01M37J59m91l39O16N0l36j82j02L35M15k61m93N2O03lj68
$$ -38 252 367 15 -309 -8 429 588 97 -242 374 424 88 -94 -196 139 554 293 -200 -148 455 452 284
3835B84m52Q7O52J87l35o86N35M15L1o79l15M33L51N6q02k60M11N28j11o21j01
$$ 284 -168 -81 571 758 423 -263 272 687 718 39 -276 157 508 564 -238 -498 -87 441 330 -291 -392
3856c92Q50K57l28o70l26J000K46m46r91J75Q78K17m86m09M4Q66p5n60m50Q26
$$ -392 458 715 387 -283 -609 391 637 191 -800 -625 253 470 -16 -425 -381 485 410 -150 -600 226
3876B26M66J83r44m33P81P32m36r50j82N77P31n86r47K71P74O69r31o29K08R31
$$ 226 692 875 -69 -502 279 1011 575 -375 -557 20 751 165 -782 -511 263 932 1 -628 -420 511
3896E11M79j071m73J80J247q2j051q20P94J108m71j043o38J118J056l69j191J2
$$ 511 990 -81 -554 -374 873 791 -260 -1080 -286 822 351 -692 -1330 -212 844 475 -716 -704
3914g04R79P46m93r52J37O41N99n17j425J85J172M43q41r21M17J186K09j000q49
$$ -704 275 1021 528 -424 -287 354 953 436 -989 -804 368 811 -30 -951 -534 652 861 -139 -988
3933i88J060P66O4j066n70P76J072n92j263l50R17P92k16j356r9J481N76o10j073
$$ -988 72 838 902 -164 -734 42 1114 522 -741 -1091 -174 618 402 -954 -1053 428 1004 394 -679
3952f79J71J177O51j292p31J83J320R7j113q25L07J564k32r31q43J017J250m97
$$ -679 -508 669 1320 28 -703 -520 800 897 -216 -1041 -734 830 598 -333 -1176 -159 1091 594
3970E94j033o85J484P08l20j449r2J040N28n30j233J39J189N57j070q82K97J586
$$ 594 -439 -1124 360 1068 748 -701 -793 247 775 245 -988 -849 340 897 -173 -1055 -758 828
3988H28K92j427n50K48J718l81r79q05Q11R20j32j165r54J284J178o33j124l82
$$ 828 1120 -307 -857 -609 1109 728 -251 -1056 -245 675 543 -622 -1576 -292 886 253 -871 -1253
4006a253J414R30q29j041J54J213M88r12j124N08J071L28j378k08M59R61k32q99
$$ -1253 161 1091 262 -779 -625 588 1076 164 -960 -452 619 947 -431 -639 -180 781 549 -350
4024c50n34O90J022m8j236j30P21Q05n10j169k78J328M56n92j248K32J144L35
$$ -350 -884 -194 828 780 -456 -586 135 940 430 -739 -1017 311 767 175 -1073 -841 303 638
4042F38o25q91K45Q59P39j211m96K15J247K32j389k47N68P67r4r24o16Q99O39
$$ 638 13 -878 -633 226 965 -246 -742 -527 720 952 -437 -684 -116 651 557 -367 -983 -84 555
4061E55l85o59j8N90P59r41m53m02J183K30n58q18M58M95O13r66o63N57N79L85
$$ 555 170 -489 -507 83 842 -99 -552 -954 229 459 -99 -917 -459 36 649 -317 -980 -423 156 541
4081E41r52n29O91O11p7q07p5M13P40l09p64K0P04M68n97n61O3P51K48l69o04
$$ 541 -411 -940 -249 362 285 -522 -597 -184 556 247 -517 -497 207 675 78 -483 -420 331 579 210 -394
4102c94o0R29j1n06k92k8P06J82m36n34M40K46k4n80l07M86M89j63p13j20K60
$$ -394 -454 475 464 -42 -334 -362 344 526 90 -444 -4 242 218 -362 -669 -183 306 143 -570 -690 -430
4123d30N65k16j92l89N15L55p20j93J83N62J05j94k60J57M82j5n29k7L77o9J88
$$ -430 135 -81 -273 -662 -147 208 -512 -705 -522 40 145 -49 -309 -152 330 315 -214 -241 136 67 255
4144B55m73N1L17j03K64m65J20M1J05J10j90m4k03L37l29K6o1J77j9k75L35l93
$$ 255 -218 -167 150 47 311 -154 -34 7 112 222 32 -12 -215 122 -207 -181 -242 -65 -84 -359 -24 -417
4166d17M11j57K1k3J12o0Q1m1k82R4K48J27m50R3J46j42J44k19L14k21J97j62
$$ -417 -6 -163 -142 -165 -53 -113 -32 -73 -355 -261 -13 114 -336 -243 -97 -239 -95 -314 0 -221 -24 -186
4188a86J20J24j73J22l05N12j89Q8o9r6N9Ml37K68L7j59K06k84j6L09K3j33o3
$$ -186 -66 58 -115 7 -298 214 25 113 44 -52 7 11 -326 -58 -21 -180 26 -258 -274 35 58 -75 -138
4211a38J43m9L40k36m98N31J4o6n14l8J09M32K7l35k64J16O82j23n02j61P17o7
$$ -138 5 -44 296 60 -438 93 107 41 -473 -511 -402 30 57 -278 -542 -426 256 133 -369 -530 187 120
4233A20kn59Q3L41L62l23p13K26P68k84j55o31Q88J49K4k09r00P19O07k43n00
$$ 120 118 -441 -358 -17 345 22 -691 -465 303 19 -136 -767 121 270 294 85 -815 -96 511 268 -232
4254b32k41L71O05o25j80k40O81K07l78l20k16Q20K71l83o70J23J018k69m34p26
$$ -232 -473 -102 503 -122 -302 -542 139 346 -32 -352 -568 252 523 140 -530 -407 611 342 -92 -818
4274h18M59M03O7n79l88O45J88J48p85j73N76Q12n50j024K69N15N73o63n18Q5
$$ -818 -359 44 111 -468 -856 -211 -23 125 -660 -833 -257 555 5 -1019 -750 -235 338 -325 -843 -758
4294g58O07M22p76k03o0R18O4q88j80M68P10q5n14l56M67P25k29q07k84N84M97
$$ -758 -151 271 -505 -708 -768 150 214 -674 -854 -386 324 239 -275 -631 -164 561 332 -475 -759 -175 322
4315C22j85o37j34P05L98k30j037M65P18K93n71p43L15O02L35q19p47O00P00j16
$$ 322 137 -500 -634 71 469 239 -798 -333 385 678 107 -636 -321 281 616 -203 -950 -350 350 234
4335B34o96n41O70Q34l12r74k62Q40N70k03r21j79P59P82p57r76K22Q00L71n98
$$ 234 -462 -1003 -333 501 189 -785 -1047 -207 363 160 -761 -940 -181 601 -156 -1132 -910 -110 261 -337
4355c37q46L41P43N27j011j85M69O48L05p88p09O08P91k08p70m11Q62L80l83n81
$$ -337 -1183 -842 -99 428 -583 -768 -299 349 654 -134 -843 -235 556 348 -422 -833 29 409 26 -555
4375e55j44N87M30p6r55J97O70M27n56p83K25P98J16o79o66M41Q41L5p92m61L71
$$ -555 -699 -112 318 242 -713 -516 154 581 25 -758 -533 265 381 -298 -964 -523 318 353 -439 -900 -529
4396e29O92J71q07k58P56O94n94k73m83P82M24m57q05l1R24K99m39p88L26M87
$$ -529 163 334 -473 -731 25 719 125 -148 -631 151 575 118 -687 -718 206 505 66 -722 -396 91
4416I1K69l68p33N54M56J73o88n30P40M91l02o07l35O24M35P9r90k40P10O45m60
$$ 91 360 -8 -741 -187 269 442 -246 -776 -36 455 153 -454 -789 -165 270 349 -641 -881 -171 474 14
4437A4q73L29O09L73m82o17L91N07N4l82n70M18P13o6m95m30K62P54k60l60k07
$$ 14 -859 -530 79 452 -30 -647 -256 251 305 -77 -647 -229 484 418 -77 -507 -245 509 249 -111 -318
4458c18L98N05j61p69j40N74M31n23o44L85K42L52l37o50K27O31Q0k89m72M45
$$ -318 80 585 424 -345 -485 89 520 -3 -647 -262 -20 332 -5 -655 -428 203 283 -6 -478 -33
4478c3M18j60k99m72K2O67Q9o35J9R3O09j64m10K6K93K42j35l40j57L02L73l07
$$ -33 385 225 -74 -546 -524 143 232 -403 -384 -291 318 154 -256 -230 63 305 170 -170 -327 -25 348 41
4500D1m43K62L59J84l02j45k83N26Nk26l57J17N39k68j23l41L98K40rn71J69J55
$$ 41 -402 -140 219 403 101 -44 -327 199 204 -22 -379 -262 277 9 -114 -455 -57 183 174 -397 -228 -73
4522g3RK7k13J21n3K79j52K3p2Q8K16j02k48J20O0K02M4m14K76m0r4L5k52K13
$$ -73 -64 -37 -250 -129 -182 97 -55 -32 -104 -16 200 98 -150 -30 30 232 276 -138 138 98 4 39 -213 0
4546@J47J65j01k10k24K93K51l02O7l14M77J3k90N7Q2l9j92o4O4N1kJ4J74o0J08
$$ 0 147 312 211 1 -223 70 321 19 86 -228 249 262 -28 29 111 72 -120 -184 -120 -69 -71 -57 117 57 165
4571A65r5J12j26j4r7K08K02k85J29l67K97l06M46j80j11K30k66K85k56J11l12
$$ 165 70 182 56 42 -55 153 355 70 199 -168 129 -177 269 89 -22 208 -58 227 -29 82 -230
4592b30K13K62m05j13K45M72m87l18K01R9R2m2q3l7K78o8o6M4r7M8J89k30o0Q0
$$ -230 -17 245 -160 -273 -28 444 -43 -361 -160 -61 31 -11 -94 -131 147 79 13 57 -40 8 197 -33 -93 -13
4616a3K82J78l16j45J4L5Q4o4j18K33J02o0m06M5M02N4k64l48m5P54n3k77l20
$$ -13 269 447 131 -14 0 35 119 55 -63 170 272 212 -194 -149 253 307 43 -305 -350 404 351 74 -246
4639b46O4M90N7k07n44M23J96k33j74k82L72K78j16l32q1M00L34k01l23k33N97
$$ -246 -182 308 365 158 -386 37 233 0 -174 -456 -84 194 78 -254 -335 65 399 198 -125 -358 239
4660B39J03n7p66J52L51N52o74j61%L88K88l37l37m9Q86q4m72j63J73L98k3o42
$$ 239 342 285 -481 -329 22 574 -100 -261 -261 127 415 78 -259 -308 578 494 22 -141 32 430 407 -235
4682b35r4K97O64l81l72r8K70M31m01k50n3P52J59n67n58R7P91K24m24o77L24
$$ -235 -329 -32 632 251 -121 -219 51 482 81 -169 -222 530 689 122 -436 -339 452 676 252 -425 -101
4703a01L80N8l33k88o6O09M8m47j38K92L28M3r74J71M80N43m54m68J45O07Q2n59
$$ -101 279 337 4 -284 -350 259 307 -140 -278 14 342 385 -589 -418 62 605 151 -317 -172 435 517 -42
4725d2l83Q9O32J57m10k74J35O59p9m34j58K69O69k12p25l70K63O88l9p41J09
$$ -42 -425 -336 296 453 43 -231 -96 563 484 50 -108 161 830 618 -107 -477 -214 474 435 -306 -197
4746a97K38M59j14q36J44M55K54k51p46K09P88J26p09j70J82L43L40r26r9N89
$$ -197 41 500 386 -450 -306 149 403 152 -594 -385 403 529 -180 -350 -168 175 515 -411 -510 79
4766G9M00j63n49k6M38M93m31l90L5J93N18l54o17J30O70L23o87k12Q1L62J45
$$ 79 479 316 -233 -259 179 672 241 -149 -114 79 597 243 -374 -244 426 749 62 -150 -69 293 438
4787D38k62m62K77L89J29p67p5M02M03j66o56j66L48N50k19m59j68M96N35o17
$$ 438 176 -286 -9 380 509 -258 -333 69 472 306 -350 -516 -168 382 163 -296 -464 32 567 -50
$$ [...]
8191c
##END NTUPLES=NMR FID
##END=
