##TITLE=1H_SA_sl.Et_2
 CDCl3, 8 sc, 
 1.9.2020
##JCAMPDX= 6.0         $$ Bruker NMR JCAMP-DX V2.0
##DATA TYPE= NMR FID
##DATA CLASS= NTUPLES
##ORIGIN= UXNMR, Bruker Analytische Messtechnik GmbH
##OWNER= root
$$ XWIN-NMR		Version 3.5
$$ Tue Sep  1 11:57:13 2020 Russian Standard Time (UT+4h)  she@DPX200
##.OBSERVE FREQUENCY= 200.1315066352
##.OBSERVE NUCLEUS= ^1H
##.DELAY= (6, 6)
##.ACQUISITION MODE= SIMULTANEOUS
##.ACQUISITION SCHEME= undefined
##.AVERAGES= 8
##.DIGITISER RES= 18
##SPECTROMETER/DATA SYSTEM= spect
##.PULSE SEQUENCE= zg30
##.SOLVENT NAME= CDCl3
##.SHIFT REFERENCE= (INTERNAL, CDCl3, 0, 15.7039)
##AUDIT TRAIL= $$ (NUMBER, WHEN, WHO, WHERE, WHAT)
$$ ##TITLE= Audit trail, XWIN-NMR		Version 3.5
$$ ##JCAMPDX= 5.01
$$ ##ORIGIN= Bruker BioSpin GmbH
$$ ##OWNER= she
$$ F:/spectra/data/she/nmr/H-F/1/audita.txt
$$ ##AUDIT TRAIL=  $$ (NUMBER, WHEN, WHO, WHERE, WHAT)
(   1,<2020-09-01 11:55:50.10 +0400>,<she>,<DPX200>,
      <created by zg, POWCHK disabled, PULCHK disabled
       configuration hash MD5:
       00 E9 B6 7A A2 85 ED C7 34 08 36 98 17 FE 4E 26
       data hash MD5: 16K
       7D A6 7D 5F DB FB C2 44 F9 4C C3 24 A6 FC A0 11>)
$$ ##END=
$$ 
$$ hash MD5
$$ 9E 25 0C 48 55 47 CA CB 98 61 4D FC 32 4B 7F 00
##$RELAX= 
##$RELAX= 
##$RELAX= 
##$RELAX= 
##$RELAX= 
##$RELAX= 
$$ Bruker specific parameters
$$ --------------------------
##$DU= <F:/spectra>
##$EXPNO= 1
##$NAME= <H-F>
##$PROCNO= 1
##$TYPE= <nmr>
##$USER= <she>
##$AMP= (0..31)
100 100 100 100 100 100 100 100 100 100 100 100 100 100 100 100 100 100 
100 100 100 100 100 100 100 100 100 100 100 100 100 100 
##$AQSEQ= 0
##$AQ_mod= 1
##$AUNM= <au_zg>
##$AUTOPOS= <>
##$BF1= 200.13
##$BF2= 200.13
##$BF3= 200.13
##$BF4= 200.13
##$BF5= 200.13
##$BF6= 200.13
##$BF7= 200.13
##$BF8= 200.13
##$BYTORDA= 1
##$CFDGTYP= 0
##$CFRGTYP= 5
##$CHEMSTR= <none>
##$CNST= (0..31)
1 1 145 1 1 1 1 1 1 1 1 1 1 1 1 1 1 1 1 1 1 1 1 1 1 1 1 1 1 1 1 1 
##$CPDPRG= <>
##$CPDPRG1= <>
##$CPDPRG2= <>
##$CPDPRG3= <>
##$CPDPRG4= <mlev>
##$CPDPRG5= <mlev>
##$CPDPRG6= <mlev>
##$CPDPRG7= <mlev>
##$CPDPRG8= <mlev>
##$CPDPRGB= <>
##$CPDPRGT= <>
##$D= (0..31)
0 1.2 0 0 0 0 0 0 0 0.06 0 0.03 0 0 0 0 0.0002 0 0 0 0 0 0 0 0 0 0 0 0 
0 0 0 
##$DATE= 1598946949
##$DBL= (0..7)
120 120 120 120 120 120 120 120 
##$DBP= (0..7)
150 150 150 150 150 150 150 150 
##$DBP07= 0
##$DBPNAM0= <>
##$DBPNAM1= <>
##$DBPNAM2= <>
##$DBPNAM3= <>
##$DBPNAM4= <>
##$DBPNAM5= <>
##$DBPNAM6= <>
##$DBPNAM7= <>
##$DBPOAL= (0..7)
0.5 0.5 0.5 0.5 0.5 0.5 0.5 0.5 
##$DBPOFFS= (0..7)
0 0 0 0 0 0 0 0 
##$DE= 6
##$DECBNUC= <off>
##$DECIM= 32
##$DECNUC= <off>
##$DECSTAT= 4
##$DIGMOD= 1
##$DIGTYP= 9
##$DL= (0..7)
0 120 120 120 120 120 120 120 
##$DP= (0..7)
150 150 150 150 150 150 150 150 
##$DP07= 0
##$DPNAME0= <>
##$DPNAME1= <>
##$DPNAME2= <>
##$DPNAME3= <>
##$DPNAME4= <>
##$DPNAME5= <>
##$DPNAME6= <>
##$DPNAME7= <>
##$DPOAL= (0..7)
0.5 0.5 0.5 0.5 0.5 0.5 0.5 0.5 
##$DPOFFS= (0..7)
0 0 0 0 0 0 0 0 
##$DQDMODE= 0
##$DR= 18
##$DS= 0
##$DSLIST= <SSSSSSSSSSSSSSS>
$$ [...]
##$SUBNAM2= <"">
##$SUBNAM3= <"">
##$SUBNAM4= <"">
##$SUBNAM5= <"">
##$SUBNAM6= <"">
##$SUBNAM7= <"">
##$SUBNAM8= <"">
##$SUBNAM9= <"">
##$SW= 16.880792210976
##$SWIBOX= (0..15)
0 0 2 0 0 0 0 0 0 0 0 0 0 0 0 0 
##$SW_h= 3378.37837837838
##$TD= 16384
##$TD0= 1
##$TE= 0
##$TE2= 300
##$TE3= 300
##$TEG= 300
##$TL= (0..7)
0 120 120 120 120 120 120 120 
##$TP= (0..7)
150 150 150 150 150 150 150 150 
##$TP07= 0
##$TPNAME0= <>
##$TPNAME1= <>
##$TPNAME2= <>
##$TPNAME3= <>
##$TPNAME4= <>
##$TPNAME5= <>
##$TPNAME6= <>
##$TPNAME7= <>
##$TPOAL= (0..7)
0.5 0.5 0.5 0.5 0.5 0.5 0.5 0.5 
##$TPOFFS= (0..7)
0 0 0 0 0 0 0 0 
##$TUNHIN= 0
##$TUNHOUT= 0
##$TUNXOUT= 0
##$USERA1= <user>
##$USERA2= <user>
##$USERA3= <user>
##$USERA4= <user>
##$USERA5= <user>
##$V9= 5
##$VALIST= <valist>
##$VCLIST= <CCCCCCCCCCCCCCC>
##$VD= 0
##$VDLIST= <DDDDDDDDDDDDDDD>
##$VPLIST= <PPPPPPPPPPPPPPP>
##$VTLIST= <TTTTTTTTTTTTTTT>
##$WBST= 1024
##$WBSW= 4
##$XGAIN= (0..3)
0 0 0 0 
##$XL= 0
##$YL= 0
##$YMAX_a= 635585
##$YMIN_a= -521417
##$ZGOPTNS= <>
##$ZL1= 120
##$ZL2= 120
##$ZL3= 120
##$ZL4= 120
##$ABSF1= 10
##$ABSF2= 0
##$ABSG= 5
##$ABSL= 3
##$ALPHA= 0
##$AQORDER= 0
##$ASSFAC= 0
##$ASSFACI= 0
##$ASSFACX= 0
##$ASSWID= 0
##$AUNMP= <proc_1d>
##$AZFE= 0.1
##$AZFW= 0.1
##$BCFW= 1
##$BC_mod= 2
##$BYTORDP= 1
##$COROFFS= 0
##$CY= 11.3945322036743
##$DATMOD= 1
##$DC= 2
##$DFILT= <>
##$DTYPP= 0
##$F1P= 16.9975609425685
##$F2P= -3.02152046262296
##$FCOR= 0.5
##$FTSIZE= 0
##$FT_mod= 4
##$GAMMA= 1
##$GB= 0.15
##$INTBC= 1
##$INTSCL= 1
##$ISEN= 128
##$LB= 0.24
##$LEV0= 0
##$LPBIN= 0
##$MAXI= 10000
##$MC2= 0
##$MEAN= 0
##$ME_mod= 0
##$MI= 1.114404
##$NCOEF= 0
##$NC_proc= 0
##$NLEV= 6
##$NOISF1= 3.799351
##$NOISF2= 2.8
##$NSP= 1
##$NTH_PI= 0
##$NZP= 0
##$OFFSET= 15.70392
##$PC= 1
##$PHC0= -9970.568
##$PHC1= 6.600919
##$PH_mod= 1
##$PKNL= yes
##$PPARMOD= 0
##$PSCAL= 0
##$PSIGN= 0
##$REVERSE= no
##$SF= 200.130013532006
##$SI= 16384
##$SIGF1= 3
##$SIGF2= 2
##$SINO= 400
##$SIOLD= 16384
##$SREGLST= <1H.CDCl3>
##$SSB= 0
##$STSI= 0
##$STSR= 0
##$SW_p= 3612.71676300578
##$SYMM= 0
##$S_DEV= 0
##$TDeff= 0
##$TDoff= 0
##$TI= <>
##$TILT= no
##$TM1= 0
##$TM2= 0
##$TOPLEV= 0
##$USERP1= <user>
##$USERP2= <user>
##$USERP3= <user>
##$USERP4= <user>
##$USERP5= <user>
##$WDW= 1
##$XDIM= 8192
##$YMAX_p= 0
##$YMIN_p= 0
$$ End of Bruker specific parameters
$$ ---------------------------------
##NTUPLES= NMR FID
##VAR_NAME=  TIME,          FID/REAL,        FID/IMAG
##SYMBOL=    X,             R,               I
##VAR_TYPE=  INDEPENDENT,   DEPENDENT,       DEPENDENT
##VAR_FORM=  AFFN,          ASDF,            ASDF
##VAR_DIM=   8192,          8192,            8192
##UNITS=     SECONDS,       ARBITRARY UNITS, ARBITRARY UNITS
##FACTOR=    0.000296,      1,               1
##FIRST=     0,             0,               0
##LAST=      2.424536,      0,               0
##MIN=       0,             -521417,         0
##MAX=       2.424536,      635585,          0
$$ Real data points
##PAGE= N=1
##DATA TABLE= (X++(R..R)), XYDATA
0@%%%%%%%%%%QrRj6J6j6K4l2M0m8N6p0Q2r5J13j34J56j82K12k41K75l17L62m10
34b17M64n24N87o60P40q28R25j031J145j268J406j557J720j898K094k308K542
51A332k799L084l401L753m148M595n102N687o369P169q133R324j0834J2823j5581
66h600J9704k6659M1545j36115J12412P773l58736j72741J49754L57252m4651
77e9062l22491j17136K58681K96305o4341l51454k2485K86120K26629j38647l19434
88c27315J6484L19876J47993j85892k49568N5878L47509J24694k46213j72375
98a68929J33406L23380O8996k62092j54421J85505K65913q311k97865j40367K22895
109A68110J91867q0833k92763j10421K56542J67024j48893k53019l1638K52799
$$ plain form
0 0 0 0 0 0 0 0 0 0 0 0 8 -1 8 -8 8 -8 16 -16 24 -24 32 -38 44 -51 62 -72 84 -98 114 -127 148 -169 193 -217
34 -217 247 -277 310 -350 390 -438 487 -544 601 -667 739 -818 902 -996 1098 -1210 1332
51 1332 -1467 1617 -1784 1969 -2179 2416 -2686 3001 -3368 3801 -4332 4992 -5842 6981 -8600
66 -8600 11104 -15555 25990 -110125 2287 10060 -348676 -521417 -371663 -14411 -59062
77 -59062 -381553 -498689 -240008 56297 -8044 -359498 -381983 -95863 130766 -7881 -327315
88 -327315 -310831 9045 157038 -28854 -278422 -222544 124965 249659 3446 -168929
98 -168929 -35523 287857 356853 94761 -59660 125845 391758 383447 85582 -54785 168110
109 168110 359977 279144 -13619 -124040 132502 299526 150633 -102386 -134024 118775
119A18775J60112j95489k31152L8778K44397J03924k36991k03689Q1606K21152
129A01423M5523k47017j85292J44836K22808k1871k12186j29898J86146K36138
139A40610o0348k10685n2626K10572J96961r1137k24978o645K14959J47908j44585
150A20006k29212N0979K08738R3063j60840k05321Q9980K40793L4555j83572j40389
161h1220J08380K39195j1046k15689j02409J37450J93575o5821k25368p3136J56718
172F0629J50879r4336k29517k0617J94023J01867j07561j92976J9104K13095P9087
183A73677j48904j53900O0394J92432M5464j82531j27123Q7389J76777K30j99399
194g5494q5933J21220J54077k9063j83867o0857J66925J32812p5985j55583k8846
$$ plain form
119 118775 278887 83398 -147754 -108976 135421 239345 2354 -201335 -119729 101423
129 101423 146946 -100071 -285363 -140527 82281 60410 -151776 -281674 -95528 140610
139 140610 80262 -130423 -183049 27523 224484 133347 -91631 -98276 116683 264591 120006
150 120006 -109206 -58227 150511 243574 82734 -122587 -32607 208186 242741 59169 -81220
161 -81220 27160 266355 255309 39620 -62789 74661 268236 202415 -22953 -96089 60629
172 60629 211508 117172 -112345 -132962 61061 162928 55367 -137609 -118505 94590 173677
183 173677 24773 -129127 -68733 123699 169163 -13368 -140491 -53102 123675 123905 -75494
194 -75494 -161427 -40207 113870 84807 -99060 -159917 7008 139820 63835 -91748 -120594
205a20594J71764J03290j09914j55145R461J64031O0936j34833j36754M6216J46908
216D5366M2518j48778j10841R4169J32833J1181j35369q1676J06847J37445l3146
227F0549j36636m3399J07360J15588o2276j31536k3454J20593R2776q5804j19071
238a05310J3333J24175O6441q3672j19647M7662J33783K4348r2363r8092N6307
249c3035J23761L506j20581p4406P2761J04889k2679j25822m4601P7962R8387
260F0142m2718j25846j2575R4042P2364n5731j08975l624J13162M6296p9500q7936
272a30899J7184J08252K4768q4475p7386M4037J05625N293r2861m7403O5805Q6056
284B3996O70r8767k9066Q7796O7990k5949q6169j1767Q5661O0993n3378p7926
$$ plain form
205 -120594 51170 154460 44546 -110599 -101138 62893 123829 -11004 -147758 -101542 45366
216 45366 87884 -60894 -171735 -77566 55267 66448 -68921 -150597 -43750 93695 60549
227 60549 -76087 -119486 -12126 103462 41186 -90350 -113804 6789 99565 13761 -105310
238 -105310 -91977 32198 98639 14967 -104680 -57018 76765 101113 8750 -89342 -33035
249 -33035 90726 94232 -26349 -100755 -27994 76895 54216 -71606 -116207 -38245 60142
260 60142 17424 -108422 -120997 -26955 45409 -10322 -119297 -122921 -9759 36537 -42963 -130899
272 -130899 -113715 -5463 19305 -65170 -142556 -98519 7106 12399 -80462 -127865 -62060 23996
284 23996 24666 -74101 -103167 -15371 52619 26670 -59499 -71266 14395 75388 22010 -55916
296e5916R298Q4609L8074o6284n8920J6963Q2615K2528p7326m8281M1408O4362
308E3130R55o5028m7132N4012N6933k1019o1597k6304N3251M3563k5625o1889
320d6750q755N4575L5007l9508m8847J0525M2083L2698m1077m5484K4749M6641
332A5857J0504l4678l0733K1287N1626k218l6517k0723K8023L9421j2231l0539
344i21j7346K7164L2970j5372l8333O42K5242J7008p036l8418L814L0442J0689
357C0545j6596k4426N246K2974R242k1269j9973L955K6729k295k2806n516J183
370a3007K3722J945k1814l339J7992J2342J900r406o688K2143R702k636j2091
383B0765J063J5930j047l602q588k366R803M989j5769P77N038l015Q518j0596
$$ plain form
296 -55916 -46618 37991 76065 9781 -49139 -32176 50439 72967 -4359 -52640 -11232 53130
308 53130 54085 -10943 -58075 -4063 52870 31851 -29746 -56050 -2799 40764 15139 -46750
320 -46750 -55505 -930 34077 -5431 -54278 -43753 -1670 31028 -10049 -55533 -30784 15857
332 15857 26361 -8317 -39050 -17763 33863 31645 -4872 -25595 2428 41849 29618 -921
344 -921 -18267 8897 41867 26495 -11838 -11196 14046 31054 24018 -14400 -10586 19856 30545
357 30545 13949 -10477 -5231 17743 26985 5716 -14257 -10302 16427 14132 -8674 -14190 -13007
370 -13007 10715 12660 -9154 -12493 5499 17841 19741 10335 3647 25790 35492 32856 20765
383 20765 21828 37758 36711 33109 24521 22155 31958 36947 21178 21955 26993 23978 32496 21900
397B1900o82N952j911n508k793j69m508o840r472J034q054k051j2782j2006J2649
412b5241l963r687n635O69R871J0942j4980p374J6975J1347N520j7848m483J5486
426a8401J5491k310k3796k846K5892J5384j5676j1668q57L3118K2323k6169j1428
439i43J5581L1994R629k5420k1863K0771K9686o358l7405k3340K7819J7928j4879
452B3200l9787k0460L4897K3842k8672l7965P53L0883K6399l2687m3470J2826
464e0241L6302J2029m2818l6994J5327L9465K492m5669l3367L1866M7922j1554
476c5240l5144j9243M0776N6104j4537m3202r71N0215L9657j7908n0065L407N1247
489B5096K9862l3337n3265J6344M9455J9655l7961m6751K1776O1873P453m9411
$$ plain form
397 21900 21218 27170 25259 19751 16958 16789 12281 5441 -4031 -2997 -11051 -13102 -25884 -37890 -25241
412 -25241 -29204 -38891 -44526 -43857 -33986 -23044 -38024 -45398 -28423 -17076 -11556 -29404 -33887 -18401
426 -18401 -2910 -5220 -29016 -31862 -5970 9414 -6262 -17930 -18787 14331 36654 10485 -943
439 -943 14638 46632 56261 30841 8978 29749 59435 53077 15672 -7668 20151 38079 23200
452 23200 -16587 -37047 -2150 21692 -6980 -44945 -44192 -13309 13090 -19597 -63067 -50241
464 -50241 -13939 -1910 -44728 -81722 -66395 -26930 -24438 -70107 -103474 -71608 -23686 -35240
476 -35240 -70384 -89627 -48851 7253 -7284 -50486 -51457 -1242 38415 20507 -29558 -26151 25096
489 25096 54958 21621 -31644 -15300 34155 53810 15849 -30902 -9126 52747 60200 10789
501A0789k9204K3298N8450j836o2020k9641L4035M6595k1765o5735k5703M3411
513a9326L8065k7730o9408j0107O3299K9040l2285n7443L430P1876L1500n1488
525c0577n0522K4438O4700K0542o3124m5320L4482O7158N027p2198k9355N0616
537b4133O4329p254o5722k2687P2325O0683l0988o0478r393P2636M7804m7554
549D9568p1366O049P4046K5458o2653o7863K3810P1723J7832p4845n7652N0080
561a5813P0683n10p5129m2229N7940P4660k5762q3908k1241O3538O1686m4386
573A9529q2440p785P6808N0283n8675p3394J7707Q4062L4804n7956o9537L8531
585b8063R1248J0916o7813n5174M6319Q1742l096q4443m2350N8250P1331k0929
$$ plain form
501 10789 -18415 4883 63333 61497 -523 -30164 3871 50466 28701 -37034 -62737 -19326
513 -19326 18739 -8991 -78399 -88506 -25207 3833 -28452 -85895 -82465 -10589 20911 -30577
525 -30577 -81099 -56661 8039 28581 -34543 -79863 -45381 21777 26804 -45394 -74749 -24133
537 -24133 40196 32942 -32780 -55467 16858 77541 46553 -13925 -23318 49318 97122 49568
549 49568 -21798 -15749 58297 83755 21102 -46761 -22951 48772 66604 -8241 -65893 -15813
561 -15813 54870 54360 -20769 -62998 -5058 69602 43840 -40068 -61309 2229 63915 19529
573 19529 -62911 -70696 6112 56395 -2280 -75674 -57967 26095 60899 2943 -66594 -28063
585 -28063 63185 74101 6288 -48886 -2567 79175 76079 -8364 -50714 7536 78867 57938
597E7938q7449k2199O5502O7331l4394q7989j903P8652M9958m8366p8189L434
609c7674Q8884L3806p0372p0828K0553Q6256J6413p7083o3040M0851Q7795K608
621E8169q3644m3845O1909P7730n914q8564l0938P8185O7596l0986q5904j5730
633d1936P8268O0316n2239q5464L659Q5291M3326o6122p3027J9273R0545K8801
645I0691p9051o5113M2846Q4968M554q2023o0583N7708Q1351k0308r1554l9122
657g5636O8960O9954l3848r4333j7050Q2690O1896n2285q7191R028Q5402M9406
669F6993o5629q1310K7660R2698K3137p5903o4948L7839R3397N518q4994n0002
681g5544N8697Q5123j3773q3969l4034P2236P4881k9913q9951j2426Q0654N3626
$$ plain form
597 57938 -29511 -51710 13792 81123 46729 -41260 -43163 35489 85447 37081 -41108 -37674
609 -37674 51210 85016 14644 -56184 -35631 50625 67038 -10045 -73085 -32234 55561 58169
621 58169 -25475 -69320 -7411 70319 64405 -24159 -55097 23088 90684 59698 -26206 -41936
633 -41936 36332 96648 44409 -41055 -37396 47895 91221 25099 -47928 -28655 61890 90691
645 90691 11640 -53473 -10627 74341 78895 -3128 -63711 -6003 75348 55040 -36514 -75636
657 -75636 -6676 63278 29430 -64903 -81953 737 62633 10348 -76843 -67815 17587 66993
669 66993 1364 -79946 -52286 40412 63549 -12354 -77302 -39463 53934 59452 -25542 -75544
681 -75544 -16847 68276 54503 -29466 -63500 8736 83617 53704 -36247 -48673 31981 85607
693H5607m3530q8469Q75Q6222M0004o6996p6215K0723Q2767K6314p7496o5068
705g5262L7288Q5756N024q4493m7665M9705P9313j1396q8047l6881O8672O6167
717D8181l1292q0989k2379P6574N8162m3774q0908J672Q2100M2553n1982p3604
729g5686J8333Q3117L1819o8627o2285L6550P7050J5102p4831n2694M7909P9554
741E5311q711p9266l4520N7642P2233k4775q0658k1409P2868N8180m3112p6682
753e2899l493P6749M4493n3684p8349J8792Q0931K3575o1961o5618L1844Q0612
765D0992J1461p5384m8146M7824P3402m560p7853l3006N6682O9714k4253p8943
777d2070j3949O5291N4343l5972p3919l739P7321L8004n1511o3891J2694P6458
$$ plain form
693 85607 42077 -46392 -45517 40705 80709 13713 -62502 -41779 40988 67302 -10194 -75262
705 -75262 -37974 47782 52806 -31687 -79352 -29647 49666 38270 -49777 -86658 -17986 48181
717 48181 16889 -64100 -86479 -9905 48257 4483 -76425 -74753 7347 49900 -2082 -75686
729 -75686 -57353 25764 57583 -11044 -73329 -36779 40271 55373 -19458 -72152 -24243 55311
741 55311 46600 -32666 -67186 -9544 62689 37914 -42744 -64153 8715 66895 23783 -52899
753 -52899 -56392 20357 64850 11166 -67183 -48391 32540 56115 -5846 -71464 -39620 40992
765 40992 52453 -22931 -71077 -23253 50149 45589 -32264 -65270 -8588 61126 36873 -42070
777 -42070 -56019 9272 63615 27643 -46276 -50015 27306 65310 13799 -50092 -37398 39060
789C9060K4229o0581n9229L2443P3339O047o7987m3631M3305O5574m714p5886
801b8031k8782N6709N5330k1661p0505j5596O1417M9781l8669o5030J408O4264
813B0635L5489m5274n7086J1273O9611K2034n4306m7250K6915O2640J0257n5557
825f19m2418M0672N8381m949n8353k8629M5567N1656j4358o3074j5110N3259M2781
838F4806k9646n6874l220N2724L7251m1659n4668J0915N5803K0293m5809m7614
850c7698J7343N9494O290n2233l7764L0678N1960l269n1495l0940M0975M8397
862D1738j4458n4709j3706M4108L9073j9978n6005k377N0097K9686l3035m6251
874c5817P304M9442K3173m1445m0458J8661N1441P090m3231l0903K4055M9846
$$ plain form
789 39060 63289 2708 -56521 -24078 49261 55308 -12679 -56310 -13005 52569 47855 -28031
801 -28031 -56813 -104 55226 33565 -36940 -52536 8881 58662 19993 -45037 -43629 20635
813 20635 56124 10850 -46236 -34963 34648 56682 2376 -44874 -17959 44681 54938 -619
825 -619 -43037 -2365 56016 51067 -7286 -35915 9652 61308 46950 -16124 -31234 22025 64806
838 64806 35160 -21714 -24934 27790 65041 23382 -31286 -20371 35432 55725 9916 -37698
850 -37698 -20355 39139 45429 -6804 -44568 -13890 38070 34801 -16694 -47634 -6659 41738
862 41738 27280 -27429 -41135 2973 42046 22068 -33937 -36314 13783 43469 10434 -35817
874 -35817 -28513 20929 44102 2657 -37801 -19140 32301 39391 -3840 -34743 -10688 39158
886C9158m180m8092k2734L5171L8232j2974m6797j5947M1016L1567k2586m6391
898c4557n99M1052K1998k5862m2431P793M3397J4312l5804l0678J4720L8298Q545
911B0184l9637k4062K1574L7633m381l6693j5405K5304L3297r716l6105r416L4436
924b987K2868j5771l0774m333L4261J8512k2149l0679P027K9882J0786k3845k6907
937c4109J1104K9331O808l0050j8758J6515K4224K100k8417j6418J9583K5320
949G233r133k5391r781J9005K2432j1697k5485n479K4629J5761j4218k1190L30
962c2984K3636J3668j5076k2188J0650K1501O984j4493j8011J0749K2736L233
974A0405k0197r394J2147J9572j177j9442o322J3918J8825q435j7492j596J4285
$$ plain form
886 39158 34978 -13114 -35848 -677 37555 24581 -22216 -38163 2853 34420 11834 -34557
898 -34557 -35156 5896 27894 2032 -40399 -32606 10791 25103 -10701 -41379 -26659 11639 20184
911 20184 -19453 -43515 -21941 15692 11311 -25382 -40787 -15483 17814 8098 -28007 -37423 -2987
924 -2987 19881 4110 -26664 -30997 3264 21776 -373 -31052 -24025 5857 16643 -7202 -34109
937 -34109 -23005 6326 13134 -16916 -35674 -19159 5065 7165 -21252 -37670 -18087 7233
949 7233 -1900 -27291 -37072 -18067 4365 -7332 -32817 -38296 -13667 2094 -12124 -33314 -32984
962 -32984 -9348 4320 -10756 -32944 -22294 -793 6191 -8302 -26313 -15564 7172 10405
974 10405 -9792 -19186 -7039 12533 11356 -8086 -14408 -490 18335 9900 -7592 -9188 5097
987E097J2485q114j8224k27J8697M319j0976j3435J844J4989L206j2018j2173
1000a4530P066J1635R1j2000o047O211J0332Kj4311l20Q673N861k305p608j205
1015h455R168P064o863l152K074P960K446l019k239J301Q856o13l349J33L422
1030A4734J662K086k242k766O080n60n83o81L83J53l78K60k473J230j868j999
1046A3038j039K304k879l871J055j911K797j191m712j343N027J204l400j742j673
1061A664O266J627l758n196L034P221j173l851m479M501O744J817q896j314Q232
1076A2439M863N99q349r22P716Q064n306r303J236P173M805o915r075j380J1096
1091A6741K802j0960p292J984J0037J734r396j0757O746J1391j850j0886q759
$$ plain form
987 5097 17582 9468 -8756 -8983 9714 14033 3057 -10378 -8534 6455 9661 -2357 -14530
1000 -14530 -7464 4171 4262 -7738 -13785 -7574 2758 2760 -11551 -11871 -3198 2663 358 -7250 -8455
1015 -8455 713 7777 914 -2238 -164 7796 10242 7223 4984 6285 15141 14528 11179 11312 14734
1030 14734 16396 18482 16240 13474 19554 18994 18411 17730 18113 18266 17888 18148 15675 16905 15037 13038
1046 13038 11999 14303 11424 7553 8608 6697 9494 8303 3591 2248 7275 8479 5079 3337 1664
1061 1664 7930 9557 5799 603 3637 10858 9685 5834 1355 5856 12600 14417 5521 4207 12439
1076 12439 17302 17901 9552 8630 16346 24410 19104 9801 11037 18210 23015 16100 7025 5645 16741
1091 16741 19543 8583 1291 3275 13312 15046 5650 -5107 1639 13030 11180 294 -8465
1104h465P372J0632j526j6542o349J1687R066m790j5128l532J2139J3889r392
1117i39j5799K308J5429J0732j0848j5258K784K0624N577j6285j3376O698J8693
1130A0340K417j7207j5452J2876J9950l092j9098r953J6103J8486m142k4551m748
1143a8071J9874J5245j0887k3605j990K0275J4871j9034k3187M289K3833Q236
1155I849k1011j9135Q205K8276K766k4377j5080J6559K5031k669k5251j4148K2717
1168h268K2591j0380k7511n814K4368J8160j3020k9183J431K8449J4620k0011
1180d568k3859P384K7995J1860k5529k2051J3387K8624J696k6918j7660J4882
1192a4757K9530m902k9986j2574K3179K4714r542k8662p742K8837K1757j5404
$$ plain form
1104 -8465 -1093 9539 8013 -8529 -14878 -3191 5875 1085 -14043 -17575 -5436 8453 -939
1117 -939 -16738 -14430 999 11731 883 -14375 -11591 9033 14610 -1675 -15051 -8353 10340
1130 10340 12757 -4450 -19902 -7026 12924 9832 -9266 -19219 -3116 15370 11228 -13323 -18071
1143 -18071 1803 17048 6161 -17444 -19434 841 15712 -3322 -26509 -22220 1613 9849
1155 9849 -11162 -30297 -22092 6184 8950 -15427 -30507 -13948 11083 8414 -16837 -30985 -8268
1168 -8268 14323 3943 -23568 -29382 -5014 13146 126 -29057 -27626 823 15443 -4568
1180 -4568 -28427 -21043 6952 18812 -6717 -28768 -15381 13243 14939 -11979 -29639 -14757
1192 -14757 14773 9871 -20115 -32689 -9510 15204 5662 -23000 -30742 -1905 19852 4448
1204D448l0385K052K9836J5182j8313l0297O735L2322R945k7141k2977J2599L0920
1217A4926O530l0918j8909J9387L1898l130l0812j3406K2910L0077r286l3851
1229a4584r213L0052K2467j5840l1921m759L3601J9155k2505l2163O382L4168
1241A4840J3229k6010k9896J3571L5625P683l4061k2775K0852L2915L0l6998j7947
1254b8942K7196L3184j1948l6389q994L1228K8764j8878l6283j471L8354J9509
1266C5330k5115l2671N665L8653J3535l0855l1834J7060L6780M298l3307k6047
1278b8508K2554L6155k211l9676j5768K8157L1732j0289l8785r450L2583K9177
1290C5671k0394l7057N5L5460K1515k4917l4965O819M0409J1519l0285k9085J4393
$$ plain form
1204 4448 -25937 -23885 5951 21133 2820 -27477 -20742 11580 21525 -5616 -28593 -15994 14926
1217 14926 21456 -9462 -28371 -8984 22914 19784 -11028 -24434 -1524 28553 19267 -14584
1229 -14584 -23797 6255 28722 12882 -19039 -23798 9803 28958 6453 -25710 -19328 14840
1241 14840 28069 2059 -27837 -14266 21359 29042 -5019 -27794 -6942 25973 26003 -10995 -28942
1254 -28942 -1746 31438 19490 -16899 -25893 5335 34099 15221 -21062 -22533 15821 35330
1266 35330 10215 -22456 -16791 21862 35397 4542 -27292 -10232 26548 30846 -2461 -28508
1278 -28508 -5954 30201 27990 -11686 -27454 703 32435 22146 -16639 -26089 6494 35671
1290 35671 15277 -21780 -21725 13735 35250 10333 -24632 -17813 22596 34115 3830 -25255 -10862
1303a0862L8985N032l5048k4989K4092L5201l232l6678j7430K8150L2171r895
1315B5497m0343q133L2813K5593j7918l6576l723L5147K2253k7213l4066M970
1327b1699L6190J4324l0136l1284J1499L9139N412l4011k5278K0034L6175p51
1339A9614l6691k0908K8795L2513r531l8051j1023L1729K9224j5831l9310j161
1351c0631L6391K2902k3103l4239N526L8931J7904l1280k9870J4331L8718P066
1363C2646l3911k6324J9495L8960k686l7822j9120K6831L2311q388l8907j2664
1375b9579L3398K7609j7206l8129k389L4275K1402k3485l7342N527L6525J2735
1387B3341l1236k9614J1561L6570O984l6009k2757K1120L5070k177l4579j6267
$$ plain form
1303 -10862 28123 33155 -1893 -26882 -2790 32411 29179 -7499 -24929 3221 35392 25497
1315 25497 -14846 -22979 9834 35427 17509 -19067 -22790 12357 34610 7397 -26669 -21699
1327 -21699 14491 28815 -1321 -32605 -21106 18033 23445 -10566 -35844 -15810 20365 19614
1339 19614 -17077 -37985 -9190 23323 13792 -24259 -35282 -3553 25671 9840 -29470 -30631
1351 -30631 5760 28662 5559 -28680 -23154 15777 33681 2401 -27469 -13138 25580 32646
1363 32646 -1265 -27589 -8094 30866 28180 -9642 -28762 -1931 30380 21992 -16915 -29579
1375 -29579 3819 31428 14222 -23907 -26296 7979 29381 5896 -31446 -25919 10606 23341
1387 23341 -7895 -37509 -25948 10622 17606 -18403 -41160 -20040 15030 12853 -21726 -37993
1399c7993K6969L2907j0499l5265r169L2493K4439j6352l3751l157L5296J9392
1411B5310k3055l0851P453L3266J4892k5600k7754J4952L3905O583l0130k0539
1423b1568J7930L0892q31l3217j6331K2520K8229j0795l1472j0281K5681K5986
1435B6743j5847l1646j442L0927J7725j8711k9391L875L2506J1812k4648k7542
1447b5639J1884K9481N546k7690k2770J6571L0784o76l0566j2859K0442K9012
1459B3520m588l1014q238K6305K4534j3193k9377l529K7599J8319j8415k9261
1471a7338K059L1369J0248k1574k4263Q225L1870P606k6492j9177J7161K7244
1483B6938J506k8771j5292J9967K4223o018l0928r053K2543J9803j1788k8001
$$ plain form
1399 -37993 -11024 21883 11384 -23881 -33050 -557 23882 7530 -26221 -29378 5918 25310
1411 25310 2255 -28596 -21143 12123 27015 1415 -26339 -11387 22518 29101 -1029 -21568
1423 -21568 -3638 27254 26423 -6794 -23125 -605 27624 16829 -14643 -24924 757 26743
1435 26743 10896 -20750 -22192 8735 26460 7749 -21642 -17767 14739 26551 1903 -25639
1447 -25639 -13755 15726 21272 -6418 -29188 -12617 18167 17491 -13075 -25934 -5492 23520
1459 23520 18932 -12082 -20320 5985 30519 17326 -12051 -15580 12019 30338 11923 -17338
1471 -17338 -15279 16090 26338 4764 -19499 -11274 20596 28202 1710 -17467 -306 26938
1483 26938 28444 -327 -15619 4348 28571 22553 -8375 -17428 5115 24918 13130 -14871
1495a4871m343K7431J7705j8342k2278K883K7236J3282k0183k1772Q888K6714
1507B2350M487k2715j8801J2889K2788K70k4586j4780J9337K0055m536k2040p415
1520a2697J9798K0327r322k3014J53J9848J3925j3584k1258J262K0258Q758j8947
1533E507j8154O125K0199L602j7237j5570J1146K1964j492j7129r883J3651J7874
1546B0603l247k0148p412J5606J2843p763k0196l203J4979J1542j0059j8901K808
1559a2548J7583Q717j1342j3364M260J9536N632j5596j0902O984J6187rj5897
1572g59j1117R564J4851m358j6851n825J3267J1441l693j5813k027J6740R546
1585A4966q104j3392J698J3756P185j1801j4378M497J2665K583j3748r692N150
$$ plain form
1495 -14871 -19214 8217 25922 7580 -14698 -11815 15421 28703 8520 -13252 -4364 22350
1507 22350 26837 4122 -14679 -1790 20998 21268 -3318 -18098 1239 21294 16758 -5282 -12697
1520 -12697 7101 27428 18106 -4908 -4755 15093 29018 15434 -5824 -4562 15696 24454 5507
1533 5507 -12647 -6522 13677 17279 42 -15528 -4382 17582 16090 -1039 -10922 2729 20603
1546 20603 17356 -2792 -10204 5402 18245 10482 -9714 -12917 2062 13604 3545 -15356 -12548
1559 -12548 5035 13752 2410 -10954 -6694 12842 18474 2878 -8024 -1040 15147 15138 -759
1572 -759 -11876 -2312 12539 8181 -8670 -14495 -1228 10213 6520 -9293 -11320 5420 14966
1585 14966 6862 -6530 -4832 8924 16109 4308 -10070 -5573 7092 9675 -4073 -13765 -8615
1598h615J3598J120j4099n643J0218J2256k522j0300m391J1021R910o419j1456
1611e322j804J0004M331p014j1474J56J0391K902q527p691M435Q954L367q009
1625e301n680O771Q504m49q344l218M480O569k892r222k426N385M932m623n005
1640a0519j347O541N233l368m545K524O976K250j475m494J879N570O92m549l311
1655a943K393K063L65m013k581K185L931p25k747P07J516M145m52k691p90K703
1671D066J297k405j760k119J401J52k388l072KJ515j176K63j457N54K351P54q23
1688b845N52J396l41J731p43j1j3p7n52j45J026j585k19Q15J557L28M11l39J243
1707B189L938n86n72j0K043J649N8k830j948K833J463j911m545K07K042J679j495
$$ plain form
1598 -8615 4983 6103 -7996 -13639 -3421 8835 6313 -3987 -8378 2643 12553 6134 -5322
1611 -5322 -7126 2878 7209 195 -11279 -11123 -732 2170 -6357 -14048 -9613 -659 2708 -5301
1625 -5301 -10981 -4210 4294 3845 -4499 -7717 -3237 3332 440 -8782 -11208 -5823 -891 -5514 -10519
1640 -10519 -11866 -5325 -92 -3460 -8005 -5481 1495 3745 2270 -2224 -345 5225 5917 1368 -1943
1655 -1943 450 2513 2878 -1135 -3716 -1531 2400 1675 -1072 -365 1151 5296 4844 2153 1363 4066
1671 4066 5363 2958 1198 -921 480 632 -1756 -4828 -4826 -3311 -4487 -4224 -5681 -5127 -2776 -2022 -2845
1688 -2845 -2293 -897 -1238 493 -250 -261 -274 -351 -903 -1048 -22 -1607 -1826 -1011 546 874 1285 946 2189
1707 2189 6127 5541 4969 4959 7002 8651 8709 5879 3931 6764 8227 6316 1771 1978 4020 5699 4204
1724D204m913J455M120J593l797k766J558M365J692o300l142K683N312j956n605
1739a497l311L842O219k897o682j289P200M320k785o708l5R459L716n770o765
1754b983L051P786K488p146p479N018Q337N9r679m036N877P894j243j0562k671
1769e289Q472P795n670q829j236Q713O757p687r697J048J0769K790p859r026L033
1784e916J1284J631r832p910P205R774Q6j0221o458Q653J0824k807j2667k029
1798h383R205R310m608j2610q49J1455P990q791j0792J184J2010N326r522j1368
1812a0443L677J4101R93j0758r388N558J3157O34j3557p810R933J0873j725j4127
1826h882n634J0676J1760n405j5729j420J2624R360p754j3953l08J6003Q148j2179
$$ plain form
1724 4204 -709 746 4866 6459 2662 -104 1454 5819 7511 1211 -1931 752 6064 4108 -1497
1739 -1497 -4808 -966 5253 2356 -4326 -5615 1585 5905 3120 -3588 -3623 5836 9552 3782 -2983
1754 -2983 68 7854 10342 3196 -4283 735 9072 9131 -548 -4584 1293 9187 7944 -2618 -5289
1769 -5289 3183 10978 5308 -3521 -4757 3956 10713 3026 -6671 -5623 5146 7936 77 -8949 -5916
1784 -5916 5368 6999 -2833 -10743 -3538 6236 6322 -3899 -10357 -1704 9120 6313 -6354 -8383
1798 -8383 822 10132 5524 -7086 -7935 3520 11510 2719 -8073 -6889 5121 10447 925 -10443
1812 -10443 -6766 7335 8328 -2430 -11818 -6260 6897 7531 -6026 -13836 -3903 6970 5245 -8882
1826 -8882 -14516 -3840 7920 2515 -13214 -14634 -2010 7350 -404 -14357 -14665 1338 9486 -2693
1840b693j1755L783J6181N393j3671j1703P927J6923j26j5066r649J1051J4805
1853A1400k682j7236o672J5136J2529o522j6616k440J5842J2318j1059j7513K941
1866a0574J6317P983j3937j5402M799J7594M129j7404j2891R119J8006o99j6368
1879i328j0909J3160J8668n199j7344n329J5646J4984p335j9140j629J8375J0811
1892A5431j1016j8479L338J8144Q387j4129j6329P791J9971M174j6173j1629R340
1905a179K0038L6j9420q359J2239J7115m768j9567o777J5006J4687q933j9464
1918i346k632J8374J0909r662j8477J066K0797Q305j4385j5968N315J9002N655
1931A8953j7994j4964R869J8094R07k0018j0166J2488J8076k421k0270n924J7648
$$ plain form
1840 -2693 -14448 -10665 5516 10909 -2762 -14465 -6538 10385 10259 -4807 -14456 -3405 11400
1853 11400 8718 -8518 -15190 -54 12475 5953 -10663 -13103 2739 15057 3998 -13515 -10574
1866 -10574 5743 13726 -211 -15613 -10814 6780 10909 -6495 -19386 -10267 7739 7040 -9328
1879 -9328 -20237 -7077 11591 6392 -10952 -16281 -635 14349 7014 -12126 -13755 4620 15431
1892 15431 4415 -14064 -10726 7418 15805 1676 -14653 -6862 13109 17283 1110 -10519 -1179
1905 -1179 18859 18895 -525 -8884 3355 20470 15702 -3865 -10642 4364 19051 10118 -9346
1918 -9346 -11978 6396 17305 7643 -10834 -9768 11029 19334 4949 -11019 -5704 13298 18953
1931 18953 959 -14005 -4136 13958 14865 -5153 -15319 -2831 15245 12824 -7446 -13370 4278
1944D278J6274p709j7620l466J9553J3496j2893j8282J206J9864Q144j5251j7852
1957a0258N636K0400N275j8428j4637J2034J9285J741j9023j1581J4965J8965
1969B4374m616k1075p051J5609J6631j0011k1931l071J8447J2906j3983j9254
1981a3025J968K0607R676j5530j7620Q364K1691L043j6753j5450J1131K0751j883
1994A6970k0906j1051J4260J7240n079k1789n630J6623J6443q596k0867K49J8617
2007F484J3656j1924j9391K348K1320P264j6572j6375M235K0725K990j9130j4608
2020a8978J0151J9703p26j8765j0186J4066J8133k807k0497n901J7802J3675o852
2033H818k0401l408J8235J1751j3223j8530J241J8530R034j4873j5827N709K0665
$$ plain form
1944 4278 20552 12843 -4777 -8243 11310 24806 11913 -6369 -5163 14701 22845 7594 -10258
1957 -10258 -4622 15778 21053 2625 -12012 22 19307 21048 2025 -9556 5409 24374
1969 24374 19758 -1317 -8368 7241 23872 13861 -8070 -11141 7306 20212 6229 -13025
1981 -13025 -11057 9550 19226 3696 -13924 -5560 16131 19174 2421 -13029 -1898 18853 16970
1994 16970 -3936 -14987 -727 16513 11434 -10355 -15985 638 17081 8485 -12382 -12133 6484
2007 6484 20140 8216 -11175 -8827 12493 19757 3185 -13190 -8955 11770 14760 -4370 -18978
2020 -18978 -8827 10876 10150 -8615 -18801 -4735 13398 10591 -9906 -15807 1995 15670 8818
2033 8818 -11583 -14991 3244 14995 1772 -16758 -15517 3013 12047 -2826 -18653 -12944 7721
2046G721N653j6846j1992R681J9303J624j8232j2116J3788J6703m646j8866r102
2059a7327J5359J4285p170k0059l107J7799J2155j0340j8115J988J8114J0442
2071A4024j4740j6825O196J7488M678j6805j4682P699J8353n77j8751r901J1799
2084a2044J7382l913j7008o356J6562J5536p501j6865j342J6910J1342r440j8312
2097a5049K508J7950O666j3328j5080N834J7372N069j5589j1504J0218J7333R07
2110A3307j5789p781J1259J6220l831j7537n068J3186J1837p972j6500l448J5400
2123C283Q836j0376j5252J766J5775O127j0673j3726N473J6056L098j3643j0598
2136a3854P818J3408R68j5960q403J0550J2405l132j4649m681J1438J2946n293
$$ plain form
2046 7721 13374 -3472 -15464 -5783 13520 15144 -3088 -15204 -1416 15287 10641 -8225 -17327
2059 -17327 -1968 12317 5147 -14912 -18019 -220 11935 1595 -16520 -14532 3582 14024
2071 14024 -716 -17541 -11345 6143 10821 -5984 -20666 -12967 5386 4809 -13942 -23843 -12044
2084 -12044 5338 1425 -15583 -21939 -5377 10159 2658 -14207 -15549 1361 12703 3263 -15049
2097 -15049 -12541 5409 12075 -1253 -16333 -10499 6873 11942 -3647 -15151 -4933 12400 13307
2110 13307 -2482 -10263 996 17216 13385 -4152 -9220 3966 15803 7831 -8669 -12117 3283
2123 3283 12119 1743 -13509 -11743 4032 10159 -514 -14240 -8767 7289 10387 -3256 -13854
2136 -13854 -6036 7372 8340 -7620 -16023 -5473 6932 3800 -10849 -15530 -4092 8854 3561
2149C561j4235q40J4463R506p672j1623L58J4781O788j0272j1794M120J3415L248
2163A3804j1111j0749O935J3467P70j2649o662R327J1855j192j3395m199J0692
2176F893J0531n573j2930j965J0481Q597q504j2443N17J2098N354r596r891K749
2190c682J2928K766j0513q591O564J1519n9j0537p329P897J0066k140j2645l025
2204f781Q760P584l608j1568r62R800P370p240r015J998R654N198p805q278L275
2219a618J0348J260q845n902M033R545j62r097n000P150P493j904q293k890P789
2234C907O645l117r288K26P874M159m442p754N54P765L360p004n911K373O324
2249E671K277o893n066L385O811m98o671l278L790N735j557o412l320N633M174
$$ plain form
2149 3561 -10674 -11514 2949 12455 4783 -6840 -6482 8299 15087 4815 -6979 -2859 10556 13804
2163 13804 2693 -8056 -1121 12346 13116 467 -6195 3132 14987 13795 400 -3799 6893
2176 6893 17424 11851 -1079 -3044 7437 16034 7530 -4913 -4396 7702 13056 3460 -6431 -3682
2190 -3682 9246 12012 1499 -7092 -528 10991 10932 395 -6934 963 11029 8889 -3756 -6781
2204 -6781 1979 9563 5955 -5613 -6575 3225 10595 3355 -5660 -3662 5992 11190 3385 -4893 -1618
2219 -1618 8730 9990 1145 -4757 -724 8821 8659 -438 -5438 1712 9205 7301 -992 -3882 3907
2234 3907 10552 7435 -1853 -1627 6247 10406 5964 -1790 -1236 6529 9889 2885 -3026 -653 5671
2249 5671 7948 1055 -4011 -626 6185 5687 -984 -4262 -472 5263 3706 -2706 -6026 -393 3781
2264C781l397n537j610N174L673l442o104J193M803K589l906m930K000N169K155
2279A611m988l423K919M791L75m198k821L046N655j679m336q29L371L991j961
2294A524l597r19M664J775k198l610Q68L350J265k223m069J965L152l36k767j871
2310c027J156K645j2m156n19J613J653r24k959j94J456J801k093j641K65K505
2326b431mj051r04j39L168q54j506J2J383Q08j46r47k0J580L33j53n95J295O52
2345D81l03N59o00J315P32r73o07J342L27q46J4j202J585L73j404j119M55J378
2363A507k48j143j295J471J053L51k247p99K511j13j01k369n72K377J305k221
2379e33j778M14K061J286k640j155J093L205O90l236m43K072K928m66k526k112
$$ plain form
2264 3781 384 -5153 -6763 -1589 2084 -1358 -7462 -6269 -1466 1123 -2783 -7713 -5713 -544 1611
2279 1611 -3377 -6800 -3881 910 1285 -2913 -5734 -2688 2967 1288 -3048 -3877 -506 3485 1524
2294 1524 -2073 -2992 1672 3447 1249 -2361 -1493 1857 3122 899 -3170 -1205 1947 1611 -1156 -3027
2310 -3027 -1871 774 762 -3394 -3913 -2300 -647 -1571 -4530 -4724 -3268 -1467 -3560 -5201 -4936 -2431
2326 -2431 -2435 -3486 -4390 -4529 -1361 -2215 -3721 -3709 -2326 -1518 -1664 -2611 -2631 -1051 -718 -871 -1466 -171 481
2345 481 178 737 137 1452 2184 1211 604 1946 2273 1427 1441 239 1824 2197 793 -326 129 1507
2363 1507 1259 116 -1179 292 1345 1696 -551 -1350 1161 1048 947 -1422 -1994 383 1688 -533
2379 -533 -2311 -1897 164 1450 -1190 -2345 -1252 1953 2643 -593 -1036 1036 3964 3498 972 -1140
2395a140L681K417k192k330j171L264K243k070l563O65L943J690k507l158J360
2410A132L382K273m052l636K804L501L20m129l106K185N031j249m784k133L265
2425H04M889j874m687j555N029M511k902n469K98N570K628l243o442J286O432
2440E275J288m620n381K464O464J200o533l916M313O582j95p212k155M369O600
2455H543k235q091j203N978M433l670p077j624Q147L276n532o229J277Q001K136
2470F130n739o248L406Q276Q70q134m394N032O083J70r207l430P132O125k985
2485C087q210j285P305O656n065p503M85Q745M494o667o294J345R279K506p980
2500H98o786M607P803M32q153o062O150P653q55q926l599P246O932k595r649j483
$$ plain form
2395 -1140 2541 4958 2766 436 -735 2529 4772 2702 -861 -196 3747 5437 2930 -228 1132
2410 1132 4514 6787 2735 -901 1903 5404 5724 1595 -1511 674 5705 4456 -328 -2461 804
2425 804 5693 3819 -868 -2423 2606 7117 4215 -1254 -956 4614 7242 3999 -2443 -1157 5275
2440 5275 6563 1943 -3438 -974 5490 6690 157 -3759 554 7136 6941 -271 -2426 1943 8543
2455 8543 6308 -1783 -2986 2992 7425 3755 -3322 -4946 3201 6477 945 -5284 -4007 3994 6130
2470 6130 391 -5857 -2451 5825 6695 -1439 -5833 -801 5282 5452 -3755 -7185 -53 6072 3087
2485 3087 -5123 -6408 897 7553 2488 -5015 -4530 4215 8709 2042 -4252 -2907 6372 8878 898
2500 898 -5888 -1281 6522 6954 -1199 -7261 -1111 6542 5687 -3239 -6838 408 7340 4745 -4904 -6387
2516f387P505O463n811r256J14P912N207p209r139K075R399K302p813p385L996
2531h027J0204J067q994o204O500J0048k345q715m584P801Q553l073j1023j202
2545i994R116O750m218j0449M59J0767O004o747r195K721J0652M162q457q221
2559f650M057J1583P56j0437o610N808J0362q91j1494n181Q896Q877l464j1038
2573e426k926R841P596n669j1484J9J1063N046q111j0675K194J0997L784j0523
2587d274q412M994J0557J792j0957o710P600J0830j652j1022l977R045R546l340
2601D020j1247k504J0736Q046o147j0542L31J1192O245p402j0619L519J1599L686
2615A0913r282q292N013J1113J919j1095o566O705J0421j345j1298n017P871J0068
$$ plain form
2516 -6387 1118 7581 1770 -7486 -7372 540 5747 -1462 -10601 -8526 873 3175 -4638 -12023 -8027
2531 -8027 2177 3244 -5750 -11954 -5454 4594 2249 -6466 -11050 -3249 5304 2231 -8792 -9994
2545 -9994 -878 5872 1654 -8795 -8336 2431 8435 1688 -7507 -4786 5866 10028 1571 -6650
2559 -6650 -2593 8990 9746 -691 -7301 -1493 8869 7978 -3516 -8697 199 9076 5612 -5426
2573 -5426 -8352 1489 9085 3416 -8068 -8049 3014 8060 -51 -10726 -8532 2465 6249 -4274
2587 -4274 -12686 -7692 2865 4657 -6300 -13010 -5410 5420 3768 -7254 -11231 -2186 7360 4020
2601 4020 -7227 -9731 1005 9051 2904 -7638 -7307 3885 10130 2728 -7891 -4372 7227 10913
2615 10913 1631 -6661 -1648 9465 11384 289 -6277 428 10849 9504 -1794 -6811 1060 11128
2629A1128m562j1290k366R296P955n722j1166p63J1371N497p406j0364K135J1048
2643D791L678q710j0097M875J1385J499j0333p200O187J0705N5j1744n105Q808
2657a206J0017l457j1196k815R785R136n850j1262l57J1027O293p275j0430J348
2671f242J2444L751r264r141M583J1204J642j0557p653P147J0668j047j1513m878
2685h856Q288R529k961j2285k406J0095Q101o491j0438n23J0640O929q208j0223
2699h809K480J1500L396q745q816M119J1413J207j0122o957P045R727q24j0196
2713c582n688Q820Q990l335j1012k385R084P285m671j1022J03R865N480p245q992
2728h305K097R833L610q510q149L924J0647M95q814o284N035J0284j099r964m390
$$ plain form
2629 11128 6566 -4724 -7090 2206 10161 4439 -6727 -7490 3881 9378 1972 -8392 -6257 4791
2643 4791 8469 -241 -10338 -5463 5922 7421 -2912 -10112 -3925 6780 6835 -4909 -10014 -1206
2657 -1206 8811 5354 -5842 -8657 1128 10264 4414 -6848 -7205 3822 10115 2840 -7590 -6242
2671 -6242 6202 9953 689 -8452 -3869 7335 8977 -1580 -9233 -2086 8582 7535 -3978 -8856
2685 -8856 -568 8961 6000 -6285 -8691 1404 9505 3014 -7424 -7947 2693 9622 1414 -8809
2699 -8809 -6329 5171 8567 -178 -8994 -4875 6538 7745 -2377 -9334 -2289 7438 6614 -3582
2713 -3582 -9270 -450 8540 5205 -5807 -8192 892 8177 3506 -7516 -7413 2452 7932 687 -8305
2728 -8305 -6208 3625 7235 -1275 -9424 -5500 5147 5642 -3172 -9456 -4421 5863 4764 -5200 -9590
2743i590P156Q149k150j0187k589Q729P129m374r736p7Q981N421n704r305J505
2758f642R654M136p928p142L021R353K163q692n907M732R451n71q884m472O394
2773a334Q158k035r349l292Q993N977l880q730j232Q844N117n580q617J811Q479
2788C330L695p066p090K958Q512K108q577n262M620P917r5q185m425N833P770
2803F043k526q162k470P108O264l555q189r15Q046M425m926p200J625O979L791
2818F338o077o636L359P519J168o397m491L769P107j88p311k619M492O741k141
2833D633o760j831N760N689l541o414j81O393L424l348o427R06O764J855m262
2848B660n262J657O435J075n266m668L634N394j35n802k620L263N344q30o314
$$ plain form
2743 -9590 -2434 5715 3565 -6622 -9211 -482 6647 2273 -7463 -7540 1441 6862 1158 -8147 -6642
2758 -6642 3012 7148 -780 -7922 -4901 4452 6615 -2077 -7984 -3252 6199 5628 -3256 -7728 -1334
2773 -1334 6824 4789 -4560 -7852 1141 7118 3238 -5492 -6724 2120 7237 1657 -6960 -5149 3330
2788 3330 7025 -41 -7131 -4173 4339 6447 -2130 -7392 -2772 5145 5050 -3135 -7560 -1727 6043
2803 6043 3517 -4645 -7115 -7 6257 2702 -5487 -6402 1644 6069 1143 -6057 -4432 2547 6338
2818 6338 261 -6375 -3016 4503 5671 -726 -5217 -1448 5659 5471 -1840 -4459 33 6774 4633
2833 4633 -2127 -3958 1802 7491 3950 -2464 -2645 3748 7172 3824 -2603 -1697 5067 6922 2660
2848 2660 -2602 -945 5490 6565 1299 -3369 265 5659 5524 -278 -2898 365 5709 4879 -1435
2863a435j392M382M121k377n001j240N267L253m017m597L78N544J923m061m148
2878c400J239N922R90m651l453K969M230R15m807l378M399M135o49n074j452L778
2894A713L677j993m486n45M143L240l366l343k90M290K669l815l523J725L625
2909C721O75l115l675K127L920m99l508k537K583L384j308l664r50K908K503j949
2925F16l605P38J893K339j714l695Q31K833R51k444k163P07K841N14k264j286
2941b908Q52K938m23j436r87R02K610l09k071m83J792N26K04k136k98J699Q07
2958A279q75j549M92R86N37j174p77J34J325J36j455J04n01P45M34j512q69O67
2976a873K51m29k90j167O28M02J30n71k98R94l0K27j17l30J70J028n03l90M78
$$ plain form
2863 -1435 -2827 1555 5676 3299 -1702 -2942 2325 5578 1561 -3036 -2658 2886 4809 748 -3400
2878 -3400 -2161 3761 4751 100 -3353 -384 3846 4761 -46 -3424 975 5110 4461 -613 -2065 1713
2894 1713 5390 3397 -1089 -1634 2509 5749 2383 -960 -1250 3040 5709 1894 -1629 96 3721
2909 3721 4396 1281 -2394 -267 3653 3154 -354 -2891 -308 3076 1768 -1896 -2846 62 2565 616
2925 616 -2989 -2251 -358 1981 267 -3428 -2597 236 1187 -1257 -3420 -2713 128 642 -1622 -2908
2941 -2908 -2056 882 459 -977 -1964 -1062 1548 1239 -832 -1315 477 1003 1207 -929 -1227 472 1279
2958 1279 404 -1145 -653 333 870 -304 -1081 -947 378 514 -941 -837 -1338 -593 -159 -1671 -2540 -1873
2976 -1873 -1622 -2051 -2341 -3508 -2880 -2478 -2348 -2919 -3217 -2223 -2253 -2026 -2143 -2473 -2303 -1275 -1778 -2168 -1690
2995a690l98P57k2l30J31L44J50O5N23k00L44j14P18J28j0J37n49J027j07m16
3015D88l40O8n4j1l97j426O71O20L1j012n84Q00P73l2j240l41J177P68j287r52
3035b280q3N91J417j669j328L89J903L77j394p73O77K073O72j606j196K148J635
3052A553k00j701j270K013K090j046k440k08K032J587j310k438L39K693J392k361
3068G25j974R86K639P73k356k482J281L400q50k828j872J659K990j101l427j233
3084c670L217K059r13l200m76L718K243j836l422Q80L287J399k436k895J238L356
3100B549J063l773j944J756L659O1l614j689K602M111j174l435j236K937K915
3115D788j490m024q28L651J929k600m406l9L931J894l199m202J671L944J066l471
$$ plain form
2995 -1690 -2088 -1331 -1353 -1683 -1552 -1208 -1058 -993 -470 -670 -326 -440 278 406 396 533 -16 1011 904 488
3015 488 148 216 162 151 -246 -1672 -1001 -381 -350 -1362 -1946 -1146 -373 -405 -1645 -1986 -809 -41 -1328 -2280
3035 -2280 -2363 -1772 -355 -2024 -3352 -2963 -1060 -683 -2077 -2850 -2173 -100 572 -1034 -2230 -82 1553
3052 1553 1353 -348 -1618 395 2485 1439 -1001 -1209 823 2410 1100 -1338 -999 1694 3086 725
3068 725 -1249 -263 2376 3149 793 -1689 -408 2992 2142 -686 -2558 -899 2091 990 -2437 -3670
3084 -3670 -453 1606 693 -2507 -2983 735 2978 1142 -2280 -1400 1887 3286 850 -2045 -807 2549
3100 2549 3612 -161 -2105 -349 3310 3371 -243 -1932 670 4781 3607 172 -1064 1873 4788
3115 4788 3298 -726 -1554 2097 4026 1426 -2980 -3019 912 2806 -393 -4595 -2924 1020 2086 -1385
3131a385l138K106M022Q04m666k248K856L946r83m468j886L668M307k346m120
3146c531p42M510L629k610m326L71N400K459l097m303J134N241J657m511m485
3161c204K661M973J99n153l062L247M697o65o064j708M126M408k238n699p96M759
3177D81L618m032n285Q4N410K081m282m997J241N859J027m861m011K915N541O13
3193A402n478l382M648N007o33n700j982M536M771j786o315n30N330L892l584
3208A96n013K21O310L102m596m796J424O473J585n116m405K717O057J26n920l693
3224e328L897N132p07o303k735N230M333j974o122r58N237M380l262o156O28N455
3240G47L364n003m896J297O082J970n401m561K707O386J08n446l609M094N969
$$ plain form
3131 -1385 -4523 -2417 1605 2409 -2257 -4505 -1649 2297 1314 -3154 -5040 -1372 2935 589 -3531
3146 -3531 -4273 237 3866 1256 -3070 -2699 2701 5160 2063 -2240 -1106 4135 5792 1281 -3204
3161 -3204 -543 4430 4629 -524 -3586 -339 4358 3693 -2371 -4079 47 4455 2217 -3482 -4278 481
3177 481 4099 67 -5218 -5134 276 2357 -1925 -6922 -5681 178 1205 -3656 -7667 -4752 789 1402
3193 1402 -4076 -7458 -2810 2197 1564 -4136 -6118 -1582 3189 1403 -4912 -5442 -112 3780 196
3208 196 -4817 -4596 1714 4816 220 -4576 -3152 3321 4906 -210 -4615 -1898 4159 4285 -1635 -5328
3224 -5328 -1431 3701 2994 -3309 -6044 -814 3519 1545 -4577 -5535 -298 4082 820 -5336 -4708 747
3240 747 4111 -892 -5788 -4491 1591 3561 -1840 -6401 -3694 2692 2800 -2646 -6255 -2161 3808
3255C808r23o072k859N726M805j856o397j509N646M624l318o701O92N857L427
3270D950m200o149J457O982J787n695m351K595O540R48o416l842L992O239j215
3285C622o045k466N043N421k314o661j087O381L900l037o701N00O359L226m603
3300A538n596J866O221K193n528m668K988O254O16o721k922L805N656p32o704
3315a734k674N209M921k338o087j369N651L803l394n625N9O329K810m298n458
3330d195J492O108K011n497m723L258N270Q99n819l700L724N796n38o253k060
3345d227M655N139j845n526j852N594M380l383n546j48N745K718l731n427J048
3360b406N804J771m463m790K441N645J202n310l913L500N339m63n815k401L461
$$ plain form
3255 3808 2885 -3187 -6046 -320 4485 2629 -3768 -5277 369 4993 1675 -5026 -4334 1523 4950
3270 4950 750 -5399 -3942 3040 4827 -868 -5219 -2624 3916 4864 -1552 -5394 -1402 4837 3622
3285 3622 -2423 -4889 154 5575 3261 -3400 -4487 1894 5794 2757 -3944 -3444 2915 6141 1538
3300 1538 -4058 -2192 4029 6222 694 -3974 -986 5268 5884 -837 -3759 46 5702 4970 -1734
3315 -1734 -4408 801 5722 3384 -2703 -4072 1579 5382 1988 -3637 -3578 2751 5561 1263 -4195
3330 -4195 -2703 3405 5416 -81 -4804 -1546 3724 4623 -1196 -4896 -1172 4624 4086 -2167 -4227
3345 -4227 428 5567 3722 -1804 -3656 1938 6318 2935 -2611 -2759 2986 5704 1973 -3454 -2406
3360 -2406 3398 5169 706 -4084 -1643 4002 5204 -106 -4019 -519 4820 4357 -1458 -3859 -398
3375c98N347j931o217j224M595M069k793n539m21N682L233m214m653R28N856J925
3391D245m185m595K245N694M90m961l934L323N100k75n995k179M237M181j281
3406B110n461j056M662M024k542n215j71N024K697l658m353o0N362J704m540l839
3422e312J785M771O07m359l196L359M579n32m276k359L889L766r90n067j262M184
3438d13L173k410m676n5M050K722l081l911Q36M663K148l649l286J616M614J072
3454C413m038k921J938M168m50l733k830K927L275j068m040j343L184L318j610
3469A90l880m12L800K698k607l793R94L495J632l206l280J184L756Q45l726k424
3485d734J721L861N70l681j557K631L732o19l480j080L367K682j364l897m15L114
$$ plain form
3375 -398 4949 3018 -3199 -4423 172 4241 1448 -4091 -4512 1170 4403 189 -4464 -3536 2320 4245
3391 4245 60 -4535 -2290 3404 3894 -1067 -5001 -1678 3422 3147 -2848 -5027 -790 3391 2110
3406 2110 -3351 -4407 255 4279 1737 -3478 -3649 1375 4072 414 -3939 -3999 1363 3067 -1473 -5312
3422 -5312 -3527 1244 1851 -2508 -5704 -2345 2234 1702 -2574 -4933 -1044 2722 1732 -3335 -4597 -413
3438 -413 2760 350 -4326 -4381 -331 2391 -690 -4601 -3765 898 3046 -603 -3889 -2273 2341 3413
3454 3413 -625 -3546 -1608 2560 2110 -1623 -4453 -1526 1749 681 -3359 -4702 -1518 1800 190
3469 190 -3690 -4102 -302 2396 -211 -4004 -3010 485 2117 -1089 -4369 -3185 571 1416 -2310 -4734
3485 -4734 -3013 848 1418 -2263 -3820 -1189 2543 1924 -1556 -2636 731 3413 2049 -1848 -2263 851
3501H51J760j811l482J35L352J614k762k634J451L070R09k630k179J639L208k64
3517B227l474j462J846K518r78l192j186K593J990j785k143o61L327J346j031
3532f5k714J113L041R61j747k020J094K398N94k699j298J193K163k86j927q41
3548a040J395K271n48j903l40J760J861r41j865l02K029N97j326j824l71J749
3564A202n4j306j743L36J759j83j067j263R75J272N79j915m48R39J159p4j393
3581a225q90R65J292r09j260k51J109J178o15p83nJ965N65o01k44L56J334M65
3599B446o38j264J116N26J31j233p40N73N94m7j151j50O78N84n55l92p6J72P69
3618A343r56n63n4L42q4q64p14k21K97kq50j29L87J28l46M40l33M21M78O6m0L37
$$ plain form
3501 851 2611 800 -2682 -2547 805 2419 -343 -2977 -1526 1544 2453 -177 -2356 -717 2491 2227
3517 2227 -1247 -2709 -863 1655 677 -2515 -3701 -1108 882 -903 -3046 -3707 -380 966 -65
3532 -65 -2779 -1666 1375 2336 589 -1431 -337 2061 2655 -44 -1342 -149 2014 1728 -199 -1040
3548 -1040 355 2626 2078 175 -165 1595 3456 2515 650 348 2377 2974 1648 -176 -547 1202
3564 1202 1148 -158 -1901 -1565 194 11 -1056 -2319 -1344 -72 507 -1408 -1856 -917 242 168 -1225
3581 -1225 -2115 -1150 142 -767 -2027 -2278 -1169 9 -606 -1389 -1394 571 1136 535 291 647 1981 2446
3599 2446 1808 544 1660 2186 2317 1084 344 917 1511 1464 313 163 841 1425 870 478 402 574 1343
3618 1343 387 -176 -230 112 28 -836 -1550 -1771 -1474 -1476 -2326 -2455 -2068 -1940 -2286 -1846 -2179 -1758 -1280 -1214 -1254 -917
3640i17m9q8L89k98K96r8o1r2L57Q1k65nL31M56O7L0m41P33O59k27l96j59L61
3663F64J18j12q89j77O11k74m61p79K81M11N83r51n51O76P24j08p49k72L99Q73
3683A7l20j028l81R25N31n14o56n35J202P78r85m62J44J354K91o89p54O28J561
3702A107Qr62j011M21J545m60j292l83P35J149m40j487m93J220J499p94j700K45
3720a093J109J515j169j484l8J558R37j624j388P88J542J72j367j431J070K057
3736A154k07j272j070J272J832rj841r64J771J591p03k199k80J891J440j439j775
3753h08m2K411Q17j761j425n5K670Q04k420j522R73K570l69k164j456J893K069
3770B185n16k688q49K210J633q77k626l98K715J542j613k668M64K391J616k377
$$ plain form
3640 -917 -966 -1054 -665 -963 -667 -765 -826 -918 -561 -480 -745 -750 -419 37 104 134 -307 426 1085 858 462 303 664
3663 664 782 670 -219 -396 215 -59 -520 -1299 -1018 -607 -24 -975 -1526 -850 -126 -234 -983 -1255 -856 17
3683 17 -303 -1331 -1712 -787 -256 -770 -1426 -1961 -759 19 -966 -1428 -1284 70 361 -328 -1082 -454 1107
3702 1107 1115 153 -858 -437 1108 648 -644 -1027 -292 857 417 -1070 -1563 -343 1156 362 -1338 -1093
3720 -1093 16 1531 362 -1122 -1160 398 1335 -289 -1677 -889 653 825 -542 -1973 -903 1154
3736 1154 947 -325 -1395 -123 1709 1700 -141 -1105 666 2257 1554 -645 -925 966 2406 967 -808
3753 -808 -850 1561 2378 617 -808 -863 1807 2611 191 -1331 -358 2212 1843 -321 -1777 116 2185
3770 2185 1669 -1019 -1868 342 1975 1098 -1528 -1926 789 2331 718 -1950 -1486 905 2521 144
3786A44k200J289K611M82k513j597J353K925l73k512j598K044K608r89k325j191
3802a842K327K132j260l215J00K961J369j727k738N16K566J147k173k826J565
3817a098K679M50k598j953J461K955k70l107j058J673K944o84l097o86K457K495
3833B563j376l155m00L027J919j688l274M17L156J310k439k622Q37L366Q26l286
3849h19k094J647L017K47l290j901K716K618n25l606r26K384K319j281l400o34
3865c528L406J918k419k876K29L662J306k575k831J005L918P31l185k495K002
3880a732L062M87l776k010L090K896p61l578j011K805L202j724l502j48L514K236
3896C050k131l251K60L452J553k957l003J098L454O52l228k612K074L251Q9l267
$$ plain form
3786 144 -2056 -767 1844 2326 -187 -1784 -431 2494 2121 -391 -1989 55 2663 1674 -651 -1842
3802 -1842 485 2617 1357 -1858 -1758 1203 2572 845 -1893 -1377 1189 2336 163 -2663 -1098
3817 -1098 1581 2031 -567 -2520 -1059 1896 1626 -1481 -2539 -866 2078 1394 -1703 -2389 68 2563
3833 2563 1187 -1968 -2368 659 2578 890 -2384 -1967 1189 2499 60 -2562 -1725 1641 2467 -819
3849 -819 -2913 -1266 1751 1998 -1292 -3193 -477 2141 1616 -1990 -2916 -532 1787 506 -2894 -3528
3865 -3528 -122 1796 -623 -3499 -3270 392 1698 -877 -3708 -2703 1215 1946 -1239 -3734 -1732
3880 -1732 1330 1817 -1959 -3969 -879 2017 1256 -2322 -3333 -528 2674 950 -2552 -2700 814 3050
3896 3050 919 -2332 -2072 1380 2933 -24 -3027 -1929 1525 2177 -1051 -3663 -1589 1662 1751 -1516
3912a516j937K450L002o39l633j037K957K540j469l664j00K860K370k640l077
3927c533O86L286J586k613k735J004L854R17l143k075J877L395j87l120j957K818
3943F0K725o62l795j128L158K401j230l500o34L483J980j641l732P39L201J595
3959C020k545k888J082L100J078l732k009J274L657j39l311j946K416L187p57
3974A487k954j630L417K964j340l477k36L005K224j997l344K37L361J755k726
3989G46k987J070L581J059l353k178J774L562J38l561j646K086L276p16l607j116
4005a872K638K256j811l189r41L405J844j950l234O67K947J530k287k764J194
4020a567K978P71k745k208J569L131j10l169j424K092K769o73k811r90K615K620
$$ plain form
3912 -1516 -3453 -1003 1999 1360 -2273 -3310 -353 2187 718 -2946 -3046 -186 2184 -456 -3533
3927 -3533 -2847 439 2025 -588 -3323 -2319 1535 2452 -691 -2766 -889 2506 2319 -801 -2758 60
3943 60 2785 2123 -1672 -2800 358 2759 1529 -1971 -2605 878 2858 1217 -2515 -1776 1425 3020
3959 3020 475 -2413 -1331 1769 2847 -885 -2894 -1620 2037 1898 -1413 -3359 -943 2244 1487
3974 1487 -1467 -3097 320 3284 1944 -1533 -1769 1236 3460 1463 -1881 -1644 1717 3472 746
3989 746 -2241 -1171 2410 3469 116 -2062 -288 3274 3412 -149 -1795 291 3567 2851 -756 -1872
4005 -1872 766 3022 1211 -1978 -2919 486 2330 380 -2854 -2187 760 2290 3 -2761 -1567
4020 -1567 1411 2182 -563 -2771 -1202 1929 1819 -1350 -2774 -682 2087 1414 -1397 -2387 228 2848
4036B848j229l011M1K954J978j626k808J55L079J189k174k651N42L255K44k462
4052C24k248J442K743M82l122j568K136J902k90k550j368K097K476j496l022l63
4068b425K139J831j857k814K43K831J105j884k324N83K842J022k011k096J585
4083a230K511K97k560j273J400K198k48l055k92J716K368r34k635k67K485J745
4099B226j623k158J5K698J155k059j992L42K650P07k514j613R11K125J63k397
4115a364j690K059J962m42k330q02J975J509l99k315m91J975J443j422j872J75
4131b029J974J110j547k042O22K202L82j625j355R56K144K3j658j072J418J685
4147A188n11j713q28J680J206p01j969j84J456J385j138j876K58J633Q71j422
$$ plain form
4036 2848 1619 -1392 -1351 1603 3581 1955 -853 -698 2381 3570 1396 -1255 -713 2542 2786 324
4052 324 -1924 -482 2261 2743 -379 -1947 189 2091 1801 -749 -2117 -20 2456 960 -2062 -2425
4068 -2425 -286 1545 -312 -3126 -2883 -52 1053 -831 -3155 -2572 270 1292 -719 -2815 -1230
4083 -1230 1281 1578 -982 -2255 -855 1343 1095 -1960 -2252 -536 1832 898 -1737 -2004 481 2226
4099 2226 603 -1555 -1540 1158 2313 254 -1738 -1396 1254 1961 -553 -2166 -1255 870 1033 -1364
4115 -1364 -3054 -995 967 525 -1805 -2607 -632 877 478 -1837 -2328 -353 1090 -332 -2204 -2029
4131 -2029 -55 1055 -492 -2534 -1912 290 672 -953 -2308 -1352 792 815 -843 -1915 -497 1188
4147 1188 677 -1036 -1864 -184 1022 321 -1648 -1832 -376 1009 -129 -2005 -1747 -114 757 -665
4163f65r69K68J883M88j681j076Q41J354J40j550o76Q33J609m81j405o34J425
4180b96J276l45j455k94J387R32n15j641K79J306P49r56j263L85J062L92j105
4197a02j008P76J160J88j274r54P93J491l96j429k14R12R07m99j241l84J369N59
4215F54o56j080m0J451K93o18j166Q03P94R5p97l92O10J075k94r39k58P55M17
4234G07J85q18j11M57O17m42n02j99O92M26n84m85J86N82j58j30m63r4Q34k01
4254D99p63j5M12L4K35m99l43K76M8O9n16L6J35M36m6m60j71L79K60k33J77r5
4276a45K92K8k31j20L48J96k00j52K51L1j64P7m7j70N43m13p4M27k84L9Q2j16
4298A98j34J98j96j66Oj94K27j45n2j86R9n7j53l92J55L72o9m13m0M07K66n75
$$ plain form
4163 -665 -1634 -1366 517 1005 -676 -1752 -911 443 583 -967 -1643 -810 799 318 -1087 -1721 -296
4180 -296 980 635 -820 -1114 273 1205 690 -951 -672 634 1383 427 -836 -451 611 1003 -102
4197 -102 -1110 -334 826 1014 -260 -1214 -421 1070 674 -755 -969 -57 850 351 -890 -1274 95 654
4215 654 -2 -1082 -1122 329 622 4 -1162 -359 435 530 -267 -659 -49 1026 732 -207 -465 290 707
4234 707 892 74 -37 420 1037 595 93 -106 586 1012 428 -57 129 711 553 423 -40 -134 700 499
4254 499 -264 -279 133 167 402 -97 -440 -164 -116 -47 -563 -527 -392 44 -2 -462 -633 -254 6 -227 -50 -145
4276 -145 147 175 -56 -176 172 368 168 16 267 298 134 211 164 -6 537 124 50 477 193 232 314 198
4298 198 64 262 66 -100 -94 -288 -61 -206 -258 -444 -345 -402 -555 -947 -792 -420 -489 -902 -942 -535 -269 -844
4320h44J1L0N0M49l12k89M0J81L58k66m03L21K90J11j76l50%O54K18m34m61N9
4342g63J047k08n84n29Q48L99m29m81l68P50M58j35j278O30N32M3l42n77K91Q06
4362A10j40l71o07N18M75k52o28m27K29J173k80r37K7M25P31j79j265J9J173M61
4382B55n70j053M24R19M03r51q10L34J247j54p68n75M34J014Q7j420l77Q78J189
4401E06m18j385L0R64O19m30j059J68R71O30q75p49L4J115M01j011o92Q17J167
4420H03j2j101p81J090J023o3j374k75J033P32j16j615k4J138J205r06j267j50
4438f60J224J077j153j225K12J465K62j070j322N07J795m17j101q90O65J574k55
4455F88j425q51J260J365m80j832KJ372J022o43j255k64J297R40j014j345M22
$$ plain form
4320 -844 -833 -803 -753 -304 -616 -905 -865 -684 -326 -592 -995 -674 -384 -273 -449 -799 -799 -145 73 -361 -822 -763
4342 -763 284 76 -508 -1037 -189 210 -219 -700 -1068 -318 140 5 -1273 -643 -111 -68 -410 -987 -696 110
4362 110 -30 -401 -1008 -490 -15 -267 -895 -1322 -1093 80 -200 -1137 -1110 -685 46 -133 -1398 -1379 -206 255
4382 255 -315 -1368 -944 -25 378 -573 -1383 -1049 198 44 -724 -1299 -865 149 236 -1184 -1561 -683 506
4401 506 88 -1297 -1267 -303 316 -114 -1173 -1005 -34 596 -279 -1028 -994 121 522 -489 -1181 -364 803
4420 803 791 -310 -1091 -1 1022 959 -415 -690 343 1075 959 -656 -680 458 1663 757 -510 -660
4438 -660 564 1641 488 -737 -525 940 1202 132 -1190 -683 1112 695 -406 -1296 -631 943 688
4455 688 -737 -1588 -328 1037 557 -1275 -1273 99 1121 478 -777 -1041 256 1196 182 -1163 -741
4472g41J666M77j247j218O79J447M45j538j074J054J942m69j566q33J453J302
4488A779p68j244m89J589R60p07k089L46J619R17j262j791N95J776N79j851j220
4505a261P54J777q1j435j339J304J527k73k017n95J251J646p65j566k93J647J154
4522A435q10j765l11J801R02j113j751N02J762P20j421j244O25J637L50j798r14
4539a393J040J589l91j518q67J455J300m31k068k67J531J359j162j607J29J606
4555C05J009j109j698J5K175L99j388j451J089J665K68j830j100J242J577Lk039
4572h68o87J488J711p00k023k41J580J539j108j845J5J747J065j477j887N38J995
4589H42L57j285j614Q13J784P8j717j148J241J584m77j657o50J530J265p15j951
$$ plain form
4472 -741 925 1402 155 -1063 -384 1063 1508 -30 -1104 -50 1892 1423 -143 -976 477 1779
4488 1779 1011 -233 -722 867 1827 1120 -969 -623 996 1913 651 -1140 -545 1231 1810 -41 -1261
4505 -1261 -507 1270 1189 -246 -1585 -281 1246 973 -1044 -1639 -388 1258 493 -1073 -1366 281 1435
4522 1435 625 -1140 -1451 350 1252 139 -1612 -1110 652 1372 -49 -1293 -668 969 1319 -479 -1393
4539 -1393 -353 1236 845 -673 -1540 -85 1215 784 -1284 -1551 -20 1339 177 -1430 -1301 305
4555 305 1314 205 -1493 -1478 697 1096 -292 -1743 -654 1011 1279 -551 -1651 -409 1168 1171 -868
4572 -868 -1555 -67 1644 944 -1079 -1320 260 1799 691 -1154 -1139 608 1673 196 -1691 -1153 842
4589 842 1199 -86 -1700 -887 897 975 -742 -1890 -649 935 458 -1199 -1849 -319 946 231 -1720
4606a720N0J400J190q08j852M16J525Q17j293j582P62J610O99j483j498R28K094
4623A255J90j748j249J396J744m92j799n94J719J119l88j903j93J568J246j204
4639F67j593O4J566R20j312j586L25J598P62j631j464R95J621K6j566j101J115
4656e94J655l88j613q41J506J184n80j487k40J281P78k25j832K66J517Q47p41
4673D93j861M96J705N99j317j324N55K011j8j653r31J304J384j94j536q98J283
4690I8J172j98j877l05J358R15p37j479j73J804P05j131j486M75J394M26j395
4707d34j098P65J334J19j420o54O73J535r4j761l73J050J356q99j064l75J369
4724B9J137j189j085k49J939L42q05j219L10J574M73j431j297R44J393Nj524q20
$$ plain form
4606 -1720 -1670 -270 920 112 -1740 -1324 201 1018 -275 -1857 -1095 515 1214 -269 -1767 -839 1255
4623 1255 1445 -303 -1552 -156 1588 1096 -703 -1297 422 1541 1153 -750 -943 625 1871 667
4639 667 -926 -862 704 1624 312 -1274 -949 649 1411 -220 -1684 -689 932 958 -608 -1709 -594
4656 -594 1061 673 -940 -1781 -275 909 329 -1158 -1398 -117 661 436 -1396 -1130 387 1234 493
4673 493 -1368 -872 833 1432 115 -1209 -654 1357 1339 -314 -1245 59 1443 1249 -287 -1185 98
4690 98 1270 1072 -805 -1110 248 1163 426 -1053 -1226 578 1283 152 -1334 -859 535 961 -434
4707 -434 -1532 -767 567 686 -734 -1388 -715 820 726 -1035 -1408 -358 998 99 -965 -1340 29
4724 29 1166 -23 -1108 -1357 582 924 119 -1100 -790 784 1257 -174 -1471 -527 866 871 -653 -1473
4742a473J249R82j79j231n20Q37J082n50j184m61J510O24n42j503J56J278M93
4759E68j061r33L73J415J94r56q13L28J305J01j039r53J064R14qj287m74J042
4777b20R17o38j071K20N41J104p31j321K20J062O15o71j283N68R14N07r98q78
4795a143O40R29lj098n14O33J117o6j133k79P55O70j70r94k23Q22P90n07q87k25
4815h86J280L86q78n36J69R38L33r45o67L31J019r9r55l19O03M92J76o79l76M63
4835a50N19r3r46j88N43P09m40p36K45N39J93k17q58L58M53O80j041j11J46O64
4855B69L7l85j39K84N33m15j00l36M07N98l30m26j73L68O74n65n23R0Q14J58m07
4876D33k95m1K25L71n69l42J59N07J18o92j06n3O67l20m00m1L68J58k09l00p7
$$ plain form
4742 -1473 -224 758 579 -652 -1172 -335 747 197 -987 -1448 62 686 144 -1359 -1203 75 568
4759 568 -493 -1426 -1053 362 556 -400 -1213 -885 420 521 -518 -1471 -407 507 499 -788 -1262 -220
4777 -220 697 59 -1012 -792 -251 853 122 -1199 -979 83 698 27 -1256 -688 226 733 -265 -1143
4795 -1143 -503 426 423 -675 -1189 -556 561 495 -638 -917 -162 508 338 -656 -879 -57 733 226 -661 -886
4815 -886 394 780 -98 -634 -465 473 806 -139 -806 -475 544 445 -510 -829 -226 266 442 -237 -613 -150
4835 -150 369 276 -670 -858 -315 394 -46 -782 -537 2 195 -22 -880 -522 -69 611 -430 -541 -395 269
4855 269 306 -79 -218 66 599 184 84 -252 155 753 423 -3 -176 192 866 301 -222 -132 682 840 433
4876 433 138 97 322 693 124 -218 -59 448 566 -126 -232 -285 382 62 -338 -379 -11 147 -62 -362 -439
4897d39M21Q4M4o51K48R0M29k86j62j10M04m5p0l95M74J76j0o9k86L43L23k36
4919B77j85J00L7L06k46m14L0K58J25k30r8j08L86K45m18k38J6M42P0j95k21K11
4941A50j41lK3l7P3m53J88l8L3J79k29J35M2N7j02J53q5J62M0k79J34K8J71J41
4965C42j71j36j63K41M7j66o8L95k03L5l17J08J94J35q6l00J48Q4J08l45j93K92
4987a9P8Jl01l44K18M04l78q3k06K67O27m07k34n5K68L43l87J7j86J44M54n54
5009c33j87K17L31m1k63n6K44K09K34j77l82Q0M55o5k22m6L17K32j48m46k21K63
5031eN22n43l84N4N91P0k54n26J17O23%n41l82K66O56Ko39l25K60K67K67r68J0
5054h62M81M48k14o20m4O44O69n08l91R3N43J71m74m65R6R67o6m68k90O6Q59j42
$$ plain form
4897 -439 -18 66 110 -541 -293 -203 226 -60 -222 -332 72 27 -43 -438 36 212 202 133 -153 190 513 277
4919 277 92 192 229 535 289 -125 -95 163 288 58 -40 -148 238 483 65 -173 -157 285 355 160 -61 150
4941 150 9 6 29 -8 65 -388 -200 -238 -205 -26 -255 -120 -78 -21 -123 30 -55 107 147 -132 2 30 201 342
4965 342 171 35 -128 113 160 -6 -74 321 118 153 -164 -56 138 273 187 -113 35 119 227 -118 -311 -19
4987 -19 59 60 -241 -585 -367 37 -341 -424 -630 -363 264 -143 -377 -432 -164 179 -208 -191 -377 -233 221 -333
5009 -333 -520 -303 28 -13 -276 -332 -88 121 355 178 -204 -124 331 266 44 -2 315 547 399 -47 -268 -5
5031 -5 517 -26 -410 -356 235 305 51 -475 -358 265 265 -276 -658 -392 264 266 -373 -698 -438 -171 96 -872 -862
5054 -862 -381 67 -147 -767 -811 -167 502 -6 -397 -304 239 410 -64 -529 -433 534 468 0 -290 -224 635 493
5076D93n40n02L80Q82n8p25p2L80N46j41r05n8O79M89n62q45k4R07K67o50o43
5097g02L13N30K94n99m69M71M35N03q84p17O00P21j22p63k92P25M27l21q68j12
5117h30J134K63l83o02j35Q60M01l72r45L07J015j28l86p12L69O18L71r77n28
5136f60M77N68O6n73n78N21P52j49o81l6N31L89k33j105J82O76O47q24p62L91
5156d01P78K31n31p65L01R42K18r47m13N85Q99j17p86m75Q39N45k03j125r0P69
5176B54M63l94r66o8R58P72j104r41N58R77L52q17j119P49P66J29j016l93M80
5195c60Q85k61j151l48Q62R91k24j237l15J299L40m62j040L18R94L24n57r02M24
5214d20Q73J34p27r12O83R38p9r48l51N81R49k43p35l80Q72Q48p77q33j75O54
$$ plain form
5076 493 -47 -549 -169 713 655 -70 -142 238 784 643 -262 -320 359 848 286 -559 -583 324 591 -59 -702
5097 -702 -389 141 435 -164 -633 -162 273 776 -108 -825 -225 496 374 -389 -681 44 471 150 -718 -830
5117 -830 304 567 184 -418 -553 307 708 336 -609 -302 713 585 199 -513 -144 474 845 -132 -660
5136 -660 -183 385 451 -122 -700 -179 573 424 -257 -293 238 627 394 -711 -529 147 794 -30 -792 -401
5156 -401 377 608 77 -688 -387 555 773 -174 -587 -2 897 780 -6 -481 358 903 700 -425 -515 254
5176 254 717 323 -643 -711 247 1019 -85 -1026 -468 509 861 44 -1075 -326 440 569 -447 -840 -360
5195 -360 525 264 -887 -1235 -373 618 394 -843 -1158 141 481 19 -1021 -703 291 615 58 -844 -420
5214 -420 453 587 -140 -1052 -369 569 490 -458 -809 -228 721 478 -257 -637 235 1083 306 -527 -702 -48
5234d8R11n74j115R6R12M89p14p15K5J167L7q38q02N47J304l09o22q10P60O14
5254C15pp63k95N01N79l8j254J63P65P62m90j010M4P03P78o67o74Q4R82K27o75
5275C0p35L36P50L35r85p95Q17O41N8p75m56N38P31k56r83l02R85O79m94r75J31
5296g25R81P67r08q75L1J303K90q69n89K70J082j07q19q47Q91J086l61r13k22
5315e34P22O12j86j094P6O69M43j83j024NQ65M06n82r76L01P90M34j065m88K58
5335e51J101n1p18p34R30P66l61p21l23N17Q69k91q93q2N44O02l00q34K57N39
5355B66J00j44n59j34J202J24p97m97M97O07L01j179l11O91P34l11r73j57P58
5374B18M42k83o88n0Q35K55n74p02P7Q53L80p61o05K41O68J05o64o36O01O36K90
$$ plain form
5234 -48 863 289 -826 -730 182 671 -43 -758 -733 434 471 -367 -1169 -622 682 373 -249 -1059 -299 315
5254 315 308 -455 -750 -249 330 292 -962 -799 -34 728 238 -772 -728 -25 753 86 -588 -504 478 705 30
5275 30 -705 -369 381 716 -269 -1064 -247 394 452 -323 -779 -241 490 234 -749 -1051 -66 613 119 -856 -725
5296 -725 256 1023 115 -760 -729 574 864 -5 -594 -324 758 651 -168 -1015 -124 962 601 -312 -534
5315 -534 188 800 614 -480 -404 265 708 525 -499 -494 371 777 195 -781 -480 310 744 -321 -809 -551
5335 -551 550 499 -219 -953 -23 743 382 -339 -662 -145 724 433 -460 -542 2 604 304 -530 -273 266
5355 266 366 222 -337 -471 731 855 58 -439 58 665 966 -213 -524 167 901 590 -383 -540 218
5374 218 660 377 -311 -361 474 729 155 -547 -470 383 763 2 -603 -362 306 411 -253 -889 -288 348 638
5395F38q67k86J64R52k90j66n50O9J094m17n51j53O88K85pq97j79O70P33o06p66
5416d42J22O41L57m33o15L40N12L38q41n53P04K09K0m34p51O55N14o5o05l94O29
5437i2K99k80m76j14P35M54n93m19l2O30J61l09m12O0M63Q7m49l50L92M03M0o22
5459d24j41N68N06p5p35J23N56J87r6p70K9M14L18n66l97K12M85J15m38m47L87
5480a89J85L25n34m32J50P05R0o09j59L88L1N9m33l3L76P1k59k62r0L97L29l36
5502b30k18K81L37l8k20j12O7M32k3l13m33O32kj05k57j22J34L69L3k33r3L74
5524B60P4j60k80Q7J56j0J4m80L25J83L6m54P9J7j7L39l31k07K44p7M29j71k73
5547b17L66O2j72L6j17J87r9J01k29m4K09q4Q2r1J22J3J92k34J2p6K00J08m04
$$ plain form
5395 638 -229 -515 -351 601 311 145 -405 -336 758 341 -210 -363 325 610 603 -294 -473 197 930 324 -442
5416 -442 -320 321 678 245 -370 -30 482 820 -21 -574 130 339 359 -75 -826 -171 343 278 -327 -721 -92
5437 -92 207 -73 -549 -663 72 526 -67 -486 -518 112 273 -36 -448 -388 75 162 -287 -637 -245 158 198 -424
5459 -424 -565 3 509 434 -301 -178 378 565 469 -301 -272 142 460 -106 -503 -291 194 309 -129 -576 -189
5480 -189 -4 321 -213 -645 -495 210 300 -309 -468 -80 -49 10 -423 -456 -80 -9 -268 -530 -620 -223 106 -230
5502 -230 -448 -167 170 132 -88 -200 -133 299 276 -37 -470 162 160 55 -202 -324 -190 179 212 -21 -114 260
5524 260 334 174 -106 -19 137 127 141 -339 -14 169 205 -249 -170 -153 -170 169 -162 -369 -125 -202 227 56 -217
5547 -217 149 211 39 75 -42 145 46 147 -82 -126 83 -1 81 -10 112 125 317 83 95 19 219 327 -77
5570g7J85n2P4j67P3n1J44o7Jl87R7L72k46Q4K9r8M4P0k37L13O9j70j08J79p5
5595aK82l71M6OJ11j74L14k39R0K52l78L24K4j0k46K42Mo8J18Q2k13q3J81R3k7
5620C59m15n2K91K0J4k09J72j86M49k84j09m0O2M2r2k24J73K4K16n91M3j03L31
5643a09J60j55q1M1j1K45k11m0pL05k86K8P9J06o4J88m23j11O16j06J01m58K46
5666E3J29j75J10k12R7K77J13j43k01J22K92k43n56K37J42N23n77l6k29J59K33
5687A15P8l27j46L03J28Q4m78N5K52L6j25j46J37K52K3k87l70L37K96j32l65O8
5709b12N4M93m57j08Q3J14K16Qm01j24K69J68k8k17n3L15K38m20n00L38K80L36
5731C92m41o13M40M05P7m09n4M33q2O0n44O1M90J55m72k37q0Q97r0k32n48M36
$$ plain form
5570 -77 108 56 130 -37 36 -15 129 62 63 -324 -227 145 -101 -17 12 -86 -42 28 -209 104 173 3 -105 74 -1
5595 -1 281 -90 -44 -38 73 -101 213 -26 64 316 -62 262 286 276 30 272 276 208 326 408 195 112 293 386 359
5620 359 -56 -108 183 203 217 8 180 -6 443 159 50 10 72 114 22 -202 -29 -5 211 -380 -337 -440 -109
5643 -109 51 -104 -185 -144 -155 90 -121 -161 -168 137 -149 -121 -42 64 0 188 -235 -346 270 164 265 -193 53
5666 53 182 7 117 -95 2 279 392 249 48 170 462 219 -337 -100 42 565 -12 -48 -277 -118 115
5687 115 193 -134 -280 23 151 235 -243 -188 64 100 -25 -171 -34 218 241 -46 -416 -79 217 85 -280 -212
5709 -212 -158 335 -122 -230 -147 -33 183 191 -210 -334 -65 103 75 -142 -195 120 358 -62 -562 -224 56 392
5731 392 -49 -662 -222 183 260 -149 -203 230 148 208 -336 -275 215 370 -102 -339 -419 478 388 156 -392 44
5753D4J37J59l35l54L7N91J07l58l46K32M79K61n87k74J50K71K50q89R4M74J68
5774C11j73n01j13P38L76m25l57o2M48L14p05p9k3N57J35m47o61O19M76m4n12
5795a28n29O61N26k7n94k58M21N02j71o12j40P14K75k95p42nP00K19q37R5r5N11
5817A91M34q73j67JP22Qn18k93N42M04r4n91o4M86R0km34l03N43K91l25m92J8
5840d26N92M38m73m87J42M99J84m95j45R8N05R0o09j31J28N62j23o41j40N85M70
5861F23k69m39j70L47M52j86p83J66N04Q7l60m78L56K41J90m02k71N2L75J55m99
5882c09n15O51N40l71n76p9M65M00j2n83J24L72K36m18n37j3O85N48n46n72K94
5903b16M28L11q49j73L39N87r7l64l21K19N34j34l52k28K38M51j02o55j03M03
$$ plain form
5753 44 181 340 5 -349 -312 279 386 28 -318 -86 393 654 67 -207 -57 214 464 -425 -331 143 311
5774 311 138 -363 -476 262 638 213 -144 -206 242 556 -149 -228 -251 306 441 -6 -667 -48 428 384 -128
5795 -128 -657 4 530 503 -91 -349 72 574 403 -209 -349 365 640 345 -397 -402 298 517 -320 -225 -320 191
5817 191 625 -248 -415 -414 308 316 -202 -495 47 451 357 -234 -298 188 278 276 -158 -461 82 373 48 -444 -426
5840 -426 166 604 131 -356 -214 285 469 -26 -171 -73 432 522 -87 -218 -90 472 349 -292 -432 153 623
5861 623 354 -85 -255 92 544 358 -425 -259 245 332 -28 -506 -150 91 281 -121 -392 -340 35 190 -309
5882 -309 -824 -173 367 -4 -580 -659 -194 206 194 -389 -265 107 343 -75 -612 -625 60 608 62 -510 -216
5903 -216 212 523 -326 -499 -160 427 330 -34 -355 -136 398 264 -88 -316 -78 373 271 -384 -487 -84
5923h4M27k73m06l83P45M51o71k72J30P16l6p01k38M20L68j01l74k31M52P2o6
5944e5k75m04M69P83l10m91J60K82L87n64k45O2M48J40n32k94J48O71j79k54j27
5965a80L9L46J14l85m64O19M75k31l33n85M89M71k44m79L3L40L85m09m59N0N93
5986A85L16n15k88M9O31R6m11k66M6M41K44n37j35J63M66l13m86pO15J03Rn91
6008a85K25L90m7k22j92j45L66L89m41m87k3N59K07n08p4m1L39L27o81j18J74
6029a88M34J06k96o18O55J33j06m41m8L57L25m03j81K8L53L44l91l21K16M73K88
6050G19o42m02N13L06N9n35k78K34M04R0m56j82L63J43j91k51Q3K59J50l09l12
6071b35J55M08j57J00m15R7M03Pn70r6K38K58O2m97M4L8L47j57q4k50L00N07l05
$$ plain form
5923 -84 343 70 -336 -719 26 477 -194 -466 -336 380 344 -357 -595 -175 193 92 -282 -513 -61 11 -55
5944 -55 -330 -734 -265 518 208 -283 -123 159 546 -18 -263 -201 247 387 -145 -439 -291 380 201 -53 -180
5965 -180 -141 205 319 -66 -530 89 564 333 0 -585 -96 375 131 -348 -315 25 410 1 -458 -408 185
5986 185 501 -14 -302 -253 378 474 63 -203 -157 284 528 -9 -144 19 485 172 -314 -321 294 397 406 -185
6008 -185 40 430 383 161 -31 -176 190 579 138 -349 -372 187 394 -114 -188 -229 110 437 -244 -362 -188
6029 -188 246 352 56 -562 93 226 120 -321 -369 -12 313 -90 -271 -243 110 454 63 -258 -42 431 719
6050 719 77 -325 188 494 553 18 -260 -26 378 468 12 -170 193 336 145 -106 -23 236 386 77 -235
6071 -235 -80 328 171 271 -144 -47 356 363 -207 -303 -65 193 255 -242 -198 -160 187 30 -54 -304 -4 503 198
6094A98o60J88M52K05l71n52K49M34M9p0k72M1L93k0l34K1J4K05L14l59j34j33
6116a42J81R3j91N0K27K6M4n47J46R4L56m40k47L37J31L30m39j61J1K33j72nj86
6139b71J17K00L0k26j13J71Q0K13l86J29j09M04k08k0j37K82lj26j74M3K81o3
6161A14l07OK6K93J2j96j74K65K7q3k5k32L61p5K21l42K01j82K83k14j57L4J2
6184a32J26M2r0j28L31k33J36j39KJ49L51l41l12J34J03o6J86j13p9J95j36m9
6206f3l0K0J59j7j81j4J27J00J31k38K28j68p6j30J31O8P6k12op4K22Lr8N6k47
6231b33L20J9Ml07R8N0K88k01KM2ol4J09q3o7m8L1J22l30M02k31J03k00J67j6
6256Apo1J23r3m1K85k42K38l12N9L5O5M5M1j04l62M68j3k77K09M9j37n4K39K22
$$ plain form
6094 198 -462 -274 178 383 12 -540 -291 143 192 122 -150 -109 284 264 -70 -49 -35 170 484 125 -9 -142
6116 -142 39 132 -59 -9 218 244 288 -259 -113 -19 337 -103 -350 -13 118 448 9 -152 -141 92 -80 -85 -271
6139 -271 -154 46 76 -150 -263 -92 -12 201 -185 -56 -165 239 31 11 -126 156 153 27 -147 -104 177 114
6161 114 -193 -187 -161 132 144 -52 -226 39 66 -17 -42 -274 87 12 233 -109 92 -90 193 -21 -178 -144 -132
6184 -132 -6 36 -54 -182 149 -84 52 -87 -85 64 415 74 -238 -104 -1 -67 119 6 -73 122 -14 -63
6206 -63 -93 -73 86 69 -112 -126 1 101 232 -6 222 54 -22 -152 -21 47 123 -89 -95 -169 53 56 -42 14 -233
6231 -233 87 106 110 -197 -99 -49 239 38 40 82 76 42 151 68 1 -47 -16 106 -224 178 -53 50 -150 17 1
6256 1 -6 -67 56 -37 -78 207 -35 203 -109 -50 -15 50 95 136 32 -330 138 125 -152 57 106 -31 -85 154 376
6281C76l52O2J92O8j17j52r6J37K2j85P5j8J28j72L2O0J88o0k36K24j51L1J79
6304B35j03j06j88M63j60L6l63J12J96l23K20q6K00j06k02M7j47K59J66m10O2
6325a98j1M20k06J1J07m03K34N5J75j57j89n3K41k24K18K5l1J73k4l80L59j17
6347B5N2j48p2K81q9m2j04j21K09K88m39J87j00L02r8k26j59P1M72q4j55l79L33
6370Dj05K08j01k92K72L8q9k99L30j40M17j86j58O8O4K47o77P1L42P1L0j78k67
6393c30N40J83l10k18l2K82O3l82K1o1P7M01j31m05K29J30K9L18n19k3M75j60
6415A77k82J5RM42l27n7P8j71J45J34r6j58J55M0j06k06j03J47J59J20k89K75
6437A01l4L01k85k86M8L59k7k92p7J8N21k06j06kO8J07J27n28n9L52J54j15k59
$$ plain form
6281 376 24 86 278 346 229 77 -19 118 140 -45 30 12 140 -32 0 60 248 188 -48 176 25 56 235
6304 235 132 26 -162 301 141 177 -186 -74 122 -201 19 -67 133 27 -175 -128 -275 -16 150 -260 -198
6325 -198 -209 211 5 16 123 -280 -46 9 184 27 -162 -215 26 -198 20 45 14 187 163 -217 142 25
6347 25 77 -71 -143 138 49 7 -97 -218 -9 279 -160 27 -73 229 131 -95 -254 -183 289 205 50 -329 4
6370 4 -101 107 6 -286 -14 24 -65 -364 -34 -174 243 57 -101 -33 31 278 -399 -328 14 85 115 -63 -330
6393 -330 210 393 83 -135 -167 115 178 -204 -183 -244 -167 234 103 -302 -73 57 86 404 -115 -138 337 177
6415 177 -105 -90 -81 361 34 -23 55 -116 29 163 67 -91 64 104 -2 -208 -311 -164 -5 115 -174 101
6437 101 67 368 83 -203 -155 204 177 -115 -192 -174 347 141 35 33 101 208 335 -193 -252 100 254 139 -120
6460a20j27L94j6n7k71M2K68J13k09l23J71J35J62k46j77J28K17K66m48K3J2J46
6482H3J92l82j9M8K27o7q5j12K69J32l7j56l30J55K60k4n16L07K34J82l03j30
6504g2OJ98K06l05k55L79K4L9l20J09J9J76j32l42J91J45K37j77k57j91K44K62
6526A84l0n58J38M68J52l80k33J82J61K7j18m08L44L53q2k66j2j15K98K89m57
6547f3p3K09K88j77l19Q0L01P7l23l70L81J27J03l23j50K51K49J48n10q3J63J29
6569A15L32p13R0L6L81q3k37j38K50J65k41j74M9K04p8J43l76L06j5M4j95Q2J73
6592A20M6j61j30K14k73N93k35m16m8N48j49q9p9r2J16L64k36k92J06L96p0j70
6614F3k79J31J85N4j08n32K21L72O3k27k60L49K27j41j76j35L51J61j93l35j05
$$ plain form
6460 -120 -247 147 131 74 -197 -155 113 226 17 -306 -135 0 162 -84 -261 -133 84 350 -98 -75 -63 83
6482 83 275 -107 -126 -78 149 82 -3 -115 154 286 249 93 -237 -82 178 154 -362 -55 179 361 58 -72
6504 -72 -66 132 338 33 -222 157 181 220 -100 9 28 204 72 -270 -79 66 303 126 -131 -322 -78 184
6526 184 154 -404 -266 202 354 -26 -259 -77 84 111 -7 -415 -71 282 200 -66 -78 -193 105 394 -63
6547 -63 -136 73 361 184 -135 -55 246 323 0 -370 11 138 241 -82 -232 19 268 416 -94 -177 -14 115
6569 115 447 -266 -176 -140 241 158 -79 -217 33 198 -43 -217 -168 36 -42 101 -275 31 16 60 -135 -53 120
6592 120 166 5 -125 89 -184 409 174 -242 -290 258 109 20 -59 -151 -35 329 93 -199 -93 303 233 63
6614 63 -216 -85 100 154 46 -486 -265 107 170 -57 -317 32 259 118 -58 -193 158 319 126 -209 -314
6635c14J68N17k76k67l5K59J8j29j17J69J83k31O6O5j87L25R6m10r4M36j98K26
6657B70n80K23J63k7j55k13j02O56Ol82J58J77j04Mm6J1k56K46p7j6j54K13j19
6680a04L04j51k33K83k44J59P0l24L58J84j03m72J68P6K27k73K33k83L3L03j49
6701F2j70N5j25M19m25J45N2K4L96m75j14J13O1j39n7q1L01L52l91K9M3j65L79
6724B89m50J51Q3N0O4j75j99LM75p7j02j66P0q9J52r9J42j61j31L45n9j1k10J61
6748E6N8r1j01K18k0r9j84J40J00J52k37k08L34k6Q8N3l54K49N0j03q6j74r7M22
6772A40j20K0m3n8r4Q8j37J32O9J60l93M5j3N5J90L94n49r4K00j25r7K20J38N7
6796A85j35j87J98j21J10K87m15J26J7J39j63n8P8j86J55j51N3j09K94j90J75
$$ plain form
6635 -314 -146 371 95 -172 -207 52 70 -59 -176 -7 176 -55 11 76 -111 214 310 -100 -194 242 44 270
6657 270 -310 -87 76 49 -106 -319 -421 235 241 -141 17 194 90 94 48 59 -197 49 -28 -44 -198 15 -104
6680 -104 200 49 -184 99 -145 14 84 -240 118 302 199 -273 -105 -29 198 -75 158 -125 -92 211 62
6701 62 -108 -53 -178 241 -184 -39 13 37 433 -42 -156 -43 18 -121 -178 -259 42 394 3 32 75 -90 289
6724 289 -161 -10 73 123 187 12 -187 -184 291 214 112 -54 16 -73 79 -20 122 -39 -170 175 116 105 -105 56
6748 56 114 23 -78 140 120 21 -163 -23 77 229 -8 -216 118 92 180 233 -121 128 178 75 -11 -185 -282 140
6772 140 20 40 -3 -61 -155 -67 -204 -72 -3 157 -236 -191 -204 -149 41 435 -114 -208 -8 -133 -230 -10 128 185
6796 185 50 -137 61 -60 50 337 -78 48 65 204 41 -17 61 -125 30 -121 -68 -177 117 -73 102
6817A02j97j47O24j89m6k13n4J13l8L06m07K25j51N7j00L8j3L9J30j77J82k19
6839a35K83j54M4k12R6N8J02j56K34j20P6k99K26j24j6K0j43P1j06L67j72j07
6861a67R4K5P7k90M58l84K80P9j09L6k34J87j76J14P3n0J57O7K1m12J62K3k37
6884b06J09L9NP3L9O7k89K66l42M11l33K37Nl58J82P6J09q7p0KNK00l4j32k1K
6910d5J20q9l1J85k9J68l20r1PJ18J26j46R2j90J66j88K34k43J29M3J06mj12K9
6934C5j31J72j37L06k23N4r8J60K5j31J43p3q0J53k60J00o7J15o7P5J4n6oO1K7
6959A11j79J88j92N0J34k63K34o3j74J35r2K51k31P3n8M0P0J12q9N7k09M0k3o2
6983a40J01n7r1J29L47l69q8k1J77j31J55L64n61L87k27lQ4q2O9k94K83j73J17
$$ plain form
6817 102 -95 -242 382 193 147 -66 -120 -7 -45 261 -146 79 -72 -15 -115 -77 -90 -51 79 -98 84 -135
6839 -135 148 -6 38 -174 -78 -20 82 -74 160 40 116 -183 43 -81 -97 -77 -220 -149 -255 112 -60 -167
6861 -167 -73 -48 29 -261 197 -187 93 172 63 99 -135 52 -124 -10 63 13 170 237 258 -154 8 31 -206
6884 -206 -97 -58 -53 20 59 126 -163 103 -239 172 -161 76 81 -277 -95 -19 90 3 -67 -65 -60 140 106 -26 -47 -45
6910 -45 75 -14 -45 140 111 279 -41 -132 -125 -7 119 -27 65 -125 41 -147 87 -156 -27 16 122 118 6 35
6934 35 -96 76 -61 245 22 76 -22 138 163 32 175 102 22 175 -85 15 -52 63 -4 71 85 29 23 84 111
6959 111 -68 120 -72 -22 112 -151 83 20 -154 -19 -111 140 -91 -18 -76 -36 34 146 57 114 -95 -55 -78 -140
6983 -140 -39 -96 -187 -58 289 -80 -168 -189 -12 -143 12 376 -185 202 -25 -28 56 -26 43 -251 32 -141 -24
7006b4Q1m7n4m3J63j19j96OM09J5j86m0rP5N6k05o3K63k8J71m45P3L79j82N1l58
7032b57L99k21J29L29n72M04j22Jk29R7j48K42m8O7l17J57M0p7L51k92j8K32M9
7055A96m07J11pJ36L8q7l49M14J46k83n2K6J00j02J30j20J3O4j72L68l11J18L2
7078Bk02L46j18k45L11J60k96J20j95K38K11l14j33L9M02K5k20j57L00J1j72j18
7100ej87M39j23K39m32L4J03k8J38m47K46k2N5N4k63J28K02J66k81oJ5J44l33
7123a64J39j5j57L63k53J67j91P4J4J93j98j07Q8J55j3j29j9K70O0j48m27L03
7145EK43m00K24J9j89J12J70k49j99L77J11K0j00l50J68J63N8k64O7J19o4J7k4
7168C4j62L11J03k46m00J14K82K93l27N5n1J83m5k52L6n7K89n2J22m83J92J61
$$ plain form
7006 -24 57 10 -44 -87 76 -43 -239 -233 176 191 5 -35 -44 31 87 -118 -181 82 54 225 -220 -147 232 50 101 -257
7032 -257 142 -79 50 379 -193 211 89 90 -139 -42 -190 52 4 71 -246 -89 -49 -126 225 -67 -85 147 196
7055 196 -211 -100 -107 29 67 -20 -369 45 191 -92 -144 -118 -18 -120 10 -110 -97 -33 -205 163 -148 -30 2
7078 2 -200 146 28 -217 94 254 -42 78 -117 121 332 18 -115 -76 326 351 131 -26 274 285 113 -5
7100 -5 -192 247 124 363 -69 -35 68 40 178 -269 -23 -45 10 64 -199 -71 131 297 16 10 25 169 -164
7123 -164 -25 -40 -197 166 -87 80 -111 -37 -23 170 -28 -135 -47 108 95 -34 -53 217 277 129 -298 5
7145 5 248 -152 72 91 -98 14 184 -65 -264 113 224 244 144 -206 -38 125 183 -81 -14 105 41 58 34
7168 34 -128 183 286 40 -360 -246 36 329 2 57 6 189 144 -108 -72 -129 160 108 230 -253 -61 100
7190A00n5j47J58l5j92Q2l5r4KM48k81k5R7k8o1J29l65K95J47k39r0j05K50K7
7214a7O4j20O9J23Q0j29k79mJ96L6Lj22K08J50j38m3j29k6K54m7o1j28J44J31
7238B15q8k72r4L19j24o8O0q7J34J98k9j78j97J12K58k0j46k77M55k0l6o9M9o2
7262C3K6k52p6L49J40k94j95P2L50P9J1l02J38j40J41qk76j03K76p3K10k68J26
7285c6qm6j51J5q9K51K33m18J08Q1K53j30m56M70j00p2L09j59J70j57j34Q4l72
7308c54R8P5K87q2q9J0R2Pr0K8QJ84m73K37j44j3L85m6l19J13K87j15k29K8N0
7333f5L4j2O0k54Q8J97M1j35K37j31jJ11k01L0PL61j37k01j70J26K35l00j66n9
7357c05K72K60j13n0l01J91K59l98k9K60j4Q7k1j26j8L7J32K8j71j86K58m9K25
$$ plain form
7190 100 45 -102 56 21 -171 -89 -124 -218 -216 232 -49 -74 23 -5 -66 63 -302 -7 140 -99 -189 -294 -44 -17
7214 -17 47 -73 -4 119 199 70 -209 -213 -17 19 22 -100 108 258 120 77 -52 -78 176 129 68 -60 84 215
7238 215 127 -145 -239 80 -44 -112 -52 -139 -5 193 164 -14 -211 -99 159 139 -7 -284 171 151 115 46 95 33
7262 33 59 -193 -269 80 220 -74 -269 -197 153 232 243 -59 79 -61 80 72 -204 -307 -31 -104 106 -162 -36
7285 -36 -44 -90 -241 -226 -315 -64 169 -249 -141 -60 193 63 -393 77 -23 -95 214 55 225 68 -66 18 -354
7308 -354 -256 -181 106 24 -65 -55 37 44 -46 -18 -10 174 -299 -62 -206 -219 166 120 -199 -86 201 86 -143 -115 -65
7333 -65 -31 -43 17 -237 -149 48 89 -46 191 60 59 170 -31 -1 6 367 230 29 -141 -15 220 -80 -246 -305
7357 -305 -33 227 114 64 -237 -46 213 -185 -214 46 32 119 98 -28 -46 -9 123 151 -20 -206 52 3 228
7380B28l34J06nJ33m43J26m6M88l56K2P7j2L24l56l7jJ27n2J68p9r0J36K03l51
7404b4J09j50R1N9l47O5L32j15M8K11l17K0Q3O0k45j9K80l2l18J2J39R9J65m15
7428b09M5j3N01q9m58N4L51r4K3k42j53L93M1k70j60J22n1K98j89oK21p4j37N7
7452c9K6K5K9j40r9J87o0J45m0j45k5K6J86k08j29J94L19l61R1q5J78L1l38K46
7476A4n1J80O2j96j12L5O3j90K54j80R6p1N9R1k73L9J65j3m0J23j46J27j13O9
7500hL8M2p8K58j57q1K08l16p2J40R6j00M4j58M27m21L59k78j10O3K47l21L29
7523A51M5k73R7p3Pj80J08N1K37k46K37k41J39k97L92n9l41K05K48k00q2L9J33
7546I7Qj17J74l07J42q9K92l34J32p0J45L4L0q9p6N4j7R7J1p1r7R3n3N7n6q3J69
$$ plain form
7380 228 -106 0 -5 128 -315 -189 -235 253 -103 -81 -4 -16 308 -48 -85 -86 41 -11 157 78 -12 124 327 -24
7404 -24 85 -65 26 85 -262 -197 135 20 68 279 -38 -18 65 125 -120 -139 141 109 -209 -197 -58 41 206 -209
7428 -209 -164 -177 324 235 -223 -169 182 88 111 -131 -284 109 150 -120 -280 -158 -209 89 -100 -106 115 41 -96 -39
7452 -39 -13 12 41 -99 -198 -11 -71 74 34 -111 -136 -110 76 -132 -261 -67 252 -109 -18 -103 75 106 -232 14
7476 14 -37 143 205 9 -103 -68 -5 -195 59 -121 -25 -96 -37 54 -219 -180 -15 -28 -68 55 -91 36 -77 -8
7500 -8 30 72 -6 252 95 14 222 -94 -166 -26 70 -30 14 -144 283 -138 221 -57 -167 -104 143 -178 151
7523 151 196 -77 20 -53 -46 -226 -118 -67 170 -76 161 -80 59 -238 154 95 -246 -41 207 7 -75 -36 97
7546 97 105 -12 162 -145 -3 -92 200 -134 -2 -72 73 107 137 48 -28 26 9 106 117 46 -51 42 -11 46 -10 -93 76
7573G6j5j65O8q3L34k25K35l04Q0Q0P1k32j26J06q6K50o0m9L6K11pl35K98k82
7597a24p7K64k3j6L7K10J63o58K97J7k9J58m54L39q6J93K3j55k26L53l72Q4j22
7620b04O8J58j2J20j74kP0m8L5j07M52l35j9j47J16j40J68L4k23Q4QK21k23Q3
7644a7k94L09J35k09J51j41N7k1M4J0o2K72j14m2k34n0L16L4m29M50j97P8P5k93
7668a72pK16P9r6K59k11j14PQ4k4M8l72M51j19k84M3J11K11o2K9k50O1K27J17
7692B32k66N1J48Kk6j50K7J06q3k79J26l3N4L17k27j16M19m03J32J34j91K32k25
7715a9q2J4R1j16K74l90J63J07J36L7l58J49m2J8K46k42J5M5j15p2R6r4J10Q6
7739E7j18J83m30J17l4J74R9R9m8o2p1%j12J92j9j83J16L01R8k47j36n2O0K23
$$ plain form
7573 76 61 -104 -36 -119 215 -10 225 -79 1 81 152 -80 -206 -100 -186 64 4 -45 -9 202 195 -140 158 -124
7597 -124 -201 63 40 24 61 271 434 -224 73 90 61 219 -235 104 18 211 234 79 -147 206 -166 -82 -204
7620 -204 -136 22 10 130 -44 -46 24 -24 11 -96 356 21 2 -145 -29 -169 -1 33 -190 -106 -98 123 -100 -17
7644 -17 -311 -2 133 -76 75 -66 -9 -30 14 24 -38 234 120 78 -156 -206 110 144 -285 165 -32 46 121 -172
7668 -172 -179 37 116 20 279 68 -46 -39 45 21 69 -303 148 29 -255 -212 -101 110 48 77 -173 -112 115 232
7692 232 -34 17 165 167 141 -9 18 124 41 -238 -112 -145 -91 226 -1 -117 302 -101 31 165 -26 206 -19
7715 -19 -101 -87 4 -112 162 -228 -65 42 178 215 -143 6 -36 -18 228 -14 1 46 -69 -141 -45 -139 -29 57
7739 57 -61 122 -308 -191 -225 -51 48 147 99 37 -34 -34 -146 46 27 -156 -40 261 359 112 -24 -76 -16 207
7763B07M8m53K75o8K11m06L8L3J44J07k45Q8K30j60J44k78R6MJ66o7j62l7K69
7786A84j11m5j56JL33l37M3j25L06J14l26K7j45K63K37l45j75O7J97K5Jj26JK39
7810A47J19k61P4k11K00k06m7J85j61N27k35N5l86J30J16n5q2j80L07K71j81n13
7832c87J44J83J93j4p2k93M21oj15q8p9K57K8l70L31k76L52Q6l30J8m5J60l8k82
7856b22J03l7K33J29m65K21J9K3J9k23K12M6R3o0l10P7J59L49j97l06Q4J73j61
7879d1m3J10k62K96M6r7p6J98Lj99q8J7K75MJ90n38J99L4J47O2m16lK28k2j86
7904a62M4Q3O2K12j43k88j63Q21k77k58m9K12j25r2P2o3J06N4j88J61q2r2K99
7927A44o9j73k64L84K00j77k90O1K22Q5k1m46K81j49J58J03j76n3L44j22n7k07
$$ plain form
7763 207 255 -198 77 9 220 -186 -148 -115 29 136 -109 -21 209 49 193 -85 11 15 181 114 -48 -85 184
7786 184 73 28 -128 -127 206 -131 -88 -213 93 207 -119 -92 -237 26 263 -82 -257 -190 7 32 33 -93 -92 147
7810 147 266 5 79 -132 68 -138 -185 0 -161 366 131 186 -200 -70 46 -9 -91 -271 36 307 126 -387
7832 -387 -243 -60 133 119 47 -246 175 169 54 -34 -113 144 172 -198 133 -143 209 295 -35 -17 -62 98 60 -222
7856 -222 -119 -156 77 206 -259 -38 -19 4 23 -200 12 58 151 91 -219 -142 17 366 169 -137 -53 120 -41
7879 -41 -84 26 -236 60 106 9 -67 131 134 -65 -153 -136 139 143 333 -205 -6 28 175 237 -179 -182 46 24 -162
7904 -162 -118 -35 27 239 96 -192 -355 466 189 -69 -118 94 -31 -123 -51 -114 -8 46 -142 19 -63 -155 144
7927 144 75 -98 -362 22 222 45 -245 -184 38 123 102 -344 -63 -212 -54 49 -127 -180 164 42 -15 -222
7949b22J08J37l1K0J7O3m2M8l87j8M04M6j14n02L73M05r3l21j09J38K48p0k29
7972a31K7J24j53J83q1O1k7l0J66j72oJ13J3L8k34L6J60j06R3K3k89J54K43l4
7996A71lk68L08k38P4j31n7M33o7j76k10K9J80Q8l66J71K10j8j32l15J18K14l6
8019b1J25k77k3L79k87J38m9j47J94ON9k51K53k14J41j67J67O1J64k71J08j60
8041g2O2J59L2k15o4J33j6p8K64k21L0J7jo4j28J35K81k1l31n1K92r5q5r3K20
8066I0L5J9k30R1OJ13m1k94K58Klj75O9j9J01K84j20k20K01k15P0k5k82K49J56
8091A20l2j88j2M05j78K1k87K35L0m9o9j36q5L25mr7J7j38Q6J77j24o8r0K36r9
8116dj65K29J5Mj01k24P3J91nn0P2j00J2l1K03l71L89%J0k59J60P8j49K76k25
$$ plain form
7949 -222 -114 23 -8 12 29 92 50 98 -289 -307 97 143 29 -473 -100 305 212 -109 -218 -80 168 98 -131
7972 -131 -104 20 -133 50 -31 30 3 -27 139 -33 -39 74 87 125 -109 -73 87 -19 74 97 -192 -38 205 171
7996 171 168 -100 208 -30 44 -87 -144 289 222 46 -164 -135 45 133 -233 -62 148 130 -2 -317 -199 15 -21
8019 -21 104 -173 -196 183 -104 34 -15 -162 32 38 97 -154 99 -115 26 -141 26 87 251 -20 88 -72
8041 -72 -10 149 181 -34 -98 35 19 -59 205 -16 14 31 30 -34 -162 -27 254 233 -98 -149 143 48 -37 -130 90
8066 90 125 144 -86 5 11 124 83 -211 47 49 46 -129 -60 -79 22 306 186 -34 167 -48 22 -3 -285 -36 120
8091 120 88 -100 -112 293 115 136 -151 84 114 65 -4 -140 -225 100 96 -1 16 -122 -36 141 17 -51 -141 95 -4
8116 -4 -169 60 75 79 -22 -246 -173 18 13 -37 35 -65 -53 -84 119 -252 137 137 147 -112 48 126 -23 253 28
8141B8j20n9J20K47k89M73m95J1J63Rpj47J53L4K9o2M3j2k37J17J46l64L21k50
8165a48l5M9PJ43k38K43K26l35K91j74j99Q0K24J99k77J68k45J32J9K22k22r9
8187C1lj10q7J09
$$ plain form
8141 28 -92 -151 -31 216 -73 400 -95 -84 79 88 81 -66 87 121 150 88 131 119 -118 -1 145 -219 102 -148
8165 -148 -183 -134 -127 16 -222 21 247 -88 203 29 -170 -90 134 333 56 224 -21 111 130 352 130 31
8187 31 28 -82 -169 -60
8191f0
$$ Imaginary data points
##PAGE= N=2
##DATA TABLE= (X++(I..I)), XYDATA
0@%%%%%%%%oJ4j6J6k4L2m0M8n6P2q8J04j28J52j76K12k52K94l42L97m57N26o05
31c23O89p80Q85j003J130j269J424j594J777j979K201k441K704k994L311l654
47a916M028m442M894n390N938o542P216p971Q817r778J0882j2159J3654j5439
61h208J7615k0334K3844k8575L5337m5857O4654j08579M05498L00190m97733l9915
73I7937J61906K84034j68505l66494q5896K94047J73423j60108l65644K7744L21834
84B14278J27438k20842k86301O8129L32116M8929k70841k25148J11035K87747
94A86540L0875l30374j51410J90964K61832j7883k88853r1608K61978K46748o7091
105B31718k58187m3940L01697J92819j44912k32218k1400K92173J38947k20397
$$ plain form
0 0 0 0 0 0 0 0 0 0 -6 8 -8 8 -16 16 -24 24 -32 40 -48 56 -72 80 -96 116 -136 158 -184 213 -244 282 -323
31 -323 366 -414 471 -532 598 -671 753 -841 936 -1043 1158 -1283 1421 -1573 1738 -1916
47 -1916 2112 -2330 2564 -2826 3112 -3430 3786 -4185 4632 -5146 5736 -6423 7231 -8208
61 -8208 9407 -10927 12917 -15658 19679 -26178 38476 -70103 335395 635585 137852 97937
73 97937 259843 543877 375372 8878 -77018 217029 390452 230344 -135300 -107556 214278
84 214278 341716 120874 -165427 -97298 234818 283747 12906 -212242 -101207 186540
94 186540 217415 -112959 -264369 -73405 188427 170544 -118309 -209917 52061 298809 231718
105 231718 -26469 -70409 231288 424107 279195 46977 25577 317750 456697 236300
115B36300k21804M9240K53743R7285k38253k05851J27243K42864M4336k48255
125A36848j59206J70559K11843k0043k55599j36435J84604J90432j15362k49587
135d1946q3429J76801J73856j52917k44260o369K11302J31013j53118k13831N2442
146a50456K38928Q6036j73250j95526J07787K28658J5766j89768j65173J25241
156g1757K27477l4835k23056q7740J50256K05301n2154k29533k9419J90580J69555
167B14675r4003k10399M721J99546J16649j33852k03965K5878K12482M7365j66259
178A2838j63213N1147K07692K3140j88843j21537J11019J82175j185j90633q6726
189a64126J46133J54845m1003k01175m8007J61732J14772q2696j83148k3090J76867
$$ plain form
115 236300 14496 63736 317479 414764 176511 -29340 97903 340767 385103 136848
125 136848 -22358 148201 360044 340001 84402 -52033 132571 323003 207641 -41946
135 -41946 -125375 51426 225282 72365 -171895 -178264 33038 164051 10933 -202898 -150456
146 -150456 88472 174508 1258 -194268 -86481 142177 157943 -31825 -196998 -71757
156 -71757 155720 120885 -102171 -189911 -39655 165646 113492 -116041 -145460 45120 214675
167 214675 120672 -89727 -85006 114540 231189 97337 -106628 -80750 131732 179097 12838
178 12838 -150375 -99228 108464 131604 -57239 -178776 -67757 114418 113233 -77400 -164126
189 -164126 -17993 136852 95849 -105326 -153333 8399 123171 40475 -142673 -165763 11104
200A1104R9703j30318j43850K5221J75048P8437j42633j22310O5607J73305L1875
211A21189j52561j02037R2600J43894p478j56739r1535J23804J16898m8026j41378
222a01369n4393J26273J13609o9706j41563N79J27083Q8144q5259j27670K3845
233a00427J26787O3312j11526j12065M9306J23368K5557j08702r6086O7373J38802
244F5699j2286j08642n8537Q3004J25113k2385j18298l6038J06108R5506m5165
255G4079j20384j0349J04577P0953o0936j22971J6496J11047M1983p8223r5447
266f9175K6867J14412K7466j02856o6909M6119J01538K043j04236n3861N9725
277a8867R2925k5334j06386l1801Q0240O5633l5050r5488j8659J01796M8725n4809
$$ plain form
200 11104 110807 -19511 -163361 -138140 36908 115345 -27288 -149598 -83991 89314 121189
211 121189 -31372 -133409 -40809 103085 95607 -61132 -152667 -28863 88035 40009 -101369
222 -101369 -155762 -29489 84120 14414 -127149 -126570 513 88657 3398 -124272 -100427
233 -100427 26360 89672 -21854 -133919 -84613 38755 64312 -44390 -140476 -73103 65699
244 65699 53413 -55229 -113766 -30762 94351 71966 -46332 -82370 23738 119244 74079
255 74079 -46305 -56654 47923 118876 57940 -65031 -48535 62512 104495 26272 -69175
266 -69175 -42308 72104 99570 -3286 -70195 -24076 77462 79505 -24731 -78592 -18867
277 -18867 74058 48724 -57662 -89463 -9223 56410 21360 -74128 -92787 9009 57734 2925
289B925p7362R951R3709M1193o7403o8964L7342Q5371K1180p7432m6452M6418
301D76P4259Q347q2707l2975O2975O1297j9777o3756k4763O3035N7363m1586n7944
314D244n533O0003L5795m2475n5409N741N9080J9835n0227m8423K5504M2078Q813
327E9026m4737m5633L3356M3910q802m4749k2096K6775M3075j1999m6392o580
339b4846L1828L5357k0819l3585j339L0261K9583k2193l5704P473L5136O207j4369
352B2990l0156M786L7889J699k1564j9390J2942K5141L823k2966j4994J3691K2148
365C6039k138l0335j436O953J2129k158k9382n543J6380N786j2205j0688p430
378b4028J7785R559j2030o385J460J9949P49p107j705K049J1190M170j2061l391
$$ plain form
289 2925 -74437 -64486 29223 70416 3013 -65951 -28609 56762 77942 510 -45942 476
301 476 74735 83082 375 -32600 30375 91672 71895 8139 -16624 46411 103774 62188 4244
314 4244 -1289 58714 94509 52034 -3375 2366 61446 81281 31054 -17369 8135 50213 59026
327 59026 14289 -31344 2012 45922 37120 -7629 -29725 -2950 40125 28126 -18266 -24846
339 -24846 6982 42339 21520 -12065 -13404 16857 46440 24247 -11457 -3984 31152 37359 22990
352 22990 -7166 -2380 35509 37208 15644 -3746 9196 34337 38160 15194 200 13891 36039
365 36039 33901 3566 2130 9083 21212 19054 -10328 -15871 509 6295 -5910 -16598 -24028
378 -24028 -6243 3316 -8714 -15099 -13639 6310 7059 -48 -1753 296 11486 15656 3595 204
392B04J2814m686M637l415m910J2454N21j110J861P220J377P71j117N909J216
407C3746m332k078j1404J0742l134j8056o615j642J685j001j6831j5374J6280
420a8014N236o073j4624o167J9971Q360p993k0845j86K4143Q013k4426j5435P011
434d1029J9828J4299l2595j3993K5746K6614M087k2679p078L2197L7169p096k4263
447A1207k648M0656K6783k1482k5729m521L9740K0379l5177l4205J3874L3447
459F2324J1210l1908l8761K6384M0141L04m1273k6843K9261L5123j0638n0728
471D596k4341L0536L4777l3068n1385j0821K9865L5925l4544n3242P327M9386
483a4989K3976l0761m2002J5973N9694J6892l6739m1117K9510N6670J971m2501
$$ plain form
392 204 13018 8332 12969 9554 4644 17098 17619 16509 18370 25590 26967 27738 26621 32530 33746
407 33746 29414 27336 15932 26674 23540 5484 -1131 -2773 -1088 -2089 -18920 -34294 -18014
420 -18014 -12778 -18851 -33475 -39642 -19671 -11311 -19304 -40149 -40335 -16192 -8179 -32605 -48040 -41029
434 -41029 -21201 -6902 -39497 -53490 -27744 -1130 2957 -19722 -26800 5397 42566 35470 11207
447 11207 8559 49215 75998 54516 28787 24266 64006 84385 49208 15003 28877 62324
459 62324 73534 41626 2865 29249 69390 69694 28421 1578 30839 65962 55324 4596
471 4596 -19745 10791 45568 12500 -38885 -49706 -19841 16084 -18460 -71702 -64375 -14989
483 -14989 8987 -21774 -63776 -47803 11891 28783 -7956 -49073 -19563 37107 39078 -3423
495c423l4207L2789N7677m021n5451j2824M2532N1410m275n6711m921N5869M7117
508A11561k4104n5238J3N6588L1800m1509n9421J205O4056J1923n6514m9959J1214
521A615O4413R933o5860m4059L9755N8476j095o6520l5298N0995N4258j6014p7214
534b6615k1148N9596M3652l3643p1166r574O9737M5309n3516n6948J5583P3992
546C5259L7943n6810n3530L3069Q1706J3380o7005m7151M5151P1837o044p6321
558A1484m3793O4004O3211k8584p5350k2754P0148O1729m1481q1902N658P6485
570E8855M4447n6533p7159J8315P7107K7684p6301o8990L4490P7054M593p6593
582a3031n5908M7997Q6305j4897p7991l1108O2695P6466k2907q1692j8412P6863
$$ plain form
495 -3423 -37630 -4841 52836 48815 -6636 -19460 23072 74482 70207 13496 8575 64444 111561
508 111561 87457 32219 32232 88820 120620 79111 19690 20895 84951 96874 40360 -9599 1615
521 1615 66028 75961 10101 -33958 5797 64273 63178 -3342 -38640 12355 66613 50599 -26615
534 -26615 -47763 11833 55485 21842 -49324 -58898 10839 56148 2632 -54316 -38733 35259
546 35259 73202 16392 -37138 -4069 77637 91017 24012 -23139 22012 93849 87805 11484
558 11484 -32309 31695 94906 66322 -9028 -31782 38366 100095 58614 -23288 -17630 58855
570 58855 103302 46769 -30390 -12075 65032 92716 16415 -52575 -18085 58969 63562 -13031
582 -13031 -68939 -20942 65363 50466 -27525 -58633 4062 80528 57621 -24071 -42483 34380
594C4380N9175m0340q3728j683P7821M3086n1575q3946J6528Q5904K7218o4973
606A7867o5352K8530Q8470J8625q3124n1636M5839Q0746l775q8304m4057N6022
618a49P4494k5571r3134k9102P3180N8905l6509q6589j4810Q9691N1021n3923
630G504p7256R754Q7318M1316o5925p6006L1072Q6828K1197q0252o0365M4357
642c0458Q3933O287q7940m6775O4882Q1236j8017q3266l0891P4807P7037m0787
654E0048q7757j0585Q2847N4866n5935q8077N022Q9059L6779p2431q1701L1080
666d6785Q6916J9602p8641o9715M9317Q9352k189q7907m5382N7820Q1584j7405
678C6567r4846k8845P2035P0136l9258q7623j0382Q1123N8279n1509q2385J0480
$$ plain form
594 34380 93555 53215 -30513 -32196 45625 88711 37136 -46810 -30282 55622 82840 17867
606 17867 -47485 -18955 69515 88140 5016 -46620 -781 79965 76190 -12114 -56171 -149
618 -149 74345 48774 -44360 -73462 -282 58623 22114 -64475 -79285 10406 61427 7504
630 7504 -69752 -59998 27320 68636 2711 -73295 -42223 44605 65802 -14450 -74815 -30458
642 -30458 53475 59762 -28178 -74953 -10071 71165 53148 -30118 -61009 13798 90835 50048
654 50048 -37709 -48294 34553 89419 33484 -54593 -49571 39488 76267 3836 -77865 -46785
666 -46785 40131 59733 -18908 -88623 -39306 50046 47857 -40050 -85432 -27612 53972 36567
678 36567 -58279 -87124 -15089 55047 15789 -71834 -82216 -1093 57186 5677 -76708 -66228
690f6228R2646L5955o0353p0615K4723R4628K0812p7371o0040M6674Q1850L681
702F6362q4114m8077N9782P6451j5684r0099k6250O9635O5215l1146q7235j2895
714e8055P9974N3992n3913p6531K338Q0544M0227o4852p2767K0617Q4613J9164
726E5351p0001o0916L6831Q1760P137p6492m9231N7389P2505q888p7099l4644
738f6298O5604O9246k7911q2724j0904P0533N7009m2262p8570L537P9336M3811
750H0407o0405o8347K0967Q0601K5644o7321o2711L6566Q3298J261p3777m7511
762e1328M7845P5181j2118q1129l2659O3597O1387k6600q0132j4799O9380N2528
774G1153m0998p8825O274P4128L6190n3130o6272J6883P8531K2766o7826n1120
$$ plain form
690 -66228 26418 62373 2020 -68595 -43872 50756 71568 -5803 -65843 -19169 62681 66362
702 66362 -17752 -65829 -6047 70404 54720 -35379 -61629 8006 73221 42075 -45160 -58055
714 -58055 21919 75911 21998 -54533 -52195 28349 68576 3724 -69043 -48426 36187 55351
726 55351 -14650 -75566 -38735 43025 50162 -26330 -75561 -18172 54333 45445 -31654 -66298
738 -66298 -694 68552 40641 -42083 -52987 17546 74555 32293 -46277 -42740 36596 80407
750 80407 20002 -48345 -27378 53223 78867 11546 -51165 -14599 68699 69960 -3817 -51328
762 -51328 -3483 71698 59580 -21549 -54208 9389 70776 44176 -35956 -50755 18625 71153
774 71153 30155 -48670 -42396 31732 67922 14792 -51480 -34597 43934 66700 -1126 -52246
786e2246L2335P4284O268p1039m2091M8313O9831j3981p2120k6283N8526N6529
798F8326k4356p3336j3221O9832M2173m0244o6180K880O7685L3624n2088o0953
810d5858K0522O5517J7991n8637m8201K8102O4902N680o5977l5759M1139N7762
822D7183r787o0925k7788M9784N3700k4568n9424j2625N4951M1312l0281n9137
834c7605l99O0815K9331m1333n2529J5215N6180K1586m8488m7993K8057N6982
846C9819N724n3787l4600L1681N5666o544n8930k3893M1272M6522k0329n4217
858c1616j5919M6553M0332l0279n4084r86N1358K5892l2579n0482Q997N5023J5583
871B7793m2108m0839K1610M8377R110m7004l3270L1431M7675m715m9498j7477
$$ plain form
786 -52246 -19911 54373 60641 -10398 -52489 -4176 65655 51674 -20446 -46729 11797 68326
798 68326 43970 -29366 -42587 27245 69418 29174 -37006 -34126 33559 67183 15095 -45858
810 -45858 -25336 40181 58172 -465 -48666 -20564 44338 50018 -15959 -51718 -10579 47183
822 47183 37396 -23529 -51317 -1533 52167 27599 -31825 -44450 10501 51813 21532 -37605
834 -37605 -38004 22811 52142 10809 -41720 -26505 29675 51261 2773 -45220 -17163 39819
846 39819 45543 -8244 -42844 -11163 44503 37959 -20971 -44864 -3592 42930 22601 -31616
858 -31616 -47535 -982 39350 9071 -45013 -45999 5359 31251 -1328 -51810 -42813 12210 27793
871 27793 -14315 -55154 -33544 14833 23943 -23061 -56331 -24900 22775 18060 -31438 -48915
883d8915L4788M3497j2859n0411p477M3538L3782k4940m2644j231M6365K4936
895C8429l3306l9869R868M6360J0219l4491l4120J7233M4329K933m0814k4314
907c7543K6934L4703k510m1470j7194L1511L0834j3605m0291n413L0586K5395
919B1937j9099l6250J99L6099J7773k6471k5655N413L5309J2887k8244k3707J5412
932a4397L3040K789k6569j9941J9893K8991j640k9809j3616K5592K1699n783k7603
945g354q819K5930K2407j4614k6482J120K2007J8118j6721k4816K744K5235J1189
958B9944k1687j8893N768K3682N907j9960j9198J2862K3620k707j6895j3918J4123
971B648K1444k859k2096o071J7793J5010n062k0455j449J7329J4394j0593j8622
$$ plain form
883 -48915 -14127 29370 16511 -33900 -41377 2161 35943 11003 -31641 -32872 13493 38429
895 38429 5123 -34746 -24878 21482 31701 -2790 -36910 -19677 24652 27585 -13229 -37543
907 -37543 -10609 24094 21584 -19886 -37080 -5569 25265 11660 -28631 -34044 -3458 21937
919 21937 2838 -33412 -33213 2886 20659 -5812 -31467 -26054 9255 22142 -6102 -29809 -14397
932 -14397 18643 21432 -5137 -25078 -5185 23806 22166 -7643 -21259 4333 26032 20249 -7354
945 -7354 -16173 9757 32164 17550 -8932 -7812 14195 32313 15592 -9224 -6480 18755 29944
958 29944 8257 -10636 -4868 18814 24721 4761 -14437 -1575 22045 19338 2443 -11475 2648
971 2648 24092 21233 -863 -6934 10859 25869 20807 352 -1097 16232 30626 20033 1411
984A411N323J6782Q966j1079j4451L927K0469L083j4948q257N403J6253n19j3709
998A8654q910R450J2053m884j2731m749R257O101k927j4565j647J1109J445n976
1012A1680q783j77O921M051r401o288M317M643J007o730j929J727O579l33o734
1027E50J289L761K069k92n60k565N871J750k531J909K52J851L62K044j028J381
1043A6113J045j179R04J574K8m654K231m57k99l74n928o51K920O12o890j751j144
1060B100L306Q21p059l827J656O073m074o552l110L424M496k846q281l717R143
1075h447J933l634o905p56R034M814n257p968N035Q848L530o510n911L752J0303
1090A861L318j2397l902O077Q926J51j0597o245Q500J2256n306j0313l745J0201
$$ plain form
984 1411 6734 23516 32482 21403 6952 10879 31348 34431 19483 11226 16629 32882 32363 18654
998 18654 9744 19194 31247 26363 13632 8883 18140 24241 21314 6749 5102 16211 17656 11680
1012 11680 2897 2720 9641 13692 4291 -1997 2320 6963 7970 1240 -689 1038 7617 7284 550
1027 550 1839 5600 7669 7377 6817 4252 10123 11873 9342 11251 11503 13354 13716 15760 14732 16113
1043 16113 17158 15979 16883 18457 18485 13831 16062 15605 15306 14932 9004 8353 11273 11885 4995 3244 2100
1060 2100 5406 6227 -832 -4659 -3003 3070 -1004 -7556 -10666 -7242 -2746 -5592 -13873 -17590 -8447
1075 -8447 -6514 -10148 -17053 -17809 -8775 -3961 -9218 -17186 -12151 -3303 227 -6283 -12194 -8442 1861
1090 1861 5179 -7218 -11120 -5043 3883 4034 -6563 -12808 -4308 7948 2642 -7671 -11416 -1215
1104a215J0459m883j3917l126J5177O426q922j4117j19J2877P570j2448j6923
1117b3161O508J4507M812j4037j2880P517J8995K609j8827q046J1567J7861k448
1130D977j8081r050J5287J8784r742j9718m167J8848J4405j0096k1582Q1K4786
1143D732J0468j4533j9323O162K3051R384j9968k0610J2512K3218J980k4666j4494
1156b2087J4182K3276k764k8219r011K0874K1558r532k4986n404K5916J9935j7158
1169F580k5030K423K7724J1761j8790k5083P168L0019O288k4494k0613J5452K6896
1182B0301L362k6708j6475K1916K6817m403k8387q557K1964K4626j0163l1602
1194g309l792K6506J9491j8530k7476n28K9830J5399k3252k6660Q696L1675O855
$$ plain form
1104 -1215 9244 4361 -9556 -12682 2495 8921 -1 -14118 -14237 -1360 6210 -6238 -23161
1117 -23161 -16653 -2146 2666 -11371 -24251 -16734 2261 4870 -13957 -22003 -10436 7425 4977
1130 4977 -13104 -22154 -6867 11917 2175 -17543 -21710 -2862 11543 1447 -20135 -20054 4732
1143 4732 15200 667 -18656 -12494 10557 19941 -27 -20637 -8125 15093 17073 -7593 -22087
1156 -22087 -7905 15371 12607 -15612 -24623 -3749 17809 8277 -16709 -22113 3803 23738 6580
1169 6580 -18450 -16027 11697 23458 4668 -20415 -13247 16772 23060 -1434 -22047 -6595 20301
1182 20301 23663 -3045 -19520 2396 29213 24810 -3577 -12134 9830 34456 24293 -7309
1194 -7309 -11101 15405 34896 16366 -11110 -11638 18192 33591 10339 -16321 -7625 24050 30905
1207C0905k3600k4008J3757L2523J405l0786j8209K0907K6990l433l3197j3608
1219b0354K6185K5409j1327l3256m382K7696K3652j6430l2697P04L3579J7679
1231C6458k4274k7443N208L4241J2201k9558k6813J3959L4728K534l1046k3152
1243b2957K0942L3907l238l5631j5940K9532K8176r940l6654q952L3362K6214
$$ plain form
1207 30905 7305 -16703 -2946 29577 30982 196 -18013 2894 29884 26451 -6746 -20354
1219 -20354 5831 31240 19913 -13343 -17725 9971 33623 17193 -15504 -14800 18779 36458
1231 36458 12184 -15259 -10051 24190 36391 6833 -19980 -6021 28707 31241 195 -22957
1243 -22957 -2015 31892 28654 -6977 -22917 6615 34791 24851 -11803 -20755 12607 38821
$$ [...]
8191D0
##END NTUPLES=NMR FID
##END=
