##TITLE=1H_SA_sl.Et_1
 CDCl3, 8 sc, 
 1.9.2020
##JCAMPDX= 6.0         $$ Bruker NMR JCAMP-DX V2.0
##DATA TYPE= NMR FID
##DATA CLASS= NTUPLES
##ORIGIN= UXNMR, Bruker Analytische Messtechnik GmbH
##OWNER= root
$$ XWIN-NMR		Version 3.5
$$ Tue Sep  1 11:51:19 2020 Russian Standard Time (UT+4h)  she@DPX200
##.OBSERVE FREQUENCY= 200.1315066352
##.OBSERVE NUCLEUS= ^1H
##.DELAY= (6, 6)
##.ACQUISITION MODE= SIMULTANEOUS
##.ACQUISITION SCHEME= undefined
##.AVERAGES= 8
##.DIGITISER RES= 18
##SPECTROMETER/DATA SYSTEM= spect
##.PULSE SEQUENCE= zg30
##.SOLVENT NAME= CDCl3
##.SHIFT REFERENCE= (INTERNAL, CDCl3, 0, 15.7039)
##AUDIT TRAIL= $$ (NUMBER, WHEN, WHO, WHERE, WHAT)
$$ ##TITLE= Audit trail, XWIN-NMR		Version 3.5
$$ ##JCAMPDX= 5.01
$$ ##ORIGIN= Bruker BioSpin GmbH
$$ ##OWNER= she
$$ F:/spectra/data/she/nmr/H-F/1/audita.txt
$$ ##AUDIT TRAIL=  $$ (NUMBER, WHEN, WHO, WHERE, WHAT)
(   1,<2020-09-01 11:49:31.37 +0400>,<she>,<DPX200>,
      <created by zg, POWCHK disabled, PULCHK disabled
       configuration hash MD5:
       00 E9 B6 7A A2 85 ED C7 34 08 36 98 17 FE 4E 26
       data hash MD5: 16K
       C9 8E 2C D3 10 26 6F AB A2 B9 FB E9 DF 89 EF 30>)
$$ ##END=
$$ 
$$ hash MD5
$$ 6D 9D 44 E1 84 C4 9C 1E F5 D5 3E A9 38 A1 A9 E6
##$RELAX= 
##$RELAX= 
##$RELAX= 
##$RELAX= 
##$RELAX= 
##$RELAX= 
$$ Bruker specific parameters
$$ --------------------------
##$DU= <F:/spectra>
##$EXPNO= 1
##$NAME= <H-F>
##$PROCNO= 1
##$TYPE= <nmr>
##$USER= <she>
##$AMP= (0..31)
100 100 100 100 100 100 100 100 100 100 100 100 100 100 100 100 100 100 
100 100 100 100 100 100 100 100 100 100 100 100 100 100 
##$AQSEQ= 0
##$AQ_mod= 1
##$AUNM= <au_zg>
##$AUTOPOS= <>
##$BF1= 200.13
##$BF2= 200.13
##$BF3= 200.13
##$BF4= 200.13
##$BF5= 200.13
##$BF6= 200.13
##$BF7= 200.13
##$BF8= 200.13
##$BYTORDA= 1
##$CFDGTYP= 0
##$CFRGTYP= 5
##$CHEMSTR= <none>
##$CNST= (0..31)
1 1 145 1 1 1 1 1 1 1 1 1 1 1 1 1 1 1 1 1 1 1 1 1 1 1 1 1 1 1 1 1 
##$CPDPRG= <>
##$CPDPRG1= <>
##$CPDPRG2= <>
##$CPDPRG3= <>
##$CPDPRG4= <mlev>
##$CPDPRG5= <mlev>
##$CPDPRG6= <mlev>
##$CPDPRG7= <mlev>
##$CPDPRG8= <mlev>
##$CPDPRGB= <>
##$CPDPRGT= <>
##$D= (0..31)
0 1.2 0 0 0 0 0 0 0 0.06 0 0.03 0 0 0 0 0.0002 0 0 0 0 0 0 0 0 0 0 0 0 
0 0 0 
##$DATE= 1598946570
##$DBL= (0..7)
120 120 120 120 120 120 120 120 
##$DBP= (0..7)
150 150 150 150 150 150 150 150 
##$DBP07= 0
##$DBPNAM0= <>
##$DBPNAM1= <>
##$DBPNAM2= <>
##$DBPNAM3= <>
##$DBPNAM4= <>
##$DBPNAM5= <>
##$DBPNAM6= <>
##$DBPNAM7= <>
##$DBPOAL= (0..7)
0.5 0.5 0.5 0.5 0.5 0.5 0.5 0.5 
##$DBPOFFS= (0..7)
0 0 0 0 0 0 0 0 
##$DE= 6
##$DECBNUC= <off>
##$DECIM= 32
##$DECNUC= <off>
##$DECSTAT= 4
##$DIGMOD= 1
##$DIGTYP= 9
##$DL= (0..7)
0 120 120 120 120 120 120 120 
##$DP= (0..7)
150 150 150 150 150 150 150 150 
##$DP07= 0
##$DPNAME0= <>
##$DPNAME1= <>
##$DPNAME2= <>
##$DPNAME3= <>
##$DPNAME4= <>
##$DPNAME5= <>
##$DPNAME6= <>
##$DPNAME7= <>
##$DPOAL= (0..7)
0.5 0.5 0.5 0.5 0.5 0.5 0.5 0.5 
##$DPOFFS= (0..7)
0 0 0 0 0 0 0 0 
##$DQDMODE= 0
##$DR= 18
##$DS= 0
##$DSLIST= <SSSSSSSSSSSSSSS>
$$ [...]
##$SUBNAM2= <"">
##$SUBNAM3= <"">
##$SUBNAM4= <"">
##$SUBNAM5= <"">
##$SUBNAM6= <"">
##$SUBNAM7= <"">
##$SUBNAM8= <"">
##$SUBNAM9= <"">
##$SW= 16.880792210976
##$SWIBOX= (0..15)
0 0 2 0 0 0 0 0 0 0 0 0 0 0 0 0 
##$SW_h= 3378.37837837838
##$TD= 16384
##$TD0= 1
##$TE= 0
##$TE2= 300
##$TE3= 300
##$TEG= 300
##$TL= (0..7)
0 120 120 120 120 120 120 120 
##$TP= (0..7)
150 150 150 150 150 150 150 150 
##$TP07= 0
##$TPNAME0= <>
##$TPNAME1= <>
##$TPNAME2= <>
##$TPNAME3= <>
##$TPNAME4= <>
##$TPNAME5= <>
##$TPNAME6= <>
##$TPNAME7= <>
##$TPOAL= (0..7)
0.5 0.5 0.5 0.5 0.5 0.5 0.5 0.5 
##$TPOFFS= (0..7)
0 0 0 0 0 0 0 0 
##$TUNHIN= 0
##$TUNHOUT= 0
##$TUNXOUT= 0
##$USERA1= <user>
##$USERA2= <user>
##$USERA3= <user>
##$USERA4= <user>
##$USERA5= <user>
##$V9= 5
##$VALIST= <valist>
##$VCLIST= <CCCCCCCCCCCCCCC>
##$VD= 0
##$VDLIST= <DDDDDDDDDDDDDDD>
##$VPLIST= <PPPPPPPPPPPPPPP>
##$VTLIST= <TTTTTTTTTTTTTTT>
##$WBST= 1024
##$WBSW= 4
##$XGAIN= (0..3)
0 0 0 0 
##$XL= 0
##$YL= 0
##$YMAX_a= 754515
##$YMIN_a= -534469
##$ZGOPTNS= <>
##$ZL1= 120
##$ZL2= 120
##$ZL3= 120
##$ZL4= 120
##$ABSF1= 10
##$ABSF2= 0
##$ABSG= 5
##$ABSL= 3
##$ALPHA= 0
##$AQORDER= 0
##$ASSFAC= 0
##$ASSFACI= 0
##$ASSFACX= 0
##$ASSWID= 0
##$AUNMP= <proc_1d>
##$AZFE= 0.1
##$AZFW= 0.1
##$BCFW= 1
##$BC_mod= 2
##$BYTORDP= 1
##$COROFFS= 0
##$CY= 11.3945322036743
##$DATMOD= 1
##$DC= 2
##$DFILT= <>
##$DTYPP= 0
##$F1P= 16.9975609425685
##$F2P= -3.02152046262296
##$FCOR= 0.5
##$FTSIZE= 0
##$FT_mod= 4
##$GAMMA= 1
##$GB= 0.15
##$INTBC= 1
##$INTSCL= 1
##$ISEN= 128
##$LB= 0.24
##$LEV0= 0
##$LPBIN= 0
##$MAXI= 10000
##$MC2= 0
##$MEAN= 0
##$ME_mod= 0
##$MI= 1.114404
##$NCOEF= 0
##$NC_proc= 0
##$NLEV= 6
##$NOISF1= 3.799351
##$NOISF2= 2.8
##$NSP= 1
##$NTH_PI= 0
##$NZP= 0
##$OFFSET= 15.70392
##$PC= 1
##$PHC0= -9973.86
##$PHC1= 11.80092
##$PH_mod= 1
##$PKNL= yes
##$PPARMOD= 0
##$PSCAL= 0
##$PSIGN= 0
##$REVERSE= no
##$SF= 200.130013532006
##$SI= 16384
##$SIGF1= 3
##$SIGF2= 2
##$SINO= 400
##$SIOLD= 16384
##$SREGLST= <1H.CDCl3>
##$SSB= 0
##$STSI= 0
##$STSR= 0
##$SW_p= 3612.71676300578
##$SYMM= 0
##$S_DEV= 0
##$TDeff= 0
##$TDoff= 0
##$TI= <>
##$TILT= no
##$TM1= 0
##$TM2= 0
##$TOPLEV= 0
##$USERP1= <user>
##$USERP2= <user>
##$USERP3= <user>
##$USERP4= <user>
##$USERP5= <user>
##$WDW= 1
##$XDIM= 8192
##$YMAX_p= 0
##$YMIN_p= 0
$$ End of Bruker specific parameters
$$ ---------------------------------
##NTUPLES= NMR FID
##VAR_NAME=  TIME,          FID/REAL,        FID/IMAG
##SYMBOL=    X,             R,               I
##VAR_TYPE=  INDEPENDENT,   DEPENDENT,       DEPENDENT
##VAR_FORM=  AFFN,          ASDF,            ASDF
##VAR_DIM=   8192,          8192,            8192
##UNITS=     SECONDS,       ARBITRARY UNITS, ARBITRARY UNITS
##FACTOR=    0.000296,      1,               1
##FIRST=     0,             0,               0
##LAST=      2.424536,      0,               0
##MIN=       0,             -534469,         0
##MAX=       2.424536,      754515,          0
$$ Real data points
##PAGE= N=1
##DATA TABLE= (X++(R..R)), XYDATA
$$ [...]
2370A325J289j344k689J045K522l35j527j755P65K624k42k197j558J793K029j051
2386F94j687p80J199K410j078k929O88J775P63l19k847l6K764O80k074j680R14
2403a543K225N92j911j702M92L534o93k626m8O18K087M96l327o77K748R06l53
2420H18k215p42K367J435j382k328L52K945J99j889j038J57K640P70l246r95K158
2437FJ179L01k839j050K587J856j266k648m44K708J060j231k239k52L233R56k815
2454h98r83P76J903J309k995j913K390J872n51k005j778K601K056r90k718o80
2470b604L063J596k106j777k65K552K407l046k501J729K004R57k057k617J875
2485g90K847k06k621j623K272J928n58j943j662K574K822j932k429M83J166K603
$$ plain form
2370 1325 2614 1270 -1419 -374 2148 1813 286 -1469 -704 1920 1678 -519 -2077 -284 1745 694
2386 694 -993 -1773 -574 1836 758 -2171 -1483 292 1055 736 -2111 -2147 617 1297 -777 -2457 -1543
2403 -1543 682 1274 -637 -2339 -1847 1687 994 -1632 -1680 -1062 1025 1521 -1806 -2483 265 1171 818
2420 818 -1397 -2139 228 1663 281 -2047 -1695 1250 1449 -440 -1478 -1321 1319 2089 -1157 -2152 6
2437 6 1185 1486 -1353 -2403 184 2040 774 -1874 -2318 390 1450 219 -2020 -2272 961 1917 -898
2454 -898 -1881 -1105 798 2107 -888 -2801 -411 1461 910 -1095 -2873 -272 1784 794 -1924 -2604
2470 -2604 459 2055 -51 -1828 -2093 459 2866 -180 -2681 -952 1052 2009 -48 -2665 -790
2485 -790 2057 1851 -770 -2393 -121 1807 1249 -694 -2356 218 3040 1108 -1321 -838 328 2931
2501B931j483l235J050K510Q67j800j984M04K957O26k113k402J632L008o97j888
2517C83j743J423L448j016l494O5K256J544l67l205o41K975J535j818k830P94
2533f91K286J006j627l192J286L466l70k562j066O58K796L58l640j059K315K324
2549B288j361k518p55K134K351j584l134N80K987N83j802j827l22L633Q64k727
2565f10j714J452K223N35k308k126K058K799o88l049j75K037J738o61k748m10
2581a647L116J258k192j556K52K263J390k371k611J457K471J33k004j504Q55K496
2597A806K05k976j307K811J176q54j877j233K032K574k233k435N24K019R27r30
2613B29k793M6L083R20k997j082R50K053P11k101k022J951K273n83k089p29J280
$$ plain form
2501 2931 1448 -1787 -737 1773 2640 840 -1144 -740 2217 2843 730 -1672 -40 2968 2271 383
2517 383 -1360 63 3511 2495 -999 -934 1322 2866 2499 -706 -1347 1628 3163 1345 -1485 -691
2533 -691 1595 2601 974 -2218 -932 2534 2164 -398 -1464 -806 1990 2348 -1292 -2351 -36 2288
2549 2288 927 -1591 -2346 -212 2139 555 -2579 -1999 988 1571 -231 -2058 -2380 1253 2117 -610
2565 -610 -2324 -872 1351 1886 -422 -2548 -490 2309 1621 -1428 -1603 434 2172 1511 -1237 -1647
2581 -1647 1469 2727 535 -1021 -769 1494 2884 513 -2098 -641 1830 1963 -41 -1545 -690 1806
2597 1806 2011 -965 -2272 539 1715 861 -1016 -2249 -217 2357 124 -2311 -1787 232 1159 229
2613 229 -2564 -2518 565 1485 -1512 -2594 -1644 409 1120 -981 -3003 -1052 1221 638 -1451 -2180 -900
2630i00K309k69l172n6K730J196j195j591p39K411K081k385k393J546K046O43
2646B262j636j726O90L126l35k578j033J986J698k76k315j213K462K129j930k239
2662i28K23J630J601j132l029N57K930O2j951j332M95K207P14k591j454J983J431
2679A416p13j379q97R39K546q69k925L19J962R36r82j675m99K559J145k376j172
2696a665J050J446O25j290k005J209K640n86j893m43Q05J438J82k365n42K323
2712I29R41j302q59p49J383J742j502j820O72J715J21j253q00K40J869K31k161
2729f03o74J196J292J9j443j570J765J443r28j490l3Q91J152l71j799rJ904L18
2747A060j262r44L38P23J476j508j729J046J373k94p86o28o3K062l64j562m11
$$ plain form
2630 -900 1409 1140 -2032 -2088 642 1838 643 -948 -1687 724 2805 420 -1973 -427 1619 2262
2646 2262 626 -1100 -410 2716 2381 -197 -1230 756 2454 2178 -137 -1350 1112 3241 1311 -928
2662 -928 -705 925 2526 1394 -1635 -1078 1852 1914 -37 -1369 -874 1333 2047 -544 -1998 -15 1416
2679 1416 703 -676 -1573 -634 1912 1043 -1882 -1563 399 1335 353 -1322 -1821 738 1883 -493 -1665
2696 -1665 -615 831 1456 166 -1839 -630 2010 1424 -469 -912 -107 1331 1513 -852 -1394 929
2712 929 1870 568 -291 -1040 343 2085 583 -1237 -565 1150 1271 18 -782 -542 1327 1558 -603
2729 -603 -1277 -81 1211 1230 -213 -1783 -18 1425 497 -993 -1026 -135 1017 646 -1153 -1162 742 1060
2747 1060 -202 -1146 -808 -85 1391 -117 -1846 -800 573 279 -507 -1135 -1198 864 500 -1062 -1473
2764a473J282Q00l98r61o87J217J248j423j442J217K17N14j26j539L22K073l74
2781D67j178l23M70R61L60j184r16J483J060j082j046N74L73R35l22j834P37J708
2799A243n65n36k27l15J479L67j331m32Q43O10k17n92k50J12J041P6j642N72O81
2818I17l17K28p65n58J617k2q17p7k77N90J09l20m64P5J221o75n51N55m47J91
2838B13Q51j084o28J155k83K18J8q89N86M48J72r37k5N70J39k01J60j043P35J082
2858A257j419N47K73p96Q58lp85L74K72L9L2m25j91M52K79k01q89P53J72r60J085
2879G24j83j267J497k60r56R75n96j74Q17m09m08K23j90L25l61K41l27o39J235
2898B67l08j036J239j048K05J046j600J78R08m50L94j12j150R24K80q8r78j9J112
$$ plain form
2764 -1473 -191 609 211 -750 -1437 -220 1028 -395 -1837 -620 -403 111 -15 -1554 -1232 841 467
2781 467 -711 -1034 -564 397 757 -427 -1343 140 1200 118 -928 -354 19 954 632 -1202 -465 1243
2799 1243 678 142 -85 -400 1079 1446 115 -317 526 1136 919 327 77 189 1230 1306 -336 236 917
2818 917 600 828 63 -495 1122 1100 283 206 -71 519 628 308 -156 -81 1140 465 -86 469 22 213
2838 213 1064 -20 -648 507 224 442 460 -429 157 605 777 -160 -185 385 524 323 483 -560 175 1257
2858 1257 -162 385 658 -138 720 717 -68 306 578 617 649 224 33 485 764 563 -326 427 599 -361 724
2879 724 541 -726 771 511 -445 530 -66 -240 577 168 -240 -17 -207 118 -243 -2 -329 -968 267
2898 267 -41 -1077 162 -886 -681 365 -1235 -1057 -149 -599 -205 -317 -1467 -543 -263 -351 -1329 -1348 -236
2917b36l01m26L75j251J183R42j382K19L28m59J403m01j632J072L19M26p26o48
2935a195R19J73K63l64j499J420P34j111K41m56j31K054r97j549J785j53M16n18
2953C2j131J065M55l37n02o56J051R6m13J49o99K49J992j462p14J052n84J248
2971H91m31j164L98R93j55l80o76M24O66j82l83j154R77J401j395l14J64J79J394
2990A253r0k215Q95Q31J64j58j294q8J128N08q21j343Q26J155k52j83j399J47
3008i36K450n00j858L53L08Q79O12j615r57J923O87q11j214j79J272N55Rk341
3026a363K40K225J80j262o62k11J764R26k382p68J796P93Q5j563r49Q57J766n20
3044I52k310j23J590P65m53j769q16K420J193j858j254O21J030J339j828j805
$$ plain form
2917 -236 -537 -963 -588 -1839 -656 286 -1096 -877 -549 -1008 395 -6 -1638 -566 -247 179 -547 -1195
2935 -1195 -276 -103 160 -204 -1703 -283 451 -660 -419 -875 -1006 1048 51 -1498 287 134 550 32
2953 32 -1099 -34 421 84 -418 -1074 -23 73 -340 -191 -890 -641 1351 -111 -825 227 -357 891
2971 891 460 -704 -306 687 532 152 -524 -100 566 384 1 -1153 -176 1225 -170 -484 -320 -141 1253
2990 1253 1163 -1052 -157 674 838 680 -614 -702 426 934 113 -1230 -404 751 499 316 -1083 -936
3008 -936 1514 1014 -844 -491 -183 696 1308 -307 -1264 659 1346 535 -679 -858 414 969 978 -1363
3026 -1363 -1123 1102 1282 20 -642 -853 911 1837 -545 -1313 483 1276 1361 -202 -1151 -294 1472 952
3044 952 -1358 -1481 109 874 421 -1348 -2164 256 1449 -409 -1663 -1042 -12 1327 -501 -2306
3060b306J330J927m57k048o73J052J560k37k171q67K373R68p99j325n64J751J810
3077A324j809j744Q88J893L19j166j595K30K672jk629m67J677J042K47j533j642
3094b294J715K614j555j751K87J216J316l57k386m03K645K77j662j208Q7J879
3110D20J009j947j768J396J979p81r06j394J045K150m7k623l74J887J014m19k150
3127a509n90K175J499j550k168P31J698J066j250k205Q26K851Ok011p29P67K112
3144A719M40k384j318K019K034j523j474o03J375K008p06k808k91K953R39j569
3160H11j842O9K677J254k432j979J439J902K3j912j703J317K677q60k931k70J864
3177A04J401m60k403n74K771J433k121j515L19K044J497k031k402R79K738j6k202
$$ plain form
3060 -2306 -976 951 494 -1554 -2227 -1175 385 148 -2023 -2890 -517 451 -348 -1673 -2237 -486 1324
3077 1324 -485 -2229 -1341 552 871 -295 -1890 -1660 1012 1011 -1618 -2085 -408 634 881 -652 -2294
3094 -2294 -579 2035 480 -1271 -984 232 1548 1191 -1195 -1598 1047 1324 -338 -1546 -1459 420
3110 420 1429 -518 -2286 -890 1089 308 -598 -1992 -947 1203 1156 -1467 -1841 46 1060 641 -1509
3127 -1509 -2099 76 1575 25 -2143 -1412 286 1352 102 -2103 -1277 1574 1580 -431 -1160 -393 1719
3144 1719 2159 -225 -1543 476 2510 987 -487 -1090 285 2293 1587 -1221 -1512 1441 2380 811
3160 811 -1031 -962 1715 2969 537 -1442 -3 1899 1922 10 -1693 -376 2301 1441 -1490 -1760 104
3177 104 1505 1045 -1358 -1932 839 2272 151 -1364 -1045 999 2496 465 -1937 -958 1780 1764 -438
3194d38j279J211K123M16k872j106K617J336p07j882j006K181K228j673k644N13
3210i82K386Q44j373k114j19K492J220k914j680J661J561O43k207k077J801K623
3226A765p85k315j104J925K092n91k890n83K394J644j875j780Q4J775J737j889
3242c96k588J367K471J96j510k100R14L330k38k651r11J375K361n32k267j094
3258b273K061K676j574k787L80J844J202m83l168L57L412L60j887j723N81K647
3274A625P04k754j527J519K409p61k207n41J153K441n65l324n3K255R31p06k054
3291a455j023L359J195j950k304P81K804J52j895j821R94K680K16l317J21J362
3307a01J202P76l129q61K721J350j420j772k72K390J415j858j643lK983N93k419
$$ plain form
3194 -438 -1717 -506 1617 2033 -839 -1945 672 2008 1301 -581 -1587 594 2822 1149 -1495 -982
3210 -982 1404 2248 875 -1239 -1358 1134 2354 -560 -2240 -579 982 1625 -582 -2659 -858 1765
3226 1765 980 -1335 -2439 -514 1578 987 -1903 -2486 -92 1552 -323 -2103 -2019 -244 1493 -396
3242 -396 -2984 -1617 854 1050 -460 -2560 -1646 1684 1446 -1205 -2116 -741 1620 1088 -1179 -2273
3258 -2273 -212 2464 890 -1897 -1517 327 1529 1046 -2122 -1765 1647 2007 120 -1603 -1022 1625
3274 1625 2329 -425 -1952 -433 1976 1215 -992 -1533 -380 2061 1496 -1828 -1881 374 1305 599 -1455
3291 -1455 -2478 881 2076 126 -2178 -1397 1407 1559 -336 -2157 -1163 1517 1733 -1584 -1463 -101
3307 -101 1101 1877 -1252 -2113 608 1958 538 -1234 -1506 884 2299 441 -1202 -1205 1778 2371 -48
3324d8j075L73K412J233l184j406K428J081j37j802j612K366J955j411j927l66
3340a120K172J001r22j902m78K354J649k563j581J077J477J229k258k489K017
3355c37K140k80j943j553J094K685n27k135j494K773J803j862j499k84J693K298
3371B572j931k977J544J244P24p98k801J046K668k1j999j539J629K116k18j843
3387e84j713J721K866j396k346M58O95K200q71l035K35K463R12j611j895M15K031
3404E45R72j586k138J257K438n94j522m56L60K532k75k772l3J495R77j17k201
3421a118n97K368R65j456j485J77J704M01n83j470j90K733Jk018j50J68J273R41
3439A664k418p62J521P32j93j491o53J558R74k88j868j09K285K09j153m55n76
$$ plain form
3324 -48 -1123 -750 1662 2895 -289 -1695 733 1814 1677 -125 -1737 629 2584 1173 -754 -1120
3340 -1120 1052 2053 1131 -771 -1249 1105 2754 191 -1390 -313 1164 2393 135 -2354 -337
3355 -337 1803 1523 -420 -1973 -879 1806 1279 -856 -2350 423 2226 364 -1135 -1419 274 2572
3371 2572 641 -2336 -792 452 1176 378 -2423 -1377 1291 1270 -729 -2268 -639 1477 1259 -584
3387 -584 -2297 -576 2290 894 -1452 -994 -299 1901 1030 -2005 -1770 693 1605 -6 -1901 -1486 545
3404 545 1517 -69 -2207 -950 1488 894 -628 -1084 -724 1808 1533 -1239 -1272 223 1200 1083 -1118
3421 -1118 -1715 653 1618 162 -1323 -1146 558 959 376 -1094 -1284 1449 1450 -568 -718 -550 723 1664
3439 1664 -754 -1516 5 737 544 -947 -1600 -42 932 644 -1224 -1333 952 1161 8 -447 -1023
3456a023J793J162k226p63R51P75N45j445j272J419J443m14j677l58J583R87l05
3473A175j272r58K255J288j620j089L85J061R64r09k036R83J376J57j260j284
3489g84R97J368K80j742q98J681R53n64r44r31J146J999j492j461K67P47R56r66
3507F12j607K01J623K79j271r46J025J091k1q51j103J128J615q26j226l2L30J137
3525A158j2k163J42J340J29k62j140L9J037M97o84j008P58J285l78p32m24J67
3543b51J362j26j488l89R82K49J47r41q41J047J028r10p85J17N91O54q4j113q6
3562h37J549R9j100m0J4N92N89r08r65P07P03n31n96q4L08O99m1p89q7J031J17
3583D30o7l62o14J035M30j050n56L55K31K37k21r69K54J144j97j114M1M95M80
$$ plain form
3456 -1023 770 1932 -294 -1057 -106 669 1214 -231 -1503 -84 1359 945 -732 -1090 493 1480 1175
3473 1175 -97 -1055 1200 2488 868 -221 164 1225 2189 1280 -756 227 1603 1760 500 -784
3489 -784 213 1581 1861 119 -779 902 1855 1291 347 -584 562 2561 1069 -392 -125 622 1578 612
3507 612 -995 -794 829 1108 -163 -1109 -84 1007 986 135 -968 160 1775 949 -277 -309 21 1158
3525 1158 1146 -1017 -875 465 594 332 -808 -769 268 765 81 -927 -169 1116 738 6 -418 -251
3543 -251 1111 985 -503 -892 90 339 486 -455 -1296 -249 779 -131 -916 -799 -208 446 362 -751 -837
3562 -837 712 811 -289 -329 -315 277 866 -42 -1007 -300 403 -128 -724 -808 -500 199 158 -631 -718 313 430
3583 430 363 1 -613 422 852 -198 -754 -399 -168 69 -152 -1121 -867 277 80 -1034 -993 -498 -18
3602a8J18q29l23Q90P55j033l2j70R3P81o07q60N14N89k73k85j42J35P45J06n81
3623d27p0O06M37o6j62j57K66M44k44p34P16k06KJ0j85j86O66K57p25K28K93p1
3645F92K41k9l68J75L51n69L44k05k15L6K62p30j61L74j57k99J25M6k72K01j65
3666c23k37O41k64k69M18O5l85M98k46n01L32m5k75L29j6j98L5J60j21L21K89
3687B08k87M7P06l65l31O55n45M71K95m51K76j47j72J90P7l91K3oO28o97J49L46
3709F79n23K69L71q20L95M64q37L89k41j90L02k49o25L12K78l22j40n8j3k91O27
3730b23k36r50J055J36l33N03n37m08J147m34o05L31k04M50J10m62j28j44J179
3749B47k66q42M72K3R54P8j323K41J112m96j25j02l87J055J32o73p03K62J218
$$ plain form
3602 -18 100 -729 -1052 -162 593 -440 -472 -642 -549 232 -375 -1235 -721 -132 -405 -690 -832 -697 48 154 -427
3623 -427 -497 109 546 480 318 161 427 871 627 -107 609 403 405 415 230 44 710 967 242 470 763 692
3645 692 933 904 536 711 1062 493 837 632 417 453 715 -15 -176 198 41 -258 -133 -87 -359 -158 -323
3666 -323 -560 81 -183 -452 -34 31 -354 144 -102 -603 -271 -316 -591 -262 -278 -476 -441 -281 -402 -81 208
3687 208 -79 -32 674 309 -22 633 88 559 854 403 679 532 360 550 627 236 259 253 881 184 333 679
3709 679 156 425 796 -24 371 835 -2 387 146 -44 258 9 -616 -304 -26 -348 -488 -546 -559 -850 -223
3730 -223 -459 -1409 -354 -218 -551 -48 -585 -993 154 -280 -885 -554 -758 -308 -198 -660 -788 -932 247
3749 247 -19 -861 -389 -366 588 666 -657 -416 696 200 75 -27 -414 641 773 100 -603 -341 877
3768H77j46q46m2M7O55L09j577K83Q58j9K56q82o53J387M14q74l50k27J039J60
3788F69m28r80K0J378J72j539K04L97J11R21j190o27J520j93k75k04p88R44Q61
3807I73n87p17j50J058K88q08l17o4O50P55j394m11Q80R2K75m48j069Q22Q83o20
3827I1k84n86Q33P43l15p36n36Q98R41j348k89K35m0J239o23j557J174M12o4J1
3847A99p35J17R53L81j249m02P30Q98p24o62j98K96J543q86j327N12N53P06k45
3866D60j632O39J198J2q07r40P43R75P2q37q22N22J504p73j272j3K75J318l01
3885C21j791K13J383M03p16j273J22J721Q5p36j167L63J859l88r56r68L51K014
3903H40m33k177L15Q94N22N38j789m60J305J279p22j256J6J503M69o93j132r0
$$ plain form
3768 877 731 -115 -157 -110 545 854 -723 -440 418 399 655 -227 -880 507 921 47 -303 -530 509 669
3788 669 241 -739 -719 659 831 -708 -504 -107 4 925 -265 -892 628 435 160 -44 -832 112 973
3807 973 386 -331 -481 577 865 57 -260 -324 326 1081 -313 -724 156 248 523 75 -994 -172 711 91
3827 91 -193 -779 54 797 482 -254 -790 108 1049 -299 -588 -353 -393 846 223 -1334 -160 252 188 199
3847 199 -536 -419 534 915 -334 -736 -6 892 168 -494 -692 -396 1147 261 -1066 -554 -1 705 460
3866 460 -1172 -533 665 677 -130 -1070 -327 648 720 -117 -939 -417 1087 314 -958 -971 -696 622 321
3885 321 -1470 -1257 126 529 -187 -1460 -1338 383 468 -268 -1435 -1072 787 399 -557 -1525 -1174 840
3903 840 407 -1770 -1455 -561 -39 499 -1290 -1750 -445 834 112 -1144 -1128 375 844 151 -981 -1071
3921a071J733K89j442n39L10J147N29j301q03R82J122l30j125p27J372J073k72
3938I47j556l52J586M32o12q53n48J409J114j969p15O74Q56P01j157j202P47J356
3956H58o3j198o16P58J256l0j299r91J478J121j108q43l43J107J167j075j649
3973a470M91J547O76r59j460L37J530J027k000p01R73J132r0j148j019R78J633
3990A477q54j682m9R75J170l02j656J80J601N87j071j290O43J283M87j126j373
4007a000P99J680l06j423o31N10J804l70j802j65J231O96l15j618L9J315J117
4024A561j233j406M64J557J16r65j022j96K075k73j349n79M73J441j35j154q15
4041a440J090J163m13j578j6J160P61o78j385q4J550L26p66j239J87J392Q84j536
$$ plain form
3921 -1071 662 951 -491 -1030 -720 427 956 -345 -1148 -166 956 626 -499 -1226 146 1219 947
3938 947 -609 -961 625 1057 445 -408 -956 453 1567 -402 -1117 -443 413 1114 -43 -1245 -498 858
3956 858 795 -403 -1019 -261 995 965 -334 -1325 153 1274 166 -677 -1020 87 1254 179 -1470
3973 -1470 -979 568 1244 285 -1175 -838 692 1719 -281 -982 -9 1123 1033 -115 -1134 -156 1477
3990 1477 623 -1059 -1108 -133 1037 735 -921 -741 860 1447 376 -914 -271 1012 1499 373 -1000
4007 -1000 -201 1479 1173 -250 -881 -371 1433 1063 -739 -904 327 1023 708 -910 -871 444 1561
4024 1561 328 -1078 -614 943 1059 94 -928 -1124 951 678 -671 -1250 -777 664 529 -625 -1440
4041 -1440 -350 813 400 -1178 -1194 -34 727 49 -1336 -1420 130 456 -310 -1549 -1362 30 914 -622
4059f22r25O15J328J14j019p98Q46J584k11j704j01R12R82m53j295m21J397J138
4077A367j344j015L74R27P18o17j599P45J368J9r89p58L57J294J95j646o62J152
4095a14J104n58j289k23P52J510j004j492L23J286O85q09j314j9J584P60j478
4112b96j035Q97J028K07j268p97Q32J566o27j355m30J315Q18J7j767J0J300P79
4130A194r42r72K41J064R39j169j229M68J554j46j054q68O30J300L42j760m42
4147h50J141R39m09r27o51J256Q47q62j017J76Q57M65n94p96p8J346M73j342o94
4166g20L26J265N2r58r10Q12J261m08j088l76P96J125l24j399k01J523L51p97
4184C30q01j03J055O17j122p94K40J303L14j270o69K66J374J91j562k39R01P41
$$ plain form
4059 -622 -1547 -932 396 510 -509 -1307 -461 1123 912 -792 -893 19 1001 548 -747 -1168 229 1367
4077 1367 23 -992 -618 309 1027 410 -1189 -444 924 943 -46 -804 -447 847 1042 -604 -1266 -114
4095 -114 990 432 -857 -1080 -328 1182 178 -1314 -991 295 980 171 -1143 -1162 422 1182 -296
4112 -296 -1331 -434 594 801 -467 -1264 -432 1134 507 -848 -1278 37 855 872 -895 -885 415 1194
4130 1194 252 -720 -479 585 1524 355 -874 -406 1148 1002 -52 -920 -290 1010 1352 -408 -850
4147 -850 291 1230 821 -106 -757 499 1346 484 -533 -357 500 965 371 -425 -503 843 1316 -26 -720
4166 -720 -394 871 923 -35 -945 -133 1128 720 -368 -744 52 1177 853 -546 -747 776 1127 330
4184 330 -471 -574 481 1098 -24 -818 -578 725 1039 -231 -900 -634 740 931 -631 -870 31 772
4202G72j63j223n66J003R85r07o77r4J082N72r78q58K71J504J9j031l89K06R00
4221D28O60j565p71J672J18m8o86o94J106P82l37j180j14R43M98n48n89k49Q46
4240B72R76j201p63O29N45K05n60j257R70J099l08j022k75M58R63m76p62k31M71
4259b67J024o73r49L10K58O55n11j207O66Q24J57k89r41q5J565m09m03o50O59
4278b66O46R0r09l91L97J162m03r74M91J63N63K42j177j23J164R3l89l80j04P07
4298F02K15k11o95L1R87o1n29j42l22Q05L30j239O4O43Q0J43o02l81Q26L60o85
4319B19n11q7J003j2n46k75j77J013P1j284K90K38K53L56q34l52P09M11l58r2
4339C5m80M01M70j6p22j25P20J04m03r0j25L97L10n11m97P92L36j43k45m94N32
$$ plain form
4202 772 609 -614 -1180 -177 808 -99 -776 -870 212 784 -194 -1052 -781 723 742 -289 -678 -472 428
4221 428 1088 -477 -1248 424 542 494 -192 -886 220 1002 665 -515 -629 314 812 264 -325 -574 272
4240 272 1248 47 -716 -87 458 663 103 -1154 -184 915 607 -415 -690 -232 731 255 -507 -738 -267
4259 -267 757 84 -865 -555 -297 358 -153 -1360 -694 130 287 -2 -943 -1028 537 128 -275 -925 -266
4278 -266 380 470 -439 -830 -433 729 326 -648 -157 6 569 811 -366 -489 675 768 379 -1 -105 602
4298 602 817 606 -89 -58 929 868 339 197 -125 680 1010 -229 -165 478 558 701 99 -282 544 904 219
4319 219 -292 -379 624 612 66 -209 -386 627 698 -586 -296 -58 195 551 -283 -635 74 485 127 35
4339 35 -445 -44 426 410 -312 -437 283 387 -16 -106 -231 166 476 -35 -532 260 596 453 208 -286 246
4360B46M40l10n85k00Q27J99k57Lm56M39L95q26o3L79j92O43n68l29J44N11L17
4381G57n44l58J94J88n6j35k78P94k51k77N0j13K82K58m68k58K99j35K11R9n09
4402b50J78L01N4r6m52J46J89p9Jm29Q9P27l49n48L72O7P0J45m79J66mM7J79j47
4426a02k53K33j53M18n03K0L99j30J31j52j04O20j0o81N73k9K0J12n7k83J07L69
4448E45k88j9J0K13k97L95k38l90M49L32o20K41j84J99j68J36j78M04k49l64K82
4469B11J4j03J0j82r1m1K58L8m25L85k04M4r5L24m80J28NP0k20J20q9L14l33K13
4493a29J76L3m01Q0J54j31R6j14K45K06J20o61K51q0J41J92K7l80K26K40j60k51
4515a20M37r6Rj0o9k04M54o9m87L23j67L24Rk5n57K76K91k61l46K54J5M%k21P
$$ plain form
4360 246 686 376 -209 -409 418 617 360 363 -93 346 741 -85 -148 231 39 682 114 -215 -71 440 757
4381 757 213 -145 49 237 181 46 -232 562 311 34 84 -29 253 511 43 -215 84 -51 160 259 -250
4402 -250 -72 229 283 187 -265 -119 70 -9 -8 -437 -348 379 30 -518 -146 -79 -9 136 -343 -177 -181 -134 45 -102
4426 -102 -355 -122 -275 143 -360 -340 59 -71 60 -92 -196 424 414 -267 306 277 297 409 352 69 176 545
4448 545 257 238 248 461 164 559 321 -69 380 712 92 333 149 348 180 316 138 542 293 -71 211
4469 211 225 122 132 -50 -141 -182 76 114 -311 74 -130 -86 -181 143 -337 -209 -204 -134 -354 -234 -323 -9 -342 -129
4493 -129 47 80 -321 -241 -87 -218 -122 -236 9 215 335 -326 -75 -155 -14 178 205 -175 51 291 131 -120
4515 -120 317 221 230 220 151 -53 401 332 -155 168 1 325 334 309 -248 28 319 58 -288 -34 -19 -15 -15 -236 -229
4540b29J63J64k45q7j7J43J26n21N2R1K07l47L52l67p7M76j14k90l4K19K68p1
4562a38k29p1L76L06l23k94K6K28L33j97n41K04O24j78k73J1O1K35N0l89j20K00
4584i9L10j3k81j15J59O68k18o30J00J31J46L4k09k88M50L37n80j25K88k7K24
4605B62l81k52L65N11j24m95J92n2K89J61o93j19O88J5l94k55n6J68O00k10q18
4626e98M82M79k8n26Nk80N13K95m80m56O59P1j3l45k14J5O86M7n33q4M53K09K2
4649C79n44j04N34M7l37l66K56K21J82l08l08pO93P8l16k01J68M46K05o96k80
4670b58N06J86O8n80m07R29K48m07l64k73N96L07m70o71O9P87K09p20k56M77M2
4691A8K27n42n43O81M42k13k92j71l1P47k67n26l80P15M13o11m24J53N55L32o05
$$ plain form
4540 -229 -66 98 -147 -234 -251 -108 18 -503 -451 -360 -153 -500 -148 -515 -592 -116 -230 -520 -554 -335 -67 -138
4562 -138 -367 -438 -62 244 -79 -373 -347 -119 214 17 -524 -320 304 126 -147 -136 -75 160 210 -179 -299 -99
4584 -99 211 198 -83 -198 -39 629 411 -219 -119 12 158 192 -17 -305 145 482 -98 -223 65 38 262
4605 262 -119 -371 -6 505 381 -114 78 26 315 476 -217 -336 352 367 -27 -282 -338 -170 430 220 -598
4626 -598 -116 363 335 -191 -186 -466 47 342 -138 -594 65 136 123 -222 -436 -421 265 312 -221 -305 148 357 379
4649 379 -165 -269 265 312 -25 -391 -135 86 268 -40 -348 -355 338 416 100 -101 67 513 718 22 -258
4670 -258 248 434 502 -78 -485 444 692 285 -79 -352 244 551 81 -590 -521 266 475 -245 -501 -24 18
4691 18 245 -297 -840 -159 283 70 -222 -393 -424 323 56 -470 -850 -135 278 -333 -757 -604 -49 283 -322
4712c22n50L91N61nk2o34K66N11j36m83j88L06N25j06m18l21M80Q06n40m19j2
4733c10L86N33l37p63L36O90m80j99l50K75P08Kp58j45K79N08j60n49l14K19Q08
4754C79j93p46l7O80J62j54q19J0J043j96o6o60K04N90k77j32l09K34N00On73
4775c54p5M04K87L5p81j1O96Oj87m81j00N53O20m45n72j17Q95L68o38n62j21R16
4797C36L25r07l77N44J64J41k04m45N14M85l56o68q4N09K82j95m81J51N77M49
4817G60p15n83K93K76L76m10n40N51N07j99j99n41M35N86j13p07j90M31N59l08
4837B69m95j3K78O34o67m79L19L60J27l35o49N15M31j7l54l16K62K55Q1l44l75
4858e13N62K82k32n94K68J53L75j49p59N2N35K51l83m59K62L63N0K8m66K10L71
$$ plain form
4712 -322 -872 -481 80 75 53 -581 -315 196 60 -423 -611 -305 220 114 -304 -625 -145 661 121 -298 -310
4733 -310 76 609 272 -491 -155 535 55 -144 -494 -219 489 491 -267 -412 -133 375 215 -334 -648 -429 379
4754 379 186 -560 -597 83 245 91 -728 -718 325 129 63 -597 -393 197 -80 -212 -521 -287 213 219 -354
4775 -354 -429 -25 262 297 -484 -495 201 207 20 -461 -561 -8 612 167 -405 -522 373 741 103 -459 -580 336
4797 336 661 -246 -623 -79 85 226 22 -423 91 576 220 -448 -532 -23 259 64 -417 -266 311 760
4817 760 45 -538 -245 31 407 -3 -543 8 515 316 117 -424 11 597 484 -223 -413 18 577 269
4837 269 -226 -239 39 673 6 -473 -154 206 333 -2 -651 -136 295 278 -76 -392 -130 125 206 -138 -513
4858 -513 49 331 99 -495 -227 -74 301 152 -607 -555 -20 231 -152 -611 -349 14 64 92 -374 -164 207
4879B07K3m04k47K27P86l53n01L34l35O36j59l92j04M20K16l23j54l44N41L59
4899D33m08n20L42N14J8n11k15R8J86L62o13j95O48p6j2k00k59L80M38n14l07
4920d11K37K05L27j44p56J41N21n0l82m7M57j00J13j41n47O00J33K7k97j31L66
4941A21L20k20l73l48O51Q7j96k51L3L27J76k36n29K09M18K92m68m05J11N05K28
4962D52n52l58N11J68J58m78j70L25N06n64j34j67N63o9m9q8k13N69j30l17l58
4983c95K22N43j55j19l06N43m0j52m52j31M50M02l88l42K94K35J43k07k49j22
5003b26K66K75j74l45J73K84n0l14K0n1K56Q6m59L8Q5M28j94k27L0K42Q4j33k33
5026a39k13M46J20l78k5J16J75q5k14j7p1M03J13l08k45K43K76J4k38l41K69L02
$$ plain form
4879 207 230 -174 -421 -194 592 239 -262 72 -263 373 214 -178 -282 138 354 31 -123 -467 74 433
4899 433 25 -495 -153 361 379 -132 -347 -249 -63 299 -314 -509 139 63 51 -149 -408 -28 410 -104 -411
4920 -411 -174 31 358 214 -542 -401 120 70 -312 -359 98 -2 111 -30 -577 23 156 183 -114 -245 121
4941 121 441 221 -152 -500 151 238 42 -209 -176 151 327 91 -438 -229 189 481 13 -392 -281 224 452
4962 452 -100 -458 53 221 379 -99 -269 56 562 -2 -136 -303 260 191 142 54 -159 410 280 -37 -395
4983 -395 -173 370 215 96 -210 333 293 141 -311 -442 8 410 22 -320 -26 209 352 145 -104 -226
5003 -226 40 315 141 -204 -31 253 203 -111 -91 -142 114 200 -259 -221 -136 292 98 -129 -99 143 227 94 -139
5026 -139 -352 94 214 -164 -189 -73 102 17 -197 -214 -285 118 231 -77 -322 -79 197 211 -27 -368 -99 203
5048B03N3m18J63L64k42l35K20q1J98R3q9l17J68L6M17m37m66M75J52L17o42Q2
5070h6J59m2N8l54J21M14k38j32Q7j2l8K00p7k25K30J32k80%j21Q0J02K67m14
5093a69J36q0K93Mn65J54K39J76k15jj20M44j78J5J0k6O8Q1J56k52N6j35K78l42
5117B7k90K15L04l34J31k08J48N08k55l00j30K31K32k49k3j18j4N36m45j70J73
5138c1n9L6j29j31n5J07N64l17n1k50K00N6O0j74J67J21q3j77L5J74K4m7q6j64
5162b10N21m17O7j15j67L94K7j26Q3j54J87K17j45k96K99k00K0j54K3j15M26l34
5184a69N1J25J46k3j85N2p7n1P6J06J01k76L68j63l50K36R1j23J54J27j63k0j02
5207f9K81l74K72k16p3L5q6N2Q3L53k16J26l22M13l54J8J55k17K46K6j91r0J89
$$ plain form
5048 203 256 -162 1 365 123 -212 8 -73 125 218 129 -188 -20 16 433 -4 -470 5 157 474 -168 -86
5070 -86 73 31 89 -265 -144 270 32 -100 -13 -25 -63 137 60 -165 65 197 -83 -83 -204 -124 -22 245 -169
5093 -169 -33 -113 180 184 -381 -227 12 188 -27 -28 -148 296 118 133 143 117 185 266 422 170 226 91 369 27
5117 27 -263 -48 256 -78 53 -155 -7 501 246 -54 -184 47 279 30 7 -111 -125 411 -34 -204 -31
5138 -31 -90 -54 -183 -314 -369 -262 302 -15 -66 -316 -116 -60 0 -174 -7 114 31 -146 -111 63 87 40 -46 -210
5162 -210 311 -106 -39 -154 -321 73 100 -26 57 -97 90 307 162 -134 165 -35 -15 -169 -146 -261 165 -169
5184 -169 -118 7 153 130 -55 -3 -80 -131 -55 51 152 -124 244 81 -269 -33 58 -65 89 216 53 33 -69
5207 -69 212 -162 110 -106 -179 -144 -230 -178 -95 258 42 168 -154 259 -95 -77 78 -139 107 133 -58 -148 41
5230D1j13M3j4P2k3q5Pk8M7K07l21j4J56k07L1K71k76l6M31m89j7L71j08j16L94
5255B24j63r8K98k16J4k72N20l56P7k00K07M4j32K22l86K85k21R7L5K56L5k49
5277B1J48n4l34L73K0j15O2k21J59m2K16k96J66k77J11J53k4M2k44M46l19j7j56
5300a82K80l1j54l4Q5J48oJ87l62j08K75P7j07k00J21j9J67j66J2R4j74P0l1j87
5324b45L77k05K10m7k09L64M5m69K61p2J00N4m70K84K08j58k48j30L38K22j64
5345D6j68J95j55J87j81J9j20J73J04Kk04l5L25l03K84l18kJ99Nj43R6pj15K73
5369A57j48O7j01J8j38K82k41Ml04K55p8M7L71q3j58k3j38K13j33l4J0K79j29
5392ej93M25J7k11N0j16J70k06rJJ04q2j19J41n7Q4M7J3r0r1J55m6J80j6p1J35
$$ plain form
5230 41 -72 -29 -43 29 6 -79 -72 -100 -53 154 -167 -181 -25 -232 -201 70 -206 -242 189 -300 -317 54 -54 -170 224
5255 224 61 -37 261 45 59 -213 307 -49 28 -172 35 79 -53 169 -217 68 -153 -56 -21 235 270 21
5277 21 169 115 -219 154 174 59 121 -100 59 17 233 -63 103 -174 -63 90 66 108 -136 310 -9 -26 -182
5300 -182 98 67 -87 -121 -36 112 106 293 -69 -177 98 175 68 -132 -11 -30 137 -29 -17 77 -97 -27 -58 -245
5324 -245 132 -73 137 90 -119 245 290 -179 82 10 110 164 -306 -22 186 28 -220 -350 -12 210 46
5345 46 -122 73 -82 105 -76 -57 -177 -4 100 102 -102 -137 188 -115 169 -149 -151 48 53 -90 6 -1 -116 157
5369 157 9 76 -25 -7 -145 137 -104 -100 -404 -149 -227 -180 191 108 -50 -73 -211 2 -131 -165 -155 124 -5
5392 -5 -198 227 244 33 83 -33 137 -69 -78 -77 27 -55 -174 -33 -90 -6 41 54 -36 -127 28 -18 162 146 75 210
5418B10j03j49K69q6k60J7J70P3k0O9j95l9K97k67J4k75M08M4j27O5j99K84j23
5441G7J39k63l0K49Qj90m1J18n4J78k49P9q3J42k55L07n9j19p8j03J06O4q3J66
5465B6J6k65J71J4r8J34L67m61q5J75L44m97Q0J27j1j50J71N8j91K61KJl10K34
5489A13m6j11n4j32K13K2J7J22R0j14j19N5k13l2K78J38k66l9P6J47j67k05K27
5512@J80j65P1m17L06J60j27J16j12J48k13J18j86J04j43K06J84j05j38j78K87
5533I6l3L9j48J3j43K62j11r0N7K51l25J01J60p4Q0N2k08J9l38L53m0K6Q0k24
5557a45J28K8n8NM5Q0j34J35J1j43jJ22k03P8J54k44K11j77J34J64l19J14Q3k
5581F6R9k64O0oj59K47J01j49pj32K15k61J92k62L40M0j24L2n2j11J10rk4O5K9
$$ plain form
5418 210 107 -42 227 141 -119 -102 68 141 121 190 -5 -44 253 -14 0 -275 133 177 50 115 -84 200 77
5441 77 216 -47 -77 172 180 -10 -51 67 13 191 -58 21 -62 80 -175 132 73 -46 -124 -227 -121 -57 -140 26
5465 26 42 -223 -52 -38 -136 -2 365 -96 -181 -6 338 -159 -79 48 37 -113 58 116 -75 186 188 189 -121 113
5489 113 67 -44 -98 -230 -17 5 22 144 234 120 1 56 -157 -189 89 227 -39 -78 -2 145 -22 -227 0
5512 0 180 15 86 -331 -25 135 8 124 12 160 -53 65 -121 -17 -160 46 230 125 -13 -191 96
5533 96 63 102 -46 -33 -176 86 -25 -115 -58 193 -132 -31 129 55 135 187 -21 -2 -340 13 -27 -1 79 -145
5557 -145 -17 11 -47 -42 3 83 -51 84 95 -48 -49 73 -130 -52 102 -142 69 -108 26 190 -129 -15 68 66
5581 66 165 -99 -39 -45 -204 43 144 -5 -12 -144 71 -190 2 -260 80 120 -4 28 -24 -135 -25 -34 -58 7 36
5606C6M8j25o9N8O2L5o4j22K01K04m06P9k5P2L56j19l98j2K08P8j05j34J41o1
5630f2K3P9P6j08r5J85J40k33K30J25l53l4p2K38J8k7m8j74J51J59k39k34L41
5653H6j42L24m04P7n2N9J73n3m0j62J63M8jj75J4j11K06k04J43K3K15Qj65K3k81
5678b28K88P7k70Q4J22P5j35k03O0J53J02k54L7N9Q7J14j2k00j0K53j03j00k42
5701b46J58J09Oj74M4o6L34k7k40L0L96j14j10m87L71J90Q1l02n9q7K93j2Ok91
5725a97M76k23J26l05j1K03o0j65J39k44K15K07k00K33l67K66J35j52j87N1K06
5746A46M6l55J65J54mM1m6k86L03r2j24J48m09o4M71N9k36J01J77p4J24n12J35
5769a32J29o5J7J21j44J4J40J3r0R5k1j33j22l16M69J14R5l84K1L49o2o0j84Q4
$$ plain form
5606 36 84 -41 -110 -52 10 45 -19 -141 60 264 -142 -63 -88 -16 340 221 -177 -189 19 97 -8 -142 -1 -62
5630 -62 -39 40 116 8 -87 98 238 5 235 360 7 -27 -99 139 157 130 82 -92 59 218 -21 -255 86
5653 86 -56 268 -136 -59 -111 -52 121 68 28 -134 29 77 76 -99 -85 -196 10 -194 -51 -28 187 195 30 53 -228
5678 -228 60 137 -133 -49 73 148 13 -190 -130 23 125 -129 -92 -33 54 168 156 -44 -54 199 96 -4 -246
5701 -246 -88 21 27 -147 -103 -169 165 138 -102 -72 324 210 100 -387 -16 174 255 -47 -106 -193 100 88 94 -197
5725 -197 279 56 182 -123 -134 69 9 -156 -17 -261 -46 161 -39 194 -173 93 228 76 -111 -60 146
5746 146 192 -163 2 156 152 193 147 -139 164 72 -52 96 -313 -377 94 153 -83 18 195 121 245 -267 -132
5769 -132 -3 -68 -51 70 -74 -60 80 93 3 98 77 -56 -178 -494 -25 89 184 -200 -179 170 108 48 -136 -52
5793e2OJ09R7l28J52L24k12k9k39L73k01J15k27K5j2J62j6L2k3l1M10m37j04L8
5817f8L20l59k2J66o3j4K83j35j18k4L52r1l82l1K55r9J2jq6J73M4K65n43k80
5841d46L98l0p0K25n4J42J19l24j01oR4L38j89m28L71lmq7m6L46P8k68m6j93L23
5866A39Q4l91J28M8K18j34l45J38m2L40J1j37k7l06L19P9p5l18J10J61j48M2J6
5889i0P6M2Q9j48j20K46Q5k30R1l1J52J47k86j77K24J2p9J88l46J62K64k34K00
5912B37l81k2J69P7j37pJ60J21l98J84j13J81J45j31k20K37J48k54j31J09j00
5933a26M7J75j68j27n7J6L49r1j01k62M84n2l9k89K98K03l30j81K73J05J07o1
5955A73j29J8l99K48K10j11Q2n0n5K35j96lK83j82k65J56K89n65M37k74J45oK8
$$ plain form
5793 -52 -46 63 160 -168 -16 308 96 67 -172 201 0 115 -112 -87 -99 63 47 79 56 25 435 -2 -106 -68
5817 -68 252 -107 -129 37 -26 -40 243 108 -10 -34 318 227 -155 -186 69 -30 -18 -19 -105 68 112 377 -166 -446
5841 -446 -48 -78 -148 77 23 165 284 -40 -141 -147 -53 285 96 -332 39 36 32 -55 -101 245 323 55 9 -184 139
5866 139 223 -168 -40 8 226 92 -253 -115 -157 183 194 57 30 -276 43 122 47 -271 -161 0 -148 -106 -90
5889 -90 -14 28 117 -31 -151 95 180 -50 41 10 162 309 23 -154 70 82 3 191 -155 7 271 37 237
5912 237 -144 -166 3 80 -57 -64 96 217 -181 3 -110 71 216 85 -135 102 250 -4 -135 -26 -126
5933 -126 -79 96 -72 -199 -256 -240 109 18 -83 -345 139 87 48 -241 57 260 -70 -251 22 127 234 173
5955 173 44 62 -337 -89 121 10 92 42 -13 222 26 23 306 124 -141 15 304 -261 176 -98 47 41 69
5978F9j49j4L39j29p9K9j65K09j27K51k44q7J53nJ18l27n8K4M28k43k05J59n9
6001a12J67m5k27JJ03J58j43N4P7m4MQ8l05M38k01R4j38j30K86K39l66j80p4N24
6025B68j30k45N7K36k65K58mk28O3r5J65j34k05R5J3J2PL4O3j9K84l34n2K6J36
6050FOm5O6q7m7j10K50j12J85l3J61k08n9L22k71K28k29j05K24j82J97r3j16P3
6074B1L0j23K46j02lj16J14j05J30j95qJ28J04m6m8o6P8p0k6M8l32K82poK81m19
6100b10Q4J73j91P3J05j79J63k77N21l37RK9k00K74p2m5M4l33L39mK71j34J38
6123B41k40J77j99j70K25N2j04O8M6q3K2J18p8j65K1J09K80l02k99J48J62J56
6145A85K3m38J85J4p5j66K29k4J42j60q8R9J46l76K59r7l4L71J47l73L2q7L4K66
$$ plain form
5978 69 -80 -94 245 116 37 66 -99 110 -17 234 -10 -97 56 51 169 -158 -216 -192 236 -7 -212 -53 -112
6001 -112 55 10 -217 -216 -113 45 -98 -44 33 -11 -7 81 -224 214 13 107 -31 -161 125 364 -2 -182 -256 268
6025 268 138 -107 -50 186 -79 179 175 -53 10 -85 80 -54 -259 -164 -151 -139 -132 -98 -35 -54 230 -104 -156 -130 6
6050 6 12 -33 33 -54 -101 -211 39 -73 112 79 240 32 -27 295 24 252 23 -82 142 -40 157 64 -52 21
6074 21 51 -72 174 72 69 -47 67 -38 92 -103 -111 17 121 75 27 -39 39 -31 -57 -9 -341 -59 -66 -72 209 -210
6100 -210 -126 47 -144 -71 34 -145 18 -259 262 -75 -66 -37 -237 37 -35 -80 -36 -369 -30 -34 237 103 241
6123 241 1 178 -21 -191 34 86 -18 50 96 13 35 153 75 -90 -69 40 320 18 -281 -133 29 185
6145 185 208 -230 -45 -31 -106 -272 -43 -67 75 -85 -173 -74 72 -304 -45 -142 -176 195 342 -31 1 -86 -52 214
6169B14k19j17J05J99jm4j20j16J34m7J49j56J97j8k71J11r3N7Q2M9j37M9K14
6192B21j45l53J92L1L95l59r4J15L4K22k45L7m4MR7j62J69m1n7K26k55m5j21K07
6216B9j29K7j28PJ52J9lr7K4qJ86l9j69j46O04j20k54j88J43K27r7k30P2J1L94
6241B87m76l70Q16l07J97n8j93j80M34k11J91m15q5L56N9k79j25K79K34r6Mqm0
6264A4K11k28l11J92M19j29L9l82K7M09l21j54M0L8M70J46k83m43p2L67J62k13
6286bj74M05Kj28q2o1N06j56j77l09J71p6J20j7l18j0K44J57k99lM33q0m2l23
6310b19q3L15K94l73k75P4J89J97l32k03M82n2R9j66k10K99R5n3k0k53K95N7J02
6333B59j30m76K70K12K5l4j94l1N06j03k94m7L32J77m05O3p0L02k20N1m31J90
$$ plain form
6169 214 -5 -122 -17 182 181 137 17 -99 35 -12 137 -19 178 160 -111 0 -93 -36 46 95 -42 7 221
6192 221 76 -277 -85 -54 341 -18 -112 3 37 259 14 51 7 11 108 -54 115 74 17 243 -12 -57 -178 29
6216 29 -100 -73 -201 -194 -42 -23 -26 -123 -99 -107 79 40 -129 -275 329 209 -45 -233 -90 137 40 -190 -118 -107 287
6241 287 -189 -559 257 -50 147 89 -104 -284 150 -61 130 -285 -370 -14 45 -234 -359 -80 154 58 62 54 14
6264 14 225 -3 -314 -122 297 168 207 -175 -148 261 -60 -214 -174 -136 334 480 197 -246 -318 49 211 -2
6286 -2 -176 229 231 103 21 -40 466 310 133 -176 -5 -81 39 22 -296 -306 -62 95 -204 -207 226 146 104 -219
6310 -219 -302 13 307 -66 -341 -267 -78 119 -213 -416 66 14 113 -53 -263 36 131 78 58 -195 100 157 259
6333 259 129 -347 -77 135 160 126 -68 -99 407 304 10 -37 295 472 67 130 60 362 142 193 -238 -48
6355d8J61K7j58j89K17K23o3j95j06n4L47Kk32j23J03M11l84Rp1L50Q2j61n32
6378c84K85L50J97n26q6K23M8K72k91m09L04KN9j27k3k33K92J50k57j42M31J27
6400B62m65R3k66L46K52k77r9P6M09j33j64q8M1J31j00j89P1R3K35l15m84M62
6422a09L69K21l46m40K26K14J49l28o1rO0L01k89k14K91Q1L4l15j46J08K14N8
6444F9j29k30J91K30r7m89N29k8k0K5j75j0L92q3j74k12q2M01J31k55j41o9M68
6467B42j86k68k9L1L70o5j73l09M42J46j16j62r1K18Q2l9l92N4L23L4l38O2K05
6490D1O8J96m27l3M72j25R0l73Nn8K80L7j62k68O78j21k23j02j33M88k3l3n68
6513b94K00N41l29k99k58N62L2R9m46k87M32J75k8m25rL55K18j20m30k7M90j69
$$ plain form
6355 -48 113 140 -18 -207 10 233 170 -25 -131 -185 162 164 -68 -191 -88 323 -61 -52 -123 227 309 148 -384
6378 -384 -99 251 448 -78 -164 59 107 379 88 -321 -17 -15 44 -83 -106 -339 -47 103 -154 -296 135 262
6400 262 -203 -110 -376 -30 222 -55 -154 -78 331 198 34 -54 -13 118 18 -171 -100 -7 228 -87 -571 -109
6422 -109 260 481 135 -305 -79 135 284 -44 -105 -114 -54 247 -42 -256 35 116 150 -165 -311 -203 11 69
6444 69 -60 -290 -99 131 34 -455 74 46 26 51 -124 -134 258 175 1 -211 -293 108 239 -16 -157 -226 242
6467 242 56 -212 -241 -210 160 95 -78 -387 55 201 85 -77 -168 50 132 93 -299 -245 78 112 -226 -164 41
6490 41 109 305 -122 -155 317 192 282 -91 -86 -144 136 173 11 -257 421 300 77 -25 -158 330 307 274 -294
6513 -294 -94 447 118 -181 -439 123 155 254 -192 -479 -47 128 100 -325 -334 21 239 119 -311 -338 152 -17
6535a7j39j28L5L51K9k32j11P1L25j88k7j08o8L09Q7m43j03L12J47nk59L9L97
6558B74j2k15j16m1M60J27l93k50J17J40K35n17o0K38K63j92k03K9K56J03J12
6579C55m09k21L12L22j97j61j81J32L39l68q1K74q4K03n16j63K25K55J81l00l81
6600d64K13L16L9j95l08M85O6q1n19L22J98M22m24o71M39L60j97J62n44L47J58
6621A24J41l32j58K68R0j50q4j75J91N28l63j86n3J25J05j95J87j63K65L11m07
6642F9j88J38K05N9j62j81n6J41J83r8k29J41K15L1m63j03K78R5J4l64N4J52J43
6665G4o4l21J37K14q4l5m35N12J34J0k37p2N3J51Q6m92K2J21L58K5k75k1J97P9
6689A37j05l44j50L22M00j73j09j70K20J61l31P4J28K7J51m72J01K05O4K09j62
$$ plain form
6535 -17 -156 -284 -249 102 131 -101 -212 -141 184 -4 -31 -139 -207 102 189 -254 -357 -45 102 97 -162 -123 274
6558 274 262 47 -69 -110 350 477 84 -166 -49 91 326 -191 -251 -13 250 58 -145 -116 140 243 355
6579 355 -54 -275 37 359 162 1 -180 -48 291 -77 -158 116 32 235 -281 -444 -219 36 217 -83 -464
6600 -464 -251 65 104 -91 -399 86 152 71 -448 -126 72 494 70 -601 -162 198 1 163 -381 -34 124
6621 124 265 -67 -225 43 133 -17 -101 -276 -85 443 80 -106 -159 -34 71 -124 63 -100 165 476 69
6642 69 -119 19 224 283 121 -60 -116 25 208 110 -119 22 237 268 -195 -298 -20 75 89 -275 -221 -69 74
6665 74 10 -311 -174 40 -44 -79 -514 -2 132 142 -95 -167 -114 37 123 -369 -347 -226 132 157 -118 -139 58 137
6689 137 32 -312 -462 -140 260 87 -22 -192 28 189 -142 -68 60 87 238 -234 -133 72 136 345 183
6710A83k95K10L5J61n1n75M83K50k86j4k62J88K10k02j48p2L04q0k11o4K63Q8
6732A15j3J15m79K93J6j7j96l4N5L65l94k07L29l03M82l44o6M0j04L95J58n47
6754c41L12oL12m87O8J39K18Lm92J2j07L74k8j01L6K41j00q9j38J47L74l70K29
6777B06k19L17j90q6K31l80O9K13j3k03J76j41K42j54j82k58L40l5K57k03K32
6798B19k08R5K59n59M0J13m7K65k08K0K72j24l02K44J26k81n1J55p6P4m0m3MP4
6822B1j08J42L7p2k11K60K77l57O7J2J20n7l5K15j91k33K80j16j41J58j38R2l6
6845a4j16L43m13K36R8j4N0q0l57j02M51J94l58k2N8J93n5j7k40K30j22L5mL25
6869B99m52N02j34l70L06l15K71k56K70j98o9J76J63k48P7k3Kj25K00k12J87N1
$$ plain form
6710 183 -112 98 133 294 243 -332 151 401 115 101 -161 27 237 35 -113 -185 119 39 -172 -236 27 115
6732 115 102 217 -262 31 47 30 -166 -200 -145 220 -174 -381 -52 -355 127 -217 -283 -243 -347 48 206 -341
6754 -341 -29 -35 277 -210 -142 -3 215 218 -274 -262 -369 5 -23 -124 -88 153 53 -36 -174 -27 347 -23 206
6777 206 -13 304 114 28 259 -121 -52 161 148 -55 121 -20 222 68 -114 -372 -32 -67 190 -13 219
6798 219 11 106 365 -194 -154 -41 -88 177 -31 -11 261 137 -165 79 205 -76 -127 28 -48 26 -14 -57 -53 21
6822 21 -87 55 92 20 -191 69 346 -11 56 68 188 131 96 311 120 -113 167 51 -90 68 -70 22 -14
6845 -14 -130 213 -200 36 134 120 170 90 -267 -369 82 276 -82 -104 -46 147 92 75 -165 65 -57 -22 -26 299
6869 299 -153 349 215 -155 151 -164 107 -149 121 -77 -146 30 193 -55 22 -1 1 -124 76 -136 51 102
6891A02K4o0Mo8K03l72K01m4J2k93L17j73J56l20J15K00o3P6l34J10J08j25J88
6914c6J62k71K23p7j03J57m53L36k76K81l1K9OO7ok73L06j39J80M2%L7j3l6j73
6939f1R2R3L1j85p6J85K2j56R4k08L51k3k05J79m41K60K19k07L48n87M1M63k50
6962b1k87K86k6R7P5l10M3R2m6j92M1L2K96k65L37l55O0M5o2j50J54R6P0j15j62
6987b67J93k97K88Q7j94O0J31K36%k61P6o3J40j68j5N2K64J59k98j47j45K41L9
7010A11j78J62J2O4k13O1k38K75R4j11l0k10L28J1l3k78P2J93Q2j50Ql41M20J14
7034B25l05J60j29K29j63j21j2Rj21M05m15K5J37L97o5m57j18J62L55j95q0j74
7056b51J12J78M1m62M61J5k54K06k97K74l5r5j18R9J17K03M6l70k42M29L91m63
$$ plain form
6891 102 126 66 70 2 205 -167 34 -10 2 -291 26 -147 9 -311 -196 4 -59 17 -317 -207 -99 -224 -36
6914 -36 126 -145 78 1 -102 55 -398 -62 -338 -57 -88 -59 -53 14 8 -265 41 -98 82 124 124 161 148 112 -61
6939 -61 31 124 155 -30 -106 79 101 -55 39 -169 182 159 -46 133 -308 -48 171 -36 312 -275 -234 229 -21
6962 -21 -308 -22 -48 49 124 -186 -143 -51 -97 -289 -248 -216 80 -185 152 -203 -143 -98 -160 -310 -156 -60 10 -105 -267
6987 -267 -74 -371 -83 4 -190 -130 1 237 237 -24 52 -11 129 -39 -54 -2 262 421 123 -24 -169 72 111
7010 111 -67 95 107 171 -42 19 -219 56 150 39 9 -201 127 138 105 -173 -101 92 174 24 32 -309 111 225
7034 225 -80 80 -49 180 17 -104 -116 -107 -228 177 -238 -213 -76 321 256 -201 -319 -157 198 3 -77 -251
7056 -251 -139 39 80 -382 79 94 -160 46 -251 23 -12 -107 -225 -126 -9 194 240 -130 -372 57 448 -15
7078a5k81K35M6r3K5q1R6J75o1n6j59J92K45j07j43j77K10J09nl82NL5L91l45
7102a41J08N4J4R3r7k75J79J13R9n3k71k1M07j37j65k6MK38k87n0K23j15K27K7
7126A48l34o6K00K14j85r7P3L03l10N7n9o9J61j04q0K08k76K95l0m9k70K74m5
7149d1J40m65L91j08L07J1m72J86J90K04k07k42k1J87J24k72P5k5J42o6k57K8
7171a91J37o3M73o35N8Q6K68j03j07k25K36L48k49O2l68L09K29m55j35K90R3K1
7193G9n9l87K57K06J24k57l63M81o3J95k82n2M93o2k53k07m9L78R6k57M2K3j11
7216b8J19J38n03K54J11J07j10k24R0K52R3k85l22L80K14k30j98R0K47J93k18
7237A70j6J4o4Mq2j59K61l1j75j25q1M3M77j26k71m0J59M46k44l21j03M16Rk7
$$ plain form
7078 -15 -296 -61 -15 -108 -83 -164 -68 107 46 -10 -169 23 268 161 18 -159 51 160 155 -227 -222 -187 204 -141
7102 -141 -33 21 35 128 31 -244 -65 48 147 94 -177 -198 209 72 -93 -119 -115 123 -164 -214 9 -106 121 148
7126 148 -186 -252 -52 162 -23 -120 -47 256 -54 3 -56 -125 36 -68 -148 60 -216 79 49 0 -270 4 -41
7149 -41 99 -366 25 -83 224 235 -237 -51 139 343 136 -106 -127 60 184 -88 -13 -38 104 38 -219 -191
7171 -191 -54 -117 356 -279 -221 -135 133 30 -77 -302 -66 282 33 95 -273 36 265 -190 -325 -35 58 79
7193 79 20 -367 -110 96 220 -37 -400 81 18 213 -69 -121 372 310 57 -150 -199 179 275 18 60 83 -28
7216 -28 91 229 -274 -20 91 198 88 -136 -46 206 299 14 -308 72 286 56 -142 -52 195 388 170
7237 170 154 168 104 108 26 -133 128 97 -78 -203 -284 -241 236 110 -161 -201 -42 404 160 -161 -264 152 161 134
7261A34k91q9L73N4r5k98N9R0J15j1j98N6L46k84J84j03k72N60l53J34q1j14M04
7284C20k71k67M2K31j8o2o0p2J92N3n3l00Q7L56J68n44J11j3K70M1k02k26K2L55
7308A60j67k21KK04J41o5j37j78M24j7j46j91J90J52K22l55l06L73Q4J92l57r4
7330i0K68r6p2l03N9P7J56J17j63j15J15K08j50k72r0K95j33j11m7R0M63j87j54
7353a35r4J86K79o8j92l47O54n2o0k94o2K29J18r0j08j55M37L6k77l20K98j8K10
7376A75j12k48K45J89J8m1j92k23M34O9l18j4N9QK73l77M4Rk5J66k4k29K45n4
7400G7ll63J63N7K54l61l7M7J59K0k99M52j16J94o8l66o5K44j48J88k74L3K31
7423A9p0k1j31O8N5J74j90K86k48J00k31K7j41M18M7l0j38k62L25J26J05m06l6
$$ plain form
7261 134 -157 -246 127 181 86 -212 -153 -63 52 41 -157 -101 245 -39 145 42 -230 330 -23 111 30 -84 320
7284 320 49 -218 -176 55 37 -25 -85 -157 35 88 35 -265 -178 178 346 -198 -87 -100 170 211 9 -217 -195 160
7308 160 -7 -228 -226 -22 119 54 -83 -261 163 146 0 -191 -1 151 373 18 -288 85 169 361 4 -90
7330 -90 178 82 10 -293 -234 -157 -1 116 -47 -162 -47 161 11 -261 -351 -56 -189 -300 -347 -257 206 19 -135
7353 -135 -229 -43 236 168 -24 -371 283 231 171 -123 -185 44 162 72 -36 -191 246 282 5 -315 -17 -35 175
7376 175 63 -185 60 249 267 226 34 -189 245 314 -4 -18 41 49 322 -55 -11 -2 -27 139 115 -114 131 77
7400 77 74 -289 -126 -69 185 -176 -213 -166 -7 13 -286 166 50 244 176 -190 -255 -11 -159 29 -245 -212 19
7423 19 -51 -72 -203 -135 -80 94 -96 190 -58 42 -189 -162 -303 115 162 132 -6 -268 57 183 288 -118 -154
7446a54L25j75r0j20p2L65j00j77R2J96m5o6k79K57Q6j95L45k01j24J16J04j22
7468c4r5OK45L2k30J62k41J87K09k28J8j29J60J08lk62o6L0K56j11j19L4J58m2
7492D5M8k33m2L52n3l1j67L3L9J73j24k6o9K40k19j71L38J13j34p8l44L46qJ14
7516A42k50Lj5Q4J60k82J04n1N74o43K66l5K6O0j31k29J24j6J23qp6j29K83k21
7540a37J53j36J74J89j4kl15K48j4k09k5P6q3K47l4l41J75r0Q3P3k7l08J93L84
7564B60l64Mj02K14l4k3RL8L4J35m04L12Q6j81r7jq3J81j09j20L53n4j36R0P1
7589G9o7J18j76R5k83P7R6J27j03J79j33J34N5k63J53j70Lk7K11j08l6J63j22
7612Bn6j28L13J21j43q9k11J83J7L43m89J00J38p2P9Q2p8k0Pj85pJ53P2r2P0%
$$ plain form
7446 -154 171 -4 -94 -214 -286 79 -21 -198 -106 90 45 -21 -300 -43 43 -152 193 -8 -132 -16 88 -34
7468 -34 -129 -123 122 154 -76 86 -155 32 241 13 31 -98 62 170 167 -95 -161 -131 125 14 -105 -71 87 45
7492 45 93 -140 -182 170 117 86 -81 -48 -9 164 40 14 -55 185 -34 -205 133 246 112 34 -310 36 28 142
7516 142 -108 -105 -120 -36 124 -158 -54 -105 469 -174 92 57 83 143 12 -217 -93 -109 14 6 -70 -199 84 -137
7540 -137 16 -120 54 243 229 227 -88 160 146 -63 -88 -12 -95 152 118 -223 -48 -138 -55 18 -9 -317 -124 260
7564 260 -104 -100 -202 12 -22 -45 -36 2 36 171 -233 79 165 -16 -113 -114 -197 -16 -125 -245 108 54 -82 8 79
7589 79 12 130 -46 49 -234 -157 -61 66 -37 142 9 143 198 -65 88 -82 -79 -106 105 -3 -39 124 2
7612 2 -54 -182 131 252 109 20 -191 -8 9 352 -137 -37 101 29 108 190 112 92 99 -86 -93 60 132 40 110 110
7638A10p4r4j73M26k46j7p7l5J55k14K19p2j62J39l8K34k68%K52q3l7j69K26j93
7662a91k4N3K44k6K6j70J33j38l4L2l1J33j91K64l3l3j04J42jJ29m44K60L0l1
7686eJ30j33k6Q4K4j14Q9L4K31j67j24K10j69p7J85j20J64k58pJ79k40J64o0n1
7710e7K12k29r7K95k21K44N5l42L2K56k41m6o4M02j85j30j7J2Q7J35j81J13q0
7733d7k5J72q7j09j03R2K9Jq2J93L6l3p8k8n3J11P3J7L0p0J10k29J38k5j5l1l5
7760d8J7k9L54p8k48n0J53j30n2j80J53K29q6n5J57k46jJ15j73m5L44mn0j30r1
7785a74J14K58j42m4j01J31l6kJ02k60L62m19K34q2m1J59K09m37p5J12M43qm20
7808a17L0J88M6o8K7k73O8nk18L45J1J5J39m42J44K67J70k11j6J2j66K24j35K67
$$ plain form
7638 110 36 -58 -231 195 -51 -68 -145 -180 -25 -239 -20 -92 -254 -115 -153 81 -187 -187 65 -18 -55 -224 2 -191
7662 -191 -215 -162 82 56 82 -88 45 -93 -127 -95 -126 7 -184 80 47 14 -90 52 51 180 -264 -4 26 -5
7686 -5 125 -8 -34 50 74 -40 49 83 314 147 23 233 64 -13 172 52 216 -42 -49 130 -110 54 -6 -57
7710 -57 155 -74 -171 124 -97 147 202 -140 -108 148 -93 -139 -203 199 14 -116 -133 -121 -34 101 -80 33 -47
7733 -47 -72 100 13 -96 -199 -107 -78 -77 -159 34 70 37 -41 -69 -122 -11 62 79 109 39 149 -80 58 33 18 -13 -48
7760 -48 -31 -60 294 216 -32 -82 71 -59 -111 -291 -138 91 5 -50 107 -139 -140 -25 -198 -243 101 97 47 -83 -174
7785 -174 -60 198 56 12 -89 42 6 4 106 -154 208 -211 23 -59 -100 59 268 -169 -244 -132 311 303 -117
7808 -117 -87 101 147 79 106 -167 -99 -104 -322 23 34 49 188 -254 -110 157 327 116 100 112 -54 170 35 302
7832C02l47j9k1K46k1m40L68j02O0J13l88J84K63n7j76R1m2o0rj97L38k14J64
7855C6R5k80q4K20J99k35j77J18J77p1k52K8m6L82k38K30l52j9J91M1j83j11K62
7878f9J33o4Q3j54J59j29J06j46J28rr2K38k79k39K32L16j68J74n00K07L22l14
7900f5j57L28k5K08l38lJ7K69j36k2j18o5J93j12r7Q7K0p9K09l71J82K01n9j80
7924a13M7k07M33O5m11m4K80J76m1j53l2j97L77L2k50q1L63j70j2k26m1R4K53
7947A42r7l23J37j46L14k59L0K58q3N1k87O2m8J64J39n3j97J14Q7N2k41J29N8
7970CK60k73ko4J29q3j1j64L07J15J6j64L3j26K25j72j4K2l4K70l23Q7k4M2m3
7995A2n3r6J02n4K09K8l79K69O6R8k8l71j2K86n7j72k00J4N28k59k15J86R5N5
$$ plain form
7832 302 -45 -64 -85 161 140 -300 68 -34 26 139 -249 -65 198 141 -35 56 14 -46 -55 -252 86 -128 36
7855 36 131 -149 -233 -13 186 -49 -226 -108 69 -2 -254 -226 -272 110 -128 102 -250 -269 -78 -37 -220 -331 -69
7878 -69 64 0 83 -71 88 -41 65 -81 47 38 -54 184 -95 -334 -102 214 46 220 -280 -73 249 -65
7900 -65 -222 106 81 289 -49 -52 -35 234 98 76 -42 -107 86 -26 -123 -36 -16 -95 114 -257 -75 126 67 -113
7924 -113 -66 -273 160 225 -186 -230 50 226 185 32 0 -197 180 212 -38 -119 244 74 62 -164 -205 -111 142
7947 142 45 -278 -141 -287 27 -232 -202 56 -27 24 -263 -201 -249 -85 54 1 -196 -82 5 57 -184 -55 3
7970 3 263 -10 -12 -76 53 -30 -41 -205 102 217 233 69 102 -24 201 29 15 37 3 273 -50 37 13 55 12
7995 12 -41 -137 -35 -89 120 148 -231 38 104 202 174 -197 -209 77 20 -152 -352 -338 190 -69 -284 -98 -3 52
8019E2J24j75m0j15L15j82Q5j35l1L62l59M4j8K86k49j20Q6r1J84J78k38k7K36
8042A72K9n0r7k27L09J94m07q7L14p7K10l01j47j74O22J42m09r9O1J66r1Q0j78
8065d5p2N5MN3j44L14j68J0j83K62j4J03l93l8J74j34J25k4K21j59O6J39q6j41
8089g5J18q9J26pj25O1J08k18Jo3K14J2l17K29j18K34M0k41J8k6L23k82O2o3J08
8114C0K28k5m43p4L23m2J10l13J12O4P6k31L69l25M9N40j62m94N2L07o5m3P0j47
8138c4L61j56o4l2k31QL28l27J47n3P6j64p0J21k30J74K97l35J86j94K40J52k77
8161g7j41L92r8j08J3k47N40k06K9q9k6o9R2r3P9J16K15j69k53J23L60j63Rk99
8185g0l8J43k00k2J85k3
$$ plain form
8019 52 176 1 -39 -154 161 -21 64 -71 -102 260 -99 -55 -73 213 -36 -156 -70 -161 23 201 -37 -64 172
8042 172 201 151 54 -173 136 330 -77 -164 150 73 283 -18 -165 -339 283 425 16 -83 -22 144 53 133 -45
8065 -45 -117 -62 -58 -5 -149 165 -3 7 -176 86 72 175 -218 -256 -82 -216 -91 -115 106 -53 13 152 66 -75
8089 -75 43 -46 80 73 -52 9 117 -101 -100 -163 51 63 -254 -25 -143 91 131 -110 -92 -118 205 -77 -15 -78 30
8114 30 258 233 -210 -284 39 -3 107 -206 -94 -30 46 -185 184 -141 -92 448 286 -208 -156 151 86 43 113 -34
8138 -34 327 171 107 75 -156 -148 180 -147 0 -53 23 -141 -211 -90 -320 -146 151 -184 2 -192 48 200 -77
8161 -77 -218 174 76 -32 -19 -266 274 68 97 8 -18 -87 5 -88 -9 107 322 153 -100 23 383 220 229 -70
8185 -70 -108 35 -165 -187 -2 -25
8191b5
$$ Imaginary data points
##PAGE= N=2
##DATA TABLE= (X++(I..I)), XYDATA
0@%%%%%%qQqJ6k4L2m0M8n6P2r6J20j44J76k08K48k96L47m07M76n52O40p39Q50
30D55r76J113j261J430j619J821k045K297k570K865l192L550l938M361m827N333
46B797n886O495p158P883q682R564j0540J1625j2841J4208j5754J7527j9583K1994
60A1649k4869K8372l2746L8385m5972N6772p3471J02951j70247N96350K67341
71G54515p27772K39233m0061M18549j04029n99004M1118L09668J26269o9779n22125
82a73418R2651L81080M1978j49022l64461N6725M74391q7636k75890j30405O512
93a27495L37986P7850m82621p5615K31653J69697K8726l61469q9293L41162J47705
104A98286l8978k80175o9276M25791Q1128j54688j24866j25989M03003J36864
$$ plain form
0 0 0 0 0 0 0 0 -8 0 -8 8 -16 16 -24 24 -32 40 -56 64 -80 96 -112 136 -160 187 -220 256 -296 344 -395 455
30 455 -521 592 -669 761 -858 963 -1082 1215 -1355 1510 -1682 1868 -2070 2291 -2536 2797
46 2797 -3089 3406 -3752 4131 -4551 5013 -5527 6098 -6743 7465 -8289 9238 -10345 11649
60 11649 -13220 15152 -17594 20791 -25181 31591 -41880 61071 -109176 487174 754515
71 754515 26743 265976 225915 644464 540435 -58569 -17451 292217 418486 348707 -173418
82 -173418 -80767 300313 342291 193269 -171192 -114467 359924 272288 -3602 -134007 -127495
93 -127495 210491 288341 -194280 -269895 -38242 131455 160181 -201288 -290581 50581 198286
104 198286 159308 -120867 -190143 235648 316776 162088 37222 -88767 314236 451100
114D51100l64208n1593K8465J99006J65490l35097j49791J89621J80314M6053
124C59360k90794r9487K51853J12276l924k37100j48595L20343J21777k17450
134A68259j42130o3576J73715J82515k68532k28949J11928J46026O5771j87967
144d2940k12955J35651K01642K2788k15160j69064K38562J61436r5321j18885
154i4246j57205J82381K55620k18121j78123K4257J12384K00106j57776k48303
164b79026J02068J98051Q7961j60384j70758J25827J86770O0845j45408k02646
174a96700J72870K37536r2532j45805r4356R6505K31022q1809k44827n917J53046
185B9033J25220o8197k22793R142J96290J01913j19552k09512Q7724J96574N188
$$ plain form
114 451100 86892 35299 63764 262770 428260 93163 -56628 132993 313307 359360
124 359360 68566 -30921 220932 333208 329284 92184 -56411 263932 385709 168259
134 168259 26129 -37447 136268 318783 50251 -178698 -66770 79256 145027 -42940
144 -42940 -255895 -120244 81398 104186 -110974 -280038 -41476 119960 24639 -94246
154 -94246 -251451 -69070 186550 -31571 -209694 -185437 -73053 127053 -30723 -279026
164 -279026 -176958 21093 109054 -51330 -222088 -96261 90509 151354 5946 -196700
174 -196700 -23830 213706 121174 -24631 -118987 -22482 208540 126731 -118096 -124013 29033
185 29033 154253 86056 -136737 -127595 68695 170608 51056 -158456 -70732 125842 131030
196A31030j04257j62394L5086K54902k9252k17334m5671O6040J70616n855k18822
207a25911m5646J42413J45619o2312j82575O151J52017R6335n0248j89337J1937
218a01557K23601N824j06316q4682j2549J74128O1967j79775q6999R8875J07943
229A00460J8242j32859p7300J01081J22942n824j64466l0511J34246O4164k8410
240A01765j21711o9587J62037Q8360j40981p5456Q68R0058R3555j15401j22961
251a09454N1663J31174K4129j19502p7068P0907J04228K2249j21090r3146J29975
262A4065R1426n1993p9019o3866R0162J29570q0917j30065K7502R4833O1768o0353
274D3113j08353J9476J16015N8979j07573r3836P7694Q8307P004p1335j00517
$$ plain form
196 131030 26773 -135621 -100535 154367 125115 -92219 -137890 -71850 98766 92911 -125911
207 -125911 -171557 -29144 116475 54163 -128412 -122261 29756 126091 75843 -113494 -101557
218 -101557 122044 127868 21552 -63130 -75679 98449 160416 -19359 -106358 -7483 100460
229 100460 118702 -14157 -91457 9624 132566 126742 -37724 -68235 66011 130175 101765
240 101765 -19946 -89533 72504 160864 19883 -55573 -54705 35353 128908 13507 -109454
251 -109454 -57791 73383 97512 -21990 -99058 -28151 76077 98326 -22764 -115910 14065
262 14065 105491 53498 -25521 -89387 775 130345 49428 -80637 -53135 41698 103466 43113
274 43113 -65240 -45764 70251 129230 21657 -72179 5515 93822 100826 29491 -71026
285g1026O9848J33039n8586r7212j9237M5634R8858k9206j30967r546J02066N5768
297H9433p0040q9404J7083P3870N0926o0855j16519N0915J08527k4892n7755n4093
309h2804J3121J15973r680j12728j2080N7276N5581r473q2280k7385P3311O5904
321D4736m3904q8713K6495O9298J4591j2673p6749k585J10509N631p2268j8732
333d4364J3384O0173L2046q1701l7465N3508N2595j2377o1283j2615L1228N1257
345D4386p01q4571j0046Q2309O585k9610k2980l4329O6487M2245o5614l4587J9205
358b1221L8655J6028l7580m4574J8236N3703P765o4901j4588M3802J0650K1332
370B7307m1371m6383O8325L8938m0611j9108m453K1085N1100l0085m9209J1442
$$ plain form
285 -71026 -1178 131861 73275 -23937 -43174 2460 101318 72112 -58855 -68401 33665 89433
297 89433 19393 -70011 -52928 20942 71868 11013 -105506 -54591 53936 29044 -28711 -82804
309 -82804 -69683 46290 36610 -76118 -88198 -30922 24659 15186 -67094 -94479 -21168 44736
321 44736 832 -87881 -61386 7912 22503 9830 -66919 -69504 41005 46636 -25632 -44364
333 -44364 -30980 29193 61239 -20462 -57927 -4419 48176 35799 -25484 -38099 -6871 44386
345 44386 43685 -40886 -50932 31377 37962 8352 -14628 -48957 17530 59775 -5839 -40426 -21221
358 -21221 17434 33462 -4118 -48692 -30456 23247 31012 -33889 -48477 -4675 5975 27307
370 27307 -14064 -60447 7878 46816 6205 -12903 -17356 3729 54829 24744 -24465 -13023
382a3023M3933J7571m3492j8749P882K9149L2240m8470m1443N5122K4112j6568
394B8264k402m2154K6991O0033l3836l7616L959K5032J8214j5516l3015q812L0451
407A9593K8284m2056l1188L3352L322J4135o852m8351L2088M1028k6313j1354
419E688J5j792L3124l271l3753m069K3219J7063k7811q762P091n113K7029o851
433B1807l8448K8541J5040j6915J8622j6680j0278L3861q242j5937M547q66j951
446A3101l247J237j2657j1461J9067j3445j7551K3687j8271r664K7085k0025l665
459b5809J9851k0010M918J4922j5618l732N119M03n277l235K12j5349Q341J7382
473a7882l0708J648K1236j9325J9974O198k9570K3099J8500j0852N465k876k431
$$ plain form
382 -13023 30910 48481 4989 -13760 -5878 23271 55511 7041 -34402 20720 44832 28264
394 28264 25862 -16292 10699 70732 36896 -720 3239 28271 46485 30969 -2046 -10858 19593
407 19593 47877 5821 -25367 7985 11307 25442 18590 -29761 2327 43355 17042 5688
419 5688 5703 3911 37035 33764 11 -4058 19161 36224 8413 -349 6742 1629 28658 21807
433 21807 -16641 11900 26940 10025 28647 11967 1689 35550 27308 11371 15918 15052 13101
446 13101 9854 11091 -1566 -13027 6040 -7405 -24956 -1269 -19540 -29204 -2119 -22144 -25809
459 -25809 -5958 -25968 -21050 -6128 -21746 -25478 -20359 -19956 -25233 -28468 -28256 -43605 -35264 -17882
473 -17882 -48590 -46942 -25706 -45031 -25057 -18859 -48429 -25330 -6830 -17682 -12217 -15093 -17524
486a7524J6027M953q651j6380J3254J2860j8401R071j0788j3049L4288p364k6554
499b8258K0147l67l140K0270k0901p170J8520M864q724j6114N511K028j066J454
513a2946k5192q197L1663j3548j8520J2191j9878J9382K1179l3944j354K0630
525b8534L478K104n039q399R255J2328M522k4876j48K9160j5567M332m61j9102
539c6947L4614J0964l1712J1153J6756K246J8807j6854j1333K5370J9835p064
551C5835k8960R123K0436o44j619k6443j2746M3727L46m0331M739k057J6759K0734
565C8899m2181j7315L2248J6600j1753k6675r739K3958J5439j0813m0876r699
577d1907M9654k971l0232j1456j3580L7839K7047n1078j9653K9762K1183J2965
$$ plain form
486 -17524 -1497 3456 -5195 -21575 -8321 4539 -13862 -4791 -15579 -28628 5660 -1704 -28258
499 -28258 -8111 -8478 -11618 8652 -12249 -19419 -899 3965 -4759 -20873 -15362 -13334 -14400 -12946
513 -12946 -38138 -46335 -14672 -28220 -46740 -34549 -54427 -35045 -13866 -47810 -49164 -28534
525 -28534 -25056 -22952 -27991 -36390 -27135 -14807 -10285 -35161 -35309 -6149 -21716 -17384 -17845 -36947
539 -36947 -2333 8631 -23081 -11928 4828 7074 25881 9027 -2306 23064 42899 35835
551 35835 6875 15998 36434 35790 34171 7728 -5018 38709 39055 -1276 3463 1406 18165 38899
565 38899 -3282 -20597 11651 28251 16498 -10177 -19916 4042 19481 8668 -32208 -41907
577 -41907 7747 4776 -25456 -36912 -50492 -12653 14394 -36684 -56337 -26575 -5392 7573
589G573k7458k6940K8713L6498j54m0184j1571L6712J8078m263k6591k5966M4624
602I071L4668l8928j9490O594J8780L5883k2304m5061K0063L9112O951k6697k9126
615a0484J1913L3441J0365l8547l7231K9952L1868j6524k3514k8882J2000N2602
627B6959j9868m9703K320K3281K3433o766m3382r928M1507K2189k9656l6660J0646
640d5628L0246J3423k0952m5471J6221N1897o812l5542j1910J2033M1168J1283
652I956n2217j3374M3064K9196j2299l4583q831L4719L6270k3063m6574P635M6988
665A6887R451k6041k9445j512N4472J3539n1261k0442K8281L1145M190l7003l2175
678c9914L7414M1626j9758m5302n622L3721K5257j3764n0199n245N1164J8825
$$ plain form
589 7573 -19885 -46825 -18112 18386 18232 -21952 -33523 3189 21267 17004 -9587 -35553 9071
602 9071 43739 4811 -14679 -8085 10695 46578 24274 -20787 -724 38388 45339 18642 -10484
615 -10484 1429 34870 45235 6688 -30543 -591 31277 14753 -8761 -37643 -25643 26959
627 26959 7091 -42612 -40292 -17011 6422 -344 -43726 -53654 -12147 10042 -19614 -56274 -45628
640 -45628 -15382 -1959 -22911 -68382 -52161 -264 -7076 -42618 -54528 -42495 -1327 9956
652 9956 -42261 -55635 -12571 16625 4326 -30257 -39088 -4369 31901 8838 -37736 -30101 16887
665 16887 26338 297 -29148 -30660 23812 37351 -13910 -34352 -6071 25074 29264 -7739 -39914
678 -39914 -2500 39126 19368 -25934 -31556 2165 27422 13658 -36541 -41786 9378 28203
690B8203l8537l0581R702L5108K6336m1153m1912L2820M4047o019l5022k2367
702c9375K0927M9525p059n2710j1213M2402K9752j9710l5263j2836M3372L6998
714D4810l5247m1812J6357L8493J5344k1891m3905J3119N4527L752m3305k2220
726b1978K1857L5074P277m3410k9302L6105M0419j8113l9777p723K5493L8510
738D4432j3437n4772J649M7622J5646k4531l4689l456M7797K2102m2409l6592
750c0638K1845M2640J901l3917l0658J8747N3534m692n5158r251L4426K9366l710
763C4435m8013j8350N0437L1043l1455l8519O74L9367K5711l0367m6382J1367
775b0052N2908N919m2590k5352J4923M1177J2514n2816k9946M2905L2621j2824
$$ plain form
690 28203 -10334 -40915 -31213 3895 30231 -10922 -52834 -20014 24033 18014 -17008 -39375
702 -39375 -18448 31077 24018 -28692 -39905 2497 32249 12539 -22724 -35560 7812 44810
714 44810 9563 -32249 -15892 22601 37945 16054 -27851 -14732 39795 43547 242 -21978
726 -21978 -121 34953 42230 -1180 -30482 5623 46042 27929 -11848 -19571 5922 44432
738 44432 30995 -23777 -22128 25494 41140 16609 -18080 -21536 26261 48363 5954 -30638
750 -30638 -8793 33847 35748 1831 -28827 -10080 43454 38762 -16396 -25647 8779 38145 34435
763 34435 -13578 -31928 18509 49552 18097 -20422 -19748 19619 45330 14963 -31419 -20052
775 -20052 32856 38775 -3815 -29167 -14244 26933 39447 -13369 -43315 -410 32211 19387
787A9387l8165k1835L5937M1777k4993n0446K323M1784K1318k6488l9707j0M9690
800A0572K2103m8325l0967K3988L5856R365l6676l6379L0927M8090j4184m0673
812b6303j3660K9709L6100r532m7253j1092M7938K4201k7062l3608J099L5900
824F437K7461l0682m4680K1340M0505M213k9556k9369J3796M4943L472m7525j7059
837c6704K9852L0649o841l6680j9400L2697L9001k5033m0268J871L1883K2554
849B3581j7700m2410N16M9228J1229l4512k5403J0712L4910J4708l5342l4018
861d4501K9143L7595o095l2999j7557K2947L7015n316m5649p299L7673K2859j6545
874A1271l1650p748L6883L0257l4121l3928J5826L2202J2550k5639l2883J4082
$$ plain form
787 19387 -18778 -40613 -4676 37101 12108 -38338 -36015 5769 27087 599 -39108 -39118 10572
800 10572 32675 -15650 -46617 -22629 13227 22592 -14084 -50463 -19536 28554 14370 -26303
812 -26303 -39963 -10254 25846 16314 -30939 -42031 5907 30108 3046 -30562 -29463 6437
824 6437 33898 3216 -41464 -20124 20381 24594 -4962 -34331 -20535 24408 27880 -19645 -36704
837 -36704 -6852 23797 16956 -19724 -39124 -6427 32574 7541 -32727 -30856 1027 23581
849 23581 5881 -36529 -36013 13215 24444 -10068 -35471 -24759 10151 24859 -10483 -44501
861 -44501 -15358 22237 16142 -16857 -34414 -11467 25548 20232 -25417 -32716 4957 27816 11271
874 11271 -20379 -28127 8756 39013 4892 -29036 -13210 18992 31542 5903 -26980 -12898
886a2898M4771L82l9286j6991K3393L1368k786l6584k0019L5854L1711k3469l2488
899a7042q01K6560K6891j9009m3744J0075M0552P238k6613k6730R514L6940Q603
912C2434l5795k5234K6078L2277p986k8625j6931K0717L8526j4218m1789J936
924a8610K8425J8271j1249l5861k145L8306J5509k7969k7937J1678K9805Q599
936B6822k4759k9798J4868M0035o162l3548r761J2951L0448J210m1053j1518L1696
949A431K0073j1687k8155r338K7832K2859j6434l3961L286L3258P383j6605k3258
962b3316j212L6139J2011l4080j5388J5364K1675R608k8245k0177K2152K7573
974B2104n468k9443p514K1627K0882n649k9647r641L3487J6295k2288j6971k972
$$ plain form
886 -12898 31873 32255 -7031 -24022 -629 30739 27953 -8631 -28650 7204 38915 15446 -17042
899 -17042 -17843 8717 35608 16599 -27145 -17070 23482 30720 4107 -22623 -13109 23831 32434
912 32434 -3361 -28595 -2517 29760 21774 -6851 -23782 -3065 35461 21243 -20546 -18610
924 -18610 9815 28086 16837 -19024 -21169 17137 32646 4677 -23260 -11582 18223 26822
936 26822 2063 -27735 -12867 27168 21006 -12542 -22303 -9352 21096 22306 -18747 -30265 1431
949 1431 21504 9817 -18338 -27676 156 23015 6581 -27380 -24094 9164 16547 -58 -23316
962 -23316 -24528 11611 23622 -10458 -25846 -10482 11193 20801 -7444 -27621 -5469 22104
974 22104 16636 -12807 -20321 1306 22188 16539 -13108 -22749 10738 27033 4745 -12226 -15198
987a5198K3715J9642k4755k4458J2492K3956L559j9994j8142J1299K3726J885
999A7727k7448j3639K4192J2944o953j7507j3639K1444K2307k0112k1350O051
1011a5983J5348J3894j4527k2705O850K4366O713k3552j2412J4069J5692M650
1023A2403j8589j8343K2303K1795j5266j2494m965J2763K2460j2307k3298N270
1035h268K1449Q205j3673j5710N992J9003R371j8796j9032J8433J6314m010j1213
1048H065j5959J0827K5650j0034k1187p12J0540J5237n347k1523k648J7177J3552
1061B3638j3698j8747N674J3275O935p943k3034O551K3680m522j3647q908J614
1074i132K0844J876k1814p221J2619J4960l086j6836m437J0854J6538l650k3750
$$ plain form
987 -15198 8517 28159 3404 -21054 -8562 15394 18953 -1041 -19183 -7884 15842 17727
999 17727 -9721 -23360 832 13776 6823 -10684 -24323 -2879 19428 -684 -22034 -15983
1011 -15983 -635 13259 -1268 -23973 -17123 7243 13956 -9596 -22008 -7939 7753 12403
1023 12403 -6186 -24529 -2226 19569 4303 -8191 -13156 -393 22067 9760 -13538 -8268
1035 -8268 13181 21386 7713 -7997 -2005 16998 26369 7573 -11459 6974 23288 19278 8065
1048 8065 -7894 2933 28583 18549 -2638 -3350 7190 22427 17080 -4443 -7091 10086 23638
1061 23638 9940 -8807 -3133 10142 17077 9134 -13900 -7349 16331 11809 -1838 -10746 -9132
1074 -9132 11712 13588 -8226 -15447 -2828 12132 9046 -7790 -12227 -1373 15165 11515 -12235
1087a2235J863J8148L751k783j5041o988K3277P016j6282q221K679J3247P447
1100A5878j2944j2583P309J7075K24j6759l449Q169R122M151j9348p866J8922
1113G901N616q848q107n837J1589J2303j3695j1871M217J1902L211r736p803K184
1127f974J3208L579j5666n637J1201M424o22p087j0617J1796R904q845q664N86
1141i414P002O172l818j0512J542J1229L937j0137m019M487M133O112q423r890
1155a1599R523P552n268m475l451K128R772k902r828j05Q137L181l796l594k731
1170g456P110P184p878p294O139M068P1j028q103J669R968j845p290q39L423L556
1186A455K440n325m543P176O013m878k851J065M25O993r78q855J843O421l15k796
$$ plain form
1087 -12235 -10372 7776 11527 8744 -6297 -13285 9992 17008 726 -7495 -4816 8431 15878
1100 15878 2934 -9649 -2340 14735 14959 -1800 -5249 2920 12042 16193 -3155 -11021 7901
1113 7901 13517 4669 -3438 -9275 2314 14617 922 -10949 -6732 5170 8381 -1355 -9158 -6974
1127 -6974 6234 9813 -5853 -11490 -289 4135 3513 -3574 -14191 -2395 7509 -1336 -10000 -9414
1141 -9414 -2412 3760 -58 -10570 -9028 2201 6138 -3999 -8018 -3531 602 6714 -1709 -11599
1155 -11599 -2076 5476 208 -4267 -7718 -5590 4182 1280 -8548 -8653 -516 2665 -1131 -4725 -7456
1170 -7456 -346 6838 -1040 -8334 -2195 1873 1944 916 -7187 -5518 4450 2605 -4685 -5524 -2101 1455
1186 1455 3895 -1430 -5973 1203 7216 2338 -513 552 977 7970 6992 -1863 -20 6401 6086 3290
1202C290k533j865N418L969o694l909N287L008j356k34m572J267P654k094o863
1217b27K022K042R42R80n268k759N570J972m515k335J428J517K107p60n692K461
1233e15O120k700k882J734j000K609K699n659j290N027m18j756k14r90R42K978
1249D685j598m008L501K119k498J091M12k017L391R77n312K538J958k484M46N51
1265C752k202J149J836l765L78K461j900j300K424j229j037L310k794j267L865
1280C681j088k831K153j09j803L006k412k102K788J004k860o8J193j253J966M3
1296A308l559O44M304k340j770K209k803K332K087m578r85L677m12j577O08k322
1312c177J118K641j581l609J715K697j951L22r58k308M181J852n205P8K787j269
$$ plain form
1202 3290 757 -1108 4310 8279 1585 -2324 2963 5971 4615 4381 -191 1076 8730 6636 -227
1217 -227 1795 3837 4779 5759 491 -2268 3302 5274 759 -1576 -148 1369 3476 2716 -2976 -515
1233 -515 5605 2905 23 1757 757 3366 6065 406 -884 4143 3725 1969 1755 765 1707 4685
1249 4685 3087 -921 2580 4699 2201 3292 3704 1687 5078 6055 743 3281 5239 2755 3201 3752
1265 3752 1550 2699 4535 770 1148 3609 1709 409 2833 1604 567 3877 1083 -184 3681
1280 3681 2593 -238 1915 1806 3 3009 597 -1505 1283 2287 -573 -641 552 -701 1265 1308
1296 1308 -2251 -1607 2697 357 -1413 796 -2007 325 2412 -2166 -3151 526 114 -1463 -855 -3177
1312 -3177 -2059 582 -999 -4608 -2893 -196 -2147 -1825 -2783 -5091 -910 942 -4263 -4185 -1398 -2667
1328b667L139j740l957L046L689j876k212K84R46K103J169l057k863N675J762
1343C441l515N63j560J333N594l271n046L904K277J93l71l977O57M602J301m569
1359A556l329L889K214j035j599m730K268O742m097m427J666K3L771N65p502M13
1375c612N264J054k972m052P01M024J558k184o809K603P199k807k880j185r17
1390e015P780P46q679J561M498K017M62n338j425N959L096k530n603J384O126
1405E039m60j689l629j185Q925k59p288J087J643K871K680o478k680O295K215
1420G087k071m635j027M518J869j798o207r54P618k52n143j242j772N028M323
1435E342q548k299M431K088Q36m212l706M027M368j734n846j572O055J121k413
$$ plain form
1328 -2667 472 -1268 -5225 -2179 1510 -366 -2578 -2294 -1348 755 1924 -1133 -3996 1679 3441
1343 3441 -74 489 -1071 262 5856 2585 -2461 1443 3720 3913 3542 -435 222 4824 6125 1556
1359 1556 -1773 2116 4330 3295 1696 -3034 -766 5976 1879 -2548 -882 -859 2912 3477 -4025 -3612
1375 -3612 1652 2706 -266 -4318 -3617 407 1965 -219 -7028 -4425 2774 -33 -2913 -4098 -5015
1390 -5015 2765 3511 -5168 -3607 891 2908 3370 -1968 -3393 2566 5662 3132 -2471 -1087 5039
1405 5039 4579 2890 -739 -1924 7001 6742 -546 541 2184 5055 7735 1257 -1423 4872 7087
1420 7087 5016 381 -646 3872 5741 3943 -2264 -3218 4400 4148 -995 -2237 -4009 1019 5342
1435 5342 -3206 -5505 -1074 1014 1850 -2362 -6068 -2041 2327 593 -5253 -6825 -770 351 -2062
1450b062k988l576P369M525p271k466K224K955M975m475o591M877N111Q95n117
1465a615l966L855M465J096o433m865P033N373m353l414k329L411Q550n151o830
1480e173K314M565L739l483p006J441O690K158o099o453M458N347n04m140o525
1495h671L913R127l871o040o27K886O832j006q721J19O068M110l501o422R49M682
1511a73L675l681p885L174P561j531l075l898J173Q761o19p080q91M188M638k43
1527D094o164j920N016M793k564p650J286N243J543j981o323j39Q435M91n202
1542a042k025Q25N765J758o016k912L917M543j135n749j252L350L270l58p173
1557d234q08O927Q74k652l366r97O116L340n379l494K680M358J707m571l616K348
$$ plain form
1450 -2062 -5050 -8626 -1257 3268 -4003 -6469 -4245 -1290 3685 -790 -7381 -2504 2607 3502 -1615
1465 -1615 -5581 -1726 2739 3835 -2598 -7463 -430 4943 590 -2824 -5153 -1742 6808 1657 -5173
1480 -5173 -2859 1706 5445 1962 -5044 -3603 3087 5245 -854 -7307 -2849 2498 1994 -2146 -8671
1495 -8671 -4758 4369 498 -5542 -6169 -3283 3549 2543 -6178 -6059 9 4119 618 -5804 -4855 -173
1511 -173 3502 -179 -8064 -4890 2671 1140 -1935 -5833 -4660 4101 3482 -3598 -4489 -301 4337 4094
1527 4094 -2070 -3990 1026 5819 3255 -4395 -3109 2134 3677 1696 -4627 -4766 3669 4160 -1042
1542 -1042 -3067 -2242 3523 5281 -735 -3647 270 4813 3678 -2071 -3323 27 3297 2939 -4234
1557 -4234 -5042 1885 2759 107 -3259 -4256 1860 5200 -179 -3673 -993 3365 5072 501 -3115 -767
1573g67N763j7o766j781M531K596m53m731l600O710L696l734l453m59M507L960
1589F002l807n361J096N889J709n240l727J770M276J734o192m707N312L656j021
1604A389m080l359M076O122k925n703l4M148M069l164n187o2M988L407n216m816
1620f347K441M164J361l606m955L213O507j465m383j837K987N618q19n830j415
1635d366M983L475k665m476j05L653L145k891n553J688N017N26k623l755J012
1650b935N581P45m898k073K856L586k98l876k629L049M261k277n084J24L093K449
1666A674j247n001j93N190J201l214k547Q78L824K088l728l605K488L949l91l229
1682a863k162J530M299j55n121q62L726K543j270l283j199L952L403k944l217
$$ plain form
1573 -767 4996 4979 -1787 -3568 963 3559 3106 -1625 -5225 1485 5181 1447 -2006 -2465 2042 6002
1589 6002 2195 -3166 -2070 3819 5528 288 -3439 -1669 2607 4341 -1851 -6558 -1246 2410 1389
1604 1389 -2691 -6050 -1974 4148 1223 -4480 -4514 -366 3703 539 -4648 -4710 278 3685 -1531 -6347
1620 -6347 -3906 258 1619 -1987 -6942 -3729 2778 1313 -3070 -4907 -1920 3698 2879 -2951 -4366
1635 -4366 617 4092 1427 -3049 -3154 499 3644 753 -4800 -3112 1905 2431 -192 -3947 -2935
1650 -2935 2646 3391 -1507 -3580 -724 2862 2564 -1312 -3941 -892 3369 1092 -3992 -3868 -775 1674
1666 1674 427 -4574 -4767 423 1624 -1590 -4137 -3259 565 2653 -1075 -4680 -2192 1757 1366 -1863
1682 -1863 -4025 -2495 1804 1649 -3472 -4334 -608 1935 665 -2618 -3817 135 3538 594 -2623
1697b623O85L693J521k026l633M58M962L73l901k146J871L142O05l818k128L125
1713A60L762k033k739p14K298K894j416l908J45L666J298k516k866M05L241J598
1729C275l236k803K038K896L9k215k371J455L850q01l473p54K712J677n99l097
1745a407r55K956K162k683k451Q49J929J550j831l110J232L402k85k337j302J099
1761a182K512J52k779j160K408J536p05k144r97K324J890j373k287L61K081Q05
1777A442o66k210k00K693J058k136j667J029J871M40j775j495J018K590m68k340
1793h16l91R15J707K78k835q21K196J236j201j431k96J499J437j407k075K47K170
1810D12K29j333j177K17K003L07k132q48J160R81N03j655j144J605J550p99j731
$$ plain form
1697 -2623 -1938 1755 3276 1250 -2383 -1925 3037 3410 -491 -2637 -766 2376 2981 -837 -2965 160
1713 160 3922 1889 -850 -1564 734 3628 2212 -1696 -1551 2115 3413 897 -1969 -1564 1677 3275
1729 3275 39 -2764 -726 2170 2209 -6 -2377 -922 2928 2127 -1346 -2100 612 2289 1690 -1407
1745 -1407 -2362 594 2756 73 -2378 -1529 400 1950 119 -2991 -1759 1643 1358 -979 -2281 -1182
1761 -1182 1330 1482 -1297 -2457 -49 1487 782 -1362 -2359 -35 1855 482 -1805 -1444 637 1442
1777 1442 776 -1434 -1634 1059 2117 -19 -1686 -657 1214 1654 -121 -1616 -598 1992 1524 -816
1793 -816 -1207 -292 1415 1693 -1142 -1963 233 1469 268 -1163 -1459 40 1477 70 -2005 -1758 412
1810 412 641 -692 -1869 -1652 351 658 -1474 -2322 -1162 -181 322 -1333 -2477 -872 678 -121 -1852
1827a852K66J305O37k38j654k34K008Q28j416r25K09J263J298j608j590J534R84
1844H15j25r54p58Q93J357k45j431n44J406Q02o11p48k78O77J272j083j409O36
1862c28P17M81o28j119L68J248L4r19p82P50N76J5m94q95P66J149r76l83K68j57
1882c09J054l67j301N86L53L98j92p38J58O72K57l26o35M30P46m86M4l45m5Q84
1902H38j96o84Q3J83L13L84q07m89Q20J17j45q03K77K07M69k72n06l1P72J09o54
1923a5K61l16J67O71p18k89M29kN4l94k67M71K39J00l62l08O99j19J16k65k68
1944a16K01M22n38p9K32R1J18k66j84K43J98J04j3n00K73O9Q5j09n29N25k0j56
1966E1J37k54k1L92k18j44M0J7m3N8l19K24NJ33K77n68J41L15p1Q2l02o5P3L59
$$ plain form
1827 -1852 -1586 -281 356 118 -1536 -1770 238 1066 -350 -1275 -1066 197 1495 -113 -1703 -169 815
1844 815 690 -264 -1022 -129 1228 983 -448 -992 414 1216 605 -143 -421 256 1528 445 -964 -328
1862 -328 389 870 242 -877 -509 739 773 -146 -928 -178 398 413 -81 -976 -210 939 -37 -420 -152 -309
1882 -309 745 378 -923 -337 16 414 222 -516 -358 314 571 245 -390 40 786 300 344 -1 -46 838
1902 838 642 -42 41 224 537 921 114 -375 445 562 417 -386 -109 98 567 295 -211 -242 530 639 -15
1923 -15 246 -70 97 768 50 -239 190 188 242 -152 -419 52 291 391 29 -279 420 301 417 152 -116
1944 -116 85 507 -31 -110 122 213 331 65 -119 124 322 426 413 -87 186 255 340 231 -298 227 207 51
1966 51 188 -66 -87 305 87 -57 -17 0 -43 15 -304 -80 -75 58 335 -233 -92 223 152 234 -68 -133 -60 299
1990B99l86K27k01k72N11k06N6n8K76k15N4j64J10R2O2j48j58M6j29L12j84R6
2012B0l62M09k2j05p3Kl4J05J82k35q2K16J13%j32M3O6j15k35j01L10M6j61N6
2036h9r6N5L13k17j1L4J0K31j20J1j13K51N7l47R3J57j59k18K68m03Q0L08P6k45
2060g4o9R2M3J62j45p0N9J74k60O3O3j17j9k18Lm8K26k11j00Q6L4J01j07n9R3
2085b98P3l0j03L44p7j30L84l83pP1J89k50L14l8l49M02j10l0J96j60L8L0P65
2108H41j83l91J47j73L15J02k71o7j12O5l4K1m26J90L35K26o61o7L06J63j19m
2130B03n19N83K77m99q5k58J95J14k4o12R2L93J17k40J40j71J60K42j00m99L18
2151a73M44l36l5l83K85N11K28q10kK68J67L8k80k41N30J19l10j95n5M92N94l45
$$ plain form
1990 299 -87 140 -61 -333 178 -28 28 -30 246 31 85 -79 31 123 185 37 -121 -75 -204 108 -76 20
2012 20 -342 67 45 -60 -133 -131 -165 -60 122 -113 -195 21 134 134 2 45 111 -4 -239 -340 -30 16 -145 -89
2036 -89 -185 -130 183 -34 -45 -11 -1 230 110 121 8 259 316 -31 62 219 60 -158 110 -293 -213 95 171 -74
2060 -74 -143 -51 -8 154 9 -61 -2 172 -88 -25 38 -79 -98 -316 -313 -361 -135 -346 -446 -360 -326 -225 -332 -391 -298
2085 -298 -225 -255 -358 -14 -91 -221 163 -220 -227 -156 33 -217 97 59 -290 112 2 -28 168 8 46 76 841
2108 841 658 267 414 241 556 658 387 320 208 273 239 260 -166 24 359 585 -76 -143 163 326 207 203
2130 203 -316 267 544 45 -40 -298 -103 11 -13 -625 -533 -140 -23 -263 -123 -294 -134 108 8 -491 -173
2151 -173 271 -65 -100 -483 -198 313 541 -269 -271 -3 164 202 -78 -319 211 330 20 -175 -230 262 856 511
2173E11q07K43Q21K1p93Q3j58K46L90q25o29N70N73k15n9m09j09J145l31r81Q5
2194f28N81L21k58m66o66J059M48q62l76L3P16K77m27r42L41J233o03o37j55P36
2214b75M17K78j137p34J292P66o49r09n2P39P85p00j307O30J158k8o13n49j3J277
2234C76K73j114o88O65R69j5q44p00O51J358p38j117j94J095O83m8j315l18J447
2253D26N51p37j017M73Q63P37o66j622Q24J339k35j002l52L33J083L78j994k5
2271f43R95Q67m56q78p43J091J335r58j426K64J516K25o94j294m1J937K07j409
2289a05o16P12R27K05j056j200J338J317l47j770n8R30J511m85j780m63K148N78
2307A786j328p83k64J742J095j621j572R17J723J10j285j231O66K060j37k189
$$ plain form
2173 511 -296 -53 768 789 -4 79 -79 167 557 -268 -897 -327 246 31 -28 -437 -546 599 268 -713 -628
2194 -628 -47 274 16 -450 -1116 -57 391 -471 -847 -814 -98 179 -248 -1190 -849 384 -219 -856 -1011 -275
2214 -275 142 420 -717 -1451 -159 607 -42 -951 -1003 -264 521 -179 -1486 -856 302 274 -339 -888 -901 376
2234 376 649 -465 -1153 -488 481 466 -378 -1078 -427 931 193 -924 -1118 -23 660 612 -703 -1021 426
2253 426 977 240 -777 -304 559 1296 630 -992 -168 1171 936 -66 -418 -85 998 1376 -618 -643
2271 -643 352 1219 763 -115 -858 233 1568 610 -816 -552 964 1189 495 -799 -840 1097 1304 -105
2289 -105 -721 -9 918 1123 67 -1133 205 1522 1175 -595 -653 277 1788 1303 -477 -940 1208 1786
2307 1786 458 -325 -589 1153 2248 627 -945 -28 1695 1805 520 -711 -45 2015 1878 -311
2323c11p22J813R13j83j784j003J932J611j708j620J05J622J054j232k133N54
2339a092K404M48k247j109R46J568M79j731k006K294K041j411j367j036J634J950
2355A765q85k467J17K022J022j444j774M9J948J559k058k232J787J551M63j558
2371a35j926J109L095r08k312m86J178K209m88k389j225K255J618j398j826J20
2387a509J225J792j001l286R56K617k2r76k078K44K974J68k165j278J321K092
2403A074l95k060j068J289K653r38l057P85J376J100Qk501p08L209O70j468j420
2420a451P1K563P29k061j843R48K817q2k522p48J111K121O22l553o26K845Q22
2437A763k18k288j012K906J555k064k083L68K663P85k256j515L03K895O23l367
$$ plain form
2323 -311 -1033 780 1693 1510 -274 -1277 655 2266 558 -1062 -957 665 1719 487 -1646 -1092
2339 -1092 1312 1760 -487 -1596 -650 918 1397 -334 -2340 -46 1995 584 -783 -1819 -185 1765
2355 1765 880 -1587 -1470 552 1574 130 -1644 -1595 353 1912 -146 -2378 -591 960 1423 -135
2371 -135 -2061 -952 2143 1235 -1077 -1563 -385 1824 1336 -1053 -2278 -23 1595 197 -1629 -1509
2387 -1509 -284 1508 507 -2779 -1823 794 772 -204 -2282 -2038 936 1104 -1061 -2339 -1018 1074
2403 1074 679 -1381 -2449 -1160 1493 555 -2502 -1717 -341 759 767 -1734 -2442 767 1437 -31 -1451
2420 -1451 -1380 1183 1912 -149 -1992 -1044 1773 1691 -831 -1579 -468 1653 2275 -1278 -1904 941 1763
2437 1763 1545 -743 -1755 1151 2706 642 -1441 -1073 1590 2375 119 -1396 -1093 1802 2425 -942
2453i42j157K366J330M28k494j867K978J943j699j847n33K237J750j407k663K
2469a575L122J204k797j544R50J811J774k777k439K504K194m73j656k128K002
2484A72K826j017k646q24K523J689j334k441l93K288K193k222k673J308J741J342
2500B532j364l333J244L285J17k552j483J230K609j58k629j826J988K931j465
2515A126k380o05J537K832j250l841N77K876R74j157k647j75L258J045k478k145
2531b453J258K449J57j962k223J414L518n77l789J22J608J864kl292o36L015J619
2548B090k063k047k3K361J650j968k666N11L372l1k249j249M03L075M45l570q14
2565b773K380J598m12k448j168K302K400j217l128J25K538J079j188k303j11L084
$$ plain form
2453 -942 -2099 267 1597 2025 -469 -2336 642 2585 886 -961 -1494 743 2493 1086 -1577 -1575
2469 -1575 1547 2751 -46 -1590 -640 1171 2945 168 -2271 233 2427 1954 298 -1830 172
2484 172 2998 1981 -665 -1489 1034 2723 1389 -1052 -1445 843 3036 814 -1859 -551 1190 2532
2500 2532 1168 -2165 -921 2364 2481 -71 -1554 -324 2285 2127 -502 -2328 -340 2591 1126
2515 1126 -1254 -1859 -322 2510 1260 -2581 -2004 872 1846 689 -1958 -2133 1125 2170 -308 -2453
2531 -2453 -1195 1254 1411 -551 -2774 -1360 2158 1581 -2208 -2086 -478 1386 1384 -1908 -2544 471 2090
2548 2090 27 -2020 -2043 318 1968 0 -2666 -2155 1217 1186 -1063 -2312 -1909 1166 1611 -1959 -2773
2565 -2773 -393 1205 793 -1655 -2823 -521 1879 662 -2466 -2341 197 1276 88 -2215 -2326 758
2581G58J034k827j427J360J923Q98k437j838J914K776p39k464o70J498K245l84
2597A620k906q28L373R16j627j848k43K316J915k135k854J226K515K36j691j647
2613a662O50K962P2k855j218J489J754q9k142j392K115K387j780k031M3J564J702
2630A569j022k561q6L126O92j873j779N79K010J310k430j966J734K313l63j692
2646d39j147J190L004p46l253j40K726P66p83j851o48K761J437k105k083R36J960
2663A585N43j358k358J104K786k98k487j040J365J578L11k690j073K463J229j294
2679C66j804j54J318J797j372k553L20K557K08j334j522J4K326P78k568j057J660
2696a020J396n25j251j107J264K415p29k288j44J794O86Qj970l64K483P08j660
$$ plain form
2581 758 1792 -1035 -2462 -1102 821 1719 -718 -2556 -642 2134 1395 -1069 -1739 -241 2004 1620
2597 1620 -1286 -2114 1259 2175 548 -1300 -1543 773 2688 553 -2301 -1075 1440 1676 -15 -1662
2613 -1662 -1012 1950 2022 -833 -2051 -562 1192 1103 -1039 -2431 -316 2071 291 -1740 -1697 -133 1569
2630 1569 547 -2014 -2100 1026 1718 -155 -1934 -1355 655 1965 -465 -2431 -697 1616 1253 -439
2646 -439 -1586 -396 2608 1862 -1391 -1531 1195 1961 1178 -673 -1321 1440 2877 772 -1311 -375 1585
2663 1585 2128 770 -1588 -484 2302 2004 -483 -1523 -158 1420 1731 -959 -2032 431 1660 366
2679 366 -1438 -1592 -274 1523 151 -2402 -2082 475 683 -651 -2173 -2159 167 945 -1623 -2680 -1020
2696 -1020 376 -149 -1400 -2507 -1243 1172 443 -1845 -1989 -195 491 499 -1471 -1835 648 1356 -304
2713c04j130P14Q47J404j215k253J489J265M28j620n57N71J495L89k184n85J803
2730E57J041r07j030j114J229J889j383j640M02J145O18o24j431j50K085L56j648
2747f05j207J193O41P16j309j646J690J532q91j359R1J44J691j59k031l7J809
2764B63K76q63j077K81R83J122j335j463J657P62k14l60j052M40J878n09j690
2781i01J29Q56O30J23j394k05J235J224j511r01J039K57L55k23j272N38J744q68
2799H55p87M4o7J138m5j375k59J062P32p80o82K29K20P70n1j717O41J004o49r
2819B74o9p64J156M82j511J39N61K5J67p01l39O3R28k62j142J99M85k09O23n86
2839d81j029J320K29p73L89p98N29L72j25p32J90N98J7m38K73m92j18J383r68
$$ plain form
2713 -304 -1434 -720 127 1531 316 -1937 -448 817 1245 -375 -932 -361 1134 1523 -661 -1246 557
2730 557 1598 691 -339 -1453 -224 1665 282 -1358 -956 189 807 183 -1248 -1398 687 1043 -605
2747 -605 -1812 -619 22 738 -571 -2217 -527 1005 114 -1245 -1154 -1010 681 522 -1509 -1546 263
2764 263 539 -324 -1401 -1120 -137 985 -350 -1813 -156 606 392 32 -1020 -580 1298 789 -901
2781 -901 -772 84 714 837 -557 -762 473 1697 186 -715 324 581 936 713 -559 -21 1723 855
2799 855 68 112 45 1183 1138 -237 -496 566 1298 518 -164 65 285 1055 1004 -713 -72 932 283 274
2819 274 205 -559 597 1079 -432 -293 268 293 460 -241 -580 -517 411 149 -993 -794 -309 -518 105 -481
2839 -481 -1510 -190 39 -734 -345 -1143 -614 -242 -367 -1099 -909 -311 -294 -732 -459 -951 -1069 314 -654
2858f54n42R06q10N42O81j001K17Q56p21L08r4q9L50l9j08n92K72R88j066M37
2878a59K95j224J036N66j471P99L0r12J507q34j58O1K17J54m12j73R8m95P66q8
2898c97j006R96n15m59J389j015o50J457n10m80O81o11N33N79m29m65m83J236
2916a49q7q17M58o04L74J588j715l24J456o96Q93n5j661J147P75j78k44n87Q78
2935D52N37m53r3r70J117J300j674kK62m40J554o95j741J767L52p22N20j022M78
2954E27Q26l08o00o70J220N66j322J29l81k11J912j349j407J702m68L36M2j531
2972i87O68J395q38n15k07L80R39n61l32r68O33J498j099j162R78j59N51J27j692
2991a351P23J525o88m5p95J42R37N22q10j074O05J391m09r72j84l36K169m43k201
$$ plain form
2858 -654 -1196 -290 -1100 -558 123 -878 -661 195 -526 -218 -312 -401 -51 -90 -198 -790 -518 470 -596 -159
2878 -159 136 -1088 -52 514 -957 -158 -128 -1040 467 -367 -525 -464 -247 -93 -505 -678 -580 -1075 -309 -397
2898 -397 -1403 -407 -922 -1381 8 -1007 -1657 -200 -710 -1190 -509 -1120 -587 -8 -437 -902 -1385 -149
2916 -149 -236 -1053 -595 -1199 -825 763 -952 -1276 180 -516 377 322 -1339 -192 583 405 161 -426 452
2935 452 989 536 443 -527 590 1890 216 214 476 36 1590 895 -846 921 1273 551 1071 49 527
2954 527 1353 1045 445 -225 995 1561 239 368 -13 -224 1688 339 -1068 634 166 502 544 -987
2972 -987 -319 1076 238 -277 -484 -104 835 274 -58 -1026 -393 1105 6 -1156 -178 -337 214 341 -1351
2991 -1351 -628 897 209 164 -631 -489 448 970 160 -914 -309 1082 673 -299 -483 -819 1350 907 -1294
3010a294O65Q42L32%j149p27K044M12q96r40k05J810L14q50j711L67K127j21k059
3029a039q6K77J384N52k199o09K135P15o40j388o05J564J553j175k023M88J638
3046E42N65j506j004l09K135Q07k422p22J110J475O7j489j431J618J896o97j954
3063a319n5J515J048l26k042o49K011J182j906j159K39J778J074j706j811J653
3079d73J898k19j561o51P24K077qk350o96J822J479n94j694p69J712J952j807
3096H42j795N93J845R27j295j770N93K583L94k358o56P31J381O72k066j526J396
3113D91K439j428j853l53J058J783q65k377j74K525O23j257j402j47K033J589
3129B685k410k061J025J798K31j634j734J043K547M1l126n35J870J647k74k262
$$ plain form
3010 -1294 -629 213 545 545 -604 -1331 713 1125 229 -711 -916 894 1208 358 -1353 -986 1141 1020 -1039
3029 -1039 -1125 -848 536 1088 -1111 -1720 415 1130 490 -898 -1503 61 1614 439 -1584 -1096 542
3046 542 1107 -399 -1403 -1712 423 1230 -1192 -1914 -804 671 738 -751 -2182 -564 1332 635 -1319
3063 -1319 -1374 141 1189 863 -1179 -1828 183 1365 -541 -1700 -1461 317 1391 -315 -2126 -473
3079 -473 1425 1206 -355 -1006 -282 1795 1787 -563 -1259 563 2042 1448 -246 -1015 697 2649 842
3096 842 -953 -360 1485 2412 1117 -653 -60 2523 2917 559 -97 634 2015 2687 621 -905 491
3113 491 2930 1502 -351 -704 354 2137 1272 -1105 -1279 1246 1869 612 -790 -937 1096 2685
3129 2685 275 -1786 -761 1037 1268 -366 -2100 -1057 1490 1531 -1595 -2130 -260 1387 1113 -1149
3145a149m90K035K217j576j995j0J869J625j289k726O40L016P5k007j029N08K574
3162B288K88k311j658K171K072o42j994j106J930K166j125l026J29K384Q63j361
3178A068k423j52K677J032k591j715J331J638M76k032j865J294K987m65k745q60
3194b345J550J951o28k437j221K954J272j821j548l49K112J545j742k168J153
3209a722K623J31j681j389N82K772L29k664j283K256J630n67j647j407J935K707
3225B605j928k103J25J676J809j461k261K94K348J314k163j754J188J781R94k193
3241B71k860K029K876j175j730j305Q73L224q49k881k98K370J491j205k504J08
3257a565K153J810j788k783R06K544L99j238k561K40M079m11k715p81J189K064
$$ plain form
3145 -1149 -1639 396 2613 1037 -958 -968 901 2526 1237 -1489 -849 2167 2242 235 -794 -286 2288
3162 2288 2576 265 -1393 778 2850 2208 214 -892 1038 3204 2079 -947 -818 1566 2429 1068
3178 1068 -1355 -1507 1170 2202 -389 -2104 -773 865 1341 -691 -2556 -1262 1725 1260 -1485 -2345
3194 -2345 -795 1156 528 -1909 -3130 -176 1096 -725 -2273 -2622 -510 1035 -707 -2875 -1722
3209 -1722 901 1032 -649 -2038 -1456 1316 1645 -1019 -2302 -46 1584 1017 -630 -2037 -102 2605
3225 2605 677 -1426 -1301 375 2184 723 -1538 -1244 1104 2418 255 -1499 -311 1470 2464 271
3241 271 -2589 -560 2316 1141 -589 -1894 -1021 2203 1354 -1527 -1825 545 2036 831 -1673 -1565
3257 -1565 588 2398 610 -2173 -1267 1277 1676 438 -2123 -1883 2196 1785 -930 -1711 -522 1542
3273A542M12k921j071K054K426j223k604j3K014J303m23l080J97L051N22j841
3289C45j234l23K966R01k993j426J538K388j91k369q57J166K352l99l020r4K327
3306A077N67l77k042q22K963J009k226j381P22J751R58k030j700P49K660R4k507
3323e35q78J372J493N46k646j318K643J398j279j397j211K149J976k026j982K24
3339a471K146R03j901j488L49J861J553k912j575K082J063K77j623k297K369K440
3355A776j197k143p66J802K112r89k725k79K355J866k324j442O67J172J995j760
3371A20k759J737K316l18j204k076J404K632m69k400r17J822K057j092j983l49
3387a479J190K589j495k859J261J448J041n21k740L59K964j1j652j367N90K373
$$ plain form
3273 1542 1954 -967 -2038 16 2442 1219 -1385 -1398 616 1919 1496 -1584 -1387 1664 2186 345
3289 345 -889 -1212 1754 2655 -338 -1764 -226 2162 1971 -398 -1255 -89 2263 1864 -1156 -1250 1077
3306 1077 1644 1267 -775 -1597 1366 2375 149 -1232 -510 1241 2199 169 -1531 -782 1878 1972 -535
3323 -535 -1413 -41 1452 1998 -648 -1966 677 2075 796 -601 -1812 337 2313 287 -1695 -1471
3339 -1471 675 1578 -323 -1811 -1462 399 1952 -960 -2535 -453 610 887 -736 -3033 -664 1776
3355 1776 579 -1564 -2330 -528 1584 595 -2130 -2409 -54 1812 -512 -1954 -1287 -115 1880 120
3371 120 -2639 -902 1414 1096 -108 -2184 -780 1852 1383 -1017 -1934 -112 1945 853 -1130 -1479
3387 -1479 -289 2300 805 -2054 -793 655 1696 1175 -1565 -1206 1758 1747 95 -1272 -682 1691
3403A691j84j853j551J183K270m08k438k2J170J669j19l115K92K372K80n84j897
3420a244L0J938R96j780j341L43K059m7j562o85K88K363L5k514M2J267R14M08
3438A510k110p42K416N02q04j321k47J712Q07j159j453jK176L81j868k60J60J318
3456A017J151k476o43J811O75K19j687p58J257J419r35j684m61J989N33j293o39
3473e05q33K148J008k240p83J219O10Q12r93j832J220J691n91j482p10R23J317
3490I79l93j729o82J919Q36j287r47p6R31J647j209j976J295J155L17j189j195
3507a604N31J767k12j697p77J243J005n59p26j095J201J827j256j350Q44N62P34
3524D38r1j503R1J871p5r09q43N07Q26K53r56j263R68J338l67r31JN3J198K30
$$ plain form
3403 1691 1507 -346 -1897 -714 1556 1148 -1290 -1312 -142 1527 1408 -1707 -1415 957 1237 653 -1244
3420 -1244 -1214 724 1720 -60 -1401 -1058 1001 954 -608 -1293 -1005 1358 1393 -1121 -1079 188 1102 1510
3438 1510 -600 -1342 1074 1576 772 -549 -796 916 1723 564 -889 -890 1286 1667 -201 -461 -301 1017
3456 1017 2168 -308 -951 860 1535 1754 67 -691 566 1985 1050 -634 -1095 894 1427 134 -505
3473 -505 -1338 810 1818 -422 -1205 14 624 1436 443 -1389 -169 1522 931 -551 -1261 -338 979
3490 979 586 -1143 -1825 94 930 -357 -1304 -1380 -449 1198 -11 -1987 -692 463 780 -409 -1604
3507 -1604 -1073 694 482 -1215 -1992 -749 256 -303 -1029 -2124 -923 904 -352 -1702 -858 -296 438
3524 438 347 -1156 -1065 806 731 -178 -1021 -514 312 565 -391 -1654 -686 652 285 -646 -645 -592 606 836
3544H36j492n8J167L68m72o06o59J045M18o36j098J73Q94j42m15o90j73J402K03
3563F5j313o9P85O42K71r68p33J202K77m96o15k89N94N45q3j234K92J166k59m19
3583f39Q4k62Q50P22p66m08P55K55K09l55n87M09P46j20j178K13N23R7J13o29
3603C2k97P10N55m22k50M04q0O57n89q50P51O50o08l14k12k89P99J0q31o14Q77
3624H9J28n22l0k77N78M12j34p34O32J73%k47k69l09L59N21q52K36J93k98M19
3645F8k19l04J37O39m15j30M15p9L67L85n48j73K77j41k03N26m93k60L98k04n49
3666e06N99J58o12M20J29l26K33m6j18l3J76l30L73L9o05L2J50r2k82K19l84k32
3688a038P68k78k18L48%j91P08m02j99L80J04m5j40LQ3J6K1j49j78N61l66m6K85
$$ plain form
3544 836 -656 -714 453 821 349 -257 -916 129 547 -89 -1187 -1014 -120 -262 -677 -1367 -1540 -138 65
3563 65 -1248 -1317 -532 110 381 -587 -1320 -118 159 -337 -952 -1241 -647 -102 -185 -1419 -1127 39 -220 -639
3583 -639 -555 -817 33 755 -11 -419 336 591 800 445 -142 267 1013 893 -285 -72 451 548 661 32
3603 32 -265 445 1000 578 328 732 652 1309 720 -130 621 1271 663 349 137 -152 647 657 -174 -788 89
3624 89 217 -305 -335 -612 -34 378 244 -490 142 315 315 68 -201 -510 -151 370 -482 -246 -53 -351 68
3645 68 -151 -455 -318 321 -94 -224 191 112 479 864 316 143 420 279 76 602 109 -151 247 43 -506
3666 -506 93 251 -361 59 188 -138 95 49 -69 -102 74 -256 117 156 -449 -417 -267 -359 -641 -422 -806 -1038
3688 -1038 -270 -548 -766 -418 -418 -609 99 -303 -502 -122 -18 -63 -203 -200 -117 -101 -80 -229 -407 154 -212 -258 27
3711B7n21M20K85l54j2nO5L30L1m26P4O4L25n39J7P8k52N81k03o26J99M38m27
3734d31J54m72J87O94p4q05K08K72l7M33o58p2J70O37k29r73O21L08J70L13r72
3755e56l24J722l16o58J19pP62J89r44k70N38Q88n16p30J63J83M34K67j298j25
3775d79J477k89l12m47n01R73P56j036m99M14M55L16j068n58P15M92K07j471O9
3794g86R11j05K3p96p80J683K70r66J0n80P98O32m91p77M32Q19L54j264l88P18
3814b83L9R00j020q99J422J53ql56q12O15J184q98l62n3L36Q60l54q76m1P31R15
3835A193j024q18O88L39J31j18j387P88P38k91m58o98L55J422n23j128Q2L17R91
3854E99p64r22M44K50R38q13j137O89R49m39l53r24J47J950k63j268k75M69J005
$$ plain form
3711 27 -494 -74 211 -143 -155 -160 -95 235 266 -160 -86 -22 303 -236 -219 -141 -393 188 -15 -641 -442 -4 -431
3734 -431 -277 -749 -562 132 58 -747 -539 -267 -304 129 -529 -601 -431 206 -23 -996 -375 -67 103 416 -556
3755 -556 -880 842 526 -132 -13 -20 742 931 -13 -283 255 1143 627 -103 60 243 677 944 -354 -479
3775 -479 998 709 397 -50 -551 422 1178 142 -357 57 512 828 -240 -798 -83 409 616 -855 -786
3794 -786 125 20 43 -753 -1533 150 420 -546 -536 -1116 -318 314 -177 -954 -522 297 651 -613 -1001 -283
3814 -283 -244 656 -364 -1263 159 312 304 -52 -864 -249 935 37 -325 -378 -42 818 464 -412 -453 278 1193
3835 1193 169 -649 39 378 509 391 -996 -208 530 239 -219 -917 -562 860 337 -791 -709 -392 599
3854 599 -165 -1087 -643 -393 545 -268 -1405 -716 233 -206 -559 -1483 -1336 614 351 -917 -1192 -723 282
3873B82l5j065o31O41J522k63j784O38O01O87j1j929K95J842j73n79j157L68J389
3892F38K69j362o40Q13J740p42j184l12N85J942m98k075K21J640j55j09j289n38
3910a056J770N83r75j295M67J417K44q96j101L34J964J7j936rM98Q68N92k071
3928e85m85J383R28q58j186l62J313R89o94j304m02K109J32o60j068K18J049J040
3946A557j766j070R74R82K85j268j068J058J324l65j630k17J497P21n91o41q59
3963a077J394J353j552j141Q93P34O85q73j751Q64J468o9r45q76N54J368Q4j593
3981d80p64J557J182p37j009m52R85J680j195j784L39J491K25p03j723K28J931
3998G71J56j176r00N25J520j03j318j064R57J893q63j334k62Q67J216m40k087
$$ plain form
3873 282 247 -818 -1449 -808 714 451 -1333 -695 -94 593 582 -1347 -1052 790 617 38 -1119 -751 638
3892 638 907 -455 -1095 -282 1458 716 -468 -780 -195 1747 1249 -826 -605 1035 880 771 -518 -1056
3910 -1056 714 1297 322 -973 -506 911 1155 259 -842 -508 1456 1473 -463 -472 26 894 1486 -585
3928 -585 -1070 313 1241 383 -803 -1165 148 1137 443 -861 -1263 846 978 318 -750 -532 517 1557
3946 1557 -209 -1279 -305 677 962 -306 -1374 -316 1008 643 -987 -1204 293 1014 423 -218 -1077
3963 -1077 317 1670 118 -1023 -130 604 1289 416 -1335 -471 997 928 -17 -893 -339 1029 1113 -480
3981 -480 -1244 313 1495 758 -251 -703 282 1962 767 -1017 -678 813 1038 335 -1388 -1160 771
3998 771 927 -249 -1149 -624 896 793 -525 -1589 -632 1261 398 -936 -1198 -331 885 445 -1642
4015a642P3J686L14q88r97J27J334M65j108j023O23J843l00j189n39M99J649k53
4033F74j760j65J230Q40l35j024p97J517J053r71j293K18J257O08o46j484M83
4050e95J769m7j232r04Q70R67K64j071j242J246R45l64j409l46Q03J471n90j601
4068a066m4J576Q42r70j165k9J580O33j500j075R40J260j3r85r91L70J864l12
4086I15j338p15J304R31j91j524m83J686R80j084j210K02J065Q92j000j300J91
4103f79J611J21j166q33L45J654J74j764n98J411J408q53j037n45J009J376p27
4120I07j613L39R11P64q72j223J48J398N99j261q60P64J024K78j057j118R09J656
4138A693o32j213j6L87J413n30j689o2J328M61p95q69j17J033R19r13j358O06
$$ plain form
4015 -1642 -1569 117 431 -457 -1454 -1327 7 472 -636 -1659 -1036 807 507 -682 -1221 -722 927 674
4033 674 -1086 -1251 -21 819 484 -540 -1337 180 1233 262 -1031 -813 444 1052 406 -1078 -595
4050 -595 1174 1127 -105 -1009 -139 828 1092 21 -1221 25 970 606 -803 -1149 -346 1125 535 -1066
4068 -1066 -1110 466 1308 338 -827 -856 724 1357 -143 -1218 -278 982 969 -16 -1007 -637 1227 915
4086 915 -423 -1138 166 1097 906 -618 -1101 585 1565 481 -729 -527 538 1430 430 -870 -679
4103 -679 932 1053 -113 -946 -601 1053 1227 -537 -1135 276 1684 831 -206 -751 258 1634 907
4120 907 -706 -367 544 1308 436 -787 -639 759 1358 97 -763 1 1025 1303 246 -872 37 1693
4138 1693 1061 -152 -168 219 1632 1102 -587 -649 679 1140 345 -524 -641 392 1311 398 -960 -354
4156c54J009J46p01j114O04J254n2j195q38J076N75K30j266o71R86J208p94j107
4174a004l8P85J097n82j412J38J499K95p39p38j4J240N22j282q35R20Q10k9q37
4193b04n27O36J073k19j370J16R10N58l44r95o01J616N01j035n00k02J228L05
4211I46o96j131M53J169mj350m03Q09P89N0j052o34J035P59o36p59k89J012P74
4230H42q14j048L34Q26M74j042l63K23Q76M53j121p33P93P11L3l16r12O32J482
4249A330p92p64k72P37O43m86r15J19P69J040j368n66M93N46L50l80j156Q18Q10
4268I56l55j86m48J37J068l77r64j56M37P68l24q70o7M48M41J60j283K90O83O5
4288D23j74n49k29J505k27q69l7L2O09K75j011j69P2Q46M7j268P67%L15N12j176
$$ plain form
4156 -354 655 801 100 -1014 -410 844 792 -403 -1241 -165 410 640 -626 -1297 -311 897 103 -1004
4174 -1004 -1042 -257 840 258 -1154 -1016 483 778 39 -699 -713 527 1049 -233 -1068 -148 662 633 -204
4193 -204 -731 -95 978 759 -611 -495 415 973 629 -366 -967 649 1150 115 -385 -587 641 946
4211 946 250 -881 -428 741 737 -613 -1016 -207 582 632 -420 -1054 -19 740 104 -655 -944 68 842
4230 842 28 -1020 -686 140 614 -428 -791 -568 308 761 -360 -1093 -300 411 444 128 -784 -152 1330
4249 1330 538 -226 -498 239 882 396 -519 -400 369 1409 41 -525 -32 514 864 484 -672 146 956
4268 956 601 415 -33 104 1172 795 -169 -325 112 880 556 -314 -381 67 508 668 -615 -325 358 423
4288 423 249 -300 -529 976 749 -120 -157 -125 484 759 -252 -421 -349 497 544 -724 43 43 358 870 -306
4309c06j36Q48K15l12m04n26R38L42n63m07k05J090J57r04j39J99N99n2q04o8
4329d38P11k19N06p15n62R50L23n47k13j23N11M01o52k95k49J053K09j097P8L57
4349a1oK00k99n95R18j3k55r0m49Q05N11m20l79j75M03M33o81j38K96J28M28p28
4371a17m70O58O2M2O4r66O04L05j6m41j68K64K72O4m01OJ07N43p94k4J90j59N22
4394A47O0q80M76N13j78j70m27K33O43l36m75j6L17N17m03j11q4J2O43j27m30
4415g6j29K38K25J00l81Q5K99n8l65K7O3L48j68o3k30k9N04m29j76N1K24K29O7
4438C56n91j15M06k24M9o2K9L88j54J89l90Q7J32q9j14R3o2K46K68q26L65j0O8
4461C9kJ10k18L18O5k88J12J2o3K0J60j41j28l2J75m17K24N5m7K00o3j45K56m01
$$ plain form
4309 -306 -442 406 621 309 -95 -621 317 659 96 -311 -516 574 731 -173 -312 -113 486 434 -370 -438
4329 -438 273 54 560 -155 -717 233 556 9 -204 -327 184 585 -67 -362 -611 442 651 -446 -368 -11
4349 -11 -17 183 -116 -711 207 194 -61 -151 -600 205 716 296 -83 -258 145 578 -103 -241 55 183 611 -117
4371 -117 -587 71 133 175 239 -727 -123 182 166 -275 -443 -179 93 157 -244 -238 -131 412 -382 -406 -216 -375 147
4394 147 207 -673 -197 316 138 -32 -459 -226 417 81 -394 -410 -93 424 21 -90 -174 -162 481 354 -76
4415 -76 -205 33 258 358 -23 62 361 303 -62 -35 28 376 208 145 -85 -114 390 -39 -215 -164 60 289 356
4438 356 -235 -350 56 -168 -119 -181 -152 236 82 271 -119 -32 100 11 -103 -10 -72 174 442 -384 -19 -29 39
4461 39 37 147 -71 247 312 24 136 148 85 105 265 124 -4 -36 139 -278 -54 1 -46 154 91 -54 202 -199
4485a99O7K14j39J45l10J24j18J37K92m13O0j3q0j11K62o9j69L25j66p8J73j39
4507b05J30M0k17J95K61k25j96L75r4p5Rj47K14J29n4k95J42J87M0j0j23m48M79
4530A12L5j91n2K30j47P2k16K1j02K54M9L3m14K69j61K01mm99N19l72K39j3j59
4553b96L3K82J4n03K40J38K29k21q6k20M83L24m76k12K31L12k79J15m32J25N75
4574C76j36l05j27K21J40N16o03l35N31K13j77k21k42K42M87j16q06K57N52r4
4594C73p8m42k0M77M03q69j12J02M79m7j76m58J39M63L63q46P3J90K39n2o14k11
4616f24O17L38n83k46J97M47N4j94n46K09L27M10o05l9l0P38Q8r66j60N14O48
4637E94n02k99k35N06M0J3n94m2Q29j30j40k51k73P48R1n01k01K59L90K20q45
$$ plain form
4485 -199 -132 82 -57 88 -222 -98 -216 -79 213 -200 -140 -153 -233 -344 -82 -151 -320 5 -161 -239 -66 -205
4507 -205 -75 -35 -252 -57 204 -21 -217 158 64 -11 -2 -149 65 194 140 -155 -13 174 214 204 81 -367 112
4530 112 147 -44 -96 134 -13 59 -157 -136 -238 16 65 98 -316 -47 -208 -7 -11 -510 9 -363 -124 -137 -296
4553 -296 -263 19 33 -470 -230 -92 137 -84 -170 -390 93 417 -59 -271 -40 272 -7 108 -324 -199 376
4574 376 240 -65 -192 29 169 685 82 -253 278 491 314 93 -149 93 580 464 -342 -85 467 373
4594 373 295 -147 -167 310 713 -156 -268 -166 313 266 90 -368 -229 234 597 -249 -176 14 253 201 -413 -624
4616 -624 -7 331 -252 -498 -301 146 200 6 -540 -331 -4 406 -199 -238 -268 470 558 -408 -568 -54 594
4637 594 92 -207 -442 64 104 117 -477 -519 310 180 40 -211 -484 264 355 -146 -347 -88 302 522 -323
4658c23l78N37O77j71p51l36M40M22Mm76n25Q23L71l92j53j81L44L58j51n74J08
4679c27O00L6l80p76M89N77R1o28k90M65L99J6k81o48M84Q63p19n94K08J29O47
4700C61j47p30j05R42o5m44o80N09N17K33n86l70L21N18k15k07q34O34R87p84
4720a45k29k15O38J13l34m99L34L96K48Mq31M65L61J58l29q80N72P52j38n02o8
4741a29J74L88J18o10k83L29P54o91k84J04K21L60n3q74J47Q81k32j2p40K10N80
$$ plain form
4658 -323 -701 -164 513 342 -409 -745 -305 117 121 -355 -880 -57 314 -78 -231 -412 -68 290 139 -435 -327
4679 -327 273 309 -71 -847 -358 219 310 -318 -608 -143 256 272 -9 -657 -173 690 -29 -623 -415 -286 361
4700 361 214 -516 -621 321 256 -188 -868 -359 158 391 -195 -565 -244 274 59 -148 -982 -348 639 -145
4720 -145 -374 -589 49 162 -172 -671 -337 59 307 311 -520 -55 306 464 135 -745 -173 579 441 -61 -129
4741 -129 45 433 551 -59 -342 -13 741 50 -234 -130 91 451 398 -476 -329 552 320 308 -432 -222 358
$$ [...]
8191B39
##END NTUPLES=NMR FID
##END=
