##TITLE=1H_SA_sl.CrO3
 CDCl3, 8 sc, 
 21.12.2020
##JCAMPDX= 6.0         $$ Bruker NMR JCAMP-DX V2.0
##DATA TYPE= NMR FID
##DATA CLASS= NTUPLES
##ORIGIN= UXNMR, Bruker Analytische Messtechnik GmbH
##OWNER= root
$$ XWIN-NMR		Version 3.5
$$ Mon Dec 21 12:50:19 2020 Russian Standard Time (UT+4h)  she@DPX200
##.OBSERVE FREQUENCY= 200.1315066352
##.OBSERVE NUCLEUS= ^1H
##.DELAY= (6, 6)
##.ACQUISITION MODE= SIMULTANEOUS
##.ACQUISITION SCHEME= undefined
##.AVERAGES= 8
##.DIGITISER RES= 18
##SPECTROMETER/DATA SYSTEM= spect
##.PULSE SEQUENCE= zg30
##.SOLVENT NAME= CDCl3
##.SHIFT REFERENCE= (INTERNAL, CDCl3, 0, 15.7039)
##AUDIT TRAIL= $$ (NUMBER, WHEN, WHO, WHERE, WHAT)
$$ ##TITLE= Audit trail, XWIN-NMR		Version 3.5
$$ ##JCAMPDX= 5.01
$$ ##ORIGIN= Bruker BioSpin GmbH
$$ ##OWNER= she
$$ F:/spectra/data/she/nmr/H-F/1/audita.txt
$$ ##AUDIT TRAIL=  $$ (NUMBER, WHEN, WHO, WHERE, WHAT)
(   1,<2020-12-21 12:49:15.00 +0400>,<she>,<DPX200>,
      <created by zg, POWCHK disabled, PULCHK disabled
       configuration hash MD5:
       00 E9 B6 7A A2 85 ED C7 34 08 36 98 17 FE 4E 26
       data hash MD5: 16K
       E4 AC 3A 55 FF E3 D4 F6 4D 54 02 EE 11 95 E1 0F>)
$$ ##END=
$$ 
$$ hash MD5
$$ 33 95 C1 A5 EA 60 36 E4 0A F3 16 F3 CD 24 E7 F0
##$RELAX= 
##$RELAX= 
##$RELAX= 
##$RELAX= 
##$RELAX= 
##$RELAX= 
$$ Bruker specific parameters
$$ --------------------------
##$DU= <F:/spectra>
##$EXPNO= 1
##$NAME= <H-F>
##$PROCNO= 1
##$TYPE= <nmr>
##$USER= <she>
##$AMP= (0..31)
100 100 100 100 100 100 100 100 100 100 100 100 100 100 100 100 100 100 
100 100 100 100 100 100 100 100 100 100 100 100 100 100 
##$AQSEQ= 0
##$AQ_mod= 1
##$AUNM= <au_zg>
##$AUTOPOS= <>
##$BF1= 200.13
##$BF2= 200.13
##$BF3= 200.13
##$BF4= 200.13
##$BF5= 200.13
##$BF6= 200.13
##$BF7= 200.13
##$BF8= 200.13
##$BYTORDA= 1
##$CFDGTYP= 0
##$CFRGTYP= 5
##$CHEMSTR= <none>
##$CNST= (0..31)
1 1 145 1 1 1 1 1 1 1 1 1 1 1 1 1 1 1 1 1 1 1 1 1 1 1 1 1 1 1 1 1 
##$CPDPRG= <>
##$CPDPRG1= <>
##$CPDPRG2= <>
##$CPDPRG3= <>
##$CPDPRG4= <mlev>
##$CPDPRG5= <mlev>
##$CPDPRG6= <mlev>
##$CPDPRG7= <mlev>
##$CPDPRG8= <mlev>
##$CPDPRGB= <>
##$CPDPRGT= <>
##$D= (0..31)
0 1.2 0 0 0 0 0 0 0 0.06 0 0.03 0 0 0 0 0.0002 0 0 0 0 0 0 0 0 0 0 0 0 
0 0 0 
##$DATE= 1608540554
##$DBL= (0..7)
120 120 120 120 120 120 120 120 
##$DBP= (0..7)
150 150 150 150 150 150 150 150 
##$DBP07= 0
##$DBPNAM0= <>
##$DBPNAM1= <>
##$DBPNAM2= <>
##$DBPNAM3= <>
##$DBPNAM4= <>
##$DBPNAM5= <>
##$DBPNAM6= <>
##$DBPNAM7= <>
##$DBPOAL= (0..7)
0.5 0.5 0.5 0.5 0.5 0.5 0.5 0.5 
##$DBPOFFS= (0..7)
0 0 0 0 0 0 0 0 
##$DE= 6
##$DECBNUC= <off>
##$DECIM= 32
##$DECNUC= <off>
##$DECSTAT= 4
##$DIGMOD= 1
##$DIGTYP= 9
##$DL= (0..7)
0 120 120 120 120 120 120 120 
##$DP= (0..7)
150 150 150 150 150 150 150 150 
##$DP07= 0
##$DPNAME0= <>
##$DPNAME1= <>
##$DPNAME2= <>
##$DPNAME3= <>
##$DPNAME4= <>
##$DPNAME5= <>
##$DPNAME6= <>
##$DPNAME7= <>
##$DPOAL= (0..7)
0.5 0.5 0.5 0.5 0.5 0.5 0.5 0.5 
##$DPOFFS= (0..7)
0 0 0 0 0 0 0 0 
##$DQDMODE= 0
##$DR= 18
##$DS= 0
##$DSLIST= <SSSSSSSSSSSSSSS>
$$ [...]
##$SUBNAM2= <"">
##$SUBNAM3= <"">
##$SUBNAM4= <"">
##$SUBNAM5= <"">
##$SUBNAM6= <"">
##$SUBNAM7= <"">
##$SUBNAM8= <"">
##$SUBNAM9= <"">
##$SW= 16.9725356469052
##$SWIBOX= (0..15)
0 0 2 0 0 0 0 0 0 0 0 0 0 0 0 0 
##$SW_h= 3396.73913043478
##$TD= 16384
##$TD0= 1
##$TE= 0
##$TE2= 300
##$TE3= 300
##$TEG= 300
##$TL= (0..7)
0 120 120 120 120 120 120 120 
##$TP= (0..7)
150 150 150 150 150 150 150 150 
##$TP07= 0
##$TPNAME0= <>
##$TPNAME1= <>
##$TPNAME2= <>
##$TPNAME3= <>
##$TPNAME4= <>
##$TPNAME5= <>
##$TPNAME6= <>
##$TPNAME7= <>
##$TPOAL= (0..7)
0.5 0.5 0.5 0.5 0.5 0.5 0.5 0.5 
##$TPOFFS= (0..7)
0 0 0 0 0 0 0 0 
##$TUNHIN= 0
##$TUNHOUT= 0
##$TUNXOUT= 0
##$USERA1= <user>
##$USERA2= <user>
##$USERA3= <user>
##$USERA4= <user>
##$USERA5= <user>
##$V9= 5
##$VALIST= <valist>
##$VCLIST= <CCCCCCCCCCCCCCC>
##$VD= 0
##$VDLIST= <DDDDDDDDDDDDDDD>
##$VPLIST= <PPPPPPPPPPPPPPP>
##$VTLIST= <TTTTTTTTTTTTTTT>
##$WBST= 1024
##$WBSW= 4
##$XGAIN= (0..3)
0 0 0 0 
##$XL= 0
##$YL= 0
##$YMAX_a= 572609
##$YMIN_a= -335040
##$ZGOPTNS= <>
##$ZL1= 120
##$ZL2= 120
##$ZL3= 120
##$ZL4= 120
##$ABSF1= 10
##$ABSF2= 0
##$ABSG= 5
##$ABSL= 3
##$ALPHA= 0
##$AQORDER= 0
##$ASSFAC= 0
##$ASSFACI= 0
##$ASSFACX= 0
##$ASSWID= 0
##$AUNMP= <proc_1d>
##$AZFE= 0.1
##$AZFW= 0.1
##$BCFW= 1
##$BC_mod= 2
##$BYTORDP= 1
##$COROFFS= 0
##$CY= 11.3945322036743
##$DATMOD= 1
##$DC= 2
##$DFILT= <>
##$DTYPP= 0
##$F1P= 15.9154993809931
##$F2P= -4.1035820241983
##$FCOR= 0.5
##$FTSIZE= 0
##$FT_mod= 4
##$GAMMA= 1
##$GB= 0.15
##$INTBC= 1
##$INTSCL= 1
##$ISEN= 128
##$LB= 0.24
##$LEV0= 0
##$LPBIN= 0
##$MAXI= 10000
##$MC2= 0
##$MEAN= 0
##$ME_mod= 0
##$MI= 1.114404
##$NCOEF= 0
##$NC_proc= 0
##$NLEV= 6
##$NOISF1= 3.799351
##$NOISF2= 2.8
##$NSP= 1
##$NTH_PI= 0
##$NZP= 0
##$OFFSET= 15.70392
##$PC= 1
##$PHC0= -10759.29
##$PHC1= 7.400949
##$PH_mod= 1
##$PKNL= yes
##$PPARMOD= 0
##$PSCAL= 0
##$PSIGN= 0
##$REVERSE= no
##$SF= 200.130013532006
##$SI= 16384
##$SIGF1= 3
##$SIGF2= 2
##$SINO= 400
##$SIOLD= 16384
##$SREGLST= <1H.CDCl3>
##$SSB= 0
##$STSI= 0
##$STSR= 0
##$SW_p= 3612.71676300578
##$SYMM= 0
##$S_DEV= 0
##$TDeff= 0
##$TDoff= 0
##$TI= <>
##$TILT= no
##$TM1= 0
##$TM2= 0
##$TOPLEV= 0
##$USERP1= <user>
##$USERP2= <user>
##$USERP3= <user>
##$USERP4= <user>
##$USERP5= <user>
##$WDW= 1
##$XDIM= 8192
##$YMAX_p= 0
##$YMIN_p= 0
$$ End of Bruker specific parameters
$$ ---------------------------------
##NTUPLES= NMR FID
##VAR_NAME=  TIME,          FID/REAL,        FID/IMAG
##SYMBOL=    X,             R,               I
##VAR_TYPE=  INDEPENDENT,   DEPENDENT,       DEPENDENT
##VAR_FORM=  AFFN,          ASDF,            ASDF
##VAR_DIM=   8192,          8192,            8192
##UNITS=     SECONDS,       ARBITRARY UNITS, ARBITRARY UNITS
##FACTOR=    0.0002944,     1,               1
##FIRST=     0,             0,               0
##LAST=      2.4114304,     0,               0
##MIN=       0,             -335040,         0
##MAX=       2.4114304,     572609,          0
$$ Real data points
##PAGE= N=1
##DATA TABLE= (X++(R..R)), XYDATA
$$ [...]
2240A860o70k291p30J945J743j022j609o96K068J238j142j770K9K041O20r66k180
2257a532P09J847L88j250j432Q09J497N62j896q55O25J340K93j616o87N82J462
2274H46k08j833j45Q25J255q89j184L8R60P27p47j032p1J509K4n87j328L90J383
2293f7J19q29q63Q53P03L41r54m95N09R03n2j080k50P18P89k06j015K3M52J110
2313G09p66n42j76J006M84n78p85J98R57J58o06r44L36R39j68q79m58R92M15l10
2333a8r93J74O14M74n71n50M85M78O7p86n56Q82N68l58p26j12N74O16o02p71L41
2354g70Q62J15p62o04Q86M66j05j008j43J024K54m99q86L44R58J00p36l85J02
2373g87J112j91o64j10L35P67j90o06k49P34M41l56n66j13N89N62n46p85K75P08
$$ plain form
2240 1860 1190 -1101 -1831 114 1857 835 -774 -1470 598 1836 694 -1076 -1047 994 1614 648 -1532
2257 -1532 -823 1024 1412 162 -1270 -461 1036 1598 -298 -1153 -528 812 1105 -511 -1198 -616 846
2274 846 638 -1195 -1340 -515 740 -149 -1333 -1295 -335 392 -355 -1387 -1458 51 75 -512 -1840 -1450 -67
2293 -67 52 -777 -1640 -787 -84 257 -697 -1192 -683 220 168 -912 -1162 -444 345 139 -876 -853 -401 709
2313 709 -57 -599 -775 231 715 137 -648 -450 507 665 59 -885 -549 390 222 -657 -1115 -123 292 -18
2333 -18 -1011 -837 -223 251 -320 -870 -385 93 160 -626 -1182 -300 268 -90 -816 -928 -354 262 -340 -1111 -770
2354 -770 92 207 -555 -1159 -273 193 88 -920 -1063 -39 215 -284 -1170 -826 132 232 -504 -889 -787
2373 -787 325 134 -530 -640 -305 462 272 -334 -583 151 592 236 -330 -443 146 708 162 -623 -348 360
2393C60N79p15o64K67L93O12r15n09L93J059m1r38n26P53R17j15r31p59M47J413
2413A080m23r76n93R29J303o36j188j47J342M28r53j154J60J446L52q31j560R38
2431d83J026O23j258q97O30Q25L07j413m34O90J438q9j777J32Q44J053m70j546
2449g99k33J323J445k011n67P1K243J32q51k031R44J533O47j589j630K56K227
2466A110J139j621k292K230J142R8k338j030J238J540N24k357m15R23J707l73
2482A225j458j542L190J6j309j794J38J936J383k159j375K31K435K65j547j751
2498b116J206J788P1k456p36J419K112l05k537n17J426K107m92j922o78J334J913
2515A617j099k216l59K086J914j266j872l45K321J117j624j847K2K629N11j564
$$ plain form
2393 360 939 224 -440 -173 220 832 -83 -592 -199 860 819 -119 -645 108 1025 910 -21 -780 -333 1080
2413 1080 657 -319 -912 17 1320 684 -504 -651 691 1119 166 -988 -828 618 970 139 -1421 -483
2431 -483 543 1166 -92 -989 -359 466 773 -640 -1074 -384 1054 965 -812 -680 164 1217 747 -799
2449 -799 -1032 291 1736 -275 -842 -771 1472 1604 753 -1278 -334 1199 1846 257 -1373 -1117 1110
2466 1110 2249 628 -1664 566 1708 1806 -532 -1562 -324 1216 1740 -617 -1032 -109 1598 1225
2482 1225 -233 -1775 1415 1431 122 -1672 -1534 402 1785 -374 -1749 -1518 917 1182 -365 -2116
2498 -2116 -910 878 949 -1507 -2243 -824 1288 983 -1554 -2071 -645 1462 970 -952 -1630 -296 1617
2515 1617 518 -1698 -2057 29 1943 677 -1195 -1540 781 1898 274 -1573 -1551 1078 1589 25
2531B5k344J638J932O16k939j072J175K372J65k704r68J674J893o38k396o80J968
2548b83K433k539j756L31K187J242j241k433k10K847J069k158j773L81K406P33
2564A236j829j847N9K864L24j055k733J539K186l2j768j437J796K697j323k239
2580a562J36J868J590j294k326m90K357K697l126j948O96K657J175l065j572Q25
2596a382J915J656j869k792J733K078L43k313j666R79L747j282k445m77J732J897
2612A854l81l225k49J709K230r30l320P54K010J208j272k030l77K763J078j631
2628A91k207L66K457O18j757k156J283K642N26k315j793J656K295q6k529r71J437
2645c43K114l73k252j182J927K051r27j850p61K012J836j808k100J21K624J403
$$ plain form
2531 25 -2319 -681 1251 1867 -1072 -2144 -969 1403 1568 -1136 -2104 -430 1463 825 -1571 -2251 -283
2548 -283 2150 -389 -2145 -1814 373 1615 374 -2059 -2269 578 1647 -511 -2284 -1903 503 1236
2564 1236 -593 -2440 -2381 483 807 -248 -2981 -1442 744 712 -1056 -2493 -697 2000 677 -1562
2580 -1562 -1426 442 2032 738 -1588 -2078 279 2976 -150 -2098 -1402 1255 2430 -635 -2207 -1382
2596 -1382 533 2189 320 -2472 -739 1339 1682 -631 -2297 -1318 2429 1147 -1298 -1775 -43 1854
2612 1854 1473 -1752 -2001 -292 1938 1008 -2312 -1558 452 1660 388 -1642 -2019 744 1822 191
2628 191 -2016 -1650 807 1425 -332 -2488 -1205 1437 1963 -352 -2145 -489 1806 1720 -809 -1780 -343
2645 -343 1771 1398 -854 -2036 -109 1942 1015 -835 -1596 416 2252 444 -1656 -1535 1089 2492
2661B492j825k429N24K525M08j563k008J019K418N15k777j202J772J768M7k078
2677c94j723J574K115r3k340j277K357J671p27k321L9J509J649j340j844M68J847
2694A170J83l08k496N56K614j20j154k576J624J794J002k446j793J531J984L43
2710A908k588j520J820J732j46k312n99J614J880q24k206m12K137J597j429k128
2726a476Q9J985J200j379k282N10K847n5j549j796R84K329k59j786j259J178K059
2743A340k08k141p42J392J610m53k005l45J597J533j181j678k96J642J340j297
2759A08j551K3K030O63j259j470P4K125L84j258j559O24J775M96j784j333J487
2776d25J250J61j655j289J726J398n44j293j270J677J297m43j577n20J610J069
$$ plain form
2661 2492 667 -1762 -1238 1287 1695 132 -1876 -857 1561 2076 -701 -1903 -131 1637 1684 -394
2677 -394 -2117 -543 1572 1479 -861 -2138 219 1890 1163 -1158 -1119 390 2039 699 -1145 -677 1170
2694 1170 1353 1045 -1451 -895 1719 1599 445 -2131 -507 1287 2289 -157 -1950 -419 1565 1908
2710 1908 -680 -2200 -380 1352 1206 -1106 -1705 -91 1789 965 -1241 -1653 484 2081 652 -1476
2726 -1476 -1387 598 1798 419 -1863 -1353 1494 1439 -110 -1906 -922 1407 1148 -638 -1897 -719 1340
2743 1340 1132 -1009 -1751 -359 1251 798 -1207 -1552 45 1578 397 -1281 -1577 65 1405 108
2759 108 -1443 -1420 610 1273 14 -1456 -1382 743 1127 -131 -1690 -1066 709 1205 -579 -1912 -425
2776 -425 825 986 -669 -1958 -232 1166 622 -671 -1941 -264 1033 590 -987 -1507 103 1172
2792A172r66j282l05J652J019j128j604J91J891N98j426j333L93J922m3j165r11
2809a325O65J530rj713m90R18J158J09j677n57J016J335p64j259o13J543J361
2826A228q39j733L32J230R33j162j143M31J443K11j145j127O33J463J04j303o36
2843a080J103R15k25j143n82R62J005m30j174k30J082O28m55j250L65P05P41r55
2861a8o15n8J048M45j018m71M12R51J39q15p86N60P91P6p05p49M65Q80j58p69
2881c95o24P39O71nq65j68L22O35K06j194q6Q47K61m14m58k69P84N45o09o64J19
2902f22R33J3m45k60J20O01K28o24m16M44N51K67j093l07P57M95P8j166J2O85
2922B51L79m74l75l33P21N22o28m26L38N79j42k32m96M5P03o0o94K18l5N75j89
$$ plain form
2792 1172 206 -1076 -1381 271 1290 162 -1442 -1251 640 1238 -188 -1521 -1128 794 751 -414 -1325
2809 -1325 -660 870 861 -852 -1342 -424 734 843 -834 -1391 -375 960 196 -1063 -1676 -133 1228
2826 1228 389 -1344 -1012 218 1151 -11 -1154 -723 720 931 -214 -1341 -708 755 859 -444 -1080
2843 -1080 23 938 713 -430 -1012 -50 955 525 -649 -879 203 831 376 -874 -509 196 937 -18
2861 -18 -633 -691 357 802 -216 -687 -275 676 815 0 -786 -226 565 641 -64 -813 -348 532 374 -395
2881 -395 -1019 -280 391 386 -479 -647 -325 310 516 -678 -764 83 344 -70 -528 -797 -13 532 -77 -741 -622
2902 -622 311 324 -121 -381 -261 340 568 -56 -472 -28 523 790 -303 -610 147 642 720 -446 -434 251
2922 251 630 156 -219 -552 169 691 63 -363 -25 554 412 180 -316 -271 432 372 -322 -104 -139 436 247
2943B47n11j03M54J26n4n06j32N41J46j82l80J22J77O5j67m03K21L02K52m59j77
2964d21K2M88K3l98J84k1K65O1m46L49j21M7j79K3k6L82j24k53L2J41L68k12j62
2987B2j41l8L85j68j06M3k21J84n5J38m4R3j47j57R2J16K9n8j94R7K19k81K50
3010E8n84N31j12k09J01o9K05j59K16k76Q6%K67j55l64q2L55K35m3k45o8L43J46
3033A77j52m12j73N50Q9k93k68K34M02Nl48j34M9O81K52j046j48M83L19j6n30
3054b79j83O15M29j98r07J29O68K63m45m08n5N17L90m38m65R7Q94l30j99m01P6
3075b30N17P5n87m01O93N53k66n99k26O28L75k98q69K12O28J89k61q33K58P27
3095B85J82n13n62J99L87P02q97n18K85P71L31o63q06N22O71J67q90l12N87P39
$$ plain form
2943 247 -264 -367 87 213 159 -347 -479 62 208 26 -354 -232 -55 10 -157 -560 -339 -37 215 -244 -421
2964 -421 -399 89 112 -286 -102 -123 142 203 -243 106 -15 32 -147 -124 -150 232 108 -145 -113 28 396 184 22
2987 22 -119 -157 228 60 -46 -3 -224 -40 -95 43 -1 92 -55 -212 -120 -4 25 -33 -227 -130 89 -192 58
3010 58 -526 5 -107 -316 -215 -284 -79 -238 -22 -298 -212 -212 55 -100 -464 -546 -191 44 1 -244 -312 31 177
3033 177 25 -387 -560 -10 79 -214 -482 -248 154 159 -189 -323 -274 407 659 -387 -535 -52 267 251 -279
3054 -279 -462 153 582 384 -523 -394 274 537 92 -316 -371 146 536 98 -367 -270 624 294 95 -306 -230
3075 -230 287 362 -225 -626 67 620 354 -245 -471 157 532 234 -635 -423 205 394 133 -700 -442 285
3095 285 467 -46 -608 -409 -22 680 -217 -735 -450 321 652 -11 -817 -295 376 543 -347 -659 -72 667
3115F67r6j035r4P36N61k87j068K7P21P88o09j008M54N72O33j045n97M40Q54K84
3135H98r65n35N08Q20j57o96p47O53P53L6p30o38Q13N02r0o36l47N69O56j95r89
3156e17N1P38O03p12q94R6R02N00p14r74j9J378N49j081q40M98R10L39j221m39
3176h47K18J473j79j049m94R65N14k09q21o59J281O53l49j274M96L50Q76o47j243
3195i45L14J086J61m31q41J65R96K28q46q18M51J030J23q01r33Q77Q35N7j082
3214c74q53J237J030o66p83o60R47Q11m54r24M1N72Q25m21j019n3J062P79j287
3233a90j090O08J205M10j191k55j36J275Q81j843j319R82N63K47J88j429R87L65
3251B58J43n65o24J193L56J21j097q87J293P11n05j149k47J638N18o99j123J96
$$ plain form
3115 667 571 -464 -558 178 739 452 -616 -589 132 920 311 -697 -243 329 962 -83 -680 -240 614 898
3135 898 -67 -602 -94 726 569 -127 -874 -221 532 568 -162 -800 13 515 425 -211 -558 11 667 472 -517
3156 -517 -466 272 875 163 -731 -635 267 767 53 -921 -940 438 987 -94 -934 -436 474 813 -408 -847
3176 -847 -629 844 665 -384 -878 87 601 392 -429 -1088 193 846 497 -777 -281 69 945 298 -945
3195 -945 -631 455 616 185 -656 -491 505 733 -113 -931 -480 550 673 -128 -1061 -184 651 708 -374
3214 -374 -1227 10 1040 374 -409 -1069 -122 689 235 -689 -648 -76 749 328 -691 -744 318 1097 -190
3233 -190 -1280 -672 533 943 -248 -503 -639 636 1517 -326 -1645 -663 -100 147 335 -1094 -107 258
3251 258 401 -164 -788 405 761 882 -215 -1102 191 902 397 -752 -999 639 1157 458 -665 -469
3269d69J015O59j357r16P61R55L14j613q6P46J234o42p08r34Q64J016o97l12n13
3288f83Q18L27K17j402O0J150M68o17j042L82J151L41j303l47q1J048M99o55o88
3307c57j27J185j01q71l60K83R76N23o45j049N22J070k25j324k34R45P06n76r65
3326f24j24O93J009o37j094r6J172O81n98q37k66J248J93o78n64l5J069L14j217
3345c91m02N33O12K26q73o23R13P63j14j046l75P95P69m86q22P7P03O90m26j015
3365d92j72R52J80n10p39M53P44J80o83o17K74Q74J56n80p86M43Q72j17o32m15
3385f15N47O43J0r42k69O09O57l6r81k94P91M08k53q52mP26N75o50p84J64P17
3406A67N34p57q07K52J076J94j038n28N93Q00J22q99o75O65O64k28o49j76N93
$$ plain form
3269 -469 546 1205 -152 -1068 -307 648 962 -651 -737 9 1243 601 -107 -1041 -177 839 142 -170 -683
3288 -683 135 462 679 -723 -663 487 955 338 -704 -322 829 1170 -133 -480 -561 487 986 331 -357
3307 -357 -484 701 600 -271 -631 -348 628 1151 506 -543 -21 1049 824 -500 -734 211 917 341 -624
3326 -624 -748 -55 954 317 -777 -873 299 980 382 -455 -721 527 720 42 -522 -557 512 826 -391
3345 -391 -793 -260 352 578 -295 -918 -5 758 644 -402 -777 18 787 301 -521 -444 259 949 523 -492
3365 -492 -664 288 468 -42 -781 -328 416 596 -87 -704 -430 444 600 20 -766 -323 549 432 -200 -615
3385 -615 -68 575 585 -357 -626 -17 640 604 -377 -671 120 528 275 -577 -581 145 720 70 -714 -550 167
3406 167 701 -56 -863 -611 465 659 -379 -907 -314 486 608 -291 -966 -301 363 135 -514 -690 -97
3425i7Q80l10r06j06N33M28l39n45r4J035K35o29n43J11P21j32k78l70R7N55L00
3446E46o47n15N72L91n6m98m47N33L95j47k90m05Q90J81k45m15l95O47K87j73
3466B09p00K19M92J37l52n32O7O67K62n05o87M48L70K19k49n11L42M25Q7q14K4
3487c82J58M47J01m29l27N53M02m19l00jK08M88l39n14K24J93M77o07j19r3O52
3508C73K94n19n65K33M74j1j62k21m0O37k21j76l48J15O40j62n85J30R7L82p5
3529B90l22m05P43M1l20k2j69M36J14j25m02R5N57j98l76m07M21K63q5j56j56
3550a83M17q8j82o5l7L8O9J34j94j69J40M07k68j48M2J62L9k1j68P5J26j7L0k27
3574h8o0L03m5l8P6n5L6K33j94M3l62K35J54k44J86j19L19l91r5K43j56J01r3
$$ plain form
3425 -97 783 473 -433 -539 -6 422 83 -462 -556 479 714 85 -458 -347 374 242 -36 -406 -309 246 546
3446 546 -101 -616 -44 347 291 -207 -654 -121 274 127 -163 -568 322 503 258 -157 -552 95 382 209
3466 209 -491 -272 220 357 5 -527 -460 207 469 -36 -723 -275 95 314 65 -446 -104 321 408 -406 -382
3487 -382 -224 223 324 -105 -432 121 523 104 -196 -197 11 499 160 -354 -130 63 540 -67 -186 -279 373
3508 373 667 148 -417 -184 290 279 117 -104 -144 493 272 96 -252 -137 503 341 -244 -114 -17 365 290
3529 290 -32 -437 306 347 27 5 -164 272 386 261 -141 -46 511 313 -63 -470 -49 214 129 -27 -183
3550 -183 234 146 -36 -101 -138 -100 -31 103 -91 -260 -120 287 19 -129 -87 75 114 93 -75 0 126 109 139 -88
3574 -88 -148 155 110 72 148 93 129 362 168 211 -151 84 238 -6 180 61 380 -11 -106 137 -19 82 -11
3597a1o3J3K48k8q3l17J20L3K2j53N3K45j23Q3j76J40J44l27m2J77j98K72j29
3620a00j80M82l54J78j5K8j48j8J51p1J54j46N6m0m8L0l2L83k18J8k59K56K2o2
3644F7Q2k48K85P0k88m7R2mJ06j32PJ10K34j67k91j30j1M67P4k77J29k58J86k95
3668b39j4J55N65n67j77l42P04M1m24k16K79k24O35m1J4q6L23K51n38m41L94K55
3690C07R6k58P9o81L13Q51q18j60R2N49n72K10q04Q21N11p08j30j2l64J245Qn86
3712a1M06j16j1l30j95L80J71N32m45r47J60P7R53n21j77k56P30l27R42j745N48
3733a82k69K37M54N8r2K53k48k57m48K34J170p45k73l3L21J36M67r66K97j02R32
3754I44l44q89q10J099N29q54P1k21L81N31n31o04M86M15J52J33l65q57O45L46
$$ plain form
3597 -11 -74 -61 187 159 76 -241 -121 -88 -66 -219 -166 79 -44 39 -137 3 147 -180 -222 -45 -243 29 -100
3620 -100 -280 202 -152 26 11 39 -109 -127 24 -47 107 -39 17 -23 -71 -41 -73 310 92 110 -149 107 129 67
3644 67 149 -99 186 256 -32 -79 13 9 115 -17 -10 100 334 167 -124 -254 -265 202 276 -1 128 -130 56 -239
3668 -239 -253 -98 467 -100 -277 -619 85 126 -298 -514 -235 -459 176 135 149 63 386 637 99 -342 52 307
3690 307 403 145 224 -457 -144 707 -111 -271 -179 370 -202 8 -796 25 536 -172 -302 -314 -678 567 575 -11
3712 -11 395 279 268 -62 -257 123 294 826 381 -566 -406 -329 624 103 -74 -330 400 73 1015 -730 -182
3733 -182 -451 -214 240 298 206 459 211 -46 -494 -260 910 165 -108 -141 180 316 783 -183 114 12 944
3754 944 600 -289 -1099 0 529 -325 -254 -475 -94 437 -94 -698 -212 203 355 488 123 -734 -89 257
3774B57n34L28J21l7O80q23m46J63K84P06j158N62R3N69p12m36JM14k43M96m34
3795a49k68M35P42n12o47k31O36J001n07r89M00K79J66l77r4k85J002J47p22j6
3815A1K85K41m39M42j537J766j06k90o53k87P43N04n38K7n44O53l43q8K30j17
3835d0M02j9n71l19q6R21K89r03k39L10O81m51Pj10L58J01L34j132o1O62K82J18
3857E34n98p0j15P59K7j105Q3P31J26M25j327j28Q72J98l01q02L22Q09L78m51
3877C67k4o87M21L06l14m32L92K01L51n54o38M46O27J05o58k89L00K07n4k82l74
3898e83O53M08m50l69R5l2N67k47l05m23J352Q5m39p69j42J169l3m24l52J3L84
3919A58L48p94j18K51K15M8n32L40J75J61Q8m93j03M49L74k66n83RK56K37m57
$$ plain form
3774 257 -277 51 172 135 815 -8 -454 -291 -7 699 -459 103 196 765 53 -383 -382 32 -211 285 -149
3795 -149 -417 18 760 248 -399 -630 6 1007 500 -489 -89 190 356 -21 -115 -400 602 749 27 11
3815 11 296 537 98 540 -997 769 663 373 -280 -567 176 680 142 169 -375 278 -65 -153 77 -40
3835 -40 362 343 -228 -547 -633 288 577 -326 -565 -255 426 -25 -18 -128 230 331 665 -467 -528 134 416 534
3857 534 -64 -134 -249 510 537 -568 -485 246 372 797 -530 -658 214 412 111 -691 -369 440 818 367
3877 367 343 -344 77 383 69 -363 29 230 581 27 -611 -165 462 567 -91 -380 -80 127 73 -209 -583
3898 -583 70 478 28 -341 -246 -278 289 42 -263 -686 666 751 312 -457 -599 570 537 113 -239 -226 158
3919 158 506 -288 -406 -155 60 108 -424 -84 91 252 340 -153 -256 193 567 301 -282 -273 -17 220 -237
3940b37n7j69P58J32l19n94O4Q03j5m80k31K11J88L26m34l77L38K44%m19j8J98
3962h8M69q3n86q3L40K84m8l91k05M08L79j69o08K83J39L10j58k71k81M51L73
3983D65m33l84K2O34K48o45l25K39L84K57o46k61R9O34l88J21l32M19L71l45n00
4004c66K15J06N10m01l45J08M97m2l06m22k2N88L61o07j72R0L13L49l86l69L02
4025AM38j52l94l22L33M42j12k32k04L09L5p7O6n61M57K06j26k0l85M0M63j30
4047G5m03j23K89K26Q7m49J14M80l94K41l45L59L47j57l89l11L82L47k21l09J2
4068a42n2M65j75k38K43p4K10r8m68L52P7K71k69n86O6O08J95m40o0RJ77K94l79
4091a4l06J33M96k49j20j46K28J78J42n23O8J34Q1L27l63m67M74K95k40m46L24
$$ plain form
3940 -237 -294 -463 295 427 108 -486 -422 381 366 -114 -345 -134 54 380 -54 -431 -93 151 151 -268 -286 -88
3962 -88 381 298 -288 -371 -31 253 205 -186 -391 17 396 227 -381 -98 41 351 193 -78 -359 92 465
3983 465 32 -352 -330 304 552 -93 -418 -179 205 462 -184 -445 -346 288 -100 21 -311 108 479 134 -366
4004 -366 -151 -45 465 64 -281 -173 324 282 -24 -446 -468 120 481 -126 -298 -208 105 454 68 -301 1
4025 1 439 287 -107 -429 -96 346 234 2 -202 107 142 65 131 -430 27 233 107 87 -298 -258 205 75
4047 75 -328 -451 -162 64 151 -298 -184 296 -98 143 -202 157 504 347 -42 -353 29 376 155 -154 -142
4068 -142 -194 271 96 -142 101 27 237 139 -329 23 100 371 102 -484 -418 190 385 -55 -115 -106 71 365 -14
4091 -14 -320 -187 309 60 -60 -206 22 200 342 -181 -113 21 102 429 66 -401 73 368 128 -318 6
4112Fl3M04j81o90L77j3K64j19n25M49K63Nj55j56L15q5jj83j36n9N97k22q9j42
4136a09nL71j5n19J82J9J50N6l27L1L61J66o09k07K93K58J14l21J24j6j11J82
4158F8j06q0J75N1J09n30K14K9J60Rk96P1J15J9l0l9L9j45L45k80rj22M20M7l29
4183i5J3j23L15j36J41j28J83l5M0j72j27l9M78k54L5r7j95K63j46K33k14j42
4205b02M24k24J53l28J59K23m8l20P3K41L2k91J08K21k89j73M60m06M76m3l69
4226a23J74k10J97m5R3k61R6K02k32K83k12j8K09j28k01N5R2R9J53j9k32k16K96
4249E2j07J78kk74r2M09k85J79j79L04l48M14j95K00O6j83p7M7L6j67J5n7L5r2
4273a23K21j62K49k08n4L01k34k00L10k15J1J28k42J22J34j83K06J25l02K90j44
$$ plain form
4112 6 -27 377 196 -494 -117 -130 134 15 -510 -61 202 207 52 -104 211 126 125 -58 -194 -253 344 122 33 -109
4136 -109 -114 257 242 -277 -95 -76 74 130 -197 -166 195 361 -248 -455 -162 96 210 -111 13 -3 -114 68
4158 68 -38 -118 57 108 217 -313 -99 -70 90 99 -197 -126 -11 8 -22 -61 -22 -167 178 -102 -111 -233 187 234 -95
4183 -95 -82 -205 110 -26 115 -13 170 135 175 3 -124 -163 315 61 96 -1 -196 67 -79 154 -60 -202
4205 -202 222 -2 151 -177 -18 205 157 -163 -90 151 183 -108 0 221 -68 -241 219 -187 289 246 -123
4226 -123 51 -159 38 -7 86 -175 -79 123 -109 174 -38 -56 153 25 -176 -121 -29 70 223 204 -28 -244 52
4249 52 -55 123 121 -153 -245 164 -121 58 -121 183 -165 249 54 254 320 137 60 107 143 -24 -9 -66 -31 -123
4273 -123 98 -64 185 -23 -77 224 -10 -210 100 -115 -104 24 -218 -96 38 -145 61 186 -116 174 30
4294C0l7L5j1k4l60J21m6J81K04j80L3JK0k0J84k98K25k9j26p1QP4R0K06j85L00
4320C25l02j32K61j59P7q6K42l31J72q6P6J79k16L7M3l7o8P9l18K55J6K04q8k23
4344h0l4M7j63K91j30J78j48K05k47K91k6l42o4L18j53K37l45j40L83j28j21L9
4366a32rO6J72j42lPk0L30l67l11L75j22K48Po2j44K09j70J14L3k79M22j67j41
4390h6k0O8J58jj12j61K35K03r4l69K67k60L77l50J07O2l3L02k16r3M47k49k16
4413c4j88m96R69l5J32m47K18J95K48p35J29j11K1M57K5m78l67N08j30N53n67
4434a33p9O9j13M78n39K82K86j39L35o27J05o3M00Q5k53k94N6l27L51J95l23J65
4456h3O9R3l54J25L56n57L42j36J49K69m9R3o88M68L8jJ86Q9o54M56K80j22K11
$$ plain form
4294 30 -7 28 17 -7 -367 -246 -292 -111 93 -87 -54 -53 -33 -53 131 -167 58 29 -97 -168 -160 -86 4 210 25 325
4320 325 23 -109 152 -7 70 -16 226 -105 67 -19 57 236 20 57 100 63 -5 74 -244 11 27 231 143 -80
4344 -80 -114 -67 -230 61 -69 109 -39 166 -81 210 184 -158 -222 96 -57 180 -165 -305 78 -50 -171 -132
4366 -132 -141 -75 97 -45 -48 -41 -61 269 -98 -409 -34 -156 92 99 37 -107 102 -68 46 79 -200 222 55 -86
4390 -86 -106 -38 120 119 7 -154 81 284 190 -179 88 -172 205 -145 -38 24 -9 293 77 -16 431 182 -34
4413 -34 -222 -718 251 216 348 -99 119 314 562 -173 -44 -155 -134 323 348 -130 -497 11 -119 434 -133
4434 -133 -212 -143 -256 222 -317 -35 251 112 447 -180 -75 -138 262 347 94 -200 -144 -471 -120 75 -248 -83
4456 -83 -14 79 -275 -150 206 -351 -9 -145 4 273 224 317 -371 97 135 134 320 409 -245 211 491 369 580
4479E80o53M6K23q02L79J21L82O8k80O99o28j20j15j60L42M13q60J66r0J4O75
4500D00N74r94n79N53J47j10m0k66O16p09L66P24j101K36r1N15m39P22l82K54
4520C96P2j56q41Q18O4n9k94J90k17J42m02N5J88K86k56j4l16P43j01J10k11M61
4542F58o48j71J284j332n65O04O62l58o90K55O50q00K18J80O95j141J042n6j272
4561g85O24J179q61o0n83P11L35L9q47R69q23K24j10N9j09J74j64P9K5k70K43
4582D9J46j58k63Q3O66k10k79K00k27J55K76j52n71N93l6K56r52L8Q2P62J95q15
4604a62N97m22K20k60J5j52L3L85j86m91L55R9J15l56Qk53Q46l78J11k66J22k19
4626b39M74m96j29N57r3L76l12N32j470M11Q19l60k3l96P88r9k16k97K87K13J5
$$ plain form
4479 580 -73 -27 196 -606 -227 -106 276 344 64 763 135 15 -100 -260 82 495 -365 -199 -289 -275 400
4500 400 974 -20 -599 -46 101 -9 -49 -315 301 -408 -42 682 -419 -183 -274 241 -198 524 142 396
4520 396 468 312 -529 289 353 294 0 190 -27 115 -287 -232 -44 242 -14 -28 -344 399 298 408 197 658
4542 658 10 -161 1123 -209 -774 -170 492 134 -556 -301 349 -451 -233 -53 642 -499 543 487 -785
4561 -785 -161 1018 157 97 -486 225 560 599 -248 721 -102 122 12 71 -38 136 -28 51 76 -194 49
4582 49 195 37 -226 -143 523 313 34 234 7 162 438 286 -285 308 272 528 -424 -386 -304 458 653 -162
4604 -162 435 13 233 -27 -12 -164 -131 254 68 -423 -68 31 146 -210 -202 -455 391 13 124 -142 -20 -239
4626 -239 235 -261 -390 167 74 450 138 670 -800 -389 430 70 47 -349 439 340 124 -173 114 327 342
4647C42p38L96K99n75j1N12j66L58J00O8o86N08k18j79K0r7l26m79J311l67n1
4668B1k3j6j64p6K98l69J14N89m19R8N56k86N2m95j98q4P85K78j123R95j231R08
4690B10k84J06k67J72N96K2n11q1N9l84O77k04K92j68n88K67%L14K53o61L9l63
4712e04J078q02L05J77m25n6L43r3j39K74m82P7N79m43J2M14l57L7j71K30l43
4733b89P94k66m44P31p90L80L6J49o26R17o37K15k84j12j12r5L36o22L45O95m85
4754a64L44q2O38p16K08k05O2k28K08M91k74m9j23m4j17n2J48J22K53p86R2K99
4776B5k02j9k05L28K61K5R7n02Q4M57k65J17k40J66k07J38j06k95M68o0J36j48
4798E3p7j03L26k58p8K10m02N39k72R6j41J27M31m96J14j65K13p8K6J5l6j50J1
$$ plain form
4647 342 -396 0 299 -276 -287 225 59 417 517 585 -101 407 189 10 30 -67 -393 -872 439 72 21
4668 21 -2 -18 -182 -258 40 -329 -215 374 -45 53 609 323 375 -120 -318 -402 383 661 -462 533 -698 210
4690 210 -74 32 -235 -63 533 555 44 -37 22 -362 315 111 403 235 -353 -86 -86 228 481 -180 -141 -504
4712 -504 574 -228 77 254 -171 -227 116 23 -116 158 -324 -247 332 -111 -99 315 -42 -5 -176 54 -289
4733 -289 505 239 -205 526 -264 116 152 301 -325 592 -45 170 -114 -226 -338 -433 -97 -719 -374 321 -164
4754 -164 180 98 736 20 228 23 85 -143 65 556 282 233 110 66 -51 -103 45 167 420 -366 -274 25
4776 25 -177 -196 -401 -73 188 213 310 -192 -108 349 84 201 -39 127 -80 58 -48 -343 125 65 201 53
4798 53 -24 -127 199 -59 -137 73 -329 210 -62 34 -107 20 451 -45 69 -96 117 39 65 80 44 -106 -95
4821i5q1O3J70j92M20J4m61K43L0l3r8j36J93P8k15k30K52J0j29K81m7n4J41l00
4845a76L88k71J91k8k53P5j46L33K12m69J19j18L41k12n0r1J63r5J78q0J69l15
4867a35L05o7n6q1k36J93L22l24j79J06K74o2q3l8J08j76L6M3n9J05o3K1N7O1
4891G2j20J87l16K3M3J76j08J90l25l5J83j6k17K05R3K56l79J26J92j98L17k68
4913H1j23R2j75K24l9Kj83J84j31J22k08J04J27k65K37N1K5P0j20N1m26K27R7
4936B4j63L15K7l9j19j71J40n9P8M6M4j69l2j47M95m64M3J99k36K87n2j98J30
4959b1k4K6O9k89J94J16M2Q3l33k52L61MJ50j39n8K05j56k1J14l8k13L11l52K72
4983E1O5k73K67l29M13k50R5K1P1k15K67k0j7k69J8j3J5J87K78k88mR1J80m25
$$ plain form
4821 -95 -176 -113 57 -135 285 299 -162 81 111 78 -20 -156 37 115 -100 -330 -78 -68 -197 84 37 -17 124 -176
4845 -176 212 -59 132 104 -149 -74 -220 113 325 -144 -25 -143 198 -14 -64 -155 8 -87 91 11 180 -135
4867 -135 170 103 47 -34 -270 -77 245 -79 -258 -152 122 60 -23 -61 47 -129 -93 -50 -109 -4 -67 -46 11 72
4891 72 -48 139 -177 -154 -111 65 -43 147 -178 -213 -30 -46 -263 -58 35 291 -88 38 230 32 349 81
4913 81 -42 50 -125 99 60 62 -121 63 -68 54 -154 -50 77 -188 49 100 125 195 75 126 -300 -73 24
4936 24 -139 176 203 164 45 -126 14 -45 33 79 123 -46 -78 -225 270 -194 -151 48 -188 99 47 -151 -21
4959 -21 -45 -19 50 -239 -45 71 113 196 -137 -389 -28 -24 126 -13 -71 134 -22 -43 71 33 -180 131 -221 51
4983 51 116 -157 110 -219 194 -56 39 60 131 -84 183 163 146 -123 -105 -118 -103 84 362 74 70 161 341 -84
5007h4Q6KJ95k94k39M40p3J43l04K69q9n0j13Q3r0J07J26k49L3L04j7k3k02K2
5031a7J91j23rL69m57O5j19J04q1J51j18J94k10K34r7J14l80J81o2L16r7j29j98
5054a78J20L68n86J13J95p7K30k3k70N3M5M7J56k79K42k31J05k08P0K87O6J55
5076D00n87mN04j18J41n8j86K04k35K10l35l46L40j10k76R4N65m9m02M12J05j8
5098B51k59K81l09m2K67k40Q9M22o13n2j82P67n91j79K16K76J2J20L6m31j38R27
5120F28o87M89p9k58j37l47P33L38l46l05L90n69O87n31o31R38q32K09K76j62
5140a96Q72j118Q23l53n86P69k58j0R7k71k45N2Q9n0Q71r06O87r29P1P85o31N47
5162A10k04J6O59l96p55P69J20k39J60l37J78K52m65L05l00M28j28m10K90r3%
$$ plain form
5007 -84 2 4 199 -95 -334 106 33 176 -128 141 52 2 -111 -28 -118 -11 115 -134 -101 203 186 163 -39 -17
5031 -17 174 51 42 411 -46 19 -100 4 -77 74 -44 150 -60 174 77 191 -189 -8 -70 246 149 20 -178
5054 -178 -58 310 -276 -163 32 -45 185 162 -108 -55 -10 37 193 -86 156 -75 30 -178 -108 179 245 400
5076 400 -187 -191 313 195 336 278 92 296 61 271 -64 -410 -70 -180 -456 -362 203 154 -248 164 269 251
5098 251 -8 273 -36 -78 189 -51 38 460 -153 -205 -387 380 -211 -390 -174 102 114 234 270 -161 -299 628
5120 628 -59 430 351 93 -44 -391 342 680 334 29 419 -150 537 6 -625 313 -519 -310 -34 -196
5140 -196 676 -442 381 28 -558 211 -47 -57 40 -231 -476 -424 -335 -385 486 -420 267 -662 -591 194 -437 110
5162 110 -94 -78 581 185 -570 199 319 80 240 -97 81 333 -132 173 -127 301 173 -237 53 -40 -40
5183d0K72l08J83q7O0l32J16K16j61L17j19l72K83M27l44J53j38k45L90j13k36
5204g8J80j41K63l18J10m5Q4K08j16j85K4l10L15P7j55P7K5n7K31l61p8J67J60
5227G7M6l21J18N3K2J27l7L0K6J0j72j7j01m2J81J55o3j24K21j35j49O1K74j43
5251I7j11j49K82j9k20L67m02N5K40k12n6J7K14q1N0k39L23k38l2K86j19j13q3
5274a43LK90j62M9m0j18J63J13l71J77K76j54j56J18k18J84L6k24K43J11k29J24
5296G2N0j27J27j14j72R6MJ43j1q8O0P6j24p3K75k45K0k2J19j86J83k46L09k77
5320a51Q0j03K28J61j73j76J9J17j96K13J41n0l17L44k11O6j16J75q6J93l6j85
5342f3Q9K43j61j90J40Rj9J32j95M2N9o6J4j28K34O6P1j48j53J06k81R8N7n3N9
$$ plain form
5183 -40 232 -76 107 20 80 -252 -136 80 -81 236 117 -255 28 455 111 264 126 -119 271 158 -78
5204 -78 102 -39 224 -94 16 -29 55 263 147 -38 -14 -324 -9 68 -87 -10 15 -42 189 -172 -250 -83 77
5227 77 123 -198 -80 -27 -5 122 85 115 141 151 -21 -38 -139 -181 0 155 92 -32 189 54 -95 -34 240 97
5251 97 -14 -163 119 100 -120 247 -155 -100 140 -72 -128 -111 103 22 72 -167 156 -82 -114 172 53 -60 -143
5274 -143 -140 150 -12 37 -3 -121 42 155 -216 -39 237 83 -73 45 -173 11 47 -177 66 177 -52 72
5296 72 122 -5 122 8 -164 -68 -64 79 68 -20 40 116 -8 -81 194 -51 -31 -53 66 -120 63 -183 126 -151
5320 -151 -71 -174 54 215 42 -134 -115 2 -194 19 160 110 -207 137 -74 -8 -124 51 -35 158 122 -63
5342 -63 26 269 108 -82 58 67 48 180 -15 27 86 20 34 -94 140 206 277 129 -24 82 -199 -101 -44 -97 -38
5367c8j80oJ24j5j5K63l05J17K70p7j40J1k3j68K85k27j35L70k5Oj33J2PM19k54
5392A43p2l16K50ml3k7Q5JJ7rp9NJ3P3JM1p9N7L6o4J5k33J45P6J21q7l23K07k16
5421b56L93j57l9J83r4k86L80J78l39J1k4R6J93j80M6p8l00K93P8Q7j21m8J1J26
5445A53J65l64J08n2Q9n8k03L48l10Q6K51K0k10l6K89r9l36K99M4l7n6j7j41K60
5469A93j81k8kj84K57j78K21k70o2K60J4j56J77j93J80P5k5Q2j87K26o8k18J42
5492G5k50P0J26m7N2n7R5J84L2r85N83P3j65K41p8P0P5k45J82p0K4l8K36k14m3
5517g4q4J00R4Ln9m3J87j14Q8Q3k92M1j18L58j68r0j9J02o4J51l48J67K24k95
5541a70J15L28k48k38M26mj24j40L66n0n9p76K63M76Jj63L10j036M69L6L29p48
$$ plain form
5367 -38 -218 -224 -100 -115 -130 133 -172 -55 215 138 -2 9 -14 -182 103 -124 -259 111 86 92 -41 -29 -22 397 143
5392 143 71 -245 5 1 -32 -59 26 27 44 35 -44 -39 -26 47 48 89 10 67 103 39 54 -179 -34 42 163 76 -247 -40 -256
5421 -256 137 -20 -59 124 30 -256 124 302 -37 -26 -50 46 239 59 105 27 -273 20 98 185 64 16 27 153
5445 153 318 -46 62 10 99 41 -162 186 -124 -38 213 233 23 -13 276 177 -159 140 184 147 91 74 -67 193
5469 193 12 -16 -18 -202 55 -123 98 -172 -234 26 40 -116 61 -132 48 123 98 180 -7 219 151 -67 75
5492 75 -175 -105 21 -26 26 -31 64 248 280 -705 -122 -49 -214 27 -51 19 94 -151 31 -39 -15 -53 183 -31 -74
5517 -74 -158 -58 36 39 -20 -63 124 10 98 181 -111 -70 -188 170 2 -88 -107 -5 -69 82 -266 -99 125 -170
5541 -170 -55 273 25 -213 213 209 85 -55 311 261 202 -574 -311 165 166 3 313 -723 -254 -218 111 -637
5563f37K39l09N79N18o56l67P37K40j3p2r18R65L94j143O58L0l87O21r86M91J82
5584A66j35p1M18m39K42k47K27o41J084m37l31L01q1j03l86N29l03K36k62J78
5604e5j31j51O65o52L6K81o4j81J66j14j58j58j40P50N27n42N2M29r62L30m4P12
5626E96j013N78K74m32P6L01m85j15R91m77p44O64j95K09m73R80m82j67M05r23
5646d32O83q9k45K46J45j017P77k28P45n36N4K19n97q2L47J86k67q1j22N62q95
5667f27P83p28J020j53k51K34n58N35n97K18M11l84J13L40l47n85K18Q0J79k83
5687c82N11J27m84O53r67M19K95K20O8l00L02j030J137q20J18n9J33J13l19L93
5707A28r10R05p5K95o87j96M32K90m00L51J46o39L48O0PL10m17J66o15J90L57
$$ plain form
5563 -637 -398 -707 -128 390 -266 -633 104 344 331 259 -659 306 700 -443 215 245 -142 479 -507 -16 166
5584 166 31 -40 378 -61 181 -66 161 -480 604 167 -164 137 56 -47 -433 96 -207 29 -233 -55
5604 -55 -186 -337 328 -324 -288 -7 -71 -252 -86 -200 -358 -516 -656 94 621 79 131 560 -402 -72 -116 596
5626 596 -417 161 435 3 79 380 -105 -220 771 294 -450 214 19 228 -245 735 253 86 491 -432
5646 -432 251 162 -83 163 308 -709 68 -160 585 49 103 322 -275 -357 -10 176 -91 -172 -294 268 -627
5667 -627 156 -572 448 295 44 278 -280 255 -342 -124 287 -97 16 356 9 -576 -358 -278 -99 -382
5687 -382 129 256 -228 425 -542 -123 172 392 460 160 462 -568 569 -251 -133 -192 -59 54 -265 128
5707 128 -782 123 48 343 -344 -540 -108 182 -218 133 279 -360 -12 48 55 365 -52 114 -501 -311 46
5728D6m58N95j86m41P95k72N7p7L8J49o95O25m87j02Q7p9L63j42K80k63R5M79
5750D07l31J64l20p29R63J32n36J5L90j11k92J15K95o1k11J90j59N9j21K44o85
5771e82L58M85J24j22J99n51L46j59J5o52K36L26O6l9J80J40l13K05l72L36o7
5792A59J15q29L59k56K55P7K20K12l05Pl28L46n41k29J195m47n2k80L45j77l50
5813e04N16j96J05k19L14o58N89M9J0j72KK32k42L27k67k75K30L91j98N3j13L18
5835B92kk99P33j365N50m03J451j358P91K4p04l28Q0Q50n98K92k95J053r70N58
5855C52l73K88q2N22p52N5q4k90Q34p70M77q0P3k1q42O27K1J5k23rM57j28J92
5878B59l78J2j41N40l71P0K68l09ok0j96O3m9L45j54J47M04o76K59m73N29P3l37
$$ plain form
5728 46 -412 183 -3 -444 351 79 136 59 97 246 -449 176 -311 -413 -326 -405 -42 -184 96 -167 -72 407
5750 407 76 240 -80 -809 154 286 -250 -235 155 44 -248 -133 162 101 -110 80 -79 -20 -141 103 -582
5771 -582 -224 261 385 263 462 -89 257 98 113 -539 -303 23 89 50 230 370 57 262 -110 226 159
5792 159 274 -555 -196 -452 -197 -120 100 312 7 14 -314 32 -509 -738 457 10 -42 -322 23 -154 -504
5813 -504 12 -184 -79 -298 16 -642 -53 -4 6 -166 -164 68 -174 153 -114 -389 -159 232 34 87 -26 292
5835 292 290 -9 724 -641 -91 -494 957 -401 390 414 -290 -618 -538 312 -286 6 -289 764 -206 352
5855 352 -21 267 185 707 -45 10 -74 -364 470 -300 177 97 170 149 -693 -66 -45 -30 -253 -262 195 67 259
5878 259 -119 -107 -248 292 -79 -9 259 -50 -56 -76 -272 -209 -258 87 -67 80 484 -192 67 -406 123 196 -141
5901a41N78o43j99L86j94M2L74j88R4J42k02l83N75o73M91l29j26M83K6j12j44
5922a43J48J40j43j32J65j25K32k8o35K83R7M5j09J97K06j21Q6k73L28q4l0r5
5944IK78j82k01J34n8n6J00J06j24m5J1O7Q1Rj10l40L86K19j86l67L66k60L08
5967A45n0q3r3K52k81O7K0J27r3N7k79O2l9K92j71Q7J74n10K96OK80k64J33k9
5991A06k14j50K39j01J25J7k8K11l01N8J18K48k21o8P9j79m7J95l98J90J24oP2
6014F9J5k04J95K13k26o9P4j4O0O4j89m2l1J84Q4k06J78j31Q3P3p1j25J7r6q6
6039a81K3J28J76j8j58K3k2j60J30O1j95Q7J97m4j26K01j00J36k14K8P6P2k76
6062a56J04J76K8l43K02j4k32L97k0o9k19L65k49kK29m0l71l8L7K78p1m9KR3k01
$$ plain form
5901 -141 437 -206 -405 -19 -213 -171 203 15 109 251 49 -334 241 -432 59 -270 -396 87 113 1 -143
5922 -143 5 145 2 -130 35 -90 142 114 -521 -238 -141 -96 -205 -8 198 77 163 -110 218 134 104 9
5944 9 287 105 -96 38 -20 -76 24 130 6 -39 -28 39 120 129 19 -321 65 284 98 -269 97 -163 145
5967 145 95 12 -81 171 -110 -43 -23 104 11 68 -211 -149 -188 104 -67 20 194 -316 -20 -14 266 2 135 106
5991 106 -108 -258 -19 -120 5 22 -6 205 -96 -38 80 328 107 39 118 -61 -108 87 -311 -121 3 -3 69
6014 69 84 -120 75 288 62 -7 67 53 113 177 -12 -54 -85 99 183 -23 155 24 107 180 109 -16 1 -95 -181
6039 -181 -158 -30 146 128 -30 -7 -29 -189 -59 2 -193 -106 91 47 -79 122 22 158 -56 -28 48 120 -156
6062 -156 -52 124 152 -191 11 -3 -235 162 142 73 -146 219 -30 -32 197 157 -214 -252 -215 63 -8 -57 -55 38 -163
6087a63J99J7l30J32J92r8J35r5j78o4L21q0J11j31k8N6J20p1k88P0J95n8Pk3
6111e2j99K02jK73k64j32K49j47J84j13K36n53L30l4J71J6j62j81J13K40k36R5
6133C5k47L07k26m9P7j88J87J75j41O4J22K1k72K11K9m00M47j23j16J10j39R0
6155b6n0L1J3L61J7o44L10L4L6j67Q8j7k14N11n71J46L37j40O7r2k45K9K0m2K14
6180FJ03r2j31J37JQ9l38L58j57j33L01k05j23O4M93m14KK92k03p4m0n9k90P17
6204C04q4j16m2l96M71k46M36j80Q0l19M4J50q8K27l27K37K03m28k21J34M0J53
6226C2o8j41R6q0K40j76o7P8L27j60J37m64N11k99p3M6R3J66n13N06l05J74l4
6249B6N8M9J84l26P1l5r0K00k72J31Q9j97J06O7k43j5O4L19l45J1J08J62o3k32
$$ plain form
6087 -163 36 53 -277 -145 47 -51 84 -11 -189 -253 68 -12 99 -32 -60 -4 116 45 -243 -173 22 -36 -29 -52
6111 -52 -251 -49 -50 223 -41 -173 76 -71 113 0 236 -317 13 -21 150 166 4 -177 -64 176 -60 35
6133 35 -212 95 -131 -180 -103 -291 -104 71 -70 -6 116 137 -135 76 105 -295 152 29 -87 23 -116 -26
6155 -26 -76 -45 -32 329 346 -298 12 46 82 -85 3 -14 -228 283 -288 -142 195 55 122 30 -215 -186 -166 -208 6
6180 6 109 17 -114 23 24 113 -225 133 -24 -157 144 -61 -184 -120 373 -41 -39 253 50 -24 -64 -123 -413 304
6204 304 220 104 62 -334 137 -109 327 147 227 -92 -48 102 14 241 -86 151 354 -74 -295 -161 -121 32
6226 32 -36 -177 -81 -161 79 -97 -164 -86 241 81 218 -246 265 -34 -107 -61 32 198 -315 191 -114 60 26
6249 26 84 133 317 -9 62 27 -63 137 -135 -4 85 -112 -6 61 -182 -197 -133 186 -159 -148 -40 122 59 -173
6273a73LQ9j0L50l84m0K06L6l71L74L06o03K53o7o4J7K17l7j09j20l9J23K10l1
6297A36k10j2M3n4K11k54R6lq5J71l26J68q6J88j96L45K25q99P99m31K29p1R7
6320H1l19N03n51K66K27j82j43Q2J0k03M65K26j74K94n36N69j227K55J51M26m02
6341a82K35l40J15N79n28K20l86J05o7K3o0K7R88k81P9l15k36P1J17L53q69L22
6363c0J72Mj10k01l4l79J29N00n14j2J48L28J98l19K32l72l54N18l99J083m99
6384H9L22m19L05l83K38k91j97J15J1J82j07l66M85K27P3l00p8k70O27n04M15
6405A74m53Q21m42k15j60N89j48j61k29J009l93j97L38o51m23M77J13k98M11J61
6425C23m09m91R30o33P2O2K68j35J72l18o6j69O56m90M23l68K63m09P25r72L2
$$ plain form
6273 -173 -170 -81 -91 259 -125 -165 41 77 -294 80 386 -217 36 -31 -95 -78 139 102 -7 -127 -166 -43 167 136
6297 136 -74 -86 -43 -97 114 -140 -44 -47 -132 39 -287 -119 -205 -17 -213 132 357 -542 257 -174 55 -16 81
6320 81 -238 265 -286 -20 207 25 -118 -36 -26 -229 236 462 288 582 46 615 -612 -357 -206 220 -182
6341 -182 53 -287 -172 407 -121 99 -287 -182 -249 -226 -286 -259 729 448 527 212 -24 47 164 517 -352 -30
6363 -30 142 146 36 -165 -199 -578 -449 51 -463 -475 -327 1 199 -120 112 -260 -614 -96 -495 588 89
6384 89 411 -8 297 -86 152 -139 -336 -221 -210 -28 -135 -501 -16 211 284 -16 -94 -364 263 -241 174
6405 174 -279 542 100 -115 -275 314 166 5 -224 785 392 195 533 -118 -541 -64 49 -249 162 323
6425 323 -86 -577 353 -280 -208 -146 122 -13 159 -159 -225 -394 262 -228 195 -173 90 -319 406 -566 -534
6446e34P3M29M13o2n60l15L73K22j80J75L95p46L34j1Q50n41j34k19l99N95o4
6467I4j42j06P07j069O10K53k86k52J56M69L9n65J98o91P22j19K53l52q6M77L44
6488F54m29L7o70K89rN29k17m60K71j96Q4J0m0L37l58J55J0L4N2n32K41K27p70
6511g51L57P35j77j22M01J71n59K39k96j17L38j80j35P5p60M36O01o3l9k47J31
6532C8J68l37J89l5j53j12K55Q0l68O66l40n2j7L29k59J66k83K27l7j21N5J3k45
6555a73R6M1J17J28l09P9Kk1K45m29L02n8Q1j24o2J32Q5J64n76K48J97m00L42
6578A07K1k82j5r5L43l92J55K37P4j14q2Q6L8l42K83j48M5M6k13K76J39l28K80
6601A19J26k91p0K39p8l56N85n10J85n2k14K31K9N5K5o1k8J96j74m3J98Kj45j29
$$ plain form
6446 -534 -461 -32 381 319 -241 -556 -183 39 -141 34 429 -317 17 6 856 315 181 -38 -437 158 94
6467 94 -48 -154 553 -516 94 347 61 -191 -35 434 473 -92 106 -585 137 18 271 -81 -167 310 654
6488 654 225 262 -408 -119 -128 401 184 -276 -5 -201 -117 -107 -147 190 -168 -13 -3 31 83 -449 -208 19 -751
6511 -751 -394 341 164 42 443 614 55 294 -2 -119 219 39 -96 -21 -781 -345 256 193 154 -93 38
6532 38 206 -131 58 23 -130 -242 13 93 -275 391 51 -1 -18 311 52 218 -65 162 125 4 59 72 -173
6555 -173 -77 -36 81 209 -100 -21 -19 -40 205 -224 78 20 101 -23 -85 47 132 296 -280 -32 165 -235 107
6578 107 128 -154 -169 -264 79 -313 -158 79 153 39 -43 43 81 -261 22 -126 -81 -35 -248 28 167 -161 119
6601 119 245 -46 -116 123 45 -311 274 -236 -51 -103 -317 -86 -57 -2 23 -38 -66 130 -44 -87 111 113 -32 -161
6625a61J1L68l05j40L0J52m3O7J06O6j53j46J61MJ54L3j81k64K71qMk9j82N25
6649C40m47J53N9j39NJ30J18j90J33kk18K05j37M6j50L4LJ56j13K2j09M5P9K4
6673D7q3J07j22J54Jm21L60o8k12K94j71M23j81K3j23L8K0j89J27J6p7J52K3j34
6697DQ1k15R4J07p9J37k69j47K41n7J6K83l11j06J63J99k72J2j51K25j88K87J3
6720F7q1O4J59l11J41m6k42M72k65j61P8L07J17k48J96Q8j78J61j99k27K08J0
6742A10l04J17l9N9J72j44n0k56L85k58J47J70J1Nj72l4j1k05k1O08k71K0R2j53
6766b2K2m59P06k90J03j36J01J11m18K31nK32n7k08j11J01P3N9j2j73J86oK22
6789B50l63j73L68l1j41P1PJ12k12Q0l01K67R8k27K57k35m0P9j3O6J2J27j68O9
$$ plain form
6625 -161 -150 218 -87 -227 -197 -45 -88 -21 85 151 -2 -148 13 17 171 204 23 -241 30 22 26 -3 -185 340
6649 340 -107 46 105 -34 -29 101 219 29 162 160 -58 147 10 56 -94 -60 -57 99 -14 8 -101 -56 23 47
6673 47 -36 71 -51 103 104 -317 43 -25 -237 57 -114 309 128 151 28 66 86 -103 24 40 -37 115 138 4
6697 4 85 -130 -36 71 -8 129 -140 -287 -46 -103 -87 196 -115 -221 -58 141 -131 -119 -270 -45 -233 54 67
6720 67 -14 50 209 -102 39 -7 -249 223 -42 -203 -125 182 299 51 247 335 157 318 119 -108 100 110
6742 110 -194 -77 -116 -57 115 -29 -79 -335 50 -208 -61 109 120 125 -47 -81 -92 -297 -318 290 19 39 131 -22
6766 -22 0 -459 247 -43 60 -76 25 136 -282 -51 -56 176 119 -89 -200 -99 -26 33 21 -152 34 28 250
6789 250 -113 -286 82 51 -90 -19 -12 100 -112 -32 -333 -66 32 -195 62 -173 -213 -134 -147 -81 -69 58 -110 -41
6813d1K59k18j1K47r9l68L39o8j10K28n2l61K47R9n2N7J98l81j37j32K63j13K01
6836eJ41k44m2J21L2K26k24J07p3M5M9r3q1J24m2l38N06l98K12R4j76l72L80L95
6860C44j82k65K41j44m5j76L08k49R2P5K47l33j72J54L29l77J35k47L55l0J88
6881B48k31m23J57L00l10J39N1J51k80o9J82K15j90K02r6j60n4J56K55k90J70
6902A23J98k26k25R2J38k12q8J50J46J50n14K32P2l07m1M29k78J73M6k21K84j36
6924a5j37J39k8Q7M7K60n18K07k64L93K9j29l6n9Q7j70M0J3k6l9L24j20j75R0
6948@K67k75L12Rm57J28Q2j49M1K42m07P2o5L11k71M41l96K13M1Kk3k12J95j7
6972H4j24k79K36K21j2j40P5l66L86Ok03R9m8j16J97L7Q9J2J93j82r4k72L71r3
$$ plain form
6813 -41 218 0 -11 236 137 -231 108 40 -70 158 106 -255 -8 91 39 96 294 -87 -224 -356 -93 -206 -5
6836 -5 136 -108 -150 -29 3 229 5 112 39 84 133 40 -41 83 41 -297 209 -189 23 117 -59 -431 -51 344
6860 344 162 -103 138 -6 -51 -227 81 -168 -76 -1 246 -87 -259 -105 224 -153 -18 -265 90 60 248
6881 248 17 -406 -249 51 -259 -120 -69 82 -198 -267 -85 130 -60 142 46 -114 -168 -12 243 -47 123
6902 123 321 95 -130 -38 100 -112 -200 -50 96 246 -268 -36 36 -271 -312 117 -161 12 58 -163 121 -15
6924 -15 -152 -13 -41 46 93 353 -165 42 -222 171 200 71 35 -24 63 -107 -67 -54 -80 -119 205 85 -90 0
6948 0 267 -8 304 313 -144 -16 66 -83 -42 200 -207 -135 -200 111 -160 281 -115 98 139 141 118 -94 101 84
6972 84 -40 -319 -83 138 126 -14 61 -305 81 87 -116 -17 -65 -181 16 53 142 154 347 165 71 -201 170 77
6996G7k41J10l00M75l0K7k76M58j83Q6j72k79J08K04l7k16J37l1O8pM6J81l97
7019a92L24k9M1K6k70L5N3m2J02K6j51j56K86P8k57p2J51L00l73k9L39k15J28
7042A03r7J17k9n7Q3k47L59k68J91k14N8J42j51J29j34L11k93M9j52J24K58m93
7064b11K16p6j03J81k10J18K8m4J90L8Lk08J27qj68J01K7j89R6K4J74j69J75J07
7088B19l18p4J40L4m2N5LL8k02J81j41J99q3m7J12k29o1P8K57o4k8M7j16K07j44
7113B1j78K49o6q2r7l6L33q0K4K4k3j43j3M6n1O9m8P1j57K64k56R4L6J52j86n8
7139i1K29k64O2q6K02j85J55J57pj12R2j18r1L00l45K77j48l25P1N1L1K72j70
7162d3J24K84l26J94m0k94Q7K13j10l36K15K15k58J47P5M8j57K06k19M8L5J0q4
$$ plain form
6996 77 -164 -54 -354 121 91 118 -158 300 117 203 31 -248 -140 64 27 -189 -52 -83 -15 -22 24 205 -192
7019 -192 132 103 144 170 -100 -65 -12 -54 48 74 -77 -233 53 131 -126 -198 -47 253 -120 -149 190 -25 103
7042 103 6 123 94 37 120 -127 232 -36 155 -59 -1 141 -10 119 -15 296 3 52 -100 24 282 -211
7064 -211 5 -71 -174 7 -203 -85 -57 -101 89 127 130 -78 49 41 -127 -26 1 -188 -92 -68 106 -63 112 219
7088 219 -99 -173 -33 1 -41 14 17 55 -147 34 -107 92 9 -38 74 -155 -216 -138 119 55 27 74 -42 165 21
7113 21 -157 92 26 -56 -153 -189 144 64 88 112 89 -54 -67 -21 -72 -3 -51 20 -137 127 -129 -35 1 153 -33 -91
7139 -91 138 -126 -64 -150 52 -133 22 179 172 60 152 34 -57 243 -102 175 27 -298 -227 -176 -145 127 -43
7162 -43 81 365 39 233 193 -101 -14 199 89 -247 -32 183 -75 72 147 195 38 244 25 73 108 118 34
7185C4R3k47K08J26J09k13j58J29L00p71l74R43q3rj007R44m07M69L26n09j17
7206b14n9L13J119j388K82o53k41J264k91J05k07Qj33J93m25L95j46l54l24j6
7226g72J576j257M95r70Q6L62rL79q26Q54p77O23J042p23L14J19l73p7k3n25J3
7247d69Q42j65j52M12p33N79m44L63j32L63q11K68O22l71q57O85L1L42M15q24
7267c6m81K13L76Q8R2l04j20K53MK16k24j8R6j71L70j07m32J14P1n9k5K62j71
7290Gn32nM48J20J45J93n59L3m81P56N6j65l9L93q16N73k35J73M9r2l14Q3K79
7313G0j91L06l19l30J45K55J44n09O17J30j49k44m40J48O75o10R14r07P54r42
7333d83j51K31M1M46l11k11R1l59O39N26n54M59j91k47j86J58l95L28M25q66R62
$$ plain form
7185 34 127 -120 88 214 323 110 -48 81 381 -390 -764 179 96 87 -920 24 -383 86 412 -97 -214
7206 -214 -273 40 1159 -229 53 -600 -841 423 132 237 30 38 -95 98 -327 68 -78 -432 -756 -772
7226 -772 804 -453 42 -928 -842 -480 -489 -110 -936 -82 -859 -236 806 83 397 516 143 66 43 -482 -469
7247 -469 373 208 56 468 -265 314 -130 233 101 464 -347 -79 543 172 -685 0 31 373 788 -36
7267 -36 -517 -304 72 160 252 -52 -172 81 85 301 77 59 155 -16 354 247 -185 -71 0 -59 -84 178 7
7290 7 -525 -530 -82 38 183 376 -183 -150 -631 125 181 16 -23 370 -446 127 -108 65 114 22 -292 -209 70
7313 70 -121 185 -134 -464 -319 -64 80 -429 188 318 169 -75 -515 -367 308 -302 612 -295 459 -483
7333 -483 -634 -403 -362 84 -227 -438 -347 -706 -67 459 -95 364 173 -74 -260 -102 -497 -169 256 -610 352
7354C52m37L49l78J49M4m37N96j15j53k87O26j89L2k55K73k56q3M59L16n14j94
7375a02l47N71n15K07k6J94n7K1j45J89j28M79k52P1Q7n69K88N05p18L83K12j43
7397B05n18N84j39m75J08j18N6K42K33k39J33k31K68M11o79k87O84m15J87kJ65
7418A73r1j28N81p53N41n76J25q4L8k48L12J09k34j13J73J81r4r9k3J02j30L2
7440b06J96Q8j36o5j6M7j04J74L6J25n0j17r1J79J0R4Kl17J15R4o8j08j15J29
7464a04l2j00J55nK45qj73p1k11L63J75k94J58l90L19J33K85j30m86J25k7R4l36
7487c15J81k86L90l25J56k3q9M75j62J78o6k55j64R7K17J34MJ12k90K53R2K1j26
7510B09k05P7j73j28j12M74k54P3k7l86J43O4M01n75M50M1J66k48k55L90k49N10
$$ plain form
7354 352 -85 264 -114 35 79 -358 238 123 -30 -317 309 120 152 -103 170 -86 -169 290 606 92 -102
7375 -102 -449 122 -393 -186 -212 -18 -75 -54 -199 -10 -138 341 89 160 247 -322 -34 471 -247 136 348 205
7397 205 -313 271 132 -343 -235 -353 -297 -55 178 -61 72 -159 109 520 -159 -446 238 -177 10 8 173
7418 173 82 -46 535 -218 323 -253 -128 -212 -174 -422 -110 -1 -235 -348 -175 6 -88 -187 -210 -108 -238 -206
7440 -206 -10 78 -58 -123 -139 -92 -196 -22 14 139 89 -28 -119 60 70 164 166 -151 -36 58 -10 -118 -233 -104
7464 -104 -136 -236 -81 -86 159 151 -22 -93 -304 59 234 -60 98 -292 27 160 445 315 -171 -46 -73 21 -315
7487 -315 -134 -420 -30 -355 -199 -222 -311 164 2 180 114 -141 -305 -208 9 143 147 259 -31 222 314 335 209
7510 209 4 81 -92 -220 -332 142 -112 -39 -66 -452 -309 -245 156 -419 31 72 238 -10 -265 125 -124 386
7532C86j25Q2o33K57N8p6L25k3j22O3n6l52J17J55j90J52Q0j12Lj26J16Oj6o3
7556i4J8M1m7P5QJ13j87o8L8K15l5p1J05k42n0Ql0K44o8k86P8J37O9Kj35L90k38
7583a0K47l43PR6Q3j97L00J50k80j36j0m9K43j05K11n47M52J44n84P70p7k28M5
7606A82P0n34J94j39M26n07N4K60q5J37K21o19K40J9j82K60k21l85O86K08j72
7627A13M20l06l81M18j10j66l76M35k09L26n06K13J12p3M20N37q82k07j29J74
7647a77o6Q90r62R50j51o41O11j1o52j38M82MK09J7p78R25K5l42N0J24p06J159
7669H22n08k88k27n92N57O30j98O68k71l69l28K37k20j91J88J2M53k07N7L7l44
7690h2k49M47m73M73l96M16J84q44R30p16N48q75N44J05j75M07p48qM54k42Q81
$$ plain form
7532 386 261 343 -290 -33 25 -51 274 251 129 192 136 -216 -99 56 -134 18 98 -14 -11 -137 -21 -15 -31 -94
7556 -94 -76 -35 -82 -7 1 114 -73 -141 -103 112 77 6 111 -131 -181 -173 -203 41 -27 -313 -235 -98 -29 -27 -162 228 -10
7583 -10 237 -106 -99 -3 80 -117 183 333 53 -83 -93 -142 101 -4 207 -340 112 256 -328 442 365 137 182
7606 182 252 -282 -88 -227 199 -308 -254 6 -79 58 279 -340 -100 -81 -263 -3 -224 -609 77 285 113
7627 113 533 227 -154 264 154 -12 -388 47 -162 164 -342 -129 -17 -90 330 867 -15 -222 -351 -177
7647 -177 -243 647 -315 635 484 -157 454 443 -209 -347 135 139 348 365 -413 512 537 195 245 369 -337 822
7669 822 314 26 -201 -793 -236 394 196 864 593 224 -104 133 -87 -278 -90 -78 375 168 225 262 -82
7690 -82 -331 116 -357 116 -280 136 320 -524 406 -310 238 -637 -93 12 -163 244 -504 -512 -58 -300 581
7711E81j07o01j18P65p99L81j69J38q90J333n10n42J445j718P02k65K29J89j82
7730a38K81K86J87q49Q2L8K21m56J58O22J1q9M1q21O04k35m22J55M29k91L95J59
7752C68m61J5J30K95l51j95l37P36m94M6K15P74n93l49J33J97M5l01R4K66l53
7773a20L51j31l24P5L23j96N20q99L54K81J4L65o59r2J58K53k91k38J28K42j75
7794f1K00K99l91K94o81r2N8N34r98R05k83O79k62l96j30K41N2l89J20K04p4N14
7816C43j77J44L9o94J01L73m60NJ6K01K3QJ70k58j08j43L36K84j14J57m30n47
7838g31R01r77P89M58n87l31n6N28j39j37K74J36L10p03k20K35n7J18j2O21K38
7859F58m58j84M8J073o36j186J017p82M50n0o79M31P99o92L53K71m76j30Q34j049
$$ plain form
7711 581 474 -127 -245 520 -279 102 -67 71 -819 514 4 -538 907 -811 -109 -374 -145 44 -138
7730 -138 143 429 616 -233 -151 -113 108 -348 -190 432 443 354 395 -426 178 -57 -479 -324 105 -186 209 368
7752 368 -93 -78 52 347 -4 -199 -536 200 -294 -248 -33 741 148 -201 -68 129 174 -127 -33 233 -120
7773 -120 231 100 -224 -149 174 -22 498 -401 -47 234 248 613 -46 -138 20 273 -18 -256 -128 114 -61
7794 -61 139 438 47 341 -340 -432 -374 160 -838 67 -216 463 201 -195 -325 -84 -32 -421 -301 -97 -171 343
7816 343 166 310 349 -345 -244 129 -331 -326 -310 -109 -86 -78 92 -166 -274 -417 -81 203 89 246 -184 -731
7838 -731 170 -807 -18 440 -147 -478 -534 -6 -145 -282 -8 128 438 -265 -485 -250 -307 -189 -201 420 658
7859 658 200 16 64 1137 501 -685 332 -450 0 -50 -729 -298 501 -191 162 433 -43 -173 661 -388
7879c88L53M15l31K07L6J06o80K11o80M79M82k88p4NL32n45K48k61m10J366m18
7900A65j3p6p1J27n07R4N45l84p1j30K25n05K29L44m9q6K14Q4k28k70K55O10p34
7923b32k47L26K61k54L49l41J42L86n92J57K95J42L3j29q02M66j24j50k85P01
7943A02k78N21m84N52L66m91k79m98R43p21N16k12j37n6j66P24k94j56Q0k76K38
7964fj73M19k67J90K07n79L77l32J44l50R9O15l56k22K18J89n56M95K56o22m8
7985c02L21j42M13m3K19l78k90m41M89j5k99L71J94l21K51o06Q19l30p6J33l12
8006c45L57J72k15jO4j27K13j9k76j09L11j44R7j54L54J34l71K34m25L2O47m10
8028A9k29M38j02N21k75l26m26j38J73N73J99n79J56M59j037L45K17L45L37l54
$$ plain form
7879 -388 -35 380 49 256 292 398 -282 -71 -751 -272 210 -78 -152 -147 185 -360 -112 -373 -783 583 165
7900 165 152 76 5 132 -375 -281 264 -120 -191 -321 -96 -601 -372 -28 -77 -163 51 135 -93 -363 -108 502 -232
7923 -232 -479 -153 108 -146 203 -138 4 390 -202 -45 250 392 425 296 -506 -40 -164 -314 -599 102
7943 102 -176 345 -139 413 779 288 9 -489 454 -267 249 37 -100 -156 -322 402 108 -48 32 -244 -6
7964 -6 -179 240 -27 163 370 -209 168 -164 -20 -370 -271 344 -12 -234 -16 173 -383 112 368 -254 -302
7985 -302 19 -123 290 247 466 88 -202 -643 -154 -169 -468 -97 97 -224 27 -579 240 -90 -166 -33 -345
8006 -345 12 184 -31 -32 32 -95 118 99 -177 -286 25 -119 -22 -176 178 312 -59 175 -250 -218 429 19
8028 19 -210 228 126 647 372 46 -380 -518 -345 228 427 -152 4 463 -574 -229 -12 333 670 316
8048C16r2n4k5l62K69k86J43J58K05l51r7K93lj70m81Q27l37l36K48q3r01J906
8070G87m20n40J6j90k06P79k10l50K27J1M11o29j02j33N92K21k36L87o55j28M92
8091A24l9j53m44J71L06j9L38l58j76L88lp89P77K93o80J68q4k83N47j63N34k01
8113B54n03L46J20k58Nj52K6o0J93l0k15M6N85p6k67J51k81P3q2O7j91L77j96
8136f8L1J67L7mj02j14k9j65K01J60l02J18O8jo5J26nQ7j37N2l5j0j94K05O8j20
8162c1L2J02k71N9L75m20J84R6j07Q2j34k89L35R3l8j09P1J74Rk74J32K9j35J56
8186A21k09O3L8N6j20
$$ plain form
8048 316 224 170 145 -217 52 -234 -91 67 272 -79 -176 117 114 -56 -537 290 -47 -383 -135 -218 -1119 787
8070 787 367 -173 -157 -347 -553 226 16 -334 -107 -96 315 -314 -416 -549 43 264 28 415 -240 -368 124
8091 124 85 -68 -512 -341 -35 -54 284 -74 -250 138 135 -654 123 416 -264 -96 -180 -463 84 -79 455 254
8113 254 -249 97 217 -41 -36 -188 -162 -222 -29 -59 -274 -228 357 281 14 165 -116 -43 -125 -58 -249 128 -68
8136 -68 -37 130 167 163 61 -53 -82 -247 -46 114 -188 -70 -2 -3 -68 58 53 140 3 55 20 10 -184 21 89 -31
8162 -31 1 103 -168 -109 266 -154 30 126 19 101 -33 -322 13 106 68 -41 30 204 213 -61 71 100 -35 121
8186 121 -88 -25 13 69 -51
8191e1
$$ Imaginary data points
##PAGE= N=2
##DATA TABLE= (X++(I..I)), XYDATA
0@%%%%%%%%%%qJ6j6J8k6L2m0N6p2Q5j01J20j42J70k01K34k70L14l65M20m82N52
32B94o28P11q05R08j019J146j286J436j599J778j973K188k424K680k957L263l599
49a886L966m370M813n304N847o454P138p910Q790r808J0996j2403J4109j6225
63h701J8928k2526K7584l5289M8643p8459K72733q414j82296L06958K04898o953
75E37106m03063j03396K79744K02662j72935l04853q4858L06627J54925j99100
85B12859k82113J1699K87182J26616k35313k47349O2798K61598O2874k55184k40735
96b35068J16311K23446Q775k52876j95628J45700K43130l0804k30903j17399J74439
107a50877K54892n0486k24695n5447J88777K27908q2251k36524k8706K01726J74021
$$ plain form
0 0 0 0 0 0 0 0 0 0 0 0 -8 8 -8 10 -16 16 -24 32 -40 45 -56 64 -78 92 -109 125 -145 169 -196 224 -258 294
32 294 -334 377 -428 480 -539 607 -679 757 -842 936 -1037 1151 -1273 1407 -1550 1713 -1886
49 -1886 2080 -2290 2523 -2781 3066 -3388 3750 -4160 4630 -5178 5818 -6585 7524 -8701
63 -8701 10227 -12299 15285 -20004 28639 -49820 222913 214499 32203 339161 544059 537106
75 537106 134043 30647 310391 513053 340118 35265 -49593 257034 411959 212859
85 212859 -69254 -57555 229627 356243 120930 -126419 -63621 197977 260851 5667 -235068
96 -235068 -118757 104689 113464 -139412 -335040 -189340 53790 22986 -207917 -325316 -150877
107 -150877 104015 53529 -171166 -226613 -37836 190072 107821 -128703 -157409 44317 218338
118B18338j12610k44835M278K26361J23972j29782k19668M6338K48193Q5474j54617
129I1442j79311P5467K36277M7548k00076j51453R3153J97235L652k31091j31603
140a48760J20662J71301l8345k22329r7633J59836J60205o8521j92598o1148J85482
151c1848J48409j04955j79857k2976J82242J21223j37302j82793K4097J73385
161a0375Q7486j47173j69607P1020J81735N5279j45855j34116R9893J89542K0578
172I8407j56448r9724J11071J76814k2413j73562p2809J21469J47445n7529j77060
183a04339m2629J42997J16520p5921j63149o241J65744Q5864r3362j42727K5687
194i1556J64445N4275j17744j22020M6263J47028K8284j38710r5227O6461J31478
$$ plain form
118 218338 105728 -139107 -134829 91532 215504 85722 -133946 -87608 160585 246059 91442
129 91442 -87869 -12402 223875 271423 71347 -80106 13047 210282 213934 -17157 -148760
140 -148760 -28098 143203 104858 -117471 -215104 -55268 104937 36416 -156182 -217330 -31848
151 -31848 116561 11606 -168251 -191227 -8985 112238 -25064 -207857 -183760 -10375
161 -10375 77111 -70062 -239669 -168649 13086 68365 -77490 -211606 -111713 77829 98407
172 98407 -58041 -157765 -46694 130120 107707 -65855 -138664 -17195 130250 72721 -104339
183 -104339 -146968 -3971 112549 36628 -126521 -132762 32982 118846 25484 -117243 -91556
194 -91556 72889 127164 9420 -112600 -66337 80691 108975 -29735 -124962 -58501 72977
205G2977J0175j41467o5868R1004J19051j0288j27586m6070J07973J02119l9201
216G2819j11437l5153J06946Q2605o2519j04663j8980J00889O7515p0424j05201
227g7603J0046R9905N2758p0708r9508L3881J01562L2966p8212q6317M3764J02800
239F5334J0046r3920o4479M7198R9773p963j01118m1172O1419R1920k1273r7950
251e2185k3072Q2959P5752l4268r0716q760R4976N4420m9283q2701N836R4949
263F7907L3657o1779p0638K3313Q2610K3843p0281n5882L7004P2093J1973p3546
275B0274m1959M4973O2353m397p1972l3260M8681N4825k2731o6069k5242N1920
287A7396M8219l5607n6838j2898N2702M0610l7302n7008L041N5984L0799l9696
$$ plain form
205 72977 83152 -58315 -124183 -33179 85872 75584 -52002 -98072 9901 112020 72819
216 72819 -38618 -73771 33175 115780 53261 -51402 -70382 30507 98022 27598 -77603
227 -77603 -67557 32348 85106 14398 -85110 -51229 50333 83299 5087 -81230 -37466 65334
239 65334 75380 -18540 -83019 -35821 63952 55989 -45129 -86301 -24882 67038 45765 -52185
251 -52185 -75257 7702 83454 49186 -41530 -50290 44686 99106 49823 -32878 -27042 67907
263 67907 101564 39785 -30853 -7540 75070 98913 28632 -27250 9754 81847 93820 20274
275 20274 -21685 23288 85641 81244 9272 -23988 24693 79518 56787 -9282 -34524 17396
287 17396 65615 30008 -26830 -39728 12974 53584 16282 -40726 -37685 18299 49098 9402
299I402n7707J9863N6545J6864m1604m9145K7071N8299L803m8192l0748K8674
311f875N4224m745n2714j4637L1667M4202j1859m9099q235L9659K8953j8107m1491
324i057m603M2538J7236k3785l3767L24L8893J1085k9405k7598R665K9479O883
337B7888l0379k1040J5187K3343N011k8686j4741J7987K1375o41k4095j1289J8341
350a739K0981q366j8633r431J7394J8146j3935j4334n488J6948J4082j1975j6939
363a3289L344J5811Q307r119j7820R743J4191k43r906j3435P952J0888n672j2273
377a1521l702L044P540o231j3377N528J961M334l558n705M781M215j328j521K065
392a3475o03P044o017j121N891j805K341m600K017O939K532l427J48N763Q441
$$ plain form
299 9402 -48305 -28442 28103 44967 3363 -45782 -18711 39588 43391 -4801 -35549 -6875
311 -6875 47349 42604 -10110 -24747 6920 51122 39263 -9836 -18071 21588 50541 32434 -9057
324 -9057 -13660 28878 46114 22329 -11438 -11114 27779 38864 9459 -18139 -8474 21005 27888
337 27888 -2491 -23531 -8344 14999 20010 -8676 -23417 -5430 15945 15304 -8791 -20080 -1739
350 -1739 19242 10876 -7757 -17188 206 18352 4417 -9917 -15405 1543 15625 3650 -13289
363 -13289 -9945 5866 14173 5054 -12766 -3023 11168 10925 1019 -12416 -4464 6424 752 -11521
377 -11521 -15223 -12179 -4639 -10870 -24247 -18719 -16758 -12424 -15982 -21687 -16906 -12691 -14019 -15540 -13475
392 -13475 -14078 -7034 -13051 -14172 -8281 -10086 -7745 -12345 -10328 -3389 -857 -4284 -4136 1627 10068
407A0068M384q299M668Q277N246l56q019J679N579L028o589o791l474O648K234
422A8283q900o669n137J0422L487q502r254q09J1893L997j1378j4231N371R517
436a910L734j5455j6774R310J2234J925j8421j3559J4038K1571l401j8482n634
449c0824J8560K7289q492k1651J43K4421K2333j4377k6713M597L0818J1776j9734
462A8146k6272R673L5290M630k5040k0221J7554L4354M64l1447j4705K2927K8322
475E3675n593l9039j0739K5923K1231j5748l9790p020K9754J7726k3874l2885
487b6379q51L3740J6212k7140k8285O810L6334J1477l0300k7113J3773L4895N014
500A8187l3160k5812K1572L3584j88l4029j8682K8772L4393k902l5280j0758L3530
$$ plain form
407 10068 14452 6153 10821 19098 24344 23988 15969 17648 23227 26255 19666 12875 9401 16049 18283
422 18283 9383 2714 -2423 7999 11486 2984 -6270 -7079 4814 8811 -2567 -16798 -11427 -1910
436 -1910 1824 -13631 -30405 -21095 -8861 -6936 -25357 -38916 -24878 -3307 -6708 -25190 -30824
449 -30824 -12264 15025 6533 -15118 -14975 9446 31779 17402 -9311 -4714 26104 37880 18146
462 18146 -8126 1547 36837 41467 16427 -3794 13760 48114 48578 17131 2426 25353 53675
475 53675 48082 9043 -1696 24227 45458 29710 -10080 -17100 12654 30380 6506 -26379
487 -26379 -27230 6510 22722 -4418 -32703 -25893 10441 21918 -8382 -35495 -21722 13173 18187
500 18187 -14973 -40785 -19213 14371 14183 -19846 -38528 -9756 24637 21735 -13545 -24303 9227
513I227L5704j1222l8082m614L5030L1081k3414l9509o3L6997K1630k8695m0364
526a6294O769M3093J3631l2982l5747J4349M5534O021l6447l1486K0855M2940
538D0236o10m4378k6028K5993L7624n811m9219j9534L3627L6468j2145m7735j0918
551d2430M1492L6447k1617m3686l553M6601L1435l1202m3607K752M9715K2587
563D4934l9377m4490J3541N2122J2770m4243m0191K7291N2731L649m9373l1692
575d2328L8433M8982p578n4697k1368M3398M3234k0604n6991j0313M6616L7215
587D3999l1564n3024J967N0696K9091l7314m6091J2186N3869J7755m0878m0440
599c9748J8987N3216N776m4644l4624K4934M8838j445m8609k6996L2455M3883
$$ plain form
513 9227 44931 33709 -4373 -8987 26043 57124 33710 -5799 -5862 31135 52765 24070 -16294
526 -16294 -9525 33568 47199 14217 -21530 -7181 38353 44374 7927 -23559 -2704 40236
538 40236 39626 -4752 -30780 -4787 32837 27026 -22193 -41727 -8100 28368 16223 -31512 -42430
551 -42430 -938 35509 13892 -29794 -33347 13254 44689 13487 -30120 -27368 22347 44934
563 44934 5557 -38933 -25392 26730 39500 -4743 -44934 -17643 35088 38737 -10636 -42328
575 -42328 -3895 45087 37509 -17188 -38556 4842 48076 27472 -29519 -39832 6784 43999
587 43999 12435 -40589 -38622 12074 41165 3851 -42240 -30054 23815 41570 692 -39748
599 -39748 -20761 32455 38231 -6413 -41037 -16103 32735 31290 -17319 -44315 -11860 32023
611C2023n186n1304j9030M0350L9573j2468n1823j2366M4450L5904k4624n0221
623c4722o199M6494L0790l4355m7808J715M9552K5173l9166m5164J2196N3868
635A2374J6925m3124m2235K4060N4130O312m8376l5474L3008N1291l628n3695
647b8432k4790M0153M7410j3660n4997j2725M6081M2885k3552n3491k495N1313
659A3700L4469l3462n0297N756N4087K3004m1230m6946J4301N5588J1122m6303
671f211m0537K3930N3566K661n0738l1362L2807M8159m519n3850k2711M0126M1791
684C3112j3325n4086j4057M4667L7181k4191m9893n073M8109L2541l3238m4554
696d2807N751M9830K3873l7744m1531J5693N0863J3097m0746l7540K4012M9254
$$ plain form
611 32023 26837 -24467 -43497 -3147 36426 23958 -27865 -40231 4219 40123 15499 -34722
623 -34722 -40921 5573 36363 2008 -45800 -44085 5467 30640 -8526 -53690 -41494 12374
635 12374 29299 -13825 -56060 -32000 22130 28442 -19934 -55408 -22400 28891 25263 -28432
647 -28432 -53222 -13069 34341 20681 -34316 -47041 -960 41925 18373 -35118 -37613 13700
659 13700 48169 14707 -35590 -29834 24253 47257 6027 -40919 -26618 28970 40092 -6211
671 -6211 -46748 -22818 30748 33409 -17329 -48691 -15884 32275 27756 -26094 -48805 -8679 33112
684 33112 19787 -34299 -48356 -3689 33492 9301 -40592 -45665 2444 34985 1747 -42807
696 -42807 -37056 12774 36647 -1097 -42628 -26935 23928 37025 -3721 -41261 -17249 32005
708C2005K547m4437l0248L1175M5623m825m7518k0239L5248M1376j2224m7691
720a9208j0890L7354L5138j9002m5903n166M0735K9147k6788m2658L99M3701K1685
733C8544l0726l9278O968M6022J4848l4975l5656J5888M4709P631l8519l0775
745c5319K4054M2009J368m3812k4598L2659L8945o753m5676j8100L8827L6019
757C9623j7093m5532o904M2490L0946k7766m2947K492M3705K3446l4248l8734
769c0522J1117M3910J2486l5552l4988J8848M2828L459l7771k7808K4895M0091
781C0993m259l9511j9220K9337L4123q841m0846j0513L2377K9250j5124l8742
793b0976m089L4283K4509k0985l4697Q02L6670J8499k5802l1706O249L7277J2635
$$ plain form
708 32005 34552 -9885 -40133 -8958 36665 31840 -15678 -35917 -669 40707 28483 -19208
720 -19208 -30098 7256 42394 23392 -22511 -27677 13058 42205 15417 -27241 -26842 16859 38544
733 38544 7818 -31460 -24492 21530 36378 1403 -34253 -18365 26344 33975 -4544 -35319
745 -35319 -11265 30744 32112 -11700 -36298 -3639 35306 28553 -17123 -35223 3604 39623
757 39623 22530 -23002 -29906 12584 43530 15764 -27183 -24691 19014 42460 8212 -30522
769 -30522 -19405 24505 36991 1439 -33549 -14701 28127 31586 -6185 -33993 -9098 30993
781 30993 26734 -12777 -31997 -2660 31463 22622 -18224 -28737 3640 32890 17766 -20976
793 -20976 -25065 9218 33727 12742 -21955 -21153 15517 34016 8214 -23492 -17243 20034 32669
806C2669k9031k8771J2449L6245O447l1995k5255J9000L3714M94l4670j9474K3798
819d380K9640n054l5542j3047K6755K6770j1625l4134o922K8959K3619j8091l1027
832b4079o84L0041J8548k2166k8410N105L1087J1929k4039k5985J0941L1143N485
845A8916k5317k2238J5884K9866K52k7680j5966J9431K6804l540k9839j0080K1795
858a712K3327p943k9354n924K3806K0313j3467k6817k401K6444J5902j7836k3908
871a9570K293K7002J0890k0733k1936Q067K6575M899k2262j8941J3301K3884J75
884A3644k3292j3910J7254K0496l724k3653q131J8776J8224p619k2834k977J9421
897A675J5892j2536j9651O20J9385J1854j5119j6644L480J9363P100j4956j4619
$$ plain form
806 32669 3638 -25133 -12684 23561 30008 -1987 -27242 -8242 25472 25966 -8704 -28178 -4380
819 -4380 25260 20206 -15336 -28383 -1628 25142 13517 -20617 -27539 1420 25039 6948 -24079
832 -24079 -24763 5278 23826 1660 -26750 -21645 9442 21371 -2668 -28653 -17712 13431 18916
845 18916 -6401 -28639 -12755 17111 17363 -10317 -26283 -6852 19952 16412 -13427 -23507 -1712
858 -1712 21615 13672 -15682 -21606 2200 22513 9046 -17771 -20172 6272 22174 4338 -19570
871 -19570 -17277 9725 20615 -118 -22054 -13987 12588 17487 -4775 -23716 -10415 13469 13644
884 13644 -9648 -23558 -6304 14192 10468 -13185 -21316 -2540 15684 8065 -14769 -17746 1675
897 1675 17567 5031 -14620 -14000 5385 17239 2120 -14524 -11044 8319 15419 463 -14156
910a4156N796J8909L051j3655j3417Q257J7560N22j5290j0147J0118J5197r37
923A1808j7248o604J1814J3235l042j6977l903J3461J1398o335j5209j256J4490
936E632J0072j0083j2970J378J4886O344j1607j1068M101J4548K600j1591r780
949g538P294J2602j98j1469p447R131J0044j888j1266m219R108P807l248j0428
963a715j600P748O927n393q701p4P121N638o742o878R97P226L226n671o137J576
979b452P333J382m846n613K715O744O88n322m880L582N980Q38o994k638M263N169
995E949l1o846j146M923M288k096n369j44M588L457l946l612j72M832J538m405
1011A808k586R58L523j9l563k653K972K037j669k456j381K946J47j979j437M00
$$ plain form
910 -14156 -8360 10549 13600 -55 -13472 -5215 12345 12867 -2423 -12570 -2452 12745 11808
923 11808 -5440 -12044 -230 13005 9963 -7014 -10917 2544 13942 7607 -7602 -8858 5632
936 5632 15704 5621 -7349 -5971 8915 15259 3652 -7416 -3315 11233 13833 2242 -7538
949 -7538 -244 12358 12160 691 -6756 2375 12419 10531 -735 -4954 4154 11961 8713 -1715
963 -1715 -3315 4433 11360 5967 -2734 -2808 4313 9951 3209 -3669 -2672 4554 7780 2109 -4028 -2452
979 -2452 4881 6263 1417 -4196 -1481 5263 5951 629 -4251 -669 5311 6149 -845 -3483 780 5949
995 5949 5918 -928 -2074 2849 7137 5041 -328 -472 4116 7573 3627 15 -157 4675 6213 1808
1011 1808 -778 180 3703 3684 121 -2532 440 2477 808 -1648 -3029 -83 64 -1915 -3352 -2952
1027b952J549m47j236j481J943r7n99r90K41J874o05r98n24J995R86j064j808
1044d213Q79K610r3j433j963K423K054k21k257j468K994K141j164l534l86K721
1060i10K599j737m829Q85L152K866l255m624Q37M905J813m641l900J391O356J24
1076A032n806l456K474O871j122o657l226N125N780k007o878k470P649M377l190
1091a504p149k46Q003M003n024p319K229P599L281o903n785L857P135J777p745
1106c791m280M498P381J21o927m243N210P635j599p083m249O504P158k750p846
1121d261l382P247O601l464r300j531Q373O201m292j0088N99Q953N978o213r833
1136h412J740J0131N423q980r409L293J2209K704j1008q096N733J3058J08j2437
$$ plain form
1027 -2952 -1403 -1850 -3086 -4567 -2624 -2721 -3320 -4310 -4069 -2195 -2800 -3798 -4322 -2327 -1341 -2405 -4213
1044 -4213 -3334 -724 -817 -2250 -4213 -1790 264 43 -2214 -3682 -688 1453 289 -3245 -3631 -910
1060 -910 1689 -48 -4877 -3992 -840 2026 -1229 -5853 -5016 -111 1702 -2939 -6839 -5448 908 1032
1076 1032 -4774 -8230 -5756 1115 -7 -6664 -9890 -4765 1015 -992 -7870 -10340 -2691 1686 -1504
1091 -1504 -8653 -8899 -896 3107 -1917 -9236 -7007 592 3873 -3030 -8815 -4958 2177 3954 -3791
1106 -3791 -8071 -3573 3808 3929 -2998 -7241 -2031 5604 4005 -3078 -7327 -823 6335 3585 -4261
1121 -4261 -7643 -396 6205 2741 -6559 -8090 283 6484 2192 -7896 -7297 1656 7634 1421 -8412
1136 -8412 -6672 3459 8882 -98 -9507 -6214 5995 8699 -2309 -10405 -4672 8386 8494 -3943
1150c943p009Q966J2210k099j3777n099J2451R841m743j4205k476J3769Q533q389
1164D030j3686J210J4139O476j1511j1906M756J4684L484j2744r891P144J4033
1177A0218N02j3338p661R146J3091k612j4106n552J1029J1956n375j3541l306
1190i549J2600J0021o821j3654j143J4443P542q275j3722J640J4427O134j0576
1203C067j3378M950J3612M349j3062j0444O576J5189j51j3699p626P770J4588
1216A1741k208j3311o818J0638J3055m807j4403n092J3916J0159o649j4613k095
1229a0487J4166Q492p633j4746J052J4435Q270j1228j3133K956J5344N995j3470
1242A3j1654N565J5691K367j3950j0404P975J6359p1j6177q574J0705J5650l354
$$ plain form
1150 -3943 -10952 -1986 10224 8125 -5652 -10751 1700 11541 6798 -7407 -9883 3886 12419 4030
1164 4030 -9656 -8446 5693 12169 658 -11248 -6492 8192 11676 -1068 -10959 -3815 10218
1177 10218 10720 -2618 -10279 -1133 11958 9346 -4760 -10312 717 12673 7298 -6243 -9549
1190 -9549 3051 13072 6251 -7403 -8546 5897 13439 5164 -8558 -6918 7509 13643 3067
1203 3067 -10311 -5361 8251 12600 -462 -10906 -4330 10859 10708 -2991 -10617 -2847 11741
1216 11741 9533 -3778 -10596 42 13097 8290 -6113 -11205 2711 12870 6221 -8392 -10487
1229 -10487 3679 12171 4538 -10208 -9156 5279 13549 2321 -10812 -7856 7488 13483 13
1242 13 -11641 -6076 9615 11982 -1968 -12372 -4397 11962 11891 -4286 -12860 -2155 13495 10141
1256A0141j5897p492J4819J3386o347j7496l320J6650J0459q822j8022J152J7319
1269F530Q729j2757j6413N118J7569N944j5790j3394P707J8176J675j7004j0350
1282a4260J0577J6876k302j7330p246J2976J4894n506j6970m696J4826J1653p356
1295F136j6277j949J5977R113r748j5149J248J5553P557j1725j4093M305J5436
1308F384N270j3807j1923O981J5143K339j4532j0065Q655J5497p99j4974q299
1321a4130J1026J4505l393j5554n941J3106J2669n180j6193k817J4529J0605p979
1334E253j5713k37J5911Q216j0882j4339L543J4943O029j2661j2581N569J5365
1347H416L199j4021j0417P990J5777j281j5422p851J1717J3424l067j6314n877
$$ plain form
1256 10141 -5756 -13248 1571 14957 8610 -8886 -12206 4444 14903 6081 -11941 -10789 6530
1269 6530 15259 2502 -13911 -8793 8776 14720 -1070 -14464 -6757 11419 13094 -3910 -14260
1282 -14260 -3683 13193 10891 -6439 -13685 -709 14185 8679 -8291 -12987 1839 13492 6136
1295 6136 -10141 -12090 3887 13000 3252 -11897 -10649 4904 12461 736 -13357 -9052 6384
1308 6384 11654 -2153 -14076 -7095 8048 10387 -4145 -14210 -5555 9942 9143 -5831 -14130
1321 -14130 -3104 11401 8008 -7546 -13487 -381 12288 7108 -9085 -11902 2627 13232 5253
1334 5253 -10460 -10697 5214 13430 2548 -11791 -8248 6695 12724 63 -12518 -6949 8416
1347 8416 11615 -2406 -12823 -4833 10944 9663 -5759 -13610 -1893 11531 8464 -7850 -13727
1360a3727J3100J1827n871j5865k877J4319R883p657j5348R58J4464P993j0343
1373H56j3680L051J4523O701j2478j2753O012J4872L479j3874j0437P744J5404
1386I420j94j4064q056J0052J4412l299j4569n606J2372J2024n571j4786k542
1399a0407J3912R094q199j4213P10J4100O774r969j2379L316J3528M966j1519
1412b86j0565N513J2998K552j2916q384O899J3121n68j2763o840Q473J1798k902
1426F130j2096n172J0251R829m244j1864l223J1409Q563n829j2301k59J1689O901
1440I784p937j1971K303J1877N294r819j0360M473J2281L127j1263q326O320J2312
1454H095J82j1884o149P623J1881k669j1889m354R253R477m446j1645k079J0509
$$ plain form
1360 -13727 -627 11200 5329 -10536 -13413 906 10789 3132 -12216 -11258 3206 11199 856
1373 856 -12824 -9773 4750 11451 -1027 -13780 -7768 7104 10583 -3291 -13728 -5984 9420
1386 9420 9226 -4838 -12894 -2842 11570 8271 -6298 -11904 468 12492 6921 -7865 -10407
1399 -10407 3505 12599 4400 -9813 -9103 4997 11771 1802 -10577 -7261 6267 11233 -286
1412 -286 -10851 -5338 7660 10212 -2704 -11088 -4189 8932 8364 -4399 -11239 -2766 9032 6130
1426 6130 -5966 -11138 -887 8942 4698 -7166 -10389 1020 9583 3754 -8547 -8806 2883 9784
1440 9784 1847 -10124 -7821 4056 9350 -469 -10829 -6356 5925 9052 -2211 -10537 -4217 8095
1454 8095 8277 -3607 -9756 -2133 9748 7079 -4810 -9164 89 9566 5120 -6525 -8604 1905
1468A905P413n912j0991L48J0794N712p738r279K016J0615L706q701q008L629
1482d491R884K137r458o960N170R442K79r527n473O403R050j358r531l911P732
1497f12P805l106r358k226Q080O711m284r879o48R069N243n647r215J488R161
1512B582M158p478p531L300R026K523q090o402M486Q831j22q191m670N284Q079
1527E785k300p935l148O701O413l011p929j184P309N050m153p470O49P304K976
1542E057m827o778K101O839J787o222m441K539N956J157o198l453L112O351L52
1557C332o303l494M768N348j014n869k503M668M925k458n329j692N498L405k845
1572D37n091k23N670K674l507m815J552N018J924m286m356K383M660Q04m783l244
$$ plain form
1468 1905 9318 3406 -7585 -7237 3557 9269 1531 -7748 -5732 4883 8589 -112 -8120 -4491
1482 -4491 5393 7530 -1928 -8888 -3718 5724 6003 -3524 -8997 -2594 6456 5098 -4433 -8344 -612
1497 -612 7193 4087 -5271 -7497 583 7294 3010 -6869 -7517 1552 6795 1148 -8067 -6579 2582
1512 2582 6740 -738 -8269 -4969 4057 6580 -1510 -7912 -3426 5405 5283 -2908 -7578 -2294 5785
1527 5785 3485 -4450 -7598 -897 5516 2505 -5424 -6608 701 5751 1598 -5872 -5223 2081 5057
1542 5057 230 -6548 -4447 2392 4179 -2043 -6484 -3945 2011 3168 -3030 -6483 -3371 2980 3332
1557 3332 -2971 -6465 -1697 3651 2637 -3232 -5735 -1067 3858 1400 -3929 -5621 -123 3282 437
1572 437 -4654 -4877 793 3467 -40 -4855 -3303 1715 3639 -647 -5003 -2620 2040 2844 -1939 -5183
1588e183K659M282j46m935j721K941M263j813l762j068L375L305j782l910o32
1603d127L554K314j575m164l9L673J643k128l527R11L445J492k870k433J296L513
1619I78R33l080j891J931K928K72l189j427K360K638j244l047o16K870K015j614
1635H17k545j96L296J313k106k348J206K807j35k092j894J488K131q41k294r79
1651b372K059Q09q07j987K68J809M63r80j577R06J385K22j186q41J079P70l75
1668c55j152O39L97P01j009n64N64J049K82j065J82N02P17M4o86J04P65M93m42
1687A166n37L3M89M60j041k84J52O41J28m42r29O32P72K9m66o82M11R56j20j128
1707B40p28Q79Q43m20j556p8J026Q79o45j969J18J713J194j671j720O42K355K04
$$ plain form
1588 -5183 -2524 1758 1612 -3323 -5044 -2103 2160 347 -3415 -4483 -1108 2197 415 -3495 -4127
1603 -4127 -573 1741 166 -3998 -4037 -364 1279 -849 -4376 -3465 -20 1472 -1398 -3831 -2535 978
1619 978 1911 -1169 -3060 -1129 1799 2071 -1118 -2545 -185 2453 1209 -1838 -2454 416 2431 817
1635 817 -1728 -1924 1372 2685 579 -1769 -563 2244 2109 17 -1877 -389 1742 901 -1393 -2372
1651 -2372 -313 496 -311 -2298 -2030 -221 242 -738 -2315 -1409 -24 198 -988 -1829 -750 20 -355
1668 -355 -1507 -868 -471 230 -779 -1343 -779 270 552 -513 -331 171 888 932 246 350 1115 1608 1166
1687 1166 629 662 1151 1611 570 286 438 1079 1207 765 -164 468 1240 1269 803 121 532 1488 1368 240
1707 240 -488 391 1234 814 -742 -820 206 1085 440 -1529 -1411 302 1496 -175 -1895 -1253 1102 1306
1725A306j943j142P09K698m38k170j123J519K170o37k291j008K503J686p45k867
1741a773Q2K847J699j903k747O38K439J794k399k993J176L111J222l244k330J502
1757h79L583J16m042j458K413L269n28l916j417L147L325j931l589q58L701K483
1773C419k669l987J92M600J430l347l742J653M098J118m103l041K315M351K28
1788B515m793k259K899M223j174m665j268L426L908k072m444n15M283K969k441
1803E92m283J4M662K427l006m211R44M804J449l488l365J530M385R01l854l409
1819c908K469M394M29m720k756K900M597p11m731k279L235M723j533n214j738
1834d843M530M247k738n174q94N359L578l750n188J38O254K450m477n323J946
$$ plain form
1725 1306 -637 -1779 -1070 1628 1190 -980 -2103 -584 1586 949 -1342 -2350 153 1839 1094 -1773
1741 -1773 -1691 1156 2855 952 -1795 -1157 1282 3076 677 -2316 -1140 1971 3193 -51 -2381 -879
1757 -879 2704 2820 -1222 -2680 -267 3002 2474 -1442 -2859 288 3613 1682 -1907 -2765 936 3419
1773 3419 750 -3237 -3045 1555 2985 -362 -4104 -2451 1647 2765 -1338 -4379 -2064 2287 2515
1788 2515 -2278 -4537 -1638 2585 1411 -3254 -4522 -1096 2812 740 -3704 -4219 64 3033 592
1803 592 -3691 -3677 985 3412 406 -3805 -2861 1943 3392 -96 -3461 -1931 2454 3355 -499 -3908
1819 -3908 -1439 2955 3384 -1336 -4092 -1192 3405 2694 -2037 -4316 -1081 3642 2109 -3105 -4843
1834 -4843 -313 3934 1196 -3978 -4872 487 4065 315 -4873 -4735 1519 3969 -508 -5831 -3885
1849c885N896J644n161m592L127O057P54n967l665M250N946j297o288k173M993
1864c61N666k656o327q56N304M474l559n759j43O374L023l983n444J015O532J717
1880E017m523n292K394O159Q57n535m444L497N684R9o172l541M151N861p56o626
1896c170k339M722N416k468o176j265N512M854l774o076m9O441L129m596n363
1911e202R27O709K187m775n483K505O791J150n499m621L857N736L18o135l608
1926e143M141N802j013o854j909M680N325k108o631j205N407M737l214o101l33
1941d419O126L931m291o163O89O477K679m832o066K119O657J635n601m913L199
1956b773O513O76o535l923M509O235q33o948k392N168N758k425p245j199N798
$$ plain form
1849 -3885 2011 3655 -1506 -6098 -2971 3086 3840 -2127 -5792 -1542 4404 3107 -3181 -5354 -361
1864 -361 5305 2649 -3678 -4534 770 5244 1685 -4074 -4217 2157 5180 1197 -4247 -3232 3300 5017
1880 5017 494 -4798 -2404 3755 4612 -923 -5367 -1870 3814 3913 -2259 -5800 -1649 4212 3456 -3170
1896 -3170 -5509 -787 4629 2161 -4015 -5280 232 5086 1312 -4764 -4813 1628 4757 161 -5202
1911 -5202 -4275 2434 4621 -154 -5637 -3132 3659 4809 -690 -5311 -1454 4282 4600 -1535 -5143
1926 -5143 -1002 4800 3787 -3067 -4976 -296 5029 2921 -3710 -4915 492 5229 2015 -4086 -4419
1941 -4419 1707 5638 1347 -4816 -4127 2350 5029 197 -5869 -3750 2907 4542 -1059 -5972 -2773
1956 -2773 3740 4416 -2119 -6042 -1533 4702 3869 -3079 -5471 -303 5455 3030 -4215 -5414 384
1971C84N014m076o273p1O896L384m548n749R15O971K757n373n399K278O696J024
1987D830n850m733L810N991N8o386l501M565N492j027o469j966M863M997k110
2002B564o256j025N114M776l258n996q6N679L356l850n987P11O508K534m790n197
2018e203K159O331J775n340m544L085O114N44o072l411L816N801j035o434k334
2033d748M549N250k456o186j311N350M678l550n345l63N767L418m026n503J139
2048c337N983J831m665n001J830O150R43m918m246L068N379J89n499k951L759
2063a485N218m85n764k296M371M884j599n931j213M436M625k829n622l05N249
2078A254L424l519n007N37O269J838l710m696J682N691J386m854m315K796N208
$$ plain form
1971 384 5398 1322 -4951 -5022 1874 5258 710 -5039 -4124 2847 5604 231 -5168 -2890 3806 4830
1987 4830 -1020 -5753 -1943 4048 4106 -2280 -5781 -1216 4276 3249 -3220 -5186 -323 4674 2564
2002 2564 -3692 -4717 397 5173 1915 -4081 -4167 1512 4868 1018 -4969 -4258 2250 4784 -6 -5203
2018 -5203 -3044 3287 5062 -278 -4822 -1737 4377 4921 -1151 -4562 -746 5055 4020 -2414 -4748
2033 -4748 -199 5051 2595 -3591 -4902 448 5126 1576 -3769 -4132 1635 5053 1027 -4476 -3337
2048 -3337 2646 4477 -188 -5189 -3359 2791 3734 -1184 -5430 -2362 3017 3206 -2293 -5244 -1485
2063 -1485 3733 3248 -2516 -4812 -441 4443 2844 -3087 -4300 136 4761 1932 -3690 -3995 1254
2078 1254 4678 1159 -3848 -3311 2958 4796 1086 -3610 -1928 3763 5149 295 -4020 -1224 3984
2093C984L41n337l013L501M263n37n475j659L671M244j697n164p96M379L682k891
2109A496m846m9M147L262l677m565N04N200J905l781m175J554N055J032m012l270
2125d220K440M832M0m247k348K638M346o29m532j913L780L681j583m620p54L769
2141F80L648k657m212Q3M188K303k755l669N43M735J132l561l105J436M321M28
2157C538l797k529K104L628j73l771k238L027K881m22l815j323K807K956j344
2172A529l602q18K821K681j950l199k18K824J951k227k594j13L419J327k263k926
2188c358J022L690Q77k780k517J643K917N20l015k120J913L431l73l214j432K361
2204d35K902r73l349n27K773K186j647k752k6K906J775k152l055N43L330R66k486
$$ plain form
2093 3984 4325 -1012 -4025 -524 3739 3202 -2273 -3932 -261 3983 2286 -2878 -3674 705 4387 1496
2109 1496 -3350 -3399 748 4010 333 -4232 -3728 1472 3377 -404 -4579 -3025 2030 3062 -950 -4220
2125 -4220 -1780 3052 3092 -1155 -3503 -865 3481 2852 -1680 -3593 187 3868 2285 -2335 -3089 680
2141 680 4328 1671 -2541 -2458 1730 4033 1278 -2391 -1848 2887 4019 458 -2647 -1211 3110 3538
2157 3538 -259 -2788 -684 2944 2771 -1000 -3238 -211 2670 2248 -1567 -2890 -83 2873 1529
2172 1529 -2073 -2891 -70 2611 661 -2538 -2756 68 2019 -208 -2802 -2915 504 1831 -432 -3358
2188 -3358 -2336 1354 2231 -549 -3066 -1423 1494 2014 -1001 -3121 -1208 2223 1850 -1364 -2796 -435
2204 -435 2467 1494 -1855 -2382 391 2577 930 -1822 -1848 1058 2833 681 -2374 -1831 1499 2465 -21
2221b1k356Q28L476M2k642j889J796K639o13k626r86K081J510n32k359o78K379
2238D9J259j036k561K22J803J404j702j684K00J940J316j750j698M91K143M42
2254H38j519j489J162J777j25j302j109Q55J992l20j552p20J362R11Q8j748l49
2271a248J343J009l87j712K08J226O30q07j394L93J300O53j331p47J19J230K86
2288G71j036o90K50J483k04j105n88P47R33J93j201n89J078M7L14r28j85N47K85
2307A22J53j156R0O76Q13p53n84J46Q11J91q11n52P39N12j50m29l79M83J076l63
2327F35r51j96O46O78n88o93K07Q50Kn95l69L04P88m7m75p29O63P01m24p38R9
2348b32Q47M9p22m80M50O27J50j001l48J246Q7l03r46J96Q68J31o33j97J57Q63
$$ plain form
2221 -21 -2377 -1549 1927 1969 -673 -2562 -766 1873 1260 -1366 -2352 -271 1239 707 -1652 -2330 49
2238 49 1308 272 -2289 -2067 -264 1140 -562 -2246 -2046 -106 1210 -540 -2238 -1747 396 838
2254 838 -681 -2170 -1008 769 644 -658 -1767 -912 1080 760 -792 -1512 -150 761 849 -899 -1248
2271 -1248 95 1104 717 -995 -787 439 1069 262 -1132 -739 561 1214 -117 -864 -745 485 771
2288 771 -265 -955 -705 778 574 -531 -1119 -372 561 754 -447 -1036 42 89 403 -525 -710 -163 122
2307 122 275 -881 -791 -115 698 -55 -639 -493 318 509 -302 -854 -115 397 247 -182 -561 -78 998 635
2327 635 -316 -512 134 812 224 -469 -262 588 590 -5 -374 -70 718 671 196 -533 130 831 407 -331 -232
2348 -232 615 664 -58 -538 -88 539 689 -312 -660 586 673 370 -576 -380 488 619 -14 -211 -54 809
2368H09J15r20k20L03P38n9q29k04Q10O16o02q19o1R99J26l51o91rO32K20j63
2389D40j039M65P99M5p67l73K37Q79N5n98o75M30P64R1q83l78N63Q02p7j358R7
2410d81Q17P93o68r43QJ051P58r26j292L95Q96R03j029j134L78J217L87j150j168
2429a188J042Q67Q8j406j93O96J207K7k143p6Q68J261l51j895J29N66Q28o86j114
2448a473P63J256O34j090j734R33J270M47j677r48O26R96J034j766r91J071J807
2465A158K74j812j030N21K141j33j913o91J167J550q26j661j44K243J41r51j823
2482a789n18K985N47k113j198Q58K523L19k222j280J108K013J20k859l11J183
2498f34K371j457j563j104J976J612o79j827r51J917J449l82k436q6K102J211
$$ plain form
2368 809 924 4 -216 87 825 766 -63 -267 543 1159 557 -262 -323 676 802 451 -240 -249 383 603 440
2389 440 -599 -134 665 710 -57 -430 -193 686 741 143 -532 -102 662 753 -130 -508 55 857 780 -578 -481
2410 -481 336 1129 461 -482 -474 577 1335 409 -883 -488 408 1311 282 -852 -474 743 1130 -20 -1188
2429 -1188 -146 721 809 -597 -790 -94 1113 1140 -1003 -1079 -211 1050 699 -1196 -1067 -501 327 -359 -1473
2448 -1473 -710 546 1180 90 -1644 -711 559 1006 -671 -1619 -993 3 1037 -729 -1720 -649 1158
2465 1158 1432 -380 -1410 -889 1252 1119 -794 -1485 -318 1232 406 -1255 -1399 844 985 34 -1789
2482 -1789 -2307 678 1225 -888 -2086 -1228 1295 1614 -608 -1888 -780 1233 1353 -1506 -1817 -634
2498 -634 1737 280 -1283 -2387 -411 1201 522 -1305 -2256 -339 1110 728 -1708 -1794 308 1519
2514A519j456j888k02K580J095j864j609L63K364O98k135j033O96K817j69k117
2530c41j343J621J846J85k403j155J550K313j147j728o71J732J393p15k618K69
2546a212J620K357k594j519N71K090P52k140j245m89L265P37k200k500J284K693
2562A470m69j476j371J445J929l96j810j815K576J922n39k468o71J347K013r74
2578G13k714O24K255J344j731l057K063J787J050k513j984J401K459R14j822k434
2594a645J443J712K29k340q49J615K664p86l412L0J930K013q64k918n07K017J889
2611B221r86k286j71K051J979k309k232L56K557Q05j704j852K96K380J400k385
2627A20j933P69L003m10k486l72J228J681N5k654j047K511J808o94k641l30K192
$$ plain form
2514 1519 63 -1825 -2027 553 1648 -216 -1825 -1462 902 1600 -535 -1568 -872 1945 1776 -341
2530 -341 -1684 -63 1783 1968 -435 -1590 -40 2273 1126 -602 -1273 459 1852 1137 -1481 -1212
2546 -1212 408 2765 171 -1348 -777 1313 2065 -75 -1320 -1809 1456 2193 -7 -2507 -1223 1470
2562 1470 1001 -475 -1846 -401 1528 1132 -678 -2493 83 2005 1466 -1002 -1673 -326 1687 713
2578 713 -2001 -1377 878 2222 491 -2566 -503 1284 2334 -179 -2163 -762 1697 2611 789 -1645
2594 -1645 -202 1510 1739 -601 -1450 165 2829 2043 -1369 -1339 591 2604 1740 -1178 -1685 332 2221
2611 2221 1235 -1051 -1222 829 2808 499 -1733 -1377 1180 1985 281 -1571 -1275 1105 2505 120
2627 120 -1813 -1044 1959 1549 -937 -1309 -81 1600 1655 -999 -2046 465 2273 1579 -1062 -1392 800
2644H00J244q97k415o4K295J395j717k263N20K136R67j690j691O51K410Q14k241
2661B54k443J589K462k52k205j113J575K182m73k476q44J812J780n71k318J72
2677h69J572J385o33k912K60J597J670j219k109K76K260J95j272j950R70K198
2693A419Q8k024j451J688P82J467l640k31J618J590L32k469j606J825K696r79
2709A105k418p42K067J523r00k283j2K076J259j302k432O32K199Q32j534j975
2725a905O11K369M79j864j403R66K447j71k420r69J610J592l80j802r46J683J817
2742A714q92j980j69J747J150r17j937o4K045Q00j281j678L11J892Q64j866j136
2759a397O60J482O16j563j481R31J787L03k053q81J073J720k29j672q54J205J479
$$ plain form
2644 800 2044 1147 -1268 -1332 963 2358 641 -1622 -1102 1034 2001 311 -1380 -729 1681 2495 254
2661 254 -2189 -600 1862 1610 -595 -1708 -133 2049 1576 -900 -1744 68 1848 1277 -1041 -869
2677 -869 703 2088 1455 -1457 -1197 400 2070 851 -1258 -982 1278 1473 201 -1749 -779 1419
2693 1419 1507 -517 -1968 -280 502 1969 -1671 -1902 -284 1306 1638 -831 -2437 -612 2084 1105
2709 1105 -1313 -2055 12 1535 635 -1648 -1660 416 1675 373 -2059 -1427 772 1604 70 -1905
2725 -1905 -1294 1075 1554 -310 -1713 -747 1700 1529 -891 -1860 -250 1342 962 -840 -1786 -103 1714
2742 1714 822 -1158 -1327 420 1570 653 -1284 -1348 697 1497 216 -1462 -1151 741 1605 -261 -1397
2759 -1397 -737 745 1361 -202 -1683 -752 1035 1338 -715 -1596 -523 1197 968 -704 -1558 -353 1126
2776A126o43j369q88J657J698r26j806k6J448R10p76j860N36J682P38j489j306
2793a294L24J740O57j917o58N89J339L09j420j025J166J427j3j694q20J376J204
2810A290l87j578j32J269Q52l84j672q0J306R81r64j258m0J304P87q86j411N93
2828d10J269L95j129r64M17J353Pj270p76P97J144j96j276o53J529Q57l77j461
2846g44k18J287P90o51j134m9J095L57n90j190L12J269M17j200m62J93J135J21
2864G38r28m99L35R21K23j052l90O49Q40k74o95k93M22P59m24n54l16O56O50j45
2884F23j083J09O54P72q36q25L68M45O36p27q95N09P58J10o17n32L1R83K48p13
2904A8o63L25P90j50q38q4O06P00l96q17l59J015L35n65l65J16N43J86l06o54
$$ plain form
2776 1126 483 -886 -1774 -117 1581 655 -1151 -1177 271 1181 405 -1455 -919 763 1501 12 -1294
2793 -1294 -970 770 1427 -490 -1148 -559 780 1089 -331 -1356 -190 1237 1224 -470 -1290 86 1290
2810 1290 903 -675 -807 462 1314 930 -742 -822 484 1465 501 -757 -797 507 1294 408 -1003 -410
2828 -410 859 1254 125 -839 -422 931 938 -332 -1108 -311 833 637 -639 -1292 237 1094 717 -744
2846 -744 -962 325 1115 464 -670 -719 376 733 143 -1047 -735 534 951 -249 -711 -518 617 738
2864 738 -190 -689 -354 567 790 -262 -652 -3 837 563 -132 -425 -3 756 332 -222 -538 118 768 623
2884 623 -460 -351 303 1075 239 -586 -218 227 863 136 -759 -250 508 618 1 -531 -500 483 731 18
2904 18 -645 -320 470 320 -518 -602 4 704 308 -509 -868 147 482 -83 -448 -332 211 397 91 -563
2924e63J49P62j11k79l23J95O40k1n59l27M60N34l19m06o1M8R06n47k09p5L39
2945B33J00k34k58j13N59j35m2j67j11M89j97k52j32O5L83R8k06m89N30l5k23
2966a37j80K74m1K80n6l38L81o2k08M2j8R4K24k19r6J63j32K14o5k41J9K66j49
2989A5r2J07r7L94l19J74j12J43J60l78j55J79jQ5l18L82K3K10k20J37m59J46
3011DL52k21k29K62k42J84K41m19pN5L76j68m99L89L64j09k07l23p8M82R3j45
3033A55n76K66M58K27l84l84J54N94M6n30j15J66N10l09l56k90P09K20Pp50p0
3054b52O65J92m26k50O9M45M02r10j98M47L90J24n44n28N55M25k58l75Q0K73K21
3075E47K3r27J20O19L82m54m70k24N62M40k95p41P3P66J86l86p06K72N55M30n00
$$ plain form
2924 -563 -414 348 237 -42 -365 -170 470 449 -110 -437 23 557 238 -168 -229 -181 725 178 -31 -106 233
2945 233 333 99 -159 -272 287 152 110 -57 -168 321 124 -128 -260 -195 188 286 80 -409 121 86 -137
2966 -137 -317 -43 -84 196 140 -198 183 121 -87 -45 -63 31 255 36 -60 103 -29 185 120 -121 -102 164 15
2989 15 -77 30 -67 327 8 182 70 213 373 -5 -160 19 18 103 -215 167 190 400 180 317 -142 4
3011 4 356 135 -94 168 -74 110 351 -68 -75 -20 356 188 -311 78 442 333 126 -197 -275 207 300 155
3033 155 -421 -155 303 530 146 -238 -84 510 556 26 -89 77 587 278 -78 -368 341 561 568 -182 -252
3054 -252 413 605 179 -71 -2 443 845 -65 -263 184 574 698 154 -374 181 606 348 -27 53 326 547
3075 547 570 -357 -237 382 764 310 -160 -384 178 618 323 -418 -345 421 607 221 -485 -213 342 772 272
3096B72q73O66L23J68q74m5L68O01pq07j54M79P84k64p93k99P06M51m77p77M0
3117e12P72N22o81n97J35R40K40n84q71L48R09R0o61n87K98Q90J54r79j74L02
3137d6N83K27r76l30O35J064p33p83l85O80Q50l65j025K19O31M74n29r07J78P01
3157A63O29r04q15N02P09L20r95m93O26J026m6j009p53Q21R47J72j522k44P14
3176a52R09l85p92m01R57N63k81j109K6Q06P42o76j019K25J072K93m67r57M42
3195b04J027K2j073m83L57R85N6q17o81N28J006j70q78m07R61J136o61j192mM46
3215d6J192o66j039kJ059M50p57j014R2R52O13o16j120O27O86K18o53j226N57
3234f93J483j16j480j182Q60J988p63o54L44r0R34n00m77L8P85O14j018n07k41
$$ plain form
3096 272 -601 65 388 556 -318 -363 5 606 599 -208 -362 117 901 637 -156 -455 251 702 225 -552 -512
3117 -512 260 782 101 -496 -361 579 819 235 -636 -288 621 711 50 -537 -239 651 805 -174 -348 -46
3137 -46 537 764 -212 -542 93 1157 424 -359 -744 -64 786 421 -604 -385 246 720 191 -716 -538 163
3157 163 792 -112 -927 -425 284 604 -391 -884 -258 768 722 -287 -1040 -219 728 900 -622 -866 -152
3176 -152 757 372 -420 -821 136 699 418 -691 -665 141 883 207 -812 -587 485 778 311 -646 -204
3195 -204 823 845 -228 -711 -354 631 687 -130 -811 -283 723 553 -325 -732 229 1365 704 -488 -492 -46
3215 -46 1146 480 -559 -561 498 948 191 -823 -731 221 834 218 -902 -275 411 629 -24 -1250 -693
3234 -693 790 674 -806 -1988 -1128 860 97 -557 -213 -303 631 131 -346 -308 477 1091 73 -434 -675
3253f75N92J002l80j578m60J614J358j173j210Q33N91R00j282j446N37J568K13
3270A004q49j399J172J020Rj104p74J183L59k60p92m1N43J012m03j100o74J303
3288B09R23q08j058j76R38J147j257j254Q49J114J2q73m64L86J462r37k87j012
3306a086P31Q33q5p85l56K98J237j79j422J27M11J242p35o41l98J294P64r75q56
3325e81k83J400L06q21j048N67Q91O89j269o68N23Q21M39j009p61L00R49j00n77
3344b32l87O04R73m90j026j35Q17Q69q86o14n4Q27O11o83r25J90Q98M16q03n54
3364e84K80P84J89j031l91O35N04R1r06l21N09R86m81m53l94N77N26j68p38k81
3384f67N94N44k06o11l99O39O04l10p62p5R43M70o41p05J21P98K98n14n91M8Q75
$$ plain form
3253 -675 -83 919 539 -1039 -1499 115 1473 300 -910 -77 514 1414 132 -1314 -777 791 1004
3270 1004 155 -1244 -72 948 957 -147 -921 262 621 361 -431 -472 71 1083 680 -420 -1094 209
3288 209 1132 324 -734 -910 28 1175 -82 -1336 -487 627 639 -234 -698 -312 1150 213 -74 -1086
3306 -1086 -355 478 393 -392 -748 -450 787 608 -814 -687 -276 966 231 -410 -808 486 1250 275 -581
3325 -581 -864 536 842 21 -1027 -460 431 1120 -149 -817 -294 527 966 -43 -804 -504 445 345 -232
3344 -232 -619 -15 958 468 -558 -693 124 993 107 -507 -561 266 877 194 -731 -541 357 773 -30 -584
3364 -584 -304 480 669 -362 -753 -118 386 477 -429 -750 -241 745 264 -189 -583 -6 520 352 -386 -667
3384 -667 -73 471 265 -346 -745 -106 498 188 -574 -649 294 764 123 -582 -461 337 635 121 -470 -422 453
3405D53J42q14k56%Q44K30q31m36P96N62j88j087r7Q33M73k41q14J1O04M11n73
3426B2n82N2Q60K22m68o96L38N65L93o76o42M20P47j5r57j88K76O78K59p68j50
3447c10J03N12L1n28k45P91J68l70l78j4L40N20l73m23k47R14j05l35l94J00N90
3468C47R9l96m72L42M71ln38j45K29P34k41p31m8O00K12K49r08k92Q08L06l86
3489B37n70J61K86N64l83m77k57P43Q3j01o48J40O02O4j51k79k07M48o2j93k32
3510b32Q3N80O9n20p8J30M08m6n66k51M36M94j73m94j77M64L68r8o24j56N33L97
3532E47l23n00M44J65O4l48j43J45L47J51p23K05j57L66L1l22j15M15k11N7k06
3553a11r4N4K14l23J8L32J07j14j91J04J7l1l7k47K1n1N49Rk63M8j80K07o6L84
$$ plain form
3405 453 595 -219 -475 -475 369 599 -232 -668 128 690 502 -585 -682 151 624 383 -431 -420 184 595 22
3426 22 -560 -508 352 574 106 -590 -252 313 706 30 -612 -192 555 540 -417 -605 -329 349 608 -160 -310
3447 -310 -207 305 336 -192 -437 354 522 152 -226 -240 100 620 247 -176 -423 491 386 51 -343 -243 347
3468 347 446 50 -422 -80 391 388 -150 -295 -66 668 427 -304 -352 248 460 709 -199 -491 317 623 237
3489 237 -333 -172 114 678 295 -182 -439 304 387 286 -362 -222 380 444 293 14 -193 255 193 0 -232
3510 -232 -149 431 500 -20 -98 32 440 394 -172 -423 13 507 334 -160 -337 127 495 397 -227 -383 150 547
3532 547 224 -276 168 333 397 49 -94 51 398 549 -174 31 -126 240 271 -51 -166 249 38 95 -111
3553 -111 -205 -151 63 -260 -242 90 197 83 -108 -4 13 -18 -55 -302 -281 -332 217 226 -37 11 -169 38 -28 356
3577C56m84O7o2K73q3k09P7J02j0j57o8K05J20j4j11l5Q9K9j48RRJ91O5j74k04
3602a67P0J09R2j07j14K6J11Q7P2k06O7k1j48q8q3L78K3q1k72K03m3R5O2k97K35
3627Cj07j07L96k2l15J05qj12N69k91n6PJ7J14n4j66N4j5j23L55k00j41oK97k99
3652a05K5R6J8L45m30K4j84L26k21O09O9q08L34J08K37j140M36L46J96n94l5L75
3674B7K48l42J32l64J73O29J29j093N88J29l48k3k30J67M6J31J54j07k63J12N48
3695D43k28j93m76R25j75m01l64j00P81N41q92o41Q72n72O61l41L59rq5N1k39
3716h3q14O34Q31q68J78L6L52m60P38l61k9K44k0o36M95j149J076k62l9l22K58
3737b01N38N40p94j055J085O88k05q33o80O25N97l28L1m47L05L93n1l78pN93q63
$$ plain form
3577 356 -128 -61 -123 150 67 -142 -65 37 27 -130 -198 7 127 113 2 -33 56 85 -63 -54 -45 146 211 37 -167
3602 -167 -97 12 104 -3 -117 -91 20 107 179 -27 40 19 -129 -217 -300 78 101 20 -252 -49 -92 3 65 -232 3
3627 3 -104 -211 185 163 -152 -47 -55 -167 402 111 55 62 79 193 139 -27 27 12 -111 244 44 -97 -103 194 -105
3652 -105 -80 16 34 379 -51 -27 -211 115 -106 503 572 -236 98 206 443 -697 -261 85 281 -313 -348 27
3674 27 275 -67 65 -299 -126 503 632 -461 127 256 -92 -115 -345 -178 -132 -1 153 46 -217 -105 443
3695 443 215 22 -454 471 296 -105 -469 -569 212 753 -139 -780 92 -480 181 -160 199 190 105 156 -83
3716 -83 -897 -263 568 -300 -122 -86 266 -194 544 183 154 398 378 -258 237 -912 164 -98 -137 -459 -201
3737 -201 337 877 83 -972 113 801 596 -237 -917 -292 305 -23 8 -439 -134 259 208 -170 -177 416 -447
3758d47J053q59k3M73j60j41n0J50M16k38m56k96P40M35n4m73n28L23O03k15p26
3779d73R3L94J57j04j56N8M33K31r96N57m27J47P33J08o46m67k82J171o60p17
3799h46M6O08P82q65N89p34Q55k26K15n35k9R47j50j337M94j89P29j35m43m96
3819g20R95J78l03R6r09M76M33l87j28m15J190l98K15l49r02R89J1N3l76J15Q98
3840G62m64l64l64J82J68N3n3l41O48M32m13o30K62l48P94p18m92N48M89J13m6
3861B18p04K86N46J07J26j198L96L05N43r60n79J166k40L26L8r21L05M82N26n91
3881A77j006R14N42J03r14k51P15L38l52o30K07N66j32l78k48j08N32O22r15j87
3901d05L18J17J17k19m64J75L91K27m53r2J02L85L6P8n05M68j75L86n22n22N35
$$ plain form
3758 -447 606 -253 -276 197 37 -104 -154 -4 412 174 -282 -578 162 597 543 70 -458 -135 468 253 -473
3779 -473 -380 14 171 67 -89 -31 402 633 -363 194 -233 -86 647 755 109 -358 -640 531 -129 -846
3799 -846 -800 -192 590 -275 314 -420 435 209 424 -111 -140 807 657 -680 -186 -375 354 219 -224 -720
3819 -720 275 453 150 246 -663 -187 246 -141 -269 -684 506 108 323 -26 -928 61 72 125 -251 -136 762
3840 762 298 -66 -430 -248 -80 -27 -80 -421 227 659 246 -384 -122 -470 324 -394 -886 -338 151 264 218
3861 218 -486 -200 346 453 579 -619 -223 82 625 -335 -914 252 12 338 376 -545 -240 242 768 177
3881 177 -829 85 627 730 -184 -435 280 618 266 -364 -157 409 277 -101 -349 -457 75 697 -218 -405
3901 -405 -87 30 147 -72 -536 -361 30 257 -196 -288 -186 199 235 313 -192 276 101 487 -35 -557 -22
3922b2L16q6p53M29K82j4J30n30j88M51M20n50m19M12O0P00n40p10N47L89J55
3943D79o22k49O14M8N0m48j52N41j86K17l85k86N95L85l71m86j57N99J43L13r61
3964c19K6N01K53m18l16k9K10N19l47m40K11N46l14j25l42J39O25l34j00l44L01
3985i7M39m7l30l24L09K93J02q89J67O40K39j37n82p7L08K02m55j19K33L74L09
4006E58n54n56J54N89K97n70k59J34M53j2j34n19K67M59m48q7j45J92N27k43n44
4027d41J01K91K69k80R5l83N26K63k86m43J36L91K20m46k23J02L01J97n51m25
4047e86M12K35K94k19j90K04L28k94k13l05M52M18l98o33L91L2M52l63j3l49L79
4068C4r0j3k73J8M20NJ80l98M6J28K84l23l19J00K75K2k95m4K08J11K23m72LR6
$$ plain form
3922 -22 294 208 -545 -116 166 152 282 -248 -436 15 435 -115 -534 -122 -62 638 98 -612 -65 324 479
3943 479 -143 -392 222 270 320 -128 -280 261 75 292 -93 -379 216 601 230 -256 -413 186 329 642 -319
3964 -319 -293 208 461 43 -273 -302 -92 427 80 -360 -149 397 83 -42 -384 -245 380 46 -54 -398 -97
3985 -97 342 295 -35 -359 -50 243 345 -544 -377 263 502 365 -217 -294 14 216 -239 -358 -125 249 558
4006 558 4 -552 -398 191 488 -82 -341 -207 246 234 100 -419 -152 307 -141 -228 -373 -181 346 103 -441
4027 -441 -340 -49 220 -60 35 -348 178 441 155 -288 -152 239 459 13 -210 -108 193 390 -161 -586
4047 -586 -174 61 355 136 -54 150 478 184 -29 -334 118 536 138 -495 -104 -72 380 17 4 -345 34
4068 34 -56 -69 -342 -324 96 101 281 -117 -71 57 341 18 -301 -201 74 96 -199 -243 -35 76 299 -173 -170 -74
4092g4K16M9k14j01n3P18l40n14J69j70Q48m57k82M47j86K44l8r3j52K07j40k2
4114F2m90L30K75K4j56l39P8M16l6k14o9j04K63J20j97K0JRj39K86p1L2J92m89
4138a96L77m38J99J07J45m05j29M39K5p3k23ON58k52j29j64L0K03j99j06K9P6
4160a20K99m8j50L7m0M19m93J03K01q5J75k24K7l8l17M28j38oj16L49o1k78J0
4183f6q5K72r1k7k26L06m8l1l5J46j66J89j72J28p1j35R0J0k50J96o0L02n6m22
4207c02L13J40J17k38K86m14K16J33j08j72K15l40J40J25k11L04J94l81R1j94
4227h6J71j83J39j95R8J33k32R1j44K59j11mm0j4J26J12K0k72j10J82K46m67L15
4250C4n06M61n6M59op26L68L1q0K31j25j00K51J39l88k14J93J22j59M4J49l32
$$ plain form
4092 -74 142 191 -23 -124 -177 541 201 -313 -144 -314 534 77 -205 242 56 300 262 169 17 224 84 62
4114 62 -428 -98 177 201 45 -294 -216 200 164 -50 -119 -223 40 160 -37 -17 -16 -7 -146 140 69 101 293 -196
4138 -196 181 -257 -58 49 194 -211 -340 99 124 51 -172 -166 392 140 11 -153 -123 80 -119 -225 -196 -120
4160 -120 179 131 -19 18 -22 397 -96 7 208 123 298 74 101 63 -254 174 36 30 -86 263 202 -76 -66
4183 -66 -151 121 30 3 -223 83 35 4 -31 115 -51 138 -34 94 23 -112 -22 -12 -262 -66 -126 176 120 -302
4207 -302 11 151 268 30 316 -98 118 251 143 -29 186 -154 -14 111 -100 204 398 17 108 -86
4227 -86 85 -98 41 -154 -56 77 -155 -64 -208 51 -60 -64 -104 -118 8 120 140 -132 -242 -60 186 -281 34
4250 34 -472 -11 -67 392 386 -340 28 59 -21 210 85 -15 236 375 -13 -227 -34 88 -71 -27 122 -210
4272b10J79K83j89nj03O7N6k56J86J04j41J5Q1j30j6J6j23K13P8j61J03q1k82
4295c16Q1L35l02Q5K0J77j87N0k49K60J21j89J34L5k0J92l54L10o8j34N8J55l53
4318a59L30p0p0q0j18J69o7J15O0M3j49M5O9L1k06K65k49N7j37n0M62k9l43J09
4342B8J40j0j55k07J81l0K86j66p2j07N6K13k54j66L21K18j22j49J5J86r6qj93
4365i1L8J17J21M1k34k98K61J76L6M0l0p2l7j18mk03M86j7J68m24O8J2P6o0k70
4390b18K74J32j06j04j65K19K16m2J01l81L10l49Q0L08L2l51J81J21o22L14M25
4411C75l45K1J75n38M06J22l16l38N56k02r7J23j88J63n29P66l86J2N28n7J30
4432C81j88k48J34O6J18o36k82L13O05m03j93J01J84L40p21M16K15j64%k34L18
$$ plain form
4272 -210 -31 252 63 58 -45 22 78 -178 8 112 -29 -14 67 -63 -79 -63 -186 27 105 -56 47 -34 -316
4295 -316 -235 100 -202 -117 -97 80 -107 -57 -306 -46 75 -114 20 55 35 227 -127 183 115 -19 39 194 -159
4318 -159 171 101 31 -49 -167 2 -65 50 110 153 4 49 118 149 -57 208 -41 16 -121 -171 291 262 -81 28
4342 28 168 158 3 -204 -23 -53 233 67 -5 -112 -56 157 -97 -263 58 276 154 5 20 206 110 102 -91
4365 -91 -53 64 185 226 -8 -306 -45 131 167 207 177 105 68 -50 -54 -257 229 212 380 -44 24 36 112 52 -218
4390 -218 56 188 82 -22 -187 32 248 206 307 -74 236 -113 -33 275 307 -44 137 258 -364 -50 375
4411 375 30 51 226 -312 94 216 -100 -438 118 -84 -181 -58 -246 -83 -612 154 -232 -220 308 251 381
4432 381 193 -55 79 145 263 -373 -655 -342 263 -140 -333 -232 -48 292 -429 -13 202 38 38 -196 122
4453A22r9P71m42m58l08Q44l70R5k61k13kN41j78k78R8J5O1M33l02J61q24Q59
4475B65k56l03J07J71J89m75J57l49O71J78j85l34m90O03N41j4m25J04q3l82J51
4496a59j88L70j89J35M20m78M7J93L60m93l57M61J5n61O41l19J99N7N01m54K45
4517D46n38J64P5n3Nq21J169l48k87K0N73o59p51O94L7Q60n56r7p20R39K02o26
4539b72j25M51J77j08k31K42K18J42r05K99n14L46N64O48o84k71p83Q60P49p07
4559I6m36R0N17m45l62N89o00k09J372m79l40M22L51l27o90L25J18L99m86L91
4579B96m04Q7J64j41q7j11J87l24L07j19j18O67l24l2j17m00P70j23l40K22m05
4600c45K41m8Pk10L32NK08L56k27l92q45P86k60N72j9J01k51n15P93m64N47l01
$$ plain form
4453 122 23 794 352 -106 -414 430 60 155 -106 -319 -321 220 42 -236 -138 -123 -62 371 69 230 -594 265
4475 265 9 -294 -187 -16 173 -302 -145 -494 177 355 170 -164 -654 -51 490 476 51 155 72 -310 -159
4496 -159 -347 23 -166 -31 389 -89 -42 151 511 18 -339 122 137 -424 217 -102 97 154 655 201 446
4517 446 -92 72 147 94 99 -722 447 99 -188 -168 405 -254 -1005 -311 -274 586 30 -67 -787 152 354 -272
4539 -272 -397 54 231 123 -108 134 352 494 -411 -112 -626 -280 284 932 248 -23 -806 54 803 96
4559 96 -340 -250 267 -178 -540 49 -551 -760 612 133 -207 215 566 239 -451 -126 -8 391 -95 296
4579 296 -108 -21 143 2 -85 -196 -9 -333 -26 -145 -263 404 80 48 -69 -469 301 178 -162 60 -345
4600 -345 -104 -152 -145 -355 -23 -18 190 546 319 -73 -918 -132 -392 180 161 262 11 -504 289 -175 372 71
4622G1j92L3k2M90l62q86O53P19l55o51M76n17O33m97J36j42QO95o1k13k16J48
4644e2K34k66l47l1M85M08m55j6L21k15L15l14n9N57p20q61P63j64N02l26K13
4665b8L41m10j15k65J271j052k84K88P0O76o58K32n0o8j30m12N84J36O1r5k9o03
4687e40K02Q86q70N45j20k08l28O23j4p35K75L58j90J96K9N3l00j84K67j26M20
4708B39J97o95L58J39k61j39l29L50k2j00N40p51P10m89O02l52M26n39M11j83
4728A12n86J43K55L93k71j82k91L74K77l49J57j38K0l74M72j76o07L71O55j55
4748A00n12N44j54J14l40M13r8j37N68q06J9P98l04p9k46k67O52L6o79L83K04
4769B09j6k43j09P7K17k71K17K77m72O1J36J94l22J30Q2k38m1j46k03M60j04K50
$$ plain form
4622 71 -121 -88 -110 380 18 -868 -215 504 149 -502 -26 -543 90 -407 -271 -413 -405 290 229 16 -200 -52
4644 -52 182 -84 -431 -462 23 431 -24 -40 281 66 381 67 8 565 -155 -1016 -253 -417 85 -241 -28
4665 -28 313 -97 -212 -477 794 -258 -542 -254 -184 492 -166 66 16 -52 -182 -594 -10 126 187 92 63 -540
4687 -540 -338 548 -322 223 103 -105 -433 190 176 -559 -284 74 -116 80 109 162 -138 -322 -55 -181 239
4708 239 436 -259 99 238 -23 -162 -491 -141 -163 -263 277 -474 236 -253 349 -3 423 -116 295 112
4728 112 -474 -331 -76 317 46 -136 -427 -53 224 -125 32 -106 -86 -460 12 -164 -771 -400 255 100
4748 100 -412 132 -22 92 -248 165 67 -70 498 -308 -289 509 205 126 -120 -387 265 301 -378 5 209
4769 209 193 -50 -159 -82 135 -136 81 358 -114 -53 83 277 -45 85 167 -71 -112 -258 -461 -1 -105 145
4791A45j29j06J07j90N10m34K69l03J00M8j08K80j59J09j45m2Q7j26K73q2j99
4812i5Q6J61k80n4K94j12j2j31L07j55j16L77k55j7K7p7J01k74J23K74l71J3J83
4835cJ28n24L55R5j08n7J59l5J0j05j94L77k35L12j87J26J84m16J7q6J28j13L4
4858a38K12M7j18j96J27k9J20J06k1r7kk19J98k5Rm0J19j17j61M6J06r4J34j4
$$ plain form
4791 145 16 -90 17 -173 337 -97 172 -131 -31 17 -91 189 30 139 -6 -48 39 -87 186 104 -95
4812 -95 -9 152 -128 -182 112 0 -12 -143 164 9 -107 270 15 -2 25 -52 49 -225 -102 172 -199 -186 -3
4835 -3 125 -399 -44 51 -57 -114 45 10 20 -85 -279 98 -137 175 -12 114 298 -118 -101 -187 -59 -172 -138
4858 -138 74 121 3 -193 -66 -95 25 131 110 13 11 -208 -10 -35 -26 -66 53 -64 -225 -179 -73 -167 -33 -47
$$ [...]
8191A82
##END NTUPLES=NMR FID
##END=
