##TITLE=1H_SA_sl_CNFOH4
 CDCl3, 208 sc, 
 19.11.2020
##JCAMPDX= 6.0         $$ Bruker NMR JCAMP-DX V2.0
##DATA TYPE= NMR FID
##DATA CLASS= NTUPLES
##ORIGIN= UXNMR, Bruker Analytische Messtechnik GmbH
##OWNER= root
$$ XWIN-NMR		Version 3.5
$$ Thu Nov 19 13:49:38 2020 Russian Standard Time (UT+4h)  she@DPX200
##.OBSERVE FREQUENCY= 200.1315066352
##.OBSERVE NUCLEUS= ^1H
##.DELAY= (6, 6)
##.ACQUISITION MODE= SIMULTANEOUS
##.ACQUISITION SCHEME= undefined
##.AVERAGES= 208
##.DIGITISER RES= 18
##SPECTROMETER/DATA SYSTEM= spect
##.PULSE SEQUENCE= zg30
##.SOLVENT NAME= CDCl3
##.SHIFT REFERENCE= (INTERNAL, CDCl3, 0, 15.7039)
##AUDIT TRAIL= $$ (NUMBER, WHEN, WHO, WHERE, WHAT)
$$ ##TITLE= Audit trail, XWIN-NMR		Version 3.5
$$ ##JCAMPDX= 5.01
$$ ##ORIGIN= Bruker BioSpin GmbH
$$ ##OWNER= she
$$ F:/spectra/data/she/nmr/H-F/1/audita.txt
$$ ##AUDIT TRAIL=  $$ (NUMBER, WHEN, WHO, WHERE, WHAT)
(   1,<2020-11-19 13:48:21.45 +0400>,<she>,<DPX200>,
      <continue with go, POWCHK disabled, PULCHK disabled
       configuration hash MD5:
       00 E9 B6 7A A2 85 ED C7 34 08 36 98 17 FE 4E 26
       data hash MD5: 16K
       8E 16 05 71 9C 8A 77 1D 3D 63 C6 76 2A 61 0A E1>)
$$ ##END=
$$ 
$$ hash MD5
$$ 67 54 6C 96 89 0F F8 8A F9 95 17 57 28 84 DE 11
##$RELAX= 
##$RELAX= 
##$RELAX= 
##$RELAX= 
##$RELAX= 
##$RELAX= 
$$ Bruker specific parameters
$$ --------------------------
##$DU= <F:/spectra>
##$EXPNO= 1
##$NAME= <H-F>
##$PROCNO= 1
##$TYPE= <nmr>
##$USER= <she>
##$AMP= (0..31)
100 100 100 100 100 100 100 100 100 100 100 100 100 100 100 100 100 100 
100 100 100 100 100 100 100 100 100 100 100 100 100 100 
##$AQSEQ= 0
##$AQ_mod= 1
##$AUNM= <au_zg>
##$AUTOPOS= <>
##$BF1= 200.13
##$BF2= 200.13
##$BF3= 200.13
##$BF4= 200.13
##$BF5= 200.13
##$BF6= 200.13
##$BF7= 200.13
##$BF8= 200.13
##$BYTORDA= 1
##$CFDGTYP= 0
##$CFRGTYP= 5
##$CHEMSTR= <none>
##$CNST= (0..31)
1 1 145 1 1 1 1 1 1 1 1 1 1 1 1 1 1 1 1 1 1 1 1 1 1 1 1 1 1 1 1 1 
##$CPDPRG= <>
##$CPDPRG1= <>
##$CPDPRG2= <>
##$CPDPRG3= <>
##$CPDPRG4= <mlev>
##$CPDPRG5= <mlev>
##$CPDPRG6= <mlev>
##$CPDPRG7= <mlev>
##$CPDPRG8= <mlev>
##$CPDPRGB= <>
##$CPDPRGT= <>
##$D= (0..31)
0 1.2 0 0 0 0 0 0 0 0.06 0 0.03 0 0 0 0 0.0002 0 0 0 0 0 0 0 0 0 0 0 0 
0 0 0 
##$DATE= 1605778550
##$DBL= (0..7)
120 120 120 120 120 120 120 120 
##$DBP= (0..7)
150 150 150 150 150 150 150 150 
##$DBP07= 0
##$DBPNAM0= <>
##$DBPNAM1= <>
##$DBPNAM2= <>
##$DBPNAM3= <>
##$DBPNAM4= <>
##$DBPNAM5= <>
##$DBPNAM6= <>
##$DBPNAM7= <>
##$DBPOAL= (0..7)
0.5 0.5 0.5 0.5 0.5 0.5 0.5 0.5 
##$DBPOFFS= (0..7)
0 0 0 0 0 0 0 0 
##$DE= 6
##$DECBNUC= <off>
##$DECIM= 32
##$DECNUC= <off>
##$DECSTAT= 4
##$DIGMOD= 1
##$DIGTYP= 9
##$DL= (0..7)
0 120 120 120 120 120 120 120 
##$DP= (0..7)
150 150 150 150 150 150 150 150 
##$DP07= 0
##$DPNAME0= <>
##$DPNAME1= <>
##$DPNAME2= <>
##$DPNAME3= <>
##$DPNAME4= <>
##$DPNAME5= <>
##$DPNAME6= <>
##$DPNAME7= <>
##$DPOAL= (0..7)
0.5 0.5 0.5 0.5 0.5 0.5 0.5 0.5 
##$DPOFFS= (0..7)
0 0 0 0 0 0 0 0 
##$DQDMODE= 0
##$DR= 18
##$DS= 0
$$ [...]
##$SUBNAM2= <"">
##$SUBNAM3= <"">
##$SUBNAM4= <"">
##$SUBNAM5= <"">
##$SUBNAM6= <"">
##$SUBNAM7= <"">
##$SUBNAM8= <"">
##$SUBNAM9= <"">
##$SW= 16.9725356469052
##$SWIBOX= (0..15)
0 0 2 0 0 0 0 0 0 0 0 0 0 0 0 0 
##$SW_h= 3396.73913043478
##$TD= 16384
##$TD0= 1
##$TE= 0
##$TE2= 300
##$TE3= 300
##$TEG= 300
##$TL= (0..7)
0 120 120 120 120 120 120 120 
##$TP= (0..7)
150 150 150 150 150 150 150 150 
##$TP07= 0
##$TPNAME0= <>
##$TPNAME1= <>
##$TPNAME2= <>
##$TPNAME3= <>
##$TPNAME4= <>
##$TPNAME5= <>
##$TPNAME6= <>
##$TPNAME7= <>
##$TPOAL= (0..7)
0.5 0.5 0.5 0.5 0.5 0.5 0.5 0.5 
##$TPOFFS= (0..7)
0 0 0 0 0 0 0 0 
##$TUNHIN= 0
##$TUNHOUT= 0
##$TUNXOUT= 0
##$USERA1= <user>
##$USERA2= <user>
##$USERA3= <user>
##$USERA4= <user>
##$USERA5= <user>
##$V9= 5
##$VALIST= <valist>
##$VCLIST= <CCCCCCCCCCCCCCC>
##$VD= 0
##$VDLIST= <DDDDDDDDDDDDDDD>
##$VPLIST= <PPPPPPPPPPPPPPP>
##$VTLIST= <TTTTTTTTTTTTTTT>
##$WBST= 1024
##$WBSW= 4
##$XGAIN= (0..3)
0 0 0 0 
##$XL= 0
##$YL= 0
##$YMAX_a= 1325608
##$YMIN_a= -1070258
##$ZGOPTNS= <>
##$ZL1= 120
##$ZL2= 120
##$ZL3= 120
##$ZL4= 120
##$ABSF1= 10
##$ABSF2= 0
##$ABSG= 5
##$ABSL= 3
##$ALPHA= 0
##$AQORDER= 0
##$ASSFAC= 0
##$ASSFACI= 0
##$ASSFACX= 0
##$ASSWID= 0
##$AUNMP= <proc_1d>
##$AZFE= 0.1
##$AZFW= 0.1
##$BCFW= 1
##$BC_mod= 2
##$BYTORDP= 1
##$COROFFS= 0
##$CY= 11.3945322036743
##$DATMOD= 1
##$DC= 2
##$DFILT= <>
##$DTYPP= 0
##$F1P= 15.9154993809931
##$F2P= -4.1035820241983
##$FCOR= 0.5
##$FTSIZE= 0
##$FT_mod= 4
##$GAMMA= 1
##$GB= 0.15
##$INTBC= 1
##$INTSCL= 1
##$ISEN= 128
##$LB= 0.24
##$LEV0= 0
##$LPBIN= 0
##$MAXI= 10000
##$MC2= 0
##$MEAN= 0
##$ME_mod= 0
##$MI= 1.114404
##$NCOEF= 0
##$NC_proc= 0
##$NLEV= 6
##$NOISF1= 3.799351
##$NOISF2= 2.8
##$NSP= 1
##$NTH_PI= 0
##$NZP= 0
##$OFFSET= 15.70392
##$PC= 1
##$PHC0= -11046.98
##$PHC1= 9.600901
##$PH_mod= 1
##$PKNL= yes
##$PPARMOD= 0
##$PSCAL= 0
##$PSIGN= 0
##$REVERSE= no
##$SF= 200.130013532006
##$SI= 16384
##$SIGF1= 3
##$SIGF2= 2
##$SINO= 400
##$SIOLD= 16384
##$SREGLST= <1H.CDCl3>
##$SSB= 0
##$STSI= 0
##$STSR= 0
##$SW_p= 3612.71676300578
##$SYMM= 0
##$S_DEV= 0
##$TDeff= 0
##$TDoff= 0
##$TI= <>
##$TILT= no
##$TM1= 0
##$TM2= 0
##$TOPLEV= 0
##$USERP1= <user>
##$USERP2= <user>
##$USERP3= <user>
##$USERP4= <user>
##$USERP5= <user>
##$WDW= 1
##$XDIM= 8192
##$YMAX_p= 0
##$YMIN_p= 0
$$ End of Bruker specific parameters
$$ ---------------------------------
##NTUPLES= NMR FID
##VAR_NAME=  TIME,          FID/REAL,        FID/IMAG
##SYMBOL=    X,             R,               I
##VAR_TYPE=  INDEPENDENT,   DEPENDENT,       DEPENDENT
##VAR_FORM=  AFFN,          ASDF,            ASDF
##VAR_DIM=   8192,          8192,            8192
##UNITS=     SECONDS,       ARBITRARY UNITS, ARBITRARY UNITS
##FACTOR=    0.0002944,     1,               1
##FIRST=     0,             0,               0
##LAST=      2.4114304,     0,               0
##MIN=       0,             -1070258,        0
##MAX=       2.4114304,     1325608,         0
$$ Real data points
##PAGE= N=1
##DATA TABLE= (X++(R..R)), XYDATA
0 0 0 0 0 0 0 0 0 0 0 0 0 0 0 0 0 0 0 0 8 -208 208 -208 208 -208 213 -414 416 -416 588 -624 673 -832 921
33 921 -1042 1229 -1345 1500 -1685 1900 -2127 2386 -2652 2950 -3265 3629 -4010 4433 -4890 5389
49 5389 -5942 6546 -7208 7940 -8754 9657 -10668 11815 -13120 14604 -16337 18383
61 18383 -20839 23866 -27695 32748 -39767 50321 -68697 111305 -550876 -189513 -847279
72 -847279 -818368 -516745 -1070258 -384666 -448993 -770998 -396088 -305878 -371242 153690 -408713
83 -408713 -6164 125084 -79811 248293 -35637 17978 68738 23164 -124864 -93820 -291300
94 -291300 -298385 -178628 -589703 -314214 -571581 -542990 -387828 -578307 -476988 -417703 -438577
105 -438577 -314043 -147869 -395087 2578 -118865 -110383 221300 -184935 125630 62740
115 62740 -47511 66178 -99117 -158616 -82165 -244147 -314490 -210283 -533847 -267280 -408422
126 -408422 -501283 -272182 -493804 -308501 -256082 -252649 -214133 -99302 -102971 42347 65330
137 65330 -34188 211364 51595 160099 150308 2169 108593 63457 -39643 -41389 -86283
148 -86283 -226285 -38433 -250149 -249791 -148319 -325981 -96376 -182452 -213778 -66085 -80868
159 -80868 -18910 93127 -9685 104446 210655 69166 262561 128618 110847 240076
169 240076 93456 103062 59784 -18427 9988 -12825 -148849 -92090 -171268 -160471 -89704 -252172
181 -252172 -154648 -121574 -146480 -68579 -78516 -114159 31097 8623 -14338 83176 -29287 78005
193 78005 56173 -19292 37414 -47461 -67419 -29507 -140189 -162269 -118219 -259501 -151841
204 -151841 -221913 -282567 -163905 -262086 -193124 -162849 -198409 -143310 -95831 -133007 -24137
215 -24137 -59661 -84693 57726 -68195 29839 2762 -65057 27140 -17612 -72389 -46464 -55971
227 -55971 -124459 -19210 -157133 -97544 -70847 -162657 -30881 -128650 -84453 -38917 -54413
238 -54413 -44987 30478 -36338 12339 97358 -46520 123441 18417 37112 99086 -1775
249 -1775 58431 26221 13741 -9597 32931 -74517 24031 -48637 -85244 36428 -125540 -316
261 -316 -58041 -60128 -15908 -30744 -45968 -25261 11130 -63868 53643 -78120 22132 1294
273 1294 -55831 47382 -76817 5506 -27384 -19755 -54451 -10423 -64890 -38125 11374 -122961
285 -122961 26466 -89162 -13710 -21543 -77079 1622 -49626 -4533 -42314 5286 -63457 47357
297 47357 -34421 -23468 58754 -75571 82341 -24208 15069 34922 21870 35316 32805 47064
309 47064 12636 110321 -22227 98673 30630 19922 112768 -25122 78351 24139 33055
320 33055 16390 46408 -12219 26266 39847 -44315 86313 -47720 55986 30423 -289
331 -289 74560 11838 59851 46786 68683 11630 105660 15641 48477 78215 -38085 89244
343 89244 -23664 12016 -4539 -33181 -22145 -33786 -46606 -63883 -11226 -105385 14317 -66869
355 -66869 -46710 18838 -60345 40663 -7394 16491 25596 55775 20925 58298 40413 18420
367 18420 89862 -25878 58240 -2703 -15976 24820 -43979 -22086 -31296 -33827 -50606 3929
379 3929 -68728 -4136 8586 -24239 63286 -7689 67288 73490 63083 92572 92573 80396 111734
392 111734 100998 44435 120520 31626 54312 52806 -20456 26049 -18464 -35170 -30578 -41589
404 -41589 -60309 -20080 -66717 -33693 -2665 -54687 28591 -8627 10296 53174 22964 33507
416 33507 64453 32795 35793 46710 -17420 29804 -22816 -44643 -36890 -90927 -71624 -90249
428 -90249 -129287 -115735 -106705 -143351 -88772 -122931 -112184 -51120 -95433 -38423 -33279 -30054 2384
441 2384 9244 677 32654 9364 8673 38715 -35710 14686 -31406 -53085 -31120 -78047 -77921
454 -77921 -81561 -94428 -102636 -63430 -113763 -63672 -57870 -60910 -306 -44063 22247 27501 38781
467 38781 53516 66200 56393 83422 84678 27342 92703 16085 43044 24964 -26928 1259
479 1259 -44483 -33952 -58110 -55382 -83181 -32383 -74753 -47495 -13656 -68423 35081 -20054
491 -20054 23437 40273 31429 58290 56931 61364 39437 79939 10224 60025 1989 -3241 14602
504 14602 -67372 -9673 -72330 -58402 -75332 -66345 -88521 -62821 -57801 -89574 -135 -69820
516 -69820 13283 -7720 595 47874 14925 65513 38673 59277 30003 77346 9991 33512
528 33512 29157 -36591 40008 -65828 -20372 -48483 -59875 -47384 -68092 -54950 -64143 -22179
540 -22179 -73203 10356 -43462 1269 28775 -25233 61377 3660 44047 26271 37315 9890
552 9890 23289 6244 -30594 16521 -77518 -16339 -77080 -75290 -60488 -111875 -74688 -104170
564 -104170 -83152 -103333 -59401 -108115 -51158 -49507 -78462 -2257 -75837 -720 -29248 -27185
576 -27185 -14046 -31786 -20740 -36363 -30603 -77836 -20948 -93868 -60012 -71091 -114332 -57797
588 -57797 -111208 -74324 -95599 -76370 -80074 -52278 -56172 -54409 -11692 -50101 25548 -23711 6348
601 6348 24662 -2479 32525 10013 15793 4295 25478 -20516 16369 -14195 -24796 13613
613 13613 -47313 3114 -31443 -17656 -1007 -15737 -6016 5411 6806 5830 45617 -3186 47901
626 47901 35562 24766 58470 19937 43950 26979 29103 19631 18695 -4469 4775 -1981 -29381
639 -29381 2061 -44629 -20279 -21407 -38353 -25786 -27437 -27608 -19826 -13088 -34295 4292 -20571
652 -20571 -6905 -157 -21722 6167 -16666 -9881 -5341 -21872 -24683 -6493 -37301 -25424 -23370
665 -23370 -50426 -13883 -42280 -34518 -28432 -37041 -21688 -20349 -26719 -14865 -8526 -20747 13694
678 13694 -16481 3391 13097 -4578 16440 4006 4101 7645 14968 -5710 13271 -6955 913
691 913 16312 -20449 14235 -11759 1043 8705 -5719 -5481 7451 3245 -5755 21309 -22018
704 -22018 23022 974 -3811 16606 -15209 12540 -5082 1213 -10875 -706 -18906 1863
716 1863 -9394 -30610 10123 -38359 1306 -19154 -25009 -14582 -22152 -13158 -26604 -10125 -39943
729 -39943 1251 -35411 -16188 -15051 -42340 5291 -38533 -10300 -24498 -16442 -21762 -8114 -13336
742 -13336 -24177 10102 -34314 22880 -20491 -1056 7457 -13073 22795 -11619 10832 -4579
754 -4579 21466 -8982 17316 3472 -7346 37192 -21733 27511 -5866 16211 17646 6272
766 6272 20005 5985 35977 3236 44099 -253 37837 28940 8830 48432 -2381 40143
778 40143 11969 23622 7396 17891 8568 -1676 22093 -26749 26336 -25191 8270 -236
790 -236 -19475 12699 -22364 9419 -12688 12406 -19353 11304 -2676 -6847 21603 -28468 24415
803 24415 -17768 5978 -5705 -15711 -1260 -20805 -5510 -31636 70 -42131 -2987 -22634
815 -22634 -29752 2176 -37416 8931 -19514 250 -9059 6750 6202 6908 18411 -4273 41183
828 41183 -2139 32089 12023 6286 34434 1258 19542 740 18602 685 20749 -3372
840 -3372 4559 18471 -7972 31868 -7164 22562 17644 17162 29536 18703 29205 23181 41259
853 41259 13188 44140 19393 23295 33617 4845 29930 2107 12504 3067 3616 -6001 -2642
866 -2642 -5675 -12945 4909 -28523 5713 -11680 -5500 4540 -10534 3267 2153 6774 -4115
879 -4115 11987 -6050 9502 2055 -8055 9037 -17687 323 -10300 -14991 -12411 -15642 -22120
892 -22120 -12296 -15416 -25336 -4732 -23286 -2580 -6173 -9797 3111 450 5968 7602 8857 7357
906 7357 22943 3228 17512 12952 2595 21916 2677 5643 1849 3918 -1874 4054 -10174
919 -10174 -2355 3411 -10214 9318 -11614 6544 5712 2567 9900 6968 7499 10120 19235 -3581
933 -3581 22395 1289 8726 11497 -9301 9043 -10971 -725 -13569 -10149 -20333 -9760 -19529
946 -19529 -25037 -4136 -34175 -221 -22950 -13447 -6707 -13267 -1114 -11670 1750 -11370 9507
959 9507 -13872 6138 -2977 -10220 11139 -22616 8753 -13116 -5187 -10173 -6037 -7847 -9359 5566
973 5566 -20527 15611 -14558 12634 3757 -603 24255 -679 25581 7021 26746 13793 29602
986 29602 13451 17627 34787 -716 36923 -219 23831 12722 8351 17028 -61 18575 -3006
999 -3006 22911 -8017 19660 4149 4294 23093 -11330 26337 -2682 17593 2473 10137 6198
1012 6198 1089 12133 -15184 16544 -23117 7610 -14384 -14450 879 -29683 -3371 -27247 -7429
1025 -7429 -27794 -7233 -25051 -18018 -8004 -35029 3327 -35868 -3172 -21322 -18704 -8268
1037 -8268 -23654 -6741 -26285 -2622 -29184 -1943 -26371 -17228 -6384 -32087 1557 -28993
1049 -28993 -4982 -20825 -6094 -11329 -9621 -61 -16728 14111 -18508 14996 -7587 2054 12378
1062 12378 -7792 14598 -4325 13465 -2529 13338 -1909 7524 8547 -4462 18021 -12058
1074 -12058 17800 -2718 5209 9769 -2286 10760 1483 12203 -4430 18229 -4253 9245
1086 9245 8122 -5422 15019 -8809 10040 -4739 1790 -2627 -324 -4210 -8864 2383 -18874
1099 -18874 6575 -16653 -5966 -4402 -14581 -1205 -10343 -4034 -11412 431 -10700 1161 -9568
1112 -9568 -8407 1598 -14723 4584 -11346 -3107 -1167 -4714 -5381 -5585 -2408 -4953 3492 -12032
1126 -12032 4379 -2319 542 3694 -3827 10803 2367 6042 4287 9252 3434 12234 4026 5628
1140 5628 15640 875 11466 5310 6781 7191 5742 3191 6268 5133 -357 10640 -5651 8749
1154 8749 -207 -483 7195 -1899 1804 1645 3264 -4234 7009 -10283 1932 -2787 -9648 2525
1168 2525 -13768 -787 -13091 -8539 -11212 -8675 -12241 -13253 -6088 -21660 -2862 -20183 -9162
1181 -9162 -11432 -14611 -5466 -15700 -5173 -15214 -607 -11563 316 -8565 -6950 4609 -13357
1194 -13357 5249 -12174 5182 -1611 -1886 1229 -333 8683 -4368 12745 -5225 16069 3697
1207 3697 8098 17981 2850 23294 2178 21198 10626 20108 10848 16496 20370 6458 30146
1220 30146 504 24675 13275 15132 18321 8471 21842 7353 23504 1302 23064 6349
1232 6349 13935 16690 -1789 24255 -1951 16785 231 9126 4886 3993 7237 -6674 13160
1245 13160 -12308 12975 -9575 -331 2837 -12354 8870 -14572 3402 -12318 1690 -10564
1257 -10564 -4358 -2983 -15088 5734 -20811 6947 -15015 -3875 -3983 -12198 2080 -14405 2599
1270 2599 -15261 5147 -12742 1833 141 -8079 12316 -12230 11976 -5652 7999 3244 3717
1283 3717 9221 -345 14771 -6011 20642 -3326 11432 9413 294 17544 -1679 16296 2677
1296 2677 15780 2403 10675 9465 4678 17601 -2892 21650 621 16339 10613 4374 14858
1309 14858 4987 15359 824 15172 -2779 12474 3482 -1227 8219 -8606 10291 -6023 2558
1322 2558 -3101 -2718 -159 -1315 2221 -8016 10225 -8664 6975 -115 -2469 7118 -2006 6467
1336 6467 -2964 6373 -1791 6666 -1827 -160 1269 -5417 9889 -7735 3604 -102 1611 4213
1350 4213 679 4570 5376 12207 2685 13547 7328 13065 13901 7801 18885 9175 18280 12705 14436
1365 14436 10513 15652 9785 9667 15248 1858 13795 2841 7441 6251 4541 5760 4850 5720 4795
1380 4795 10093 1074 11593 3645 6674 9646 1589 8795 2859 3185 467 2655 -4389 1221 -4957
1395 -4957 -8234 -2784 -13952 -4580 -14963 -10390 -12984 -12969 -11243 -10730 -9970 -14849 -2714 -13634 -3504
1410 -3504 -8430 -5954 -833 -7726 -1342 -7464 -32 -5722 653 -6668 -2428 -1731 -11516 3495 -12418
1425 -12418 -470 -5753 -3406 -1605 -4204 1398 -2484 10218 -1238 12738 3562 11789 14129 7201
1439 7201 21581 5365 19823 10980 18036 10123 14684 13243 7873 17581 -1144 16881 2714
1452 2714 10362 6736 1262 11899 -440 13108 -1040 13030 1605 10898 7889 2666 17393
1465 17393 -1823 18223 1235 10520 4994 3617 5778 -2245 7504 -9641 6803 -13171 -407
1478 -407 -6923 -12397 290 -18056 -1170 -13137 -3393 -12279 -3814 -4298 -8010 3285 -13752 8072
1492 8072 -10239 4819 -1011 -2786 6312 -5819 6762 -7835 7241 -7874 3115 -3707 -6119
1505 -6119 3482 -12139 7213 -10027 2852 -3081 -269 2821 -3149 7865 -3786 14076 -2024
1518 -2024 13537 4770 5116 15331 -239 15274 80 12549 1474 8805 690 403 5418 -6575
1532 -6575 8518 -13212 4191 -4659 -4638 -627 -9378 1776 -7364 3120 -8495 4123 -4728 -2121
1546 -2121 3992 -7873 7757 -8247 4922 -3981 -681 -1902 -4189 -834 -8488 1310 -15711 620
1560 620 -11518 -7561 -3914 -11933 -431 -10372 -941 -6823 732 -2967 1748 3082 840 11584
1574 11584 -1052 13174 4179 10567 12271 7140 10908 5399 11150 4308 12164 3703 8861 6530
1588 6530 3486 9880 826 11212 4626 9505 6864 10485 9519 10019 14549 7761 17382 7062 15294
1603 15294 12072 10484 13164 7935 12089 7815 9008 2819 6867 -547 2356 337 -5070 2472 -7311
1618 -7311 -2532 -6073 -3489 -4367 -3459 -6086 -3261 527 -5446 2736 -5417 1871 -415 -1850 476
1633 476 -1909 260 -2321 267 -8063 -1257 -6837 -4513 -4944 -9819 -4112 -9617 -3854 -5689 -2586
1648 -2586 -5962 -1273 -934 -1428 7301 -1787 12231 4006 8497 9558 8087 12347 9656 12195 5824
1663 5824 15389 5248 11041 7398 5418 11117 -330 11739 1315 8250 4898 8165 8582 5205
1677 5205 10347 2322 18317 4775 15410 8657 10211 14868 6689 15686 4077 13353 3575 9811
1691 9811 4586 1293 6183 -5768 9909 -8058 1704 -4437 -3772 -2133 -6714 411 -7309 5197
1705 5197 -8007 7208 -2817 1542 7297 -2993 10912 -4157 8700 1078 6910 763 1379
1718 1379 4596 -5983 9979 -8894 5387 -2997 -565 2412 -6298 5957 -4296 6639 -3529
1731 -3529 10255 1954 8407 11849 2674 17609 2271 19627 7257 13799 11784 9323 14691 4007
1745 4007 17332 269 13513 3345 6311 8125 -1150 10319 -4141 10045 -1138 7433 2996
1758 2996 3206 6665 1010 12560 -2459 14105 122 7584 6968 600 8532 -260 8349 -5519
1772 -5519 4357 -4977 -109 -1572 -8888 1623 -12125 818 -11898 -2946 -6775 -6460 -804 -7724
1786 -7724 2819 -7560 6837 -2761 4139 4791 908 9223 -1535 8661 996 8745 2710 4724
1800 4724 3409 501 6773 -3656 8123 -887 5365 3863 3749 8130 2676 11026 4454 13237 4604
1815 4604 12333 10341 13436 15652 7931 19234 8795 16035 11887 11544 10895 9124 10761 5571 11378
1830 11378 577 9859 2234 4076 5226 70 5226 -135 3792 -132 2967 -2706 3198 1835
1844 1835 167 4926 -3956 4489 -1681 -545 -1848 -259 -1359 -3165 -1576 -4804 -2520 -8034 -3510
1859 -3510 -8348 -8125 -5411 -9457 -6824 -9898 -4729 -7906 -3305 -7334 -2340 -1880 -3874 1889 -4529
1874 -4529 2096 -374 2493 1639 2812 1819 2161 4796 -1437 6232 -67 3549 2174 -397 3191 -1238
1890 -1238 2796 -1849 6822 -909 5743 1500 2791 7260 -337 10443 1147 10448 5812 8870 7068
1905 7068 5494 8518 3364 10279 -60 8194 866 3342 3726 -2241 5468 -4795 1913 -5314 567
1920 567 -4824 -1944 -952 -7089 5199 -6872 4882 -3318 1068 1255 -607 3783 -2984 7396 -4071
1935 -4071 6748 -3172 1039 2888 -4484 6171 -6635 2514 -7148 1567 -4448 -2890 -232 -4265
1949 -4265 7222 -5372 7661 -3426 6822 6461 4695 11624 3990 15462 3936 15072 6433
1962 6433 11512 10975 5640 15059 298 14978 2511 7456 2784 3171 7230 -1535 9555 -4267
1976 -4267 9600 -1201 5988 4672 2247 12406 -988 12001 895 9869 4503 6348 6212 1122
1990 1122 8364 -3729 6979 -7406 2219 -3919 -5290 -1810 -12605 -1739 -12282 -2104 -12285
2003 -12285 -4254 -7143 -8988 -363 -10653 4032 -8968 2151 -3389 -1853 1224 -3905 4255 -4997
2017 -4997 6091 -6865 3517 -2942 -3516 513 -8028 2496 -9912 240 -6560 -2508 -2327 -2308
2031 -2308 2847 -3212 9204 -2012 11204 3592 8131 10674 6809 13801 6725 14697 6361 12278
2045 12278 7534 7725 9488 1712 9030 -824 6994 343 2031 1799 -457 2956 -13 6357 -501
2060 -501 7205 1556 6157 5741 3556 10806 2830 9403 4174 7722 3631 5313 3130 -82 2989
2075 2989 -3608 180 -6993 -2481 -6339 -4666 -5211 -7718 -2880 -5206 -866 -4359 2028 -1064 2766
2090 2766 4217 172 7401 2585 8120 4660 5408 4457 5562 4643 2702 5292 -787 5207 -677 3637
2106 3637 1161 1133 2251 1921 5276 1482 9881 3578 10475 8948 9190 12694 8395 15871 9356 15772
2122 15772 9433 14445 10367 10852 10032 4879 9941 2211 8317 360 2391 1976 183 3531 -1129
2137 -1129 4391 -2837 5965 124 4160 4249 363 7493 558 6578 -346 5086 563 1562 1063 -2524
2153 -2524 2261 -6423 2589 -8057 -3432 -4901 -7506 -3778 -9682 -2312 -9437 449 -6539 -268 -3298
2168 -3298 -3271 5125 -5728 7525 -1669 6335 1574 3340 3759 1364 7426 -2188 7186 -2598 4692
2183 4692 621 326 4871 -2541 7291 -2869 7398 -527 6000 4287 4564 8976 1477 14969 1269
2198 1269 12652 6057 7449 9261 2991 11909 242 9786 -1667 7764 2050 994 5186 -4534
2212 -4534 6867 -6627 3748 -5120 1365 -29 -2401 2493 -5118 5277 -5806 4399 -3799
2225 -3799 -788 2171 -5371 3693 -7137 2608 -6611 587 -3898 -3689 -873 -6880 2180 -9464 1797
2240 1797 -6939 -3247 -2235 -4356 778 -5570 4689 -4041 4819 -1874 2141 3677 -650 8728 -1372
2255 -1372 7515 582 6115 3341 3182 7443 1944 8078 -404 8590 1360 6044 5142 2108 7845
2270 7845 2080 9765 2265 8315 3958 6815 5660 3483 9078 1395 8962 2633 8070 3727 4151
2285 4151 6002 1611 7163 278 5974 -1317 4308 1585 199 3312 -2414 4919 -3270 931 -2837
2300 -2837 -192 -2399 -2417 178 -5156 1144 -4759 -405 -4427 -3491 -93 -5285 600 -4370 1348 -4004
2316 -4004 1151 -2221 714 667 -2666 2342 -2072 1806 -1531 2487 -329 1235 -1221 -99 2159
2331 2159 -3642 4649 -798 2628 1719 2144 4291 2609 4680 2086 5669 154 7238 3797 3492 4990
2347 4990 1640 6325 2717 4555 -374 4646 2135 744 -522 -256 3791 -4003 1207 -1745 1251
2362 1251 -259 -2327 431 -3231 1606 -3127 1622 -2541 1869 -369 -2639 1601 -4418 783 -3956
2377 -3956 -578 -5753 -3765 -3355 -6020 -3200 -7927 -1169 -8488 -3400 -5189 -4384 -971 -4026 1411
2392 1411 -4543 3560 -1692 4694 -180 2652 6226 39 8705 193 6620 1607 3764 4133 1770
2407 1770 6783 -694 8614 -1109 6146 2434 5185 7211 2693 9753 806 11095 5164 9323 7843
2422 7843 8528 10585 5818 13832 3714 11687 5197 7708 7053 2900 6899 105 8160 -1713 4940
2437 4940 -1941 1467 1343 -3542 4280 -5001 4895 -3296 1544 675 236 2588 -1753 3590 -4422 6020
2453 6020 -2686 1378 -691 -3237 929 -5829 1981 -7304 -1813 -6549 -2865 -2983 -7068 1034 -8829
2468 -8829 2396 -7468 -219 -2308 -1917 2818 -1240 6128 -601 7116 244 6307 3124 1941 7822
2483 7822 -2056 7265 -1472 4484 699 1078 2123 897 3584 -2397 6691 -1454 6179 1768 2492
2498 2492 6488 2472 8381 1315 6813 3144 7374 4963 3878 6761 1001 6537 -1399 3448 -431
2513 -431 321 338 -3125 320 -3411 1591 -5584 -33 -4185 -3141 -1815 -4109 1455 -3976 2406 -1936
2529 -1936 1768 -839 -96 962 -2327 1290 -4683 1216 -4201 -2183 -3322 -4496 -2128 -5201 -1498
2544 -1498 -4873 -1558 -3680 -1024 -1678 -3284 2419 -1813 4380 1367 5013 2421 4250 5299 3576
2559 3576 6537 3465 6755 2186 5863 3354 2104 3695 -27 4028 1023 3059 1108 5081 831
2574 831 2260 3614 2755 6223 2186 6324 3685 3943 3348 4377 4366 2496 5162 1892 5941 721
2590 721 2574 366 -1317 985 -2632 121 -3624 -1032 -4037 -1170 -1377 -2358 -703 -4247 68 -3618
2606 -3618 781 -1752 -409 -692 -1523 -386 -1888 1961 -3828 292 -2984 -2031 -1079 -2861 127 -5140
2622 -5140 1395 -3106 884 -2985 0 32 -1499 3518 -2477 4748 -669 2534 1357 2373 4223
2637 4223 1355 6998 1528 6361 1031 4794 4520 172 6038 -2350 5416 283 3952 1015 1566
2652 1566 1638 -955 4626 -3652 4211 -676 3221 1721 1322 2218 -2750 2941 -2542 3120 -3399 545
2668 545 -2062 -2942 1223 -5538 799 -7088 -490 -4445 -3726 -3942 -5889 -690 -7994 363 -7051 -1523
2684 -1523 -5477 -3667 92 -5410 291 -6581 324 -4196 -1245 -2633 -3533 5 -4294 2651 -5318
2699 -5318 148 -2132 -562 390 -3049 4175 -2921 4629 -1264 2575 630 388 4291 -719 5433
2714 5433 -1637 5153 180 2697 2619 1707 4793 783 6102 185 4286 1875 3052 3159 542 7773
2730 7773 -365 4743 -1217 4154 8 1156 2639 -3094 3947 -2388 3013 -3225 -172 149 -2192
2745 -2192 426 -2702 949 -3555 1656 -1897 -725 435 -2955 944 -5436 1365 -3653 1045 -1384
2760 -1384 -1841 305 -3445 29 -3199 50 -2191 484 -1396 -2514 460 -3845 2063 -952 2372
2775 2372 -254 2074 2191 1153 5204 1062 5544 1069 5148 2801 2513 4005 2997 4949 1785
2790 1785 4169 1115 4942 1698 4470 5238 2126 2599 1892 4531 1681 3320 1760 3141 3490 1864
2806 1864 4442 752 4210 1148 2216 1448 355 2365 -616 389 -1121 791 -2431 -886 -3701
2821 -3701 -3802 -2962 -4194 -2264 -5089 -1625 -4748 -1431 -3180 -3702 -1815 -2573 -622 -3938 731 -2771
2837 -2771 -816 -2178 -3460 -1058 -2513 -99 -4815 -15 -3599 -1656 -2464 -3254 643 -2118 830
2852 830 -1949 1220 -1702 1886 1551 1353 4160 508 6744 1232 5412 3493 3159 4503 2753 7611
2868 7611 1222 5954 1141 4950 2384 921 5237 1335 5754 -1193 3306 286 4892 4054 1406
2883 1406 5475 221 6424 -509 6008 1971 3180 5348 420 5145 -1712 3558 -2217 1108 -994
2898 -994 -1640 127 -2784 1677 -5511 1909 -4133 -437 -546 -1539 454 -3772 2960 -3497 1131 -1468
2914 -1468 1054 1106 -3248 3317 -3831 3531 -2453 2450 -2151 -660 1665 -3231 3305 -4725 3466
2929 3466 -2043 2698 739 -837 3779 -1780 5786 -345 4916 1184 2748 3029 652 6138 -869
2944 -869 7758 -744 4108 2363 2881 5198 -745 2917 -1604 5775 -1299 2132 -276 -1419 3582
2959 3582 -2244 3360 -1684 2288 -208 1376 762 -458 2928 -3531 2402 -3084 -191 -2792 -1213
2974 -1213 -280 -4863 -849 -4965 -513 -5069 -1413 -3678 -2959 -2098 -5078 648 -5783 -309 -2903 84
2990 84 -308 -1199 -788 -2665 2778 -3639 1532 -1188 183 1137 -1203 1017 -2329 1417 -1566 1611
3006 1611 784 580 3387 -1394 3395 783 2973 1427 3167 3829 1348 3868 1728 4944 1245 3250
3022 3250 1154 2762 2287 523 3439 969 3200 -1030 1635 -474 289 188 -543 2707 -1763 1305
3038 1305 -348 600 -691 340 -1059 -641 273 -1209 1548 -3061 -860 -3501 -1728 -1537 -2460 -1059
3054 -1059 -3633 -1291 -4287 -1719 -3037 -2702 -2265 -2967 -516 -3616 -635 -2645 -964 -2022 -2167 -482
3070 -482 -1775 -333 -1564 1246 -2581 949 169 -616 1369 -1859 2259 -1237 2280 -239 2615 1194
3086 1194 507 2623 -961 4488 479 5034 447 1660 2642 2263 3819 -55 5115 -293 3888 1990
3102 1990 1623 1908 56 3372 -1511 3222 125 1601 720 -987 980 -1948 1751 -2912 1763 -1683
3118 -1683 475 -1069 -1437 1804 -5040 218 -4106 -311 -3862 -1916 -1828 -4807 -699 -5894 352 -3975
3134 -3975 -1688 -1318 -2854 -595 -4422 -32 -4491 -148 -3780 -2218 -1768 -3430 145 -2977 1725
3149 1725 -2739 1352 -1648 348 658 -2128 3774 -1606 4156 -714 2907 1027 1507 3820 -298
3164 -298 4715 -760 3674 731 3186 1967 862 4004 -1007 5206 -437 3163 -181 2137 1510
3179 1510 -1192 3268 -1099 3744 -1597 1328 -945 555 1475 -2157 1435 -1767 1416 -396 -118
3194 -118 -502 -755 1358 -3221 -22 -4564 458 -3911 -1159 -1689 -5133 817 -3047 -106 -4692 37
3210 37 -2794 -1668 -1148 -3021 526 -3906 1423 -2341 173 276 138 1328 -1475 1521 -3092 2364
3226 2364 -1624 2178 306 -1576 1451 953 2669 -610 2453 537 647 2860 56 3935 361
3241 361 3392 1736 3220 1753 2187 3796 -252 4972 1227 3502 418 1863 899 601 3632 265
3257 265 1825 -705 1754 -54 1317 445 -913 2055 -163 3117 -2178 597 40 -489 326 -126
3273 -126 -471 -2636 -355 -1897 -1014 -2672 -2774 -2323 -2862 -1974 -3174 -331 -3783 -1178 -2201 -1523 -1191
3290 -1191 -2061 99 -2345 1502 -1327 -16 485 -211 691 88 1565 -1305 2187 -423 1203 1244 404
3307 404 1002 -1112 2819 -715 2188 410 2696 1027 1807 2891 357 4914 270 3770 1404 2656
3323 2656 2848 1104 5038 694 4045 658 3214 -966 2244 1188 -114 3782 -2578 2516 -2225
3338 -2225 2737 -368 -602 1247 -178 2917 -1805 1301 -1569 -329 -2143 -2023 855 -2194 144
3353 144 -2086 612 -3610 -2434 -1975 -2561 237 -2827 679 -3741 -158 -3517 -1580 55 -2273 1231
3369 1231 -3376 999 -1616 2362 113 442 1944 -1572 2208 -1354 2185 542 1293 1894 -222 2037
3385 2037 -1658 3497 -246 3367 584 1174 2041 -3 4412 -110 4192 1207 3916 1403 2045 2166
3401 2166 714 2753 -409 3406 -154 838 1652 -536 2279 -694 3057 -2059 1745 -1582 -67
3416 -67 926 -886 1868 -2189 1265 -2156 290 -1286 -1724 -1324 -1452 1509 -2967 2149 -4004 -652
3432 -652 -2003 -3164 812 -2952 1265 -4060 -89 -1663 -1993 -865 -2110 -6 -2742 1629 -1465
3447 -1465 986 -258 -832 1655 -557 2365 -931 1884 -486 1861 1329 -173 3162 -1413 2641
3462 2641 -993 1294 288 1865 3164 953 3724 530 4387 411 3655 730 1201 2110 1031
3477 1031 4396 1009 2907 -1572 497 -796 971 1046 -330 222 -1445 444 -1197 919 -645 -1367
3493 -1367 -1298 -2768 342 -2468 -2293 -2423 -1683 -2503 -2483 -992 -4850 -766 -2976 -890 -3084 -2189 -2237 -2854
3511 -2854 -232 -3111 -939 -3274 -1411 -1694 -2690 250 -1714 294 -1632 86 -1586 973 -955
3526 -955 -2583 984 -756 1022 -697 2222 806 1553 1035 -210 1443 103 3569 -847 2508 955
3542 955 1312 1119 850 2178 1208 343 801 2873 704 1259 1348 884 3455 -422 2823 -1401 2097 -543
3560 -543 -997 1029 -1361 1263 -1657 2346 -2879 -1208 -1242 -259 -1364 -2639 -593 -2132 39 -1990
3576 -1990 -319 -2320 -1392 -1312 -2095 120 -3842 -500 -881 -642 -2340 -1823 -1063 -2381 -27 -3050 -70
3593 -70 -2602 73 -15 -821 1111 -3146 732 -1828 1453 -82 1029 -1 189 1322 -1491 3561
3609 3561 -924 -627 1051 440 2299 172 3766 -35 2468 675 2988 1374 -866 3160 -822
3624 -822 3044 -327 1946 1919 1503 1234 379 3963 -1137 2847 -1711 1151 383 -64 1017 -2323 1878
3641 1878 -3014 861 -728 27 -620 -1506 166 -4051 -63 -3301 537 -2481 -350 -1168 -3080 -1176
3657 -1176 -2218 -277 -3090 -1525 -1751 -675 -190 -2970 572 -4644 1214 -2243 -96 -1065 -2266 2097
3673 2097 -2945 671 -1994 2001 -289 756 861 210 1289 -1011 2532 309 3061 1617 1237 2538
3689 2538 112 4349 -120 3574 756 3378 708 2222 2831 -173 3405 931 3155 577 950
3704 950 3198 -956 878 -920 1541 -838 1943 588 -845 694 -1355 688 -2050 746 -1115
3719 -1115 771 337 -512 -1046 -2523 988 -1416 483 -1822 -358 -998 -1831 -401 -3372 -595 -1692
3735 -1692 -398 -2454 -895 -1223 -2430 -526 -2263 -441 -1097 553 -2295 -1588 1114 -1855 -974 -2592
3751 -2592 1026 -656 1646 331 -68 -397 -8 1222 567 1424 95 1517 856 1118 1751 726 4104
3768 4104 930 2914 1407 1779 1739 1721 3284 1395 2732 568 1703 1142 2682 953 215 1890 817
3785 817 1933 -155 1635 -940 -203 -42 46 832 -888 1814 -2507 -131 -1224 -1362 -357 -949 -620
3802 -620 -1180 775 -2464 -1856 -314 -707 414 -1860 135 -1979 653 -2657 -816 -1862 -2085 -1256
3818 -1256 -2023 292 -1738 1031 -2124 -325 534 502 1031 -1384 1343 -1177 1481 -496 168 865 143
3835 143 2768 -408 1304 -893 2433 731 1636 1312 887 1849 909 3128 292 1734 598 2639
3851 2639 3158 -484 2675 358 2844 -616 2141 2029 543 2408 -1168 2629 -1907 117 -739 220
3867 220 849 -405 467 -2817 1202 -2418 25 -2535 -1610 -1753 -2471 529 -3801 322 -2494 -309
3883 -309 -1821 -2413 1057 -3149 -278 -2932 -431 -1514 -1930 115 -2471 940 -3100 448 -1079 949
3899 949 881 42 2482 -3096 1565 -2429 801 216 1846 1020 177 2276 -905 1655 -606 3043 129
3916 129 542 2655 -287 2498 1101 2974 -530 1200 1733 160 1603 401 3603 -407 2649 -78
3932 -78 996 906 -1402 1781 -1150 1816 -571 1076 -748 197 -1343 -1013 311 -1371 339 -1712
3948 -1712 300 -1085 -817 -700 -902 -4 -1159 37 -1841 511 -2119 -1684 -188 -3558 51 -2019
3964 -2019 523 -1633 287 -1418 -1695 -528 -1821 768 -2137 -179 -1357 286 -165 -1089 974 -375
3980 -375 1839 -1484 328 -102 242 2017 -450 2002 -556 2532 930 1860 546 1261 1628 8
3996 8 2204 -599 2377 -342 734 1423 1090 1829 721 2317 840 2077 -970 66 1439 -87
4012 -87 1025 -252 110 -218 88 -710 -1234 -689 -809 -402 -1677 -535 -1275 -504 -1880 -1415 -1218 -3403
4030 -3403 -443 -1655 10 -2137 -449 -2021 -116 -688 -1250 70 -3484 -1027 -900 -189 -1281 601
4046 601 -9 -1621 960 -1895 2933 202 718 250 842 1563 -1092 1476 -1264 1914 449 1879
4062 1879 1792 -347 1861 1572 3910 57 1728 69 1261 1366 129 2878 -818 2253 -339 2314
4078 2314 390 912 1304 -1562 2047 -1010 1575 -586 370 815 399 603 -2227 1073 -1713 1605
4094 1605 461 -429 -1558 -1894 1211 -961 330 -2096 -775 -1041 -830 -456 -3144 143 -2138 -301
4110 -301 -3313 53 -815 -2634 -388 -2633 126 -2084 1454 -1714 -716 -207 299 1754 -1482 2146
4126 2146 -1416 1290 153 32 1693 -1038 2497 -250 2246 -190 2201 1985 -208 1705 -568
4141 -568 2254 -778 2692 -25 598 1224 1020 2481 -120 2417 1126 1554 -71 2008 1437 217
4157 217 1479 -399 2965 148 1670 -473 -117 696 -2013 1245 -2927 1248 -1307 -396 -321 -319 995
4174 995 -2394 1635 -2549 514 -2240 -1104 715 -1588 -377 -3153 311 -2649 -34 -865 -116 101
4190 101 -1211 -698 -2301 515 -2473 -322 -390 -412 156 -1006 -521 -706 827 749 937 1394 1538 1542 -387
4209 -387 3194 39 1893 1869 1996 1447 668 3142 -670 2414 337 1918 1734 920 938 431 1443 -803
4227 -803 2852 -110 1611 242 617 1461 -1701 1298 -282 1055 -231 188 383 -952 53 -270
4243 -270 470 -1092 -251 -2432 166 -851 -1976 693 -1446 -1149 -1969 -547 -1690 -1532 -889 -2094 281
4260 281 -1462 -1381 -1440 -851 -1335 -289 -647 -1349 -1118 -606 1612 -1566 428 -2536 -671 128 17 1988
4278 1988 -1274 796 -293 475 131 1059 606 2187 2222 -250 2826 696 1860 2580 -953 2619 -283
4295 -283 2026 9 2052 888 2018 1733 1287 1920 123 2235 75 1464 -830 -32 623 -34 783
4312 783 -474 1862 -1766 125 436 -114 832 -1475 943 -317 1014 -182 1171 341 -1214 -570
4328 -570 -2943 953 -1766 -1300 -1796 -1844 139 -1869 -162 -1861 -9 -3518 45 108 -2692 304 -2189
4345 -2189 -124 -2535 1434 -1389 -1469 -940 -669 1105 -691 1223 -1173 1568 -991 104 976 -38
4361 -38 1560 2 838 815 2472 -1015 2353 1266 -610 1784 -474 1996 1029 1817 825 583 2060
4378 2060 -1078 1781 -288 2327 280 168 392 -674 1188 427 1346 -1569 266 -1764 -452 394
4394 394 -924 -298 -1976 666 -1661 334 -1502 -669 1882 -2714 -187 -3754 -170 -804 421 -772
4410 -772 -767 -419 -2497 -860 -1596 -530 -1751 -512 -502 -1980 681 487 962 -1178 -799 -1052 312 -1010
4428 -1010 -280 577 -1658 1457 67 356 2058 368 2232 477 1137 -418 1091 -457 1690 -8
4444 -8 622 2900 -832 1230 -1032 278 -87 -45 1177 963 1497 718 1131 823 -478 -577 -370 979 -1111
4463 -1111 1953 -168 -1420 -888 -739 376 -1157 -659 -3059 -771 -1525 -351 -2209 -2391 -626 -785
4479 -785 -2091 -1653 112 -950 -342 -1577 -906 -899 -1436 -1779 -1948 383 251 -457 523 -704 -9 -1399
4497 -1399 -744 -748 1405 -1780 306 -796 -20 371 -1134 671 -776 772 701 1174 -163 1471 2119
4514 2119 232 721 1335 886 -580 767 216 718 1996 91 1402 -863 1756 1292 376 537 -131
4531 -131 558 328 1363 -986 1433 252 985 710 537 555 -814 1198 -1755 756 -601 -692 -499 -1586
4549 -1586 1083 -1262 -318 -2438 79 -2427 -427 -1143 -1947 -751 -410 -606 -2156 -524 -654 -1301 -1011
4566 -1011 -1345 1116 -3003 -436 375 -801 -114 -999 1259 -1654 772 -38 672 400 -1203 1426 -1307
4583 -1307 1850 -744 1487 -474 1389 528 -100 1103 165 1746 577 2707 -933 146 -386 407
4599 407 1340 415 939 -1055 837 -1126 -12 974 1062 991 -1149 624 -1213 644 323 -45 903 -345
4617 -345 -200 -2340 -399 -1133 -389 109 -1839 402 -2665 1299 -2111 1392 -841 -332 -1088 -1504 -355
4634 -355 -3039 666 -3083 -1697 177 -874 -637 -773 875 -1222 -437 -1447 -295 -325 -35 554 -1228
4651 -1228 -57 -968 187 599 316 1773 979 2191 -270 774 -1254 1612 995 561 1107 -549 546
4668 546 -205 2137 1542 1341 1535 1344 1266 1528 2450 -304 1442 -234 1200 1831 305 1438 109 2530
4686 2530 -704 485 -521 1188 407 -1286 599 -824 -349 -2099 -833 -953 -640 632 -1175 -355
4702 -355 -948 685 -999 -397 -554 -1869 -845 -1482 -600 -1184 -344 -2078 -705 -1351 -2060 -794 -1467 -735
4720 -735 -1345 -638 -2885 -908 -4 110 -1420 -802 1623 -1119 788 1072 1016 -68 -860 1696 -47
4737 -47 -696 90 332 2065 1601 879 1198 1484 -340 2589 743 1171 -515 826 1031 -559 712 -427
4755 -427 970 -240 -816 1509 1569 207 -223 1346 167 -23 -188 -183 -74 -164 -40 -103 2189 -1153 1216
4774 1216 -936 -788 -1117 -530 696 -634 -498 -1463 -144 -1034 -1240 -1601 -34 -1090 -1533 1105 -1330
4791 -1330 -719 -179 -1121 677 -1615 1802 -1643 1007 -1671 -168 -594 -985 -309 -165 1822 -700 -103
4808 -103 358 1182 249 923 1018 -322 1981 222 1009 1372 530 1143 41 1125 143 1133 -79 1935
4826 1935 221 -248 599 -1055 1616 -555 1138 -87 346 875 -815 2059 -467 1112 -66 1461
4842 1461 -1286 362 1034 -763 448 -940 87 -1120 -228 -1256 -1721 -23 -431 -103 -1224 -946
4858 -946 -1459 -581 508 -695 406 -2145 390 -2004 -321 -1182 30 -726 -933 460 -677 261 -231
4875 -231 -718 -496 -345 697 -364 1429 -2102 1232 712 23 1418 -151 2219 153 1605 -345
4891 -345 665 2215 844 1207 239 3331 132 2112 822 84 1042 496 963 -491 1446 302 1588
4908 1588 496 488 -14 601 1053 -856 979 -189 135 430 -612 773 -1241 193 -1969 -578 -1020
4925 -1020 -58 -648 -1027 -693 -2073 -1309 -1223 -1954 -2689 -117 -413 -1075 -1519 -1396 -537 -1883 804 -920
4943 -920 -1671 36 -1793 668 -772 -48 -7 -516 108 -477 970 -919 248 -558 250 -162 264 7
4961 7 335 608 -1322 1588 422 -23 105 278 -407 1601 2085 1046 1727 813 470 389 1273 730 496
4980 496 1403 554 1788 310 1070 -1057 1027 463 135 347 -880 -524 -786 820 -829 -290 -824 179
4998 179 -764 -1271 -522 -494 -70 -209 -857 896 -672 -649 -892 -1073 -1542 -995 -1702 -567 319 -854 -545
5017 -545 -1815 1101 -1150 601 -724 -660 233 -209 1037 -367 1184 -214 662 312 95 885 -1610
5034 -1610 1226 883 1758 -976 589 368 -1028 1734 -419 906 -746 956 242 1045 703 -35 2125
5051 2125 568 953 1955 1504 -830 784 940 -1321 944 427 935 -1452 212 -380 -96 92 -2198
5068 -2198 -174 -1684 2127 199 342 -57 885 -657 -1779 157 -662 -1606 -643 -848 -405 -491 -609 -2364
5086 -2364 43 -856 -154 457 -1292 539 -1170 -219 -1384 478 -742 -243 269 -654 221 -129 2568
5103 2568 -134 769 -277 -197 547 71 1517 -515 334 1679 4 117 256 2312 1545 277 -716
5120 -716 2070 -622 -295 -753 346 1184 -1079 1169 71 2320 -160 538 1848 495 -136 209 701
5137 701 96 -251 -615 216 1254 -366 1054 -617 238 -655 -458 -823 -383 -95 121 903 -1798 386
5155 386 17 -1203 -518 -1035 -449 -715 -962 -1176 -1094 -607 -951 -760 -741 749 -670 2362 -666 -941 -612
5174 -612 -1013 328 530 44 -123 342 -265 263 -1293 -607 73 112 261 513 332 -434 1967 874 -232
5193 -232 967 -82 1010 -1146 1518 1310 -9 1020 -561 882 -218 2116 -1401 147 680 -372
5209 -372 -239 216 600 661 -797 -875 426 -117 -808 729 -852 1974 168 -101 263 -1868 -444 394
5227 394 122 -561 -101 -563 471 -927 297 -1566 101 -1422 -1712 -222 -1339 -867 -1511 -580 216
5244 216 -1687 -643 -751 645 -1240 473 -98 189 -500 -52 1431 -378 449 41 616 624 800 118
5262 118 -683 735 -145 889 918 -277 662 -458 439 329 1761 624 1224 -636 916 778 -207 636
5280 636 1448 -99 -393 1281 875 275 -431 -605 212 -1079 735 -668 585 -192 -187 -344 -547 200 -1452
5299 -1452 261 -1661 -1162 -706 91 695 -901 42 -2590 52 -601 -813 -149 -1981 -244 -2226 -441
5316 -441 -1454 -1167 -1261 -778 694 45 1088 -1623 436 -1405 -312 426 335 523 54 1079 -315 897
5334 897 -240 208 600 19 178 -275 2140 -211 995 992 -257 1295 612 829 973 268 937 1409 730
5353 730 408 704 -1401 1814 -688 805 -1388 534 1153 299 865 -890 1034 -65 -1707 -1286 693
5370 693 -1688 -974 -825 156 -357 -1754 -532 -597 -874 68 -727 585 -632 116 -1451 -313 -651 -1073
5388 -1073 -1 -43 408 -2424 -410 -2028 854 -1156 -1453 816 -527 56 -1217 -33 -435 -592 702
5405 702 -688 175 -305 850 -131 -72 799 -21 953 -1104 -321 -542 1324 2070 727 345 662 46 726
5424 726 1463 623 1452 1315 -332 295 -1449 53 1221 1249 -854 -991 -782 -186 630 281 528 -1566
5442 -1566 311 484 464 -78 798 127 1082 1629 -1638 1510 -23 -483 -780 -859 -1642 -1702 -1158 -205 -62
5461 -62 -1477 -622 -330 506 -153 -1233 -951 101 550 -1191 -731 715 -225 264 -1150 -115 -872 651
5479 651 -359 462 -612 -34 1267 372 1470 -587 988 540 -41 -118 401 1726 726 2082 1110
5496 1110 1634 944 -75 2156 738 1978 772 660 125 2280 -618 827 1164 338 604 -88 1050
5513 1050 708 593 828 -758 -66 -979 -487 -66 -873 1207 -1645 -623 -1991 1293 -200 -1525 -819
5530 -819 580 -582 -1048 -132 -599 -261 -1423 251 -600 -95 -828 -979 235 -1951 1191 -152 549
5547 549 -1177 -813 725 -279 454 -85 -283 -780 -818 -851 -104 -117 41 518 -604 599 -649 266 132
5566 132 747 2054 396 259 935 1730 574 567 508 1062 219 -344 1905 -466 1341 -99 -1361 1352
5584 1352 -1393 1503 -1055 282 -782 -634 69 -283 1347 -631 1342 -409 354 -950 656 -260
5600 -260 -1151 232 -560 366 -836 348 600 985 687 -717 -808 196 183 -809 -993 -375 -1006 -55 -1545
5619 -1545 -681 -936 -670 -1136 115 -1026 322 850 -1265 -71 -799 -294 -982 1283 332 405 1061 -112
5637 -112 369 -997 427 914 332 1832 208 -37 806 1228 -22 1761 1149 357 976 825 1559 1007
5655 1007 447 954 29 360 299 1053 -1231 736 -156 787 270 -435 -393 -839 -117 552 -455 -963 802
5674 802 -1643 93 -853 -624 -234 -1294 -175 -695 -938 -542 -458 -837 -736 -1249 -739 -304 -485 -593 -107
5693 -107 399 778 -745 -713 -183 -1459 60 557 -292 354 -655 -1577 -210 -844 943 -318 -1615 637
5711 637 -133 733 715 483 1079 1025 1279 136 -20 -1079 649 155 648 -390 8 449 414 -1123 1003
5730 1003 1740 -94 605 -105 389 299 -319 338 -1068 321 -318 -382 -132 -133 -717 -578 -134 -1148 780
5749 780 -1801 413 19 194 -334 -60 893 -460 -1048 -1992 -864 -191 -790 -560 -1205 673 -1870 357
5767 357 -633 260 -1073 -1329 -342 -1193 -1009 -1191 -965 363 416 181 -719 553 -1486 1407 -15 810
5785 810 945 -576 -332 -685 1168 -1356 576 937 370 809 165 816 -419 336 -217 778 -976 571
5803 571 -144 283 951 -1064 396 -1123 1297 185 1476 -546 -1720 -99 -164 84 480 1148 -477
5820 -477 -78 446 -660 -446 -1264 1072 -354 747 -296 -1386 -547 -1895 -1359 -952 17 -299 -382 218
5838 218 -1270 917 -270 676 70 -298 556 -482 146 -837 1152 -796 173 651 270 -666 346 -518
5856 -518 -1286 1874 -1541 -226 991 -631 1447 635 297 -452 -249 372 -89 855 335 1606 1713 708
5874 708 -212 1120 645 1084 312 29 1256 980 -58 -635 503 -138 905 1151 832 692 -1043 805
5892 805 -292 741 -113 -969 1304 -473 963 -356 44 -490 -588 -7 1405 506 186 160 -668 -173
5910 -173 -1532 188 -1047 -40 -246 -1482 125 -2150 -314 -638 -592 -320 -801 -1790 -482 -1061 193
5927 193 514 -1578 -202 -1658 540 141 -850 -233 -751 1618 557 270 -261 -107 -15 -437 2069 878
5945 878 26 12 1059 387 -93 1428 -141 179 -556 -28 1372 1057 1166 406 -48 419 1477 -997
5963 -997 507 336 -557 287 -946 -46 -929 91 -172 405 253 16 212 -1497 16 -760 -730 -1478 391
5982 391 -851 -1487 330 -1807 -7 -968 438 -1039 -800 276 -365 -435 -28 -788 -594 -43 -252 -2341
6000 -2341 -137 -647 125 -2104 12 -213 560 -661 -857 1684 -433 -368 -1534 1643 -242 -43 -368
6017 -368 -418 48 -1683 801 1186 936 1135 689 2191 -17 1042 1078 -116 -1217 474 144 1460 708
6035 708 -605 722 -566 -266 -396 -105 600 -58 535 -880 1072 -576 1330 -950 -1739 -389 -393 718
6053 718 -1354 -762 -1154 583 -262 627 -551 -80 -325 -2212 -154 105 12 118 -1060 335 -514 -1358
6071 -1358 405 -1064 -716 -1492 -162 -116 641 -1918 641 524 -10 978 218 -752 428 213 453 -540
6089 -540 287 -851 1618 -429 623 -576 1126 532 1210 163 764 1467 207 116 -415 418 458 874
6107 874 1400 614 655 -135 1443 152 988 1386 383 1467 -394 1227 -640 -109 -17 687 -1583 38
6125 38 251 -376 721 -833 -884 -361 -530 -190 245 -128 1073 -684 -733 -429 -1372 -309 -1503 -231 1252
6144 1252 -591 -533 -722 -91 -455 679 -1058 262 712 -576 272 139 593 -388 138 234 656 260 -834
6163 -834 1334 -714 85 -1651 687 -591 45 863 -240 1856 -397 1423 1523 687 1125 -446 1530
6180 1530 -619 1075 1265 526 410 679 991 120 1088 -331 813 115 -140 -880 401 -1397 1226
6197 1226 1491 -379 390 -728 -1412 863 -431 706 -637 1383 -1609 -1055 -966 287 -831 -826 202
6214 202 -1622 903 -1351 -94 435 -35 578 -924 30 -285 -1251 -1260 63 -241 -1222 98 239 678
6232 678 -976 70 -120 198 -574 -1675 608 -1508 -305 -893 412 -100 172 1468 -987 2142 -970
6249 -970 -276 -271 848 865 549 2267 -498 1104 254 845 -905 679 -305 192 1021 -374 1433 -431
6267 -431 595 -670 279 10 -919 1673 -690 456 -1404 274 474 478 -169 -977 467 -1019 227
6284 227 -16 -110 -609 -2728 197 -1375 -91 -1277 -85 -601 864 -1091 -770 -338 -312 222 -715 1307
6302 1307 -1167 523 115 -122 251 -375 1329 820 1114 -394 342 -13 -923 676 988 844 1108 874
6320 874 326 307 2971 -291 2105 462 612 253 -425 -99 -313 2086 350 1562 -75 1265 1028
6337 1028 -173 288 -787 1972 596 1010 199 742 506 6 846 81 43 -115 31 559 51 -576 -364
6356 -364 -540 -1330 -195 -1116 -1057 -1285 -801 -823 387 -228 -1512 -282 -1382 72 -1446 459 -1243 -653
6374 -653 120 -29 295 -474 -147 -140 -758 -181 840 -1003 -952 -188 244 29 1292 1352 485 -1097 1299 1069
6394 1069 1283 668 1026 810 -40 1146 628 686 -287 1594 637 -887 1717 -458 737 -475 -1176 1729
6412 1729 1481 -93 1565 -933 421 17 -790 740 -964 891 -311 381 1582 -751 -656 -199 -148
6429 -148 618 345 -2279 -1306 -481 -966 393 455 -788 -331 -1142 632 81 96 136 -666 -286 -176 -237 -751
6449 -751 445 -1214 -598 -1318 -41 890 -533 -950 -1760 -870 -1056 50 184 -119 -1728 481 704 487
6467 487 -568 135 847 -577 1920 493 700 1794 -333 1549 -441 991 -188 1029 404 400 -1039
6484 -1039 878 -13 -665 1303 -464 1040 198 775 567 -176 1317 -573 919 -911 324 590 -513
6501 -513 -517 -1363 1106 -789 -350 -194 -372 480 -347 486 -605 227 -441 -600 -1054 -1315 -412 -671 -1069 -1107
6521 -1107 -959 -999 417 -882 204 -1148 -800 494 -1118 68 -397 -1292 -151 -980 1078 -1275 270
6538 270 -717 1273 1137 202 900 738 680 -89 -247 -89 1371 628 -171 644 -241 1844 91 508 150
6557 150 32 1737 865 321 1031 392 -552 422 -1002 -760 -867 -6 1288 419 493 807 2 -447 -156
6576 -156 -282 -315 -416 -1123 -121 -1112 -549 -855 43 785 -2113 -146 -364 1700 776 -324 -57 -515 -566
6595 -566 -469 1062 -357 -522 867 -316 -352 813 600 -717 1570 -710 -225 106 -676 -121 -548 18
6613 18 -650 486 585 569 862 996 1516 -31 2045 447 1617 332 1254 439 227 -29 230 1049 81
6632 81 677 9 483 1193 422 708 5 192 -818 -1204 -760 -906 -373 -492 1407 65 -420 -503 214 -169
6652 -169 1451 765 -895 146 -1094 281 -1011 638 190 -608 -478 27 1595 -530 56 -617 -716
6669 -716 -22 41 -406 -905 684 -499 -530 -958 162 -640 -72 658 -30 -334 789 1100 761 1227 263
6688 263 -746 490 -61 193 -1025 1054 -53 -508 1690 -1498 772 -378 256 -526 -112 -274 -69
6705 -69 16 -561 -45 -829 231 1396 -1850 640 549 735 -120 1224 -799 1359 -60 183 -349 -479
6723 -479 932 -1228 -318 -582 183 160 -1580 138 -291 -937 -770 22 -79 390 -351 -1349 -125 -512 -375
6742 -375 1224 708 139 -458 -447 63 -297 -1075 55 -2063 -886 195 -692 303 265 214 -581 -83 -200
6761 -200 922 1247 433 934 807 578 -279 -40 -1020 782 555 -87 -718 1319 777 -887 300 947
6779 947 94 153 1402 1937 257 2278 -616 1787 895 -516 1066 1510 361 90 443 464 -410 715
6797 715 483 86 -1060 -715 -754 -113 -336 -478 -493 -1115 -64 -278 637 -614 199 -503 -561 -696 47 -271
6817 -271 -1166 409 -613 -1305 -474 -86 641 -420 -629 -465 -41 -1187 -701 1308 -1360 1089 748 1383
6835 1383 52 -137 90 -932 425 -579 1250 319 -72 -33 -136 770 872 1071 -1012 811 -989
6852 -989 182 533 419 748 171 -377 -346 413 -25 106 -1196 -59 59 -579 946 1327 382 931 795
6871 795 92 1632 51 -701 5 -145 548 -1137 108 -757 -465 -208 319 403 -1221 -402 -1961 -269
6889 -269 550 -301 80 -1699 515 -1269 -598 -1159 238 471 -478 801 -982 1586 248 796 221
6906 221 192 779 -795 -747 -106 291 584 76 -439 689 -164 -911 -1117 282 970 1287 -826 -286 1375
6925 1375 -59 341 675 -83 1052 342 459 -426 894 829 -957 211 -750 -250 -792 1160 -76 1153
6943 1153 819 -618 1221 -1000 19 7 979 747 -267 587 33 -116 -491 -464 -615 -285 -252 37 -46
6962 -46 -1569 341 -969 -937 -1494 -891 733 2 367 -1228 -80 -253 343 -779 -326 -1030 -270 677
6980 677 -653 -288 307 -346 -1130 -743 -572 218 1967 373 527 -39 -434 -394 -745 640 37 1198 310
6999 310 14 833 972 416 -1332 574 198 349 316 214 871 -190 623 -30 1779 469 1126 -1459
7017 -1459 937 -449 -734 1203 -46 -571 -1944 377 -640 -331 -355 495 897 -920 -25 -1012 -352
7034 -352 -480 -1082 570 -1078 367 -256 500 -1074 -865 -666 841 -187 -561 -527 -678 -1330 833 -334
7052 -334 -1198 -1529 66 -54 -246 -64 -698 -232 -194 365 -1188 401 262 519 918 -1038 1120 57
7070 57 569 -63 1424 1026 388 998 1385 543 681 1183 1300 231 662 47 -257 -78 -231 979 138
7089 138 -224 790 77 269 245 -200 -774 141 709 -1052 569 -1098 186 -564 -1303 -728 -833 -237 -828
7108 -828 -948 -779 623 -813 -658 -457 -821 -171 374 51 491 -506 422 -1002 -577 -889 -145 -1130 -252
7127 -252 -507 1070 -865 -1949 51 -457 252 -1133 1002 -279 -520 77 732 141 7 469 -535
7144 -535 637 637 -607 340 -295 976 -320 826 171 344 990 180 613 -160 1320 -603 -429 -1288
7162 -1288 565 1116 -448 -154 607 968 72 444 -528 -1468 -927 -1134 989 -961 679 -444 350 -201
7180 -201 -833 43 -1664 721 -1785 -1200 -248 -718 206 -717 -997 -848 647 -801 141 -408 -1789 -660
7198 -660 -740 1614 -1226 -324 164 730 660 -1140 -108 76 1273 914 1 925 347 26 -535 1392 -135
7217 -135 240 -502 -858 -210 601 1958 -1062 2336 307 758 -547 624 85 -66 1824 -14 1245
7234 1245 -608 794 -113 113 1526 -562 714 304 693 -344 222 -210 -1551 326 -1028 895
7250 895 -1274 783 -370 -477 -505 -871 852 -1044 76 -738 448 -502 198 108 -363 -394 -454 -722 -22
7269 -22 932 -86 401 781 -885 727 46 -169 -1191 209 -444 -1034 -566 -70 748 -526 1288 -145
7287 -145 63 568 -575 1587 -447 464 561 351 52 111 478 -374 125 -576 -775 112 805 -246 -725
7306 -725 360 135 803 521 65 -651 462 -387 1049 118 889 -189 676 293 -981 -6 2185 874
7324 874 -54 -889 396 -1081 1217 742 34 -949 1235 -162 -136 -777 -688 -402 -767 -236 3 31 -198
7343 -198 -1320 -523 -676 -368 -558 -1047 162 -378 690 -562 595 -1768 -192 186 -98 -37 359 -88
7361 -88 -290 323 -24 357 1424 -182 274 -28 279 -264 56 -96 -1257 160 -206 1205 -111 -103 -31
7380 -31 -175 1006 -676 1255 461 179 261 302 1054 -66 947 -200 -187 107 518 -281 1282 -894 456
7399 456 1042 -539 -64 -351 846 575 -142 255 109 749 -1839 -102 376 -233 -485 -542 -562 -674 -832
7418 -832 285 473 -334 276 -1002 -720 -219 -545 473 -506 -204 -578 530 428 -733 -1018 62 -242
7436 -242 -221 5 -891 -65 -607 -284 158 -763 623 -248 1190 -471 248 -43 783 421 162 345 807
7455 807 1036 -321 337 538 91 579 -419 -256 425 1869 765 827 229 -758 -860 -832 496 68 -736
7474 -736 710 538 15 1484 -583 -2213 868 -166 -118 -772 -779 -1945 -574 704 102 629 -590 20
7492 20 -756 1197 395 258 -427 -1925 223 -1042 -363 -612 -577 -187 -582 765 -142 -67 -610 -489 -516 -115
7512 -115 1570 349 896 1254 -122 112 -868 503 454 128 -293 -288 532 278 381 -435 521 82 2274
7531 2274 299 1315 -128 371 -430 229 650 -1039 1233 -103 -956 -98 -306 821 -677 -291 -331
7548 -331 43 -891 1446 338 -696 -757 -394 882 -1011 -1229 463 -337 376 -159 725 -75 -591 -908
7566 -908 161 -948 -525 -1005 650 -302 -415 426 -1050 -130 -1300 197 -1806 38 94 -447 -612 -1125
7584 -1125 958 354 1055 -693 -1391 1319 86 -96 1546 996 1111 1349 426 884 607 -290 759 -449
7602 -449 234 149 502 1127 -102 -687 -323 500 -51 922 -295 -706 333 909 696 -928 -111 575 -663
7621 -663 867 -1380 -209 20 564 -84 1044 -390 -637 613 176 418 -1010 -343 -660 -432 144 -434
7639 -434 424 290 263 58 -77 -656 -190 -50 1075 -255 -8 136 279 728 -651 -1302 -933 178 -870
7658 -870 -1340 -458 -430 -258 778 987 9 -516 708 1260 1111 -423 503 386 -238 -422 434 1764 -402
7677 -402 -59 852 1020 497 -1363 -25 348 2598 -272 1167 -610 1285 165 -432 -407 -422 520 -883
7695 -883 -4 -34 842 -135 15 1059 -299 49 595 739 202 -457 -357 -1553 6 -947 863 -920
7713 -920 -183 256 -1410 -1337 -1251 795 -275 -890 -1448 17 -347 87 -965 -702 7 118 1728 -385
7731 -385 28 -2124 -1682 -235 215 -712 -505 -280 144 -64 -354 522 437 270 1943 1223 110 371 611
7750 611 59 -781 1007 -688 909 728 -378 1208 -58 1208 1755 772 444 1554 529 70 -720
7767 -720 -1732 87 -220 716 -117 -632 335 -696 -106 596 -1164 244 -532 -1262 479 -125 330 -574
7785 -574 -716 1207 -492 864 430 243 256 -646 179 -538 -534 97 -667 -1139 -567 -83 350 -321 -627 -535
7805 -535 -259 -512 -357 721 159 -43 -151 251 -360 -336 695 -143 586 673 -447 409 -771 -268 598
7824 598 613 712 98 421 384 -442 -1061 106 -1318 -116 578 -49 1530 -489 -649 -398 -90 318 -564
7843 -564 1053 756 993 -1196 -352 -560 641 -516 326 -1866 -361 1406 -555 -386 -1186 -1415 379
7860 379 390 297 139 -204 -673 13 193 -231 -271 -1166 -340 -2395 1516 746 -1100 922 714 -317 -823
7879 -823 911 26 397 296 -1215 118 -1284 426 -855 -18 -836 681 156 -408 -582 -1122 1145
7896 1145 -736 420 247 578 1032 -1237 64 -231 421 -967 -350 354 -551 434 2099 1363 -155
7913 -155 750 -774 1125 308 -240 -712 -240 458 1137 1320 -158 1059 420 299 928 -1159 -265 -550
7931 -550 138 574 -365 292 -617 652 -442 325 -1147 -613 30 -816 -536 1391 -127 235 -1021 -501
7949 -501 -1071 -312 -605 -1048 920 50 -1585 71 -949 -291 520 -119 -590 -156 1110 -440 992 462
7967 462 568 434 -42 611 -825 1349 -630 522 382 604 1452 -42 442 -467 126 607 1631 1050
7985 1050 344 -223 59 953 162 -23 -164 1424 729 -858 1916 92 1054 766 514 -3 -612 -376
8003 -376 111 67 423 -182 -896 1249 -1700 -152 -192 393 -542 -450 -52 -787 -947 212 -1418 1324 63
8022 63 847 -185 -111 209 -434 36 -1562 -815 -1142 1116 -46 942 -527 596 1621 -196 580 -939
8040 -939 703 -430 75 -18 812 -572 688 1697 476 665 -128 638 1031 -39 75 789 1184 179
8058 179 329 709 -192 974 -1562 -146 350 -24 -648 390 -243 -13 104 -621 -590 168 1044 -673 70
8077 70 595 1118 936 -83 738 -211 227 -992 56 -1326 140 -664 355 -229 -185 445 -328 9 832
8096 832 -797 492 478 99 -504 -1226 -1871 136 -577 -662 376 -1276 176 -1018 -203 -25 528 674
8114 674 -780 -1124 -1883 214 -1012 651 -153 633 209 -472 507 0 1569 -810 686 468 121 -228
8132 -228 -70 1462 -409 798 865 -31 837 -927 34 -82 -1252 538 745 1443 -154 -1732 -28
8149 -28 141 1478 311 -941 296 44 -403 74 -530 -138 -394 -127 -218 822 -268 -494 1907 -517
8167 -517 699 375 339 -778 -1044 -537 64 -1683 -1408 -514 406 -38 -444 -380 -944 -1552 46 -703 -159
8186 -159 -759 174 376 163 901
8191I01
$$ Imaginary data points
##PAGE= N=2
##DATA TABLE= (X++(I..I)), XYDATA
0 0 0 0 0 0 0 0 0 0 0 0 0 0 0 0 0 4 -208 208 -208 208 -208 407 -416 416 -595 624 -680 832 -1014 1042
30 1042 -1248 1455 -1658 1865 -2079 2310 -2623 2926 -3280 3650 -4061 4506 -4997 5534 -6122
45 -6122 6763 -7450 8215 -9046 9963 -10975 12095 -13331 14707 -16259 17989 -19971
57 -19971 22246 -24901 28022 -31770 36371 -42172 49728 -60052 74996 -98821 142545
68 142545 -250192 1115215 1325608 234679 1116626 301066 678460 663864 103935 167409
78 167409 430939 -21258 352734 -249 -56693 458309 48040 347001 313354 235703 527949
89 527949 471354 476875 474238 547569 398785 669492 303507 380253 400110 112992 341299
100 341299 42711 -18748 -3119 -115927 -175607 -83372 -331810 -239807 -76657 -389799 47164
111 47164 -222087 -120945 173302 -49503 204858 182581 180762 326555 328958 202300 388096
122 388096 180739 212833 315557 -47653 188963 -33817 -87355 6187 -162528 -169134 -153632
133 -153632 -139780 -152174 -38430 -187609 38323 54684 26510 231265 96902 269703 340499
144 340499 285144 312720 378565 273574 391538 347282 146937 344068 122828 177317 174691
155 174691 -44027 78117 27228 -32462 25218 -49911 -64134 117464 -26602 82758 145512
166 145512 35851 278720 206398 207266 286685 249198 296759 327603 218591 234194 246141 142748
178 142748 218077 46612 25407 90764 -30870 -24256 -44283 -117541 -44805 -13496 -117886
189 -117886 6580 -35099 3037 110868 15916 121869 131930 118998 204220 169576 122282
200 122282 223074 130327 141285 181294 18628 132885 52022 4641 55575 -35952 -28933
211 -28933 438 -48276 -26818 12400 -85187 70280 13978 10905 117471 13890 135572
222 135572 140556 92316 127823 170099 95690 161191 119601 44860 165805 6234 82707 35979
234 35979 -36372 38893 -32613 -44176 -23245 -40476 -92984 38788 -98943 -23515 22465 -88054
246 -88054 72680 -36788 12174 31648 10045 10372 40415 -5182 -3245 48514 -95591 58880
258 58880 -66580 -58631 -3326 -113988 -27862 -81415 -78124 -98544 -35442 -115002 -44640 -68612
270 -68612 -100653 19455 -119250 16915 -56204 -38224 16490 -34862 -5255 -14525 15109 -41931
282 -41931 67734 -68632 19024 26092 -45397 63849 -65682 38734 -3589 9608 1860
293 1860 9443 -3259 11816 45568 -66050 89581 -48600 28702 36714 -50788 56971 -17479
305 -17479 23701 -10954 28570 -22764 52302 -7487 -6331 72532 -56817 97961 -23684 15277
317 15277 51982 -9580 27877 5493 10695 -32758 45438 -79096 12552 -37941 -73626 15544
329 15544 -115936 -8846 -70617 -56281 -44880 -44653 -61569 -23605 -5269 -70478 60773 -65265
341 -65265 35119 30777 -20444 61323 -7995 42017 14164 25327 -15491 34935 -32293 -7570
353 -7570 12716 -90617 37077 -67938 -17788 -9714 -47600 5993 3632 13325 11541 68433
365 68433 16345 116314 56448 78812 136053 55594 151014 87246 94765 105051 88473 63790
377 63790 81439 45060 15391 77977 -21939 43670 -4187 -9639 45880 -12311 29142 30829
389 30829 37828 53883 91273 41074 116481 111453 77469 159087 78882 125513 121829 78826 93859
402 93859 78743 46831 53689 26747 -11897 37855 -42199 -7780 -6344 -48909 15074 -15607
414 -15607 -9438 34407 36498 31044 86721 58288 98452 125617 82847 140604 105885 120163 128273
427 128273 87771 87803 101854 49839 57074 50031 -8642 52458 -5456 -4063 22037 -10352 23077
440 23077 31914 29244 56852 79468 66629 131640 99329 127033 161044 112262 172255 134323
452 134323 126622 130721 113648 84264 93583 50440 23256 54286 -21818 20559 -28261 -22984 5206
465 5206 -31931 -5140 -3818 12366 18971 65909 16736 82468 83386 60725 126545 57921 109255
478 109255 85339 77136 70535 50388 32273 28510 18005 -39087 19396 -69994 -18854 -29532
490 -29532 -72605 -6450 -50041 -4189 -7594 21462 14125 67663 55788 74669 117751 67244
502 67244 154419 84933 129032 126362 90148 117268 84547 89132 56426 87428 12620 70278
514 70278 30845 18016 66774 -2589 77731 34637 75384 79234 87698 107796 131367 144695
526 144695 119217 201554 119940 200109 158515 136382 187021 115335 153146 100424 109688 76853
538 76853 92525 44666 54856 57250 2900 83104 -9393 58523 43567 36159 75464 55856
550 55856 83783 71984 116840 65112 132769 84676 94462 119986 54600 118193 42815 67930
562 67930 46324 31916 18224 15143 -544 -25215 27799 -56520 17718 -25234 -14181 28048
574 28048 -19582 41665 15632 49991 41517 64482 41772 80743 74554 42007 100370 20079
586 20079 79700 44639 32956 40471 10399 25167 866 17526 -26409 21547 -18664 10406
598 10406 10496 -21630 47303 -1912 41622 34732 37893 46032 61282 51181 50838 76756 22940 80800
612 80800 27791 38478 40686 957 35043 -4341 -1783 -7803 -5731 -26862 1457 -28303 -24140
625 -24140 11856 -35702 15276 -9460 2798 17402 10622 20939 18950 20832 17030 40596 945
638 945 31688 9507 999 27950 -12413 -237 -3867 -8204 -12080 -2439 -25461 -2197 -1137 -16709
652 -16709 17086 -12036 20271 19723 12875 36376 25961 28271 47997 38027 29616 57655 22126
665 22126 49188 41594 19776 41835 20893 31644 27291 17772 19858 30004 9431 29430 20511
678 20511 6594 41424 11674 29994 26410 19091 29736 35254 22383 23590 31068 9665 41185
691 41185 2441 16319 17832 -3471 21216 -7415 -4401 -2430 1815 -22274 2764 -24450 -16475
704 -16475 4534 -38655 3322 -29739 -13116 -9182 -20645 -15123 -18271 -13922 -22509 -528 -42790
717 -42790 1143 -23885 -23145 390 -38658 -3331 -21712 -5467 -20147 -6062 -18770 -5268
729 -5268 362 -25134 18261 -29963 14938 -4041 -10089 10106 -9646 8590 -4542 13720 -17720
742 -17720 23966 -8587 8927 18494 -16881 36434 -8750 27501 7768 10900 18254 17517 19239
755 19239 3582 32949 -12780 43462 -2971 6046 20600 -11504 25060 -16580 8952 -15131
767 -15131 8669 -12323 -3948 -4768 -23014 21629 -35521 17267 -19776 -6557 6438 -15707 4660
780 4660 -16051 10327 -23138 14298 -25132 -3836 -5151 -31436 12201 -44321 129 -30045
792 -30045 -17658 -17707 -22596 -19359 -28121 3238 -37636 13455 -29474 2200 7414 -15208 23095
805 23095 -12299 27195 4026 22067 4778 20816 13055 7201 34445 -17909 34400 -6796
817 -6796 12779 12543 -7000 14762 -2542 20427 -5448 22902 -4780 28484 19690 9058 40050
830 40050 1342 49316 19101 28344 26029 27614 27784 19993 27915 -1053 33855 -7922 15719
843 15719 -1078 -12017 13043 -20890 4959 -14842 -3737 -11478 3460 -11440 -1557 10750
855 10750 -15669 24025 -9525 15506 10479 2958 16803 3688 10604 -1395 11328 -7503 12800
868 12800 -14317 -4667 4939 -22177 7193 -13442 -3463 82 457 -2139 8996 10968 9452 28354
882 28354 10100 37693 22406 29727 40040 26227 38879 35119 34113 31582 38852 17697 34773
895 34773 25716 18359 30856 9437 26880 22240 21651 24187 23634 22037 34817 29961 27604 44685
909 44685 23358 45438 34561 30493 38904 32950 30587 27814 26248 15366 29371 5367 15970
922 15970 6139 -7 11800 -8410 1915 -7094 -1838 -6056 5731 -10146 1075 9409 -7923
935 -7923 17860 -6599 13142 6829 6526 9912 1410 7880 1393 8470 -14033 11814 -12971 -3398
949 -3398 1574 -19840 6771 -15181 1162 -8639 2007 -1528 5487 7073 1813 25197 -2745
962 -2745 33548 8441 21075 28970 11912 30387 15298 30663 12224 33716 7993 25944
974 25944 22344 7884 32520 -1769 33598 7761 18752 20123 15736 24715 16109 31847 7922
987 7922 43924 9792 32702 27425 14788 40310 5865 35041 10313 25476 10736 17102 11122
1000 11122 3290 23467 -11357 27130 -12233 9654 7721 -2382 14601 -5266 17733 -4462
1012 -4462 23130 -4002 19266 9420 4426 24547 -10614 30494 -4114 15756 9215 5763 10105
1025 10105 2997 15840 -7070 25772 -9176 19057 6502 2561 23068 -7259 28351 3198
1037 3198 23064 9593 23273 16763 16725 30338 3162 40338 1749 29252 16547 14132 23437
1050 23437 7832 25520 2645 24493 554 22047 4995 7082 19878 -7654 26759 -4928
1062 -4928 14551 6948 8114 8857 3670 11516 -6839 18101 -10909 12920 -6914 -3499 5915 -17507
1076 -17507 4440 -18723 -4097 -12370 -6901 -14615 -10709 -7171 -20666 2375 -24644 100 -14450
1089 -14450 -9861 -5437 -15557 -2764 -13482 -2042 -14824 1819 -14657 -2898 -3195 -14453 7371
1102 7371 -13757 2422 -4765 -2125 -3253 1145 2812 -105 9089 -4290 16951 -592 12812
1115 12812 12172 5445 21932 8727 15785 11167 17030 11308 19114 11455 11922 20155 6667 21201
1129 21201 6978 17387 12560 8477 11192 12140 11833 11299 13660 2279 17345 5264 8304 11505
1143 11505 1673 10130 2589 4401 1251 5524 -5817 5982 -5787 -5169 -421 -14529 -684 -9700
1157 -9700 -8570 -9378 -8262 -12384 -6782 -8944 -14327 -2214 -20000 -2923 -13794 -9250 -5445 -14999
1171 -14999 -4585 -11134 -5506 -13478 -1596 -16677 -5585 -5940 -15483 927 -15018 20 -9103
1184 -9103 -1817 -6356 -3837 -871 -6335 5520 -9754 13740 -8130 5269 4202 -1911 13538
1197 13538 -3918 9539 -872 10550 -2340 8193 2027 1174 13374 -8416 16160 -6712
1209 -6712 9062 1311 252 8466 -1622 8071 -6878 13482 -10174 8703 -4704 -4344 8579
1222 8579 -13315 8653 -12900 4380 -6732 -2149 -6765 -6913 1318 -17310 8465 -21310 2859
1235 2859 -7225 -10618 339 -13755 2167 -13588 3735 -14760 3461 -7784 -6267 2632 -15913
1248 -15913 11933 -14720 7045 -5256 -88 4455 -2704 8714 -5767 16026 -6155 16695
1260 16695 751 7358 11822 -1933 22232 -2749 19009 3693 13408 8598 9726 15215 2050
1273 2050 23142 -2712 20419 3176 9432 14437 3268 18328 -513 17564 -406 14944
1285 14944 3009 10079 10551 -3872 17345 -8195 13582 -4684 1588 1271 -2160 1687 -10407
1298 -10407 5137 -13757 2379 -13964 -6964 -5888 -15641 664 -20151 -2165 -13343 -4673 -10811
1311 -10811 -8086 -7711 -12012 1867 -19192 2733 -16199 -3897 -5723 -13339 -3402 -14903 -2453
1324 -2453 -11756 -2704 -12804 -465 -6212 -8409 3853 -12615 8597 -1941 4097 3705 5833 9753
1338 9753 6332 13863 4754 18443 5691 18651 8492 8095 18775 7702 15833 7298 13574 9290
1352 9290 13825 6560 10553 13217 6740 18718 6308 16675 11531 13019 14793 11256 14110 13646
1366 13646 15700 8894 19190 6063 12453 11113 4915 9989 1655 5191 -201 2266 -1877 792
1380 792 -3459 -1896 577 -8160 3495 -6642 589 -755 -375 1204 298 1611 491 5975 -2226
1395 -2226 7327 -1700 2919 2532 -4651 4232 -3127 858 -4356 306 -5342 1919 -2505 -4667 4761
1410 4761 -4697 9072 -1517 5832 3687 7523 8865 7674 13057 5128 16210 5940 18228 8935
1424 8935 7441 12561 3115 13310 1402 9352 560 7982 1255 1668 5240 -3609 10663 -5920
1438 -5920 9517 -641 1855 7077 -224 8997 -1933 9460 -728 11128 -533 3319 7825
1451 7825 -5447 8483 -10426 5146 -8401 -1762 -7255 -7956 -2807 -11487 -108 -17542 3816
1464 3816 -10800 -3459 -250 -8684 5998 -7136 8410 -3720 8279 165 5959 6948 -1480 15748
1478 15748 -6028 14952 -1813 5458 5936 1445 6864 -565 10054 -3382 13597 -787 10878
1491 10878 9583 2736 18780 1547 21723 7489 18562 13609 17107 18487 10682 24659 4920
1504 4920 24959 6980 16843 11977 6120 16038 251 13728 -2445 11059 -2401 6702 954
1517 954 -3270 8889 -10964 10845 -7012 4408 -397 -129 5609 -4828 5924 -7540 7503
1530 7503 -9576 1489 -4706 -6925 2073 -15960 -498 -14870 -5268 -13771 -10829 -12374 -14928 -6601
1544 -6601 -19804 -3747 -18490 -3187 -10592 -9172 -697 -9342 2434 -7350 3526 -4320 5429
1557 5429 -2011 962 5584 -6500 7765 -5734 5620 -1296 -1307 -55 -2289 2499 -5426 5632
1571 5632 -4935 6238 -112 2519 7312 -1953 11482 4137 10750 6765 10454 8263 9028 10497
1585 10497 6429 13225 993 11151 2386 5798 3366 -2485 2894 -2453 311 -6588 -1212 -7519
1599 -7519 -664 -4698 -6868 365 -6486 205 -3050 1330 -727 -52 -2192 706 501 -3394 1860
1614 1860 -7304 473 -4748 -6292 -4264 -6991 -5998 -8085 -7465 -9512 -2779 -10360 -5653 -5353 -7741 951
1630 951 -5138 1917 -1674 2756 2388 6427 2251 5151 8669 3180 11067 537 7611 4681 5424
1645 5424 5650 412 3596 -225 4384 -4232 4949 -4014 348 3284 -3587 5074 -2200 4923 2734
1660 2734 6091 1686 5612 6408 1655 9065 -3294 8939 -2520 2949 -145 -6060 -1890 -9571
1674 -9571 -3629 -12734 -4037 -15232 -7777 -10979 -15283 -6232 -18443 -4552 -13338 -6839 -8616 -7760
1688 -7760 -3897 -6601 421 -11762 3157 -9461 1139 -3993 -8965 1271 -11763 218 -12715
1701 -12715 -3894 -10767 -4901 -6818 -9256 -845 -13259 5701 -10385 3176 -2016 -428 7026 -1337
1715 -1337 9504 119 16736 2215 12236 6562 6617 14955 585 15927 -1063 12444 2058
1728 2058 5398 3865 15 7762 -3974 9284 -6282 7565 -139 471 7873 -2248 9759 -1509
1742 -1509 9757 575 8788 2576 2764 7234 -5086 10289 -7255 5832 -4644 -4623 -2235 -10341
1756 -10341 -2046 -14767 -2586 -16274 -4307 -13288 -7937 -4937 -14557 1852 -14731 -996 -8928
1769 -8928 -2064 -3338 -4102 1596 -6992 5156 -8227 6124 -5460 -1401 -937 -7278 2684 -7949
1783 -7949 2444 -7333 776 -3999 457 74 -6340 7366 -4288 8868 1205 5086 7052 5338
1797 5338 11685 4100 13064 3770 14214 4751 10050 8269 4815 12662 190 9512 188 5479
1811 5479 1564 3861 1871 -1467 5203 -1159 7476 -3359 3339 2178 637 5856 -1038 4896 -1048
1826 -1048 6426 859 6546 1130 1862 5369 -3982 4933 -4717 645 -1775 -2389 -2832 -4049 -2446 -4988
1842 -4988 21 -9535 324 -3986 -1380 829 -1802 3115 1700 4366 1796 5837 3295 7795 6505
1857 6505 5677 9267 2869 10031 4841 6179 6374 5863 6126 5705 6335 2680 9294 2236 8478 4216
1873 4216 5728 8475 4692 10400 4779 11833 6094 12668 6416 10763 10165 6510 11499 2613 9957
1888 9957 3839 6514 2545 2441 1673 -1744 2233 -6380 2789 -7296 -1458 -3473 -5683 -1453 -7772
1903 -7772 -571 -6706 475 -6013 -396 -3752 -3476 1631 -7974 2851 -8675 -115 -4594 -3393 -3861
1918 -3861 -6535 -1169 -9559 -870 -13918 -2819 -7120 -7631 -1251 -9684 2303 -8481 2203 -4073
1932 -4073 2336 -100 2769 5227 -946 10470 -1201 12872 3482 6544 9973 3628 13647 3283
1946 3283 12550 1007 10120 2794 4494 7376 -196 12249 -1791 10771 1741 8613 6027 4501
1960 4501 10483 2545 16310 1600 14730 3474 10727 10467 2805 11785 368 12250 -1316
1973 -1316 6152 -620 1789 2122 -6917 4271 -12477 2766 -8895 -2216 -3570 -5937 1524 -8573
1987 -8573 3200 -7517 5326 -3954 3760 2844 -3548 7666 -6188 6854 -3399 4355 -956
2000 -956 -2245 -330 -6389 2839 -10978 2178 -10603 -2165 -2945 -5523 4497 -6272 5400 -2279
2014 -2279 7038 560 7054 6132 4586 12247 708 14086 3869 11514 6279 4398 9671 -437
2028 -437 6632 -2868 6198 -4172 1928 -760 -3525 3267 -7230 3918 -4837 2373 -1050 3060
2042 3060 3426 425 6762 -1836 6112 -2649 4340 -231 -1067 656 -5717 -809 -8337 -3041 -10881
2057 -10881 -7399 -11534 -11503 -8920 -13947 -6270 -14320 -6784 -10092 -8651 -7128 -7503 -2920 -5674 -705
2072 -705 -4615 3254 -3105 544 -1158 -2334 548 -4723 -379 -6558 -1916 -4896 -3577 -6282 -6603
2087 -6603 -3478 -6740 -339 -6308 -779 -1308 923 3986 3758 6069 3813 9424 5136 10586 5600
2102 5600 7309 7968 4698 8519 2069 5898 65 2753 -2812 -431 -3262 -4119 -108 -7569 240
2117 240 -5340 -1195 -2782 -1997 96 -1573 3365 -1474 6176 -1511 3583 -293 1076 1363 -4070 620
2133 620 -7334 -2398 -8397 -4611 -9714 -8399 -7406 -11137 -3566 -12157 -2739 -9922 -5330 -3655 -5249
2148 -5249 -665 -4479 2916 -2819 3921 -1485 2398 3304 -1355 5846 -4284 4122 -1744 2542 -1371
2163 -1371 -1593 1834 -4382 3869 -7604 4306 -5368 2558 2187 476 5035 -1394 8711 910 10059
2178 10059 3086 7254 6018 3388 10714 -1392 8331 -568 5330 1149 -279 725 -5409 4219
2192 4219 -8263 1780 -8359 22 -3834 -6168 1210 -9300 2742 -8660 1882 -5770 -399
2205 -399 -2018 -4583 923 -8599 1850 -9114 -308 -6007 -6966 -3606 -10948 -1755 -12189 -3511 -11444
2220 -11444 -2479 -6118 -7672 -1874 -9992 1916 -9200 507 -4926 -2352 433 -4073 3620 -5750
2234 -5750 5293 -3134 6435 -593 440 3940 -3137 7090 -3750 5334 -1964 2544 666 1392
2248 1392 5639 -1728 7912 -2466 7759 1429 3764 4350 397 7541 -1179 8254 867 5969 706
2263 706 3131 6094 -1431 7008 -3401 5510 -1938 502 -66 -1671 1117 -5767 2312 -6343 1428
2278 1428 -3987 -1175 -2117 -4675 1037 -7914 -615 -6454 -1000 -3606 -1588 -2094 -4968 70 -7659
2293 -7659 758 -4579 -347 -2914 -2666 29 -1932 1617 -3409 1484 -3801 2991 -151 -443 3295
2308 3295 -1783 5363 -398 4972 2173 5145 3808 4363 8438 3475 9370 1877 8594 5782 7372
2323 7372 9652 5163 9982 4672 8067 6605 8838 5046 6881 6362 5624 6873 3367 5277 2601
2338 2601 5443 2278 2454 2166 2075 5552 422 4406 -334 5214 2073 1075 2518 513 3382 -598
2354 -598 1766 -3863 769 -4077 -2200 -2645 -5579 -409 -6970 -2887 -7137 -3900 -6657 -4896 -3582
2369 -3582 -6893 -1351 -7495 678 -4907 -1506 -1881 -1583 2534 -3356 2405 -2254 1212 -2822 1297
2384 1297 -799 -2769 2759 -2935 3279 -3219 1496 -1780 122 1709 -1310 3490 -1373 7075 -389
2399 -389 5035 3410 2407 8741 1845 10912 2677 8571 2836 6684 2098 1954 6354 -1246 5658
2414 5658 -1558 4310 -1213 -613 169 -2726 2440 -5326 2644 -3201 2925 -2113 478 3905 -2336
2429 -2336 6775 -3535 5763 -1034 3050 771 -1562 294 -5579 1992 -6694 1012 -6137 -2691 -1930
2444 -1930 -6140 324 -6608 1907 -5458 919 -2998 -565 2321 -2582 6517 -2824 7602 1987 4143
2459 4143 3941 2805 6452 532 7143 -1687 6157 -729 4005 3231 -213 7122 -2667 6271 -182
2474 -182 5180 1160 3615 5540 1162 8792 824 9469 2598 7135 6451 3868 7956 1879 6577
2489 6577 33 5464 -694 1601 -31 -3450 1226 -7068 2133 -6030 -1560 -4120 -3645 -933 -4439
2504 -4439 858 -4979 1313 -3917 1580 -975 -2036 1467 -4249 1392 -4671 174 -5545 -2392 -3199
2519 -3199 -6636 -3023 -8153 -2872 -8911 -3080 -6042 -4845 -2520 -5946 -2116 -4706 1510 -2595 2495
2534 2495 1324 1484 3430 88 5185 -247 5698 115 2447 1907 1777 1773 -124 1880 -819 2398
2550 2398 -2811 973 1809 -306 1754 -1031 3765 51 3118 1890 4347 4101 1437 4551 700
2565 700 5011 -229 1317 1176 221 -357 -3489 -1229 -4542 -775 -6118 -2444 -4837 -5460 -3351 -5172
2581 -5172 -2610 -4666 -1084 -4574 -1702 -4883 -2156 -1967 -3221 -1761 -3556 -1288 -4104 -1315 -3501
2596 -3501 -2890 -2788 -4327 -1202 -5143 -1081 -5802 -1747 -3481 -2302 -124 -3914 931 -2909 3239
2611 3239 -902 2489 2099 2083 5393 2054 6711 -362 6607 2582 3629 3745 2503 4575 795 4872
2627 4872 5 5327 290 2365 3192 -419 4647 -695 4802 -866 2754 1270 2523 3413 -82
2642 -82 4712 -2511 4785 -1000 2626 861 -2184 1015 -3562 2677 -5329 1379 -4443 -2389 -1628 -5679
2658 -5679 1362 -6634 -348 -7448 -1565 -3689 -4346 -2527 -5803 -1081 -7349 662 -5354 -1252 -2048
2673 -2048 -4030 1880 -6549 1153 -5682 1243 -3361 -591 101 -3106 2452 -3687 3295 -2921 2579
2688 2579 431 -270 2787 -1314 4137 -1736 4403 418 4652 1525 572 5909 -234 5606 -1971
2703 -1971 4853 1379 3823 3090 -1016 4191 -1111 6182 -2855 3740 1363 -443 1416 -2613 4656
2718 4656 -3822 2270 -3894 1391 -2173 -3050 1334 -6274 3101 -7467 1019 -5189 -1693 -3121 -4439
2733 -4439 326 -6063 -101 -6024 -2136 -3568 -3792 -1861 -5687 -1593 -5629 -97 -5847 -2484 -3597
2748 -3597 -3938 -1208 -4660 1919 -5307 -556 -1941 -687 1520 -1104 2567 -1052 3094 -633 2890
2763 2890 1189 2077 1011 801 4240 -52 5704 -226 4117 2121 3420 3987 1682 4523 141 5487
2779 5487 282 3662 3471 2669 5998 1544 5704 2455 4260 3676 4231 2502 1130 3809 578 4098
2795 4098 -383 1483 540 862 1074 -213 226 -603 1525 -1387 -227 -2396 -1068 487 -1881 408
2811 408 -913 1449 -1659 180 -1307 146 507 -1332 560 -1953 796 -2330 635 -2004 -2193 -652
2827 -652 -1553 -560 -2493 1239 -1425 688 -369 -226 508 -224 4165 632 4212 1243 2878 2932 4082
2844 4082 3423 2313 6007 42 3813 99 2406 1318 1727 1941 711 3333 -1901 2909 -253 2396
2860 2396 1311 1724 3763 517 3851 127 2302 140 2261 1714 -564 1925 -1796 1749 -2857
2875 -2857 -313 -2681 -3162 -2442 -5105 -226 -6976 -671 -6063 -2078 -3860 -4636 -1615 -5775 2320 -4699
2891 -4699 1082 -1856 -660 233 -3681 2439 -3415 2734 -3454 953 -1272 -1750 851 -3266 3672
2906 3672 -3637 1863 -1250 2156 354 45 4125 -1881 7087 -247 6011 2095 2988 4762 1779
2921 1779 6989 1036 7327 1092 7075 1393 3400 5733 719 5672 -2117 5829 -262 2168 1150
2936 1150 14 2672 -672 4471 -3141 3381 244 2227 3528 -1237 4333 -2097 3085 -1626 2439
2951 2439 -2322 -644 276 -3409 717 -5498 1053 -4157 -1511 -3340 -4409 -914 -5188 354 -5351
2966 -5351 -1298 -4036 -763 -603 -2811 2629 -4520 1919 -3967 1950 -2099 -624 486 -1157 2608
2981 2608 -2499 2801 -1499 -355 561 -754 2629 -3172 2853 -1236 4333 455 2903 2652 1397
2996 1397 5402 1100 5732 796 5485 2117 2403 2723 3207 5101 276 3445 -1675 3742 2106 1803
3012 1803 2659 30 3985 -1796 1736 -339 755 511 -152 564 -1418 1318 -1582 1191 -2348 557
3028 557 110 -2597 -1308 -2923 -691 -3300 -2160 -4604 -2251 -1227 -3184 -1689 -3963 -1248 -4782
3043 -4782 -952 -3565 -1386 -1842 -1384 -766 -2710 128 -3529 244 -768 2 662 -2330 -60 -1527
3059 -1527 794 -525 681 -948 -351 2870 -403 3023 -794 1049 1327 2100 1352 1565 2029 2303 3429
3076 3429 1130 4288 1136 3275 1227 2015 2459 -159 3164 -55 2247 -815 1883 675 -542
3091 -542 1637 -810 2062 -1547 1373 -103 -252 -1500 -502 -105 -4277 244 -3828 0 -2481 -2368
3107 -2368 -1176 -3403 129 -3984 -404 -2941 -1103 -2806 -1891 -1548 -5060 729 -4179 -784 -3414
3122 -3414 -959 -2315 -3305 67 -3329 1562 -2364 1306 -2231 -68 764 -1942 3063 -2488 3626
3137 3626 -1172 2172 916 1863 3482 -576 3884 -1387 5563 533 2626 2377 1862 4323 253 4954
3153 4954 -738 4025 1385 2879 2269 806 3146 -1642 4130 -964 2547 474 134 1258 -271
3168 -271 3945 -2994 2357 -2481 860 -348 -2357 1757 -3395 986 -3209 -748 -2721 -829 -1074
3183 -1074 -2903 -5 -5538 548 -4733 -498 -2096 -3974 427 -4021 466 -4928 197 -1590 -899
3198 -899 -1418 -2726 -213 -4588 2612 -2216 -1105 -2350 -205 1163 -873 1719 -2205 3639 -1705
3213 -1705 825 103 492 3625 -1702 2967 67 2972 -130 3261 2331 3588 4647 443 4841 -44
3229 -44 3934 1517 1105 1755 -19 4543 -97 3920 -1256 2202 -866 1643 649 -566 1254 -1575
3245 -1575 2569 -1218 193 -1540 1181 -443 -2219 832 -1742 1278 -1499 -749 -1418 -2211 -1722 -2626
3261 -2626 188 -3991 -781 -2587 545 -2015 -2304 -1115 -2856 676 -1925 -206 177 138 -1163 -1284
3277 -1284 448 -1219 2598 -1145 375 569 492 177 -281 1070 -1561 1962 314 1687 1272 1551 1404
3294 1404 1655 2574 -157 4176 1030 3159 2005 1915 1999 2758 3351 1522 3950 1255 3037 -70 1483
3311 1483 1572 1402 2253 221 1039 -905 644 -997 448 1104 -1275 1621 -2820 654 -480 -840 527
3328 527 -768 -91 -1704 822 -1937 265 -2588 -1786 -1403 -2889 -382 -4120 -2735 -4944 -1536 -2689
3344 -2689 -1622 -575 -3032 883 -3467 661 -1750 185 -1570 -1160 1189 -216 2006 -3026 552
3359 552 -609 1491 414 -1225 1856 -102 2281 -1428 2544 -67 1303 2040 161 3853 -508
3374 -508 4573 55 3640 1458 1871 4578 106 4524 -343 2991 -373 3246 1582 269 1845
3389 1845 -968 2399 -1659 1699 -858 -9 268 -850 1147 -2978 3186 -2076 513 -1233 -1124 528
3405 528 -2299 906 -3394 -215 -2584 -527 -899 -1979 -491 -2999 -238 -3941 156 -3050 -1543
3420 -1543 -1808 -2529 1101 -3673 619 -1811 975 -2319 -1136 413 -2320 1879 -1611 1548 -692
3435 -692 1143 970 426 2787 -475 3248 -1694 3187 -308 597 1333 1277 3949 -1703 3856 567 2103
3452 2103 1004 1670 2396 427 3066 -1148 3296 1302 1819 2101 331 3453 -512 3117 -1247 1422
3468 1422 -25 901 1932 -297 1039 -2092 901 -2647 1522 -955 -1911 -637 -1619 -341 -2480 -913
3484 -913 -2848 -1905 -603 -1894 -1107 -3199 83 -4096 -964 -1913 -1056 -1003 -2268 -700 -2349 469 -2825
3501 -2825 768 -1976 -830 455 -702 -33 -1968 515 -745 1916 -224 1072 2033 -402 2216
3516 2216 -151 2037 -844 1847 749 1468 1974 -300 1775 365 2713 657 2323 2539 1676 1100
3532 1100 1465 3574 905 2744 878 2826 274 1000 841 -95 1468 -473 1621 -718 926 -1712
3548 -1712 1013 -63 -1782 287 -2212 458 -1923 -847 -3034 -1621 555 -3132 340 -4009 -816
3563 -816 -1829 -1044 -2215 -3230 -342 -2110 -986 -4031 1116 -1526 -944 -1056 -444 1718 -1624 821
3579 821 -468 80 -258 468 183 -465 2396 48 3116 -2032 871 172 741 2338 566 3390 -347
3596 -347 2114 998 1602 3158 1217 3427 900 3679 -51 3958 1324 1636 2552 -87 1884 -1473
3612 -1473 2262 -26 1294 1237 5 2486 -1321 1603 -2068 1186 -2729 -763 424 -1700 798
3627 798 -4026 1807 -2571 136 -2865 -440 -816 -2538 303 -3796 48 -4223 -1815 -1318 -3200 -1478
3643 -1478 -4195 -427 -3573 1632 -3277 -462 -829 -426 712 -2538 916 -1143 476 -1599 -747 -530
3659 -530 -143 1585 -2282 2369 -1194 357 -379 -243 1560 -114 1641 -907 3138 -37 1560 2342
3675 2342 1315 2434 12 3466 -1156 2508 582 1996 832 263 3589 -2017 2267 -2065 2012
3690 2012 487 -199 641 325 966 -1844 2026 -1081 -200 -898 73 1191 -2174 685 -2317 -559 -1219
3707 -1219 -2433 -461 -3053 -1789 -2925 -585 -3186 -671 -3073 -2414 -943 -1951 -542 -2133 194
3722 194 -1015 -189 -2087 -1168 167 -1364 548 -1292 -32 -495 714 784 614 1158 -1104 139 213
3739 213 1997 7 1088 1559 148 1716 416 1782 -186 964 1059 1778 3558 539 1844 632
3755 632 2520 -323 1608 200 1236 1534 969 2943 -308 1247 12 1428 -862 -136 233 -1106
3771 -1106 169 -1408 577 -1385 181 -492 -1525 828 -1809 641 -2671 -1147 -1657 -959 -2751 -1189
3787 -1189 -711 -2976 -421 -2643 -32 -2686 -848 -2233 -1401 112 -2632 -212 -3143 -826 -1276 -499
3803 -499 278 -1385 666 -665 1091 -1948 1301 -157 1305 243 504 1877 -1141 2851 855 2045
3819 2045 591 1205 2135 -270 3038 -734 3465 491 2688 891 459 1822 1147 2851 1252 3299
3835 3299 86 1695 978 928 1274 -71 2910 -1048 865 -932 1071 1468 -1997 773 -983 1103
3851 1103 -1177 -242 -1274 -822 107 -2450 869 -2121 1563 -2900 -1483 -878 -2241 704 -3328 256
3867 256 -2126 464 -2222 -2324 -960 -1303 333 -2374 1403 -2514 517 -1222 -916 490 -1843 1665
3883 1665 -1997 1697 -395 808 767 -35 2246 34 3078 -275 1768 505 451 2192 1011 2243
3899 2243 446 2386 253 1692 -939 2719 1937 -1686 1396 -447 1755 85 1523 2177 976
3914 976 2068 -1749 1964 -644 1863 94 9 -246 -874 1932 -1550 64 -2264 766 -1129 -1967
3930 -1967 -1351 -3793 -468 -4053 243 -880 -1374 -2748 -2445 -934 -2337 58 -3459 -486 -1888 -1196
3946 -1196 -368 -1666 -1481 -834 -290 -2031 1151 -899 -1797 3 -776 -102 -1609 1516 -492 422 1662
3963 1662 -178 809 -466 1232 549 634 -116 442 977 1079 2832 1267 1125 372 2224 861 -79 343
3981 343 2571 1955 302 1097 -446 3233 102 69 767 -1464 585 -2894 1492 -342 456 291 -34
3998 -34 269 -1380 370 -2021 230 -1645 -685 -1644 -1527 128 -2460 -964 -2697 -483 -1791 -2128 -1280
4015 -1280 -1838 61 -2227 -2158 -2983 -2663 -1060 -1119 -1443 -1702 -691 -1762 -494 -1667 -70 -504 1043
4032 1043 157 79 1718 -889 689 -650 310 1123 387 1334 766 1796 444 1748 385 2060 -214
4049 -214 1896 3022 1099 2241 -243 2590 854 2985 1184 486 1377 865 2129 -76 1597 247
4065 247 192 1342 1315 1238 -1388 1675 -480 1928 -1112 197 -680 -599 1734 -1369 1932 -2383 -742
4082 -742 -1183 -25 -631 -922 -97 -1901 538 -2220 140 -820 -809 -1254 -2797 418 -1287 298 -1378
4099 -1378 -305 -146 -1404 -411 -2506 1579 -1003 891 -1016 241 -455 88 1964 -1130 778 -745
4115 -745 1776 456 37 2076 -1262 2542 145 2341 -115 285 1720 515 1201 -1 2667 -731
4131 -731 1650 -1035 1620 181 169 1925 -1417 2060 714 1421 753 38 1264 -1776 1621 -2234
4147 -2234 -461 -472 -76 -2158 -1008 424 -3298 1577 -2256 -200 -2900 -1030 -942 -1803 -786 -3464
4163 -3464 261 -1621 -1494 -599 -1207 -675 -1927 -836 -3865 845 -1728 -570 -2082 -2374 -559 -2654
4179 -2654 864 -2832 225 -1564 677 277 -1018 584 -347 2971 -727 2856 -224 2216 1937 -522
4195 -522 2442 -388 2041 573 1822 1538 776 1493 356 1382 141 2044 -92 1918 1171 509
4211 509 1725 623 2402 30 1664 -50 903 318 332 1173 -1286 523 -991 622 -1337 -826 398
4228 398 -1110 622 -1617 -1629 -3594 251 -2026 -208 -1060 -2559 523 -2611 -529 -1280 568 -1674
4244 -1674 -1083 -992 -1528 -989 -1099 1905 -1091 -1389 -676 -118 706 -1995 707 -2235 371 -1384 539
4261 539 -157 -1321 1303 -615 1307 1296 1545 -425 2115 1049 869 1184 -649 1895 523 1684 1011
4278 1011 1580 94 1370 1880 347 1102 -53 2001 -245 -457 -362 -216 2008 209 624 978 597
4295 597 -493 -908 -46 -1012 -575 -1476 234 -1831 -4 157 -1721 -170 -1778 -508 -1825 296 -1412
4312 -1412 -1895 -2183 -3278 -298 -1477 254 -2606 -861 -2290 -1215 -769 -1374 1589 -2218 -657 -556
4328 -556 1038 -1059 -639 -29 -1929 2847 -446 2543 -171 569 690 -78 1528 -693 278 -664 860
4345 860 1331 2654 2217 -82 1294 824 3007 1169 1841 719 445 1819 974 1582 -214 2329 -1185
4362 -1185 260 2218 -82 246 -770 1769 -1541 824 32 -295 108 -1212 226 -2268 483 -2388
4378 -2388 -143 -3091 -984 145 -2216 -75 -1948 -87 -1168 -542 -1280 -1276 -115 -3617 -71 -2207
4394 -2207 284 -2164 -1184 673 -1013 95 -1049 -382 -1326 890 -227 -803 61 -1069 1304 113
4410 113 786 -714 252 647 -723 1088 653 2862 -971 1352 -143 418 496 402 2855 -834 1312
4427 1312 -776 1278 481 1395 1742 205 925 -284 535 -18 993 1258 95 813 -762 1089 -921
4444 -921 1276 -478 92 -349 12 -103 -373 284 -2766 741 -407 -5 -1446 -1109 867 -2174 -420
4461 -420 -2128 -1218 -1540 -1819 478 -1861 41 -898 285 -1569 -704 -1144 -759 -1125 -1541 -371 -924 415
4479 415 -644 -1508 -68 -1655 -772 -654 363 -803 1164 -761 604 926 -95 974 753 286 -46
4496 -46 -322 193 1483 572 642 -102 1155 1812 -564 -339 798 408 100 -50 477 -93 2030 -1095 964
4515 964 914 863 107 -1167 1330 514 727 -331 208 -1267 636 -524 -694 -1146 -2471 43 -965 -685
4533 -685 -1475 -1460 -2090 -2942 -1155 -2296 -2036 -600 -536 -613 -2373 1516 -481 -687 -2890 557 -633 519
4551 519 -68 -1006 475 -943 190 -1811 525 -328 -241 -773 -906 730 -669 871 337 370 2286 2364
4569 2364 2015 169 3117 140 2908 994 1001 1662 719 2730 -973 1943 1014 1843 644 938 1438
4586 1438 -255 1040 -725 1756 -242 972 -226 143 1046 -458 578 -896 424 -130 -844 1187
4602 1187 -2719 -14 -132 225 -622 -187 -2009 -714 -184 -3118 -280 -2203 -541 -1628 258 -418
4618 -418 -762 630 -2311 -730 -2297 -404 -675 -1178 129 -375 613 -810 580 -1965 376 -225 -1299
4635 -1299 1436 -1645 1526 -415 356 -78 118 926 703 1180 633 1434 -993 2094 183 2557 1176
4652 1176 -17 2687 752 2281 505 1552 641 -47 254 -89 2302 140 874 709 839 -477 -526
4669 -526 563 -1599 912 -1006 170 -1987 -140 -362 -396 -317 -1179 -57 -1299 -763 -103 -463 -603 -1354
4687 -1354 -852 -2898 219 -530 1835 -1382 -2250 31 -1245 602 -1661 1032 -717 343 -516 -5
4703 -5 713 -46 55 -1151 -226 582 1011 -1091 192 -473 1077 444 991 607 926 1225 391 749 707 77
4723 77 1516 1015 1058 924 1174 151 1071 1421 -553 2112 1326 1945 -362 1823 472 1916 1312 -230
4741 -230 434 562 -176 -85 -979 -288 -805 839 -1108 -1202 -630 -670 -1234 -1203 12 -1187 -558 -2832 -191
4760 -191 -1070 -233 -2464 -1041 -724 -1394 -94 -927 -709 -791 -433 -138 -1002 -318 -1904 1005 -1888 -86
4778 -86 -739 719 -372 -860 780 -1027 453 -1465 -81 207 923 -872 273 840 -139 2157 407
4795 407 1539 686 1279 243 -1123 1849 213 2156 -519 573 1971 -643 921 -488 1059 475
4811 475 861 463 429 55 -309 1593 -1603 710 -478 1052 -375 -725 -109 -1456 228 -1936 -163
4828 -163 -984 -455 -453 -687 -725 -1081 -1118 -1011 225 -1398 -295 -255 -1617 684 -1310 -525 -2278 240 -979
4847 -979 178 -1208 -649 575 -737 518 -825 568 376 -436 -876 -1104 380 -387 459 -1142 1495
4864 1495 226 -363 786 -828 1611 -855 1491 1005 484 895 -426 1095 276 1917 189 -87
4880 -87 875 -662 184 454 2470 -512 960 -25 803 -246 -311 1585 -1242 441 -980 1956 506
4897 506 395 346 -130 -347 127 703 -1102 278 -147 -1252 682 -493 -1088 -478 101 -1220 -252 -1789
4915 -1789 -615 465 -1462 17 -1849 -32 -791 114 -122 -1642 -1123 -836 697 -137 -126 -277 1413
4932 1413 -97 -278 56 -118 -6 -771 263 -1076 151 692 94 285 -24 1106 -609 2063 617
4949 617 221 881 -688 775 126 501 462 1601 818 880 174 75 370 -96 1925 -503 214 1342 -422
4968 -422 1543 -1151 306 -639 -794 -123 331 365 -1858 307 -807 582 -493 -32 -427 -152 -1978
4985 -1978 -431 -432 -1878 -1010 -481 -2280 -1198 -827 -1087 -1130 -633 -352 205 -708 -1116 -1079 -1878 923 -1315
5004 -1315 325 -1514 123 7 -433 484 -102 1158 -61 815 49 856 -369 823 -190 452 1079
5021 1079 -746 327 -270 1030 1158 805 1728 -49 1463 -381 1404 386 -1215 694 1277 1933
5037 1933 61 2506 -212 983 -1375 54 695 743 1133 -1143 210 -1546 293 -383 -560 -443 -1104
5054 -1104 -625 -666 -46 -1069 352 -348 -1299 -357 -2384 613 -2029 305 -962 -46 -322 -2481 463
5071 463 -1373 -26 -2833 748 238 -285 588 -2367 116 -459 173 -1445 557 -134 458 209 -426
5088 -426 1399 246 72 -1286 793 946 -99 1016 1050 690 135 2031 585 -254 431 256 1191 250
5106 250 2281 487 1084 113 -413 1725 -1212 1489 566 210 -228 454 303 206 1911 -626 969 -1550
5124 -1550 -522 -1304 251 823 -1594 -319 -1075 148 -176 -581 -312 593 -597 -1869 258 -544 -695
5141 -695 -1174 -1610 -1238 9 635 -1550 -798 -1158 871 44 -358 -696 -1960 1197 -450 623 -1418
5158 -1418 159 1335 653 -540 -437 -616 248 1019 845 727 354 361 1411 -833 1968 -56 1372 398
5176 398 1724 685 604 909 86 1193 -1095 773 -583 1083 532 1173 268 821 102 254 1233 -1106
5194 -1106 396 246 -978 389 -868 1053 473 933 264 -802 -84 -1329 -599 -2482 -351 19 -368
5211 -368 -1927 109 -447 -410 -1212 -1985 -292 -705 -45 -1257 -277 -1955 -901 784 -1299 -44 -1236
5228 -1236 -380 -1984 184 -214 57 1130 -914 822 -962 -202 890 -681 236 286 33 297 1095
5245 1095 839 1156 672 -168 1834 -344 1193 652 746 586 872 708 74 968 472 2092 -575 1679
5263 1679 44 414 1063 -487 1232 -671 26 -824 300 -459 41 846 -1277 1338 -138 -215 -848
5280 -848 -673 -519 -1455 217 -1668 392 -360 283 -770 -781 -437 -129 679 -2063 166 -1376 283 -936
5298 -936 -37 -150 -1172 801 -2196 939 -1655 -92 -333 -763 -174 -217 -550 -318 780 -1411 903
5315 903 -537 638 1784 -164 733 964 142 819 23 1152 1083 922 -393 1130 1227 1034 -733 -68
5333 -68 736 374 744 -474 1668 -520 200 1156 -836 309 99 1175 31 105 -1435 -323 920
5350 920 -1922 -37 -1137 -169 16 537 -402 -586 -853 -927 -1599 -1159 -191 -1117 590 -131 103 -52 -1611
5369 -1611 -294 -861 690 -1547 -448 -1577 0 -312 -842 613 -495 25 -690 -558 -118 -102 -1027
5386 -1027 -1054 460 1317 271 -497 1225 555 713 1203 89 634 582 210 1074 1239 943 -193 1193
5404 1193 -527 -319 -55 1389 329 -46 1702 340 1651 122 -151 -100 -212 1048 -1151 938 -382
5421 -382 -445 361 -322 -951 -1959 128 491 -425 -719 -483 -70 55 -882 -566 46 -541 208 -1521 -1541 -2483
5441 -2483 61 -636 -1291 -156 -18 -723 -1511 -252 -755 -770 -1353 -691 498 -686 566 373 -228 -673
5459 -673 -278 1395 -144 1842 -816 785 -455 -226 -1009 -394 392 -105 1174 566 1079 -594 899
5476 899 320 -301 1085 188 1089 -62 952 -149 -22 576 1328 538 -668 744 793 146 1004 641
5494 641 1687 321 -558 -265 -505 24 1005 -587 -27 759 -828 250 -1557 740 -157 -521 -965 -764
5512 -764 -859 -852 -820 -1416 658 -621 -24 -466 -2081 271 -961 -57 262 773 -736 -762 -1039 -1574 101
5531 101 -49 -248 -1699 1113 220 144 915 640 944 -756 248 995 -279 320 4 571 -58 1108
5549 1108 120 2244 2317 346 898 1059 1310 -196 845 -1047 1242 756 1022 1116 70 791 94 -459
5567 -459 257 1668 721 177 416 -1373 360 -545 -326 -500 -776 426 -272 -287 -933 -311 -575 177 -308
5586 -308 -1317 237 -1695 -166 -1225 798 -92 -1062 -240 -1475 141 -561 506 -172 -1068 -731 -653
5603 -653 -304 403 677 -323 948 -755 633 -817 -732 171 -215 -33 363 1010 783 2312 210 -214
5621 -214 518 -706 1011 -361 -93 1016 871 -886 110 1511 -310 862 1281 130 314 861 997
5638 997 425 1219 813 187 -486 -643 46 801 -709 665 -383 -360 490 -758 1845 557 -861 729
5656 729 -856 -918 -800 -937 -512 -27 -1233 -519 -578 -1553 -101 -1723 -547 -205 -1158 -1076 -954 -1080 -640
5675 -640 -570 -300 -461 -271 -1509 -75 -1385 -91 -686 610 44 223 -587 697 531 -480 1313 -490
5693 -490 780 -372 1311 391 540 1093 -31 386 -434 1422 130 1015 -126 977 -448 -791 -61
5710 -61 1129 329 406 22 -205 -13 1240 -955 -37 679 -302 37 542 -450 -157 1219 -61 562 149
5729 149 698 -439 129 331 -1486 453 -94 626 -211 -750 146 -365 40 -1571 735 -2193 -123 -134
5747 -134 -396 565 85 -442 -896 -92 395 -316 -1560 -362 510 11 212 -1568 -555 -1859 18 826
5765 826 -471 292 1309 2498 -51 1373 373 906 23 291 -371 31 1468 -191 1298 27 -524
5782 -524 715 1105 612 -20 -385 988 287 772 -1140 -118 37 951 -677 1881 244 -637 453
5799 453 1268 -46 -5 835 -866 1469 -841 76 -480 -680 406 -676 -1192 -1029 -604 -689 5 -1334
5817 -1334 -417 -377 -1135 -691 -1376 -644 153 -1594 -1133 -1290 394 -310 -351 -1779 28 -291 -835 53 -1187
5836 -1187 -199 -1522 -109 497 142 591 -927 1211 228 1375 55 1689 521 -224 97 -366 686
5853 686 -200 1695 1011 -626 309 384 1414 934 1398 579 2388 1907 566 325 916 320 -1573 -48
5871 -48 501 897 -293 1227 664 -30 -738 -1491 704 -1483 -367 -790 -420 564 -465 818 -789 -798
5889 -798 -785 -526 -1290 -1290 370 -1048 458 -1336 -531 -2454 -1039 -1482 544 -761 -506 -657 -815 -158
5907 -158 639 998 -523 -69 -64 -151 1346 -1153 81 -391 96 338 -446 1203 433 807 -1543 -488 427
5926 427 154 2132 484 261 -35 1436 1087 1428 104 494 -474 -351 -971 -248 255 269 326 977 688
5945 688 -803 -201 -1051 -133 47 -1382 -9 1173 24 987 -2488 82 -976 -101 -171 -475 -858 -220
5963 -220 -630 -1125 1270 -1225 213 -155 -1006 -774 -373 281 -286 56 -932 -18 -1685 -431 -121 -895
5981 -895 1193 -86 -1182 -786 366 947 -618 901 -462 956 -1111 1061 101 -42 -346 371 1512
5998 1512 742 1801 -382 1118 961 -122 974 -42 1275 499 1395 322 743 -146 812 1364 772
6015 772 586 -182 566 -378 -88 1835 -20 449 -1154 1199 -688 -132 1859 -1312 108 -301 -528
6032 -528 -647 939 -1069 -883 213 -1505 -906 -2131 1567 -160 614 -208 897 38 -1096 61 -1329
6049 -1329 165 -922 1294 -453 -1221 -1 388 -166 -872 374 -434 1594 -474 -584 295 -1452 226
6066 226 -379 -776 916 1046 591 -745 1234 -90 412 3 -150 1343 524 769 882 862 474 781 116
6085 116 786 1346 1364 313 87 1622 -843 1474 -790 -499 356 546 1050 -286 -185 -1150 414 -1114
6103 -1114 -76 982 203 63 -996 -577 -488 -471 1260 -568 884 388 -86 -57 -1078 -969 -1044 -1191 -526
6122 -526 -389 -1424 381 -1426 -277 -1740 -732 -177 -539 180 -1971 692 -556 -580 -357 167 -552
6139 -552 -1383 -45 -565 368 -573 -131 -152 800 729 -394 708 33 518 246 315 -463 400 -66 265 63
6159 63 361 1336 414 -305 547 433 36 750 298 273 2171 821 177 162 95 -197 -1128 -38 -376 -655
6179 -655 -10 -431 -489 -1604 831 -1366 155 -607 -1198 -79 -1985 -1422 -391 1099 -808 578 -246
6196 -246 1629 176 175 -633 -962 -1141 156 671 -1083 252 869 -348 816 -118 154 -341 642 -268
6214 -268 429 1050 572 735 872 1849 -32 -208 467 957 428 174 1287 1011 1255 -85 1168 -490
6232 -490 -151 207 555 279 -1549 193 135 834 -365 -326 -317 -454 3265 -67 335 553 -364 278 -9 546
6252 546 584 957 -263 -921 -673 -998 -652 131 181 -1425 -255 -397 -411 -3 -717 580 -1511 1673 -1299
6271 -1299 1016 -1159 395 -788 -1205 -835 -1350 1550 -1537 87 -889 -1439 -626 -1214 620 -604 768
6288 768 -993 114 410 -218 1117 -157 410 -431 672 -607 1364 -152 371 -104 -92 1263 -212
6305 -212 419 637 849 1095 -135 1162 146 1050 -233 -713 275 1624 1031 -124 1860 907 1066 -91
6323 -91 30 1185 -6 58 -12 -263 209 1655 -1260 182 459 -148 315 220 197 -1358 135 342 21
6342 21 -124 -625 0 -348 -162 -1398 296 -7 -1367 -93 -190 529 -769 -561 840 1218 -113 262
6360 262 793 105 1570 -1155 -125 -56 258 -714 -800 1727 -407 766 -658 703 945 2128 -164
6377 -164 -523 -354 -461 638 -1121 837 1752 1088 677 44 277 282 772 748 103 278 708 77 1100 969
6397 969 559 1005 409 -124 -209 -82 -374 -1762 -1079 -515 -1083 -1674 772 -1105 469 1276 -1488 462
6415 462 -1798 -547 -1024 475 -748 -547 514 -1041 633 -337 -581 526 -1637 -737 -114 327 -1774
6432 -1774 -350 -1892 -276 144 -1153 1026 287 3 601 -223 107 343 1112 1496 1020 74 545 -467
6450 -467 321 801 131 1657 -381 502 637 1304 -80 1195 1070 1152 497 -869 217 -345 1614 -38
6468 -38 571 -880 -161 960 354 -522 322 901 -1861 85 447 -1269 585 615 -252 -1613 588 -997
6486 -997 95 445 -1375 -661 -235 -75 -535 50 -1252 -146 254 -1346 -177 -1101 -94 -701 -1514 -308
6504 -308 115 -537 -842 -1365 -238 196 -356 -375 -137 -1622 -148 657 1867 -1490 690 -1 746 -659
6522 -659 759 38 -1017 789 305 907 1742 346 1210 1034 308 315 1185 976 634 967 -458 1253 120
6541 120 1856 51 640 157 -215 869 -741 1541 377 952 -789 706 -7 -1046 -135 -2315 211
6558 211 -1070 -405 778 -798 8 -1421 -378 -1126 -706 -696 -364 -605 814 128 -325 -96 -2378 180
6576 180 -639 -627 -850 -408 842 -710 -1137 -22 -163 -579 269 294 -421 599 -1141 -52 -15 496 145
6595 145 1203 -120 -636 -157 62 -335 -697 997 518 16 767 380 519 -251 585 -698 1721 -42
6613 -42 -298 -147 -75 437 -145 342 -404 429 160 443 1228 -154 -450 -150 1067 -906 418 -1169 -26
6632 -26 716 -820 500 -614 -381 -653 -686 -190 -109 -1392 -1026 -217 -913 -1396 -72 -778 -389 -1000 -119
6651 -119 -2283 -836 -628 -446 164 -170 586 420 -789 -2 -454 346 202 -675 397 594 489 -22 -327
6670 -327 727 -832 297 888 -438 738 -373 1116 -1692 1711 149 160 -739 35 324 -888 110
6687 110 414 873 183 357 -261 1145 1151 378 -719 -614 959 585 -113 903 -79 1159 -856 701
6705 701 -260 -1369 -742 -94 -95 -1055 257 -942 788 -718 -453 -1584 -468 -382 -565 -367 -1411 -874
6723 -874 -1328 -2084 -398 844 1115 -2061 -279 -683 -501 858 -63 732 -708 64 -733 -780 -93 584
6741 584 -953 1055 136 360 1171 -499 710 64 -818 987 -468 858 -572 1510 495 1213 420
6758 420 1067 579 -461 398 -1120 -13 532 56 -96 775 731 -157 -643 573 11 -507 -40 -755 -633
6777 -633 414 -1066 848 -136 743 -300 -947 -740 -612 512 -285 337 -782 -53 -658 -461 -241 -387
6795 -387 -559 -604 -49 -573 80 -1354 -1806 -1170 -522 -454 -1117 79 -969 49 996 -1873 -62 -698 160
6814 160 8 1304 41 438 520 640 1197 -1270 1270 -447 104 1470 139 -5 -167 996 681 1024
6832 1024 297 -715 548 667 272 701 765 -991 -630 -573 -702 -945 -98 493 621 1791 -398 2320
6850 2320 -484 989 -130 -181 -133 52 1445 -639 -508 -138 -407 235 -99 699 -542 -462 360 870 -739
6869 -739 -983 -127 -997 -144 -354 64 -882 -800 305 -832 -226 -65 224 643 577 -760 -955 984 -420
6888 -420 -104 -678 786 -684 1340 -429 -536 935 -654 207 1042 477 -1384 296 -276 858 418
6905 418 396 165 206 322 -278 1197 606 535 1296 -612 577 682 1051 708 -530 376 -432 511 -919
6924 -919 680 -443 709 -52 -248 568 -342 -775 290 -192 -351 135 -300 130 338 340 -3 -972 -440
6943 -440 -965 892 -693 -753 301 -1132 912 -498 -253 -1554 134 -180 -1181 -351 -815 768 151
6960 151 1375 341 -233 -40 -56 -567 -233 1227 444 1067 -567 -7 1248 -1115 683 399 -184 166
6978 166 2177 -105 432 46 -221 174 591 1247 -1132 1572 617 2 229 617 736 235 1183 -604
6996 -604 1107 -280 101 -969 -424 -212 -1070 98 435 46 -2010 -724 -142 633 -1247 -444 375 -1028
7014 -1028 -744 -434 -601 723 -1103 -474 -1021 -1025 -795 -650 366 -1049 266 -746 -601 357 -773 791
7032 791 -507 -1032 -555 -177 -375 153 408 -371 -323 -88 40 -402 -433 119 215 1327 -802 -235 225 -71
7052 -71 -262 130 774 878 -577 956 145 -396 1017 384 2085 234 -88 979 665 390 -430 318
7070 318 1073 518 243 1439 833 -1444 -91 -1011 -729 991 -328 -1092 453 -57 -1624 605 -281
7087 -281 -1345 -1389 -501 -615 -363 -1813 -699 314 -1366 677 588 -459 -181 -255 -608 -746 207 -495 -382
7106 -382 -546 -1057 627 72 -1009 -304 515 -791 -183 584 -814 905 299 872 520 174 -299 -15
7124 -15 1916 -691 618 -497 1053 -24 537 574 -410 461 654 1114 -356 479 -1851 1222 906 -239
7142 -239 27 384 272 479 67 -486 -1012 60 -612 1297 -679 164 121 1072 -733 -487 649 -1236
7160 -1236 -336 -313 1289 -843 -1012 -385 774 -602 -745 1198 -428 367 69 -525 -603 -1326 -456 142
7178 142 -624 -2196 200 527 -1290 157 1363 -828 -641 835 -1015 -1875 -372 -689 686 -363
7194 -363 1058 -734 1252 -428 -340 947 -19 1270 -60 752 -1012 279 -1198 -1460 546 -615
7210 -615 154 1359 596 160 101 -1084 -191 642 -39 1585 -335 1316 729 518 -163 1105 -481 -612
7228 -612 -771 -548 1342 -1251 787 -96 160 -355 -514 1210 -442 1164 -550 -934 -1047 -202 59 -1106
7246 -1106 -737 -841 556 -9 -441 -808 -1421 220 -882 408 140 -915 -236 192 317 -336 1208 -2509
7264 -2509 757 -287 155 448 -2060 1145 681 998 899 1699 437 -38 154 300 981 -633 1178 441
7282 441 241 -340 -114 348 -89 862 -872 640 -320 101 1425 -70 1766 -17 740 -589 327 179
7300 179 695 123 -605 294 -603 -337 -1383 -465 -596 -1381 229 10 -132 -1698 -889 384 -95 -1578
7318 -1578 -1485 -60 -1340 -11 -1368 2046 -322 -856 91 -386 638 -288 466 -810 -337 -297 -539 1743
7336 1743 -1451 -1344 -532 576 -21 -787 341 236 540 -1202 -192 -769 345 -504 1661 -538 38
7353 38 -134 937 124 -33 480 -420 949 -1031 -121 -199 -51 673 -1331 212 -360 1025 302 1320
7371 1320 450 501 -59 -805 1204 -463 670 11 558 641 14 871 -1734 813 -1498 15 458 -269
7389 -269 -200 -116 -765 -346 405 -565 -923 -898 -1691 162 246 -469 -633 296 -295 -391 -898 -1388 107 -981 -530
7410 -530 -312 48 -669 622 440 22 -705 -1068 -1465 861 650 1119 -167 1565 87 316 -261 1490
7428 1490 837 482 380 1520 100 9 1407 -702 1864 371 445 92 -994 1537 -65 220 314 -666
7446 -666 398 873 1541 1003 131 -357 595 -638 -389 -846 -1016 269 -1373 714 -1089 -240 -494 -559
7464 -559 20 -714 157 -413 -993 1119 -234 373 -699 224 77 263 -1309 -487 190 -1333 115 -936
7482 -936 -414 -1663 -716 -904 -896 -417 544 127 1 1084 -1179 345 592 135 -507 -1047 1137 -430 217
7501 217 -1892 1480 610 123 1644 1117 799 -94 462 -528 2533 859 -934 -443 -628 911 791 649
7519 649 595 -38 -587 -306 269 507 615 -939 -140 -18 460 227 -37 231 654 153 -1320 -552 908
7538 908 51 692 -764 289 -1444 169 -994 46 -745 -1169 706 -555 -304 62 362 -146 -321
7555 -321 -832 -679 773 -853 -612 -329 -1428 -1330 828 413 -1719 126 -40 770 -1307 347 -218 1087
7573 1087 -526 -195 -451 -188 752 -172 1567 597 747 1605 1093 466 -759 1104 1099 -171 156 692 585
7592 585 -889 -41 878 344 -435 1112 736 -622 241 819 150 -412 101 629 -1988 384 -589 708
7610 708 -986 -178 -306 -387 -706 -1062 215 -699 -316 -343 336 -2258 -271 -1659 239 -1299 -1156 -1273
7628 -1273 -967 -199 -1793 402 119 1322 10 -756 -1157 800 -10 -1068 -182 830 714 -1066 139
7645 139 187 -3 -844 1221 262 1113 344 -436 -87 1995 244 -154 274 -695 73 878 1735 719 267
7664 267 102 1321 67 -94 -243 -531 290 -495 146 1157 1031 -553 -902 716 -364 2121 -208
7681 -208 1015 -1415 204 584 -350 331 -931 153 316 -1130 -640 -961 -631 -678 243 -173 577 164
7699 164 -175 -604 800 2 -15 -694 -1060 1231 259 122 593 339 1463 -1291 -26 -851 132 401 -1168
7718 -1168 200 -869 319 -1982 -33 82 1154 -169 -696 897 -74 619 629 553 -275 77 -145 -377
7736 -377 357 562 128 769 192 -1017 780 482 -689 871 830 385 -568 1103 99 -227 -577 753
7754 753 1273 172 1061 54 -113 -527 -867 343 -1179 -808 140 653 318 -229 -845 -842 872 -231 413
7773 413 -1118 -563 -94 -120 1292 -1504 -365 480 -530 -396 641 1 102 976 -829 1271 -177
7790 -177 297 -354 510 -1056 -239 154 44 519 322 1080 429 -904 358 874 181 -181 -41 1815 397
7809 397 94 -185 822 172 -275 493 731 1015 -646 -60 1286 224 120 381 -220 850 600 1857
7827 1857 -424 -1212 1223 -116 500 -212 -94 1152 937 -416 -805 -456 -1211 570 37 -692 -502 -1638
7845 -1638 -113 -398 -4 698 -669 -348 -283 -280 -113 -1214 -853 29 -1775 293 252 -1297 -264 1035
7863 1035 -752 164 -711 -578 -145 -665 77 -502 -1328 870 -852 1398 -1494 257 1027 -759 1037
7880 1037 -637 -508 140 1800 -92 1 624 275 1028 -668 -442 30 -164 -1006 621 922 -652 174
7898 174 -957 378 -478 197 -495 -618 -1234 -52 1537 55 364 137 325 -765 333 -470 -462 -486 -641
7917 -641 -631 373 -402 374 898 -104 -1395 -332 -1905 354 -1589 -650 -1560 46 20 194 -44 -1122
7935 -1122 -536 -392 -432 487 -819 -144 783 -95 -315 -338 -564 1525 -384 156 1942 275 845 -115 456
7954 456 467 844 697 314 152 -5 45 -323 -643 -164 1322 604 -870 294 177 148 -156 195 92 -9
7974 -9 -449 -235 78 -731 527 -129 -805 -408 133 -294 -1402 -322 -694 456 -248 -131 296 821 579
7993 579 -270 -483 -109 -297 -44 -540 -263 -1044 -191 363 -697 -82 1409 379 -1239 -448 -558 507
8011 507 -2031 -271 -306 689 43 -354 -176 -1184 -94 434 382 -326 -416 903 1780 1716 416 827 1447
8030 1447 1429 1958 226 123 -1375 1506 -65 -276 -1320 -909 1116 -103 164 1183 65 -604 -202
8047 -202 79 298 -909 565 170 171 -225 -781 -356 451 -997 517 -606 -766 595 -543 -38 254
8065 254 394 -51 760 -899 -1081 -512 -292 -679 -880 -32 -958 -468 -1568 1117 -476 544 -944 -798
8083 -798 -513 -572 -98 -1834 -367 -344 190 -1951 145 996 -601 132 -597 -22 568 59 73 1121 -528
8102 -528 -1739 1832 -431 -773 233 965 1380 -723 -284 232 327 230 484 -1391 -783 1192 944 69
8120 69 -1036 1289 -837 614 262 -235 930 -81 937 -701 -648 -706 -523 291 -301 -72 135 -748
8138 -748 -371 -520 431 -671 -68 -220 -618 -1056 399 -381 423 -1202 -105 -543 -1339 267 -1171 776
8156 776 468 479 83 453 372 -694 613 599 209 -14 -900 -778 149 -404 -627 -354 -676 -405 -375 559 1106
8177 1106 -291 151 1596 1303 -918 873 420 856 57 -1056 -314 2 -473 903
8191I03
##END NTUPLES=NMR FID
##END=
