##TITLE=1H_SA_sl.BOH
 CDCl3, 8 sc, 
 27.10.2020
##JCAMPDX= 6.0         $$ Bruker NMR JCAMP-DX V2.0
##DATA TYPE= NMR FID
##DATA CLASS= NTUPLES
##ORIGIN= UXNMR, Bruker Analytische Messtechnik GmbH
##OWNER= root
$$ XWIN-NMR		Version 3.5
$$ Tue Oct 27 10:29:55 2020 Russian Standard Time (UT+4h)  she@DPX200
##.OBSERVE FREQUENCY= 200.1315066352
##.OBSERVE NUCLEUS= ^1H
##.DELAY= (6, 6)
##.ACQUISITION MODE= SIMULTANEOUS
##.ACQUISITION SCHEME= undefined
##.AVERAGES= 8
##.DIGITISER RES= 18
##SPECTROMETER/DATA SYSTEM= spect
##.PULSE SEQUENCE= zg30
##.SOLVENT NAME= D2O
##.SHIFT REFERENCE= (INTERNAL, D2O, 0, 15.7039)
##AUDIT TRAIL= $$ (NUMBER, WHEN, WHO, WHERE, WHAT)
$$ ##TITLE= Audit trail, XWIN-NMR		Version 3.5
$$ ##JCAMPDX= 5.01
$$ ##ORIGIN= Bruker BioSpin GmbH
$$ ##OWNER= she
$$ F:/spectra/data/she/nmr/H-F/1/audita.txt
$$ ##AUDIT TRAIL=  $$ (NUMBER, WHEN, WHO, WHERE, WHAT)
(   1,<2020-10-27 10:28:50.98 +0400>,<she>,<DPX200>,
      <created by zg, POWCHK disabled, PULCHK disabled
       configuration hash MD5:
       00 E9 B6 7A A2 85 ED C7 34 08 36 98 17 FE 4E 26
       data hash MD5: 16K
       30 10 CB 06 17 E1 53 4A A2 B3 C7 67 8D C9 E3 E8>)
$$ ##END=
$$ 
$$ hash MD5
$$ 46 34 4F B1 E9 ED 24 A5 EC 14 6C 19 30 3C 6E 31
##$RELAX= 
##$RELAX= 
##$RELAX= 
##$RELAX= 
##$RELAX= 
##$RELAX= 
$$ Bruker specific parameters
$$ --------------------------
##$DU= <F:/spectra>
##$EXPNO= 1
##$NAME= <H-F>
##$PROCNO= 1
##$TYPE= <nmr>
##$USER= <she>
##$AMP= (0..31)
100 100 100 100 100 100 100 100 100 100 100 100 100 100 100 100 100 100 
100 100 100 100 100 100 100 100 100 100 100 100 100 100 
##$AQSEQ= 0
##$AQ_mod= 1
##$AUNM= <au_zg>
##$AUTOPOS= <>
##$BF1= 200.13
##$BF2= 200.13
##$BF3= 200.13
##$BF4= 200.13
##$BF5= 200.13
##$BF6= 200.13
##$BF7= 200.13
##$BF8= 200.13
##$BYTORDA= 1
##$CFDGTYP= 0
##$CFRGTYP= 5
##$CHEMSTR= <none>
##$CNST= (0..31)
1 1 145 1 1 1 1 1 1 1 1 1 1 1 1 1 1 1 1 1 1 1 1 1 1 1 1 1 1 1 1 1 
##$CPDPRG= <>
##$CPDPRG1= <>
##$CPDPRG2= <>
##$CPDPRG3= <>
##$CPDPRG4= <mlev>
##$CPDPRG5= <mlev>
##$CPDPRG6= <mlev>
##$CPDPRG7= <mlev>
##$CPDPRG8= <mlev>
##$CPDPRGB= <>
##$CPDPRGT= <>
##$D= (0..31)
0 1.2 0 0 0 0 0 0 0 0.06 0 0.03 0 0 0 0 0.0002 0 0 0 0 0 0 0 0 0 0 0 0 
0 0 0 
##$DATE= 1603780130
##$DBL= (0..7)
120 120 120 120 120 120 120 120 
##$DBP= (0..7)
150 150 150 150 150 150 150 150 
##$DBP07= 0
##$DBPNAM0= <>
##$DBPNAM1= <>
##$DBPNAM2= <>
##$DBPNAM3= <>
##$DBPNAM4= <>
##$DBPNAM5= <>
##$DBPNAM6= <>
##$DBPNAM7= <>
##$DBPOAL= (0..7)
0.5 0.5 0.5 0.5 0.5 0.5 0.5 0.5 
##$DBPOFFS= (0..7)
0 0 0 0 0 0 0 0 
##$DE= 6
##$DECBNUC= <off>
##$DECIM= 32
##$DECNUC= <off>
##$DECSTAT= 4
##$DIGMOD= 1
##$DIGTYP= 9
##$DL= (0..7)
0 120 120 120 120 120 120 120 
##$DP= (0..7)
150 150 150 150 150 150 150 150 
##$DP07= 0
##$DPNAME0= <>
##$DPNAME1= <>
##$DPNAME2= <>
##$DPNAME3= <>
##$DPNAME4= <>
##$DPNAME5= <>
##$DPNAME6= <>
##$DPNAME7= <>
##$DPOAL= (0..7)
0.5 0.5 0.5 0.5 0.5 0.5 0.5 0.5 
##$DPOFFS= (0..7)
0 0 0 0 0 0 0 0 
##$DQDMODE= 0
##$DR= 18
##$DS= 0
##$DSLIST= <SSSSSSSSSSSSSSS>
$$ [...]
##$SUBNAM2= <"">
##$SUBNAM3= <"">
##$SUBNAM4= <"">
##$SUBNAM5= <"">
##$SUBNAM6= <"">
##$SUBNAM7= <"">
##$SUBNAM8= <"">
##$SUBNAM9= <"">
##$SW= 16.880792210976
##$SWIBOX= (0..15)
0 0 2 0 0 0 0 0 0 0 0 0 0 0 0 0 
##$SW_h= 3378.37837837838
##$TD= 16384
##$TD0= 1
##$TE= 0
##$TE2= 300
##$TE3= 300
##$TEG= 300
##$TL= (0..7)
0 120 120 120 120 120 120 120 
##$TP= (0..7)
150 150 150 150 150 150 150 150 
##$TP07= 0
##$TPNAME0= <>
##$TPNAME1= <>
##$TPNAME2= <>
##$TPNAME3= <>
##$TPNAME4= <>
##$TPNAME5= <>
##$TPNAME6= <>
##$TPNAME7= <>
##$TPOAL= (0..7)
0.5 0.5 0.5 0.5 0.5 0.5 0.5 0.5 
##$TPOFFS= (0..7)
0 0 0 0 0 0 0 0 
##$TUNHIN= 0
##$TUNHOUT= 0
##$TUNXOUT= 0
##$USERA1= <user>
##$USERA2= <user>
##$USERA3= <user>
##$USERA4= <user>
##$USERA5= <user>
##$V9= 5
##$VALIST= <valist>
##$VCLIST= <CCCCCCCCCCCCCCC>
##$VD= 0
##$VDLIST= <DDDDDDDDDDDDDDD>
##$VPLIST= <PPPPPPPPPPPPPPP>
##$VTLIST= <TTTTTTTTTTTTTTT>
##$WBST= 1024
##$WBSW= 4
##$XGAIN= (0..3)
0 0 0 0 
##$XL= 0
##$YL= 0
##$YMAX_a= 605477
##$YMIN_a= -442429
##$ZGOPTNS= <>
##$ZL1= 120
##$ZL2= 120
##$ZL3= 120
##$ZL4= 120
##$ABSF1= 10
##$ABSF2= 0
##$ABSG= 5
##$ABSL= 3
##$ALPHA= 0
##$AQORDER= 0
##$ASSFAC= 0
##$ASSFACI= 0
##$ASSFACX= 0
##$ASSWID= 0
##$AUNMP= <proc_1d>
##$AZFE= 0.1
##$AZFW= 0.1
##$BCFW= 1
##$BC_mod= 2
##$BYTORDP= 1
##$COROFFS= 0
##$CY= 11.3945322036743
##$DATMOD= 1
##$DC= 2
##$DFILT= <>
##$DTYPP= 0
##$F1P= 16.9975609425685
##$F2P= -3.02152046262296
##$FCOR= 0.5
##$FTSIZE= 0
##$FT_mod= 4
##$GAMMA= 1
##$GB= 0.15
##$INTBC= 1
##$INTSCL= 1
##$ISEN= 128
##$LB= 0.24
##$LEV0= 0
##$LPBIN= 0
##$MAXI= 10000
##$MC2= 0
##$MEAN= 0
##$ME_mod= 0
##$MI= 1.114404
##$NCOEF= 0
##$NC_proc= 0
##$NLEV= 6
##$NOISF1= 3.799351
##$NOISF2= 2.8
##$NSP= 1
##$NTH_PI= 0
##$NZP= 0
##$OFFSET= 15.70392
##$PC= 1
##$PHC0= -10687.14
##$PHC1= 7.600882
##$PH_mod= 1
##$PKNL= yes
##$PPARMOD= 0
##$PSCAL= 0
##$PSIGN= 0
##$REVERSE= no
##$SF= 200.130013532006
##$SI= 16384
##$SIGF1= 3
##$SIGF2= 2
##$SINO= 400
##$SIOLD= 16384
##$SREGLST= <1H.CDCl3>
##$SSB= 0
##$STSI= 0
##$STSR= 0
##$SW_p= 3612.71676300578
##$SYMM= 0
##$S_DEV= 0
##$TDeff= 0
##$TDoff= 0
##$TI= <>
##$TILT= no
##$TM1= 0
##$TM2= 0
##$TOPLEV= 0
##$USERP1= <user>
##$USERP2= <user>
##$USERP3= <user>
##$USERP4= <user>
##$USERP5= <user>
##$WDW= 1
##$XDIM= 8192
##$YMAX_p= 0
##$YMIN_p= 0
$$ End of Bruker specific parameters
$$ ---------------------------------
##NTUPLES= NMR FID
##VAR_NAME=  TIME,          FID/REAL,        FID/IMAG
##SYMBOL=    X,             R,               I
##VAR_TYPE=  INDEPENDENT,   DEPENDENT,       DEPENDENT
##VAR_FORM=  AFFN,          ASDF,            ASDF
##VAR_DIM=   8192,          8192,            8192
##UNITS=     SECONDS,       ARBITRARY UNITS, ARBITRARY UNITS
##FACTOR=    0.000296,      1,               1
##FIRST=     0,             0,               0
##LAST=      2.424536,      0,               0
##MIN=       0,             -442429,         0
##MAX=       2.424536,      605477,          0
$$ Real data points
##PAGE= N=1
##DATA TABLE= (X++(R..R)), XYDATA
$$ [...]
2793E333n035n441L865M202J332l966n769M708N862j938m711k665L746O342l331
$$ 5333 298 -5143 -1278 2924 4256 290 -5479 -771 5091 3153 -1558 -4223 -477 5865 2534
2808B534o111O61L956L894k944o261J465N270J081k591m461K34O469L13m453k120
$$ 2534 -3577 -2916 1040 4934 1990 -4271 -2806 2464 3545 954 -3507 -3273 3196 3509 -944 -3064
2824c064Q42M789R60n175k064L216K886N06m428l090M685L570j856l477k401M354
$$ -3064 -2222 2567 3527 -1648 -3712 -496 2390 2896 -1532 -4622 63 3633 1777 -1700 -4101 253
2840B53M337l322m470K28L160M188l347n267J465M138K158k476n373J013O578
$$ 253 4590 1268 -3202 -2974 186 4374 1027 -4240 -2775 1363 3521 1045 -4328 -3315 3263
2855C263m63l358l480J047O612j08o310r92L113M061J64o663r93O151J824j752
$$ 3263 2800 -558 -4038 -2991 3621 3513 -2797 -3789 -676 3385 3549 -3114 -4107 2044 3868 2116
2871B116n049r10O436K453n082l191P79M930K814o258l235K984L713J219m568
$$ 2116 -2933 -3843 2593 5046 -36 -3227 -2448 2482 5296 -962 -4197 -1213 2500 3719 -849
2886h49l982M337L777j732l163k493L368M263l382l356K09K443L148k405m339
$$ -849 -4831 -494 3283 1551 -1612 -4105 -737 3526 144 -3212 -3003 -560 2588 183 -4156
2901d156J359L473N85j562m015J241M724K8k970k383N83M502J070m815j278J542
$$ -4156 -2797 676 1261 -301 -4316 -3075 1649 1677 -1293 -3676 -3093 1409 2479 -2336 -3614 -2072
2917b072L040J531m593k563L606L000n26l010l178M306L535k542k365j187L245
$$ -2072 968 2499 -2094 -4657 -1051 1949 1423 -1587 -4765 -459 3076 534 -1831 -3018 227
2932B27L168k535l947J786K960J440k565m399K637L954m64k845k706J861M606
$$ 227 3395 860 -3087 -1301 1659 3099 534 -3865 -1228 2726 2262 -583 -3289 -1428 3178
2947C178j163m241n95J611L694o06n193k3L110J810r65l867j108M790P76k361
$$ 3178 2015 -2226 -2821 -1210 2484 1878 -3315 -3338 -228 1582 617 -3250 -4358 432 1208 -1153
2963a153k109n46M467R33l564j890J862K634J318l961k086L728K057n13l068j813
$$ -1153 -3262 -3808 659 1592 -1972 -3862 -2000 634 1952 -2009 -4095 -367 1690 1177 -1891 -3704
2979c704L799K873k698k585r4K661K960l301k578J529K081J257j981k786J730
$$ -3704 95 2968 270 -2315 -2409 252 3212 -89 -2667 -1138 943 2200 219 -2567 -837
2994h37K676j098j051j653R39K585j151k032Q7P28J317L65k426k9J906l72J048
$$ -837 1839 741 -310 -1963 -1024 1561 410 -1622 -1535 -807 510 875 -1551 -1580 326 -46 1002
3011A002k099q82K596L68q68q37q51J600J877j906j490K76J263J836j572k485
$$ 1002 -1097 -1979 617 985 117 -720 -1571 29 1906 0 -1490 -1214 49 1885 313 -2172
3027b172J525J384O20q68k641J618K452j187p10j479N65K737p26k833M75J061
$$ -2172 -647 737 1357 489 -2152 -534 1918 731 21 -1458 -893 1844 1118 -1715 -1240 -179
3043a79J082J7l549Q21K711k4p70k256K32L322j33k979r4P06K009N8l716R36J918
$$ -179 903 920 -2629 -1808 903 879 109 -2147 -1915 1407 1274 -1705 -1799 -1093 916 974 -2742 -1806 112
3062A12J69p23j284j10K905j21k352N34M31J635J42k005K34J688l86r1n62n07
$$ 112 281 -442 -1726 -1836 1069 948 -1404 -870 -439 1196 1338 -667 -433 1255 869 778 216 -291
3080b91K053p48p54M94o27O30M66j528O52P57j172O04k33o65J131p92o65J138
$$ -291 1762 1014 260 754 127 757 1223 -305 347 1104 -68 536 303 -362 769 -23 -688 450
3098D50j034k91O55j001Q91p6j524J322J16n31N50l21L8J500j336k74J552p66
$$ 450 -584 -875 -220 -1221 -330 -406 -1930 -608 -492 -1023 -473 -794 -756 744 -592 -866 686 -80
3116h0N56k20r70J345K61j298M88R9q7J253j632j22J473n91L34o92o39J689J4
$$ -80 476 256 -714 631 892 -406 82 181 94 1347 -285 -407 1066 475 809 117 -522 1167 1181
3135A181j454L51l72M59J281k562j75J696m66K87j001j086J839J036j898K6o05
$$ 1181 -273 78 -294 165 1446 -1116 -1291 405 -61 226 -775 -1861 -22 1014 -884 -858 -1463
3152a463J388J464k544n74J354P87L65j696j823K646J134j386n55j069J634J848
$$ -1463 -75 1389 -1155 -1729 -375 412 777 -919 -2742 -96 1038 -348 -903 -1972 -338 1510
3168A510j821j621J462R67J275j772k302K247J738n21j633j345J625K606j960
$$ 1510 -311 -1932 -470 497 1772 0 -2302 -55 1683 1162 -471 -1816 -191 2415 455
3183D55j835J96J067J906j440k510J207J605Q4q15j971N64K745p40j828n02K06
$$ 455 -1380 -1184 -117 1789 349 -2161 -954 651 735 -80 -2051 -1487 1258 518 -1310 -1812 -1606
3200a606K404n58k436K04J201M98O40k240m18K116K0Q3j107j150K018J199j332
$$ -1606 798 240 -2196 -1992 -791 -293 347 -1893 -2311 -195 -175 -92 -1199 -2349 -331 868 -464
3217d64m61l23P29K046j745j369N20P66J351o72k550Q28J993P3l17k813K83L672
$$ -464 -925 -1248 -519 1527 -218 -1587 -1067 -301 1050 378 -2172 -1344 649 722 405 -2408 -2125 1547
3235A547l86k039j248K42L210L86m185k72K309J428N79m010r56L826J686j785
$$ 1547 1161 -878 -2126 -1884 1326 1712 -2473 -2745 -436 992 1571 -2439 -3395 431 2117 332
3251C32k562l06L963J949m379j764J452L035J188m069j930L089K316p97k835k217
$$ 332 -2230 -2536 1427 3376 -1003 -2767 -1315 1720 2908 -1161 -3091 -2 2314 1517 -1318 -3535
3267c535L701L085l094k440j69K672K479k928l166J995K001P19j605l287K525
$$ -3535 166 3251 157 -2283 -2452 220 2699 -229 -3395 -1400 601 1320 -285 -3572 -1047
3282a047K183n03j794j232P95L485p30k916K00N52K581N2l482l81K306J050L97
$$ -1047 1136 633 -1161 -2393 -1598 1887 1157 -1759 -1559 -1007 1574 1626 -1856 -2237 69 1119 1516
3299A516k815j475L487J392j185j509j301K770K225k452k303M76J949K552k481
$$ 1516 -1299 -2774 713 2105 920 -589 -1890 880 3105 653 -1650 -1174 775 3327 846
3314H46l499K247K118P93j609l634K055L708r78k389j523J144M235j169m490J66
$$ 846 -2653 -406 1712 2505 896 -2738 -683 3025 2047 -342 -1865 -721 3514 2345 -2145 -1979
3330a979K109K837j121m711p1M426O66j463l593n45N516Q15l691j743P36L479
$$ -1979 130 2967 1846 -2865 -2936 1490 2156 693 -2900 -3445 2071 2886 -805 -2548 -1812 1667
3346A667J462m512j805K870K283N74m086j665L915K531k295k028j511L402L841
$$ 1667 3129 -1383 -3188 -318 1965 2539 -1547 -3212 703 3234 939 -1089 -2600 802 4643
3361D643l989l033J174K699K366l217l790K405L137K97k251l434J749M419j439
$$ 4643 654 -2379 -1205 1494 3860 643 -3147 -742 2395 2692 441 -2993 -1244 3175 1736
3376A736k582j326J151L817o17m109K48K086J761J21m164k41L905M46j211k262
$$ 1736 -846 -2172 -1021 2796 2179 -1930 -1682 404 2165 2286 -1878 -2119 1786 2232 1021 -1241
3392a241r18L673J611l317j119K8K770J851l356k150K313J424J273k109l602K726
$$ -1241 -2159 1514 3125 -192 -1311 -1283 1487 3338 -18 -2168 145 1569 2842 733 -2869 -143
3408a43K732q81j909k456J492L910j148l455o30J541L024l17m875N90L102J570
$$ -143 2589 1708 -201 -2657 -1165 2745 1597 -1858 -2488 -947 2077 1760 -3115 -2525 577 2147
3424B147j106m162K72N016M46l437k052L95M903M84n043j018K552K489M50m369
$$ 2147 1041 -3121 -2849 2167 2613 -824 -2876 -2481 2422 2906 -2137 -3155 -603 1886 2336 -2033
3440b033j662M354K132j779k227j574M231K277l689k022O87K219K017k704k997
$$ -2033 -3695 659 2791 1012 -1215 -2789 1442 3719 30 -1992 -1305 914 2931 227 -2770
3455b770K322J852K11j719k923K089L351j522j953o05R18K908j433k703L42P01
$$ -2770 -448 1404 1615 -104 -3027 -938 2413 891 -1062 -1667 -749 2159 726 -1977 -1635 -934
3471i34J955k52l311j70K419O71l20k357j191L431R19j572j081q62K736K059l026
$$ -934 1021 769 -2542 -2712 -293 378 58 -2299 -3490 -59 860 -712 -1793 -2655 81 2140 -886
3488h86j670J207J564J809k603k882K593K031k02j692k168K102L525j874k261
$$ -886 -2556 -1349 215 2024 -579 -3461 -868 1163 961 -731 -2899 -797 2728 854 -1407
3503a407o28J735L149j432l950O30K548P79p08l760M24L732j65k048k102O48L368
$$ -1407 -2035 -300 2849 1417 -2533 -1903 645 1424 716 -3044 -2620 1112 947 -1101 -3203 -2555 813
3520H13j0l049m38J385K042N77l412n12K589J044p28j963q47K524J421j967j136
$$ 813 803 -2246 -2684 -1299 743 1320 -2092 -2604 -15 1029 301 -1662 -2509 15 1436 -531 -1667
3537a667n5J845J922k364j604J267J512Q44j463k122J667J977q44q90j748P73
$$ -1667 -1722 123 2045 -319 -1923 -656 856 1700 237 -1885 -218 1759 915 25 -1723 -950
3553i50K409j320j829K81M88J929p60k547J021J373K32J04k309J66K414k16j183
$$ -950 1459 139 -1690 -1409 -921 1008 248 -2299 -1278 95 327 431 -1878 -1712 702 486 -697
3570f97n17m43J731Q24k538j78O34R22J117j620j314J897M62K59m17j689J626
$$ -697 -1214 -1657 74 898 -1640 -1818 -1184 -262 855 -765 -2079 -182 280 539 122 -1567 59
3587E9J533j097m93m44J49K275j424j613O54M86J051m78j770M15J836m52l04j293
$$ 59 1592 495 2 -442 -293 1982 558 -1055 -401 85 1136 658 -1112 -697 1139 687 383 -910
3605i10k1K660p50j826J99P2J502j9k412k64J858j81Q6j494l28K393j48j150l81
$$ -910 -931 1729 979 -847 -648 -576 926 907 -1505 -1769 89 -92 -6 -1500 -1828 565 417 -733 -1114
3624a114M88R26P93j797L21Q88O9O66j140o21J445J08o32l4p12J026R95j787M49
$$ -1114 -626 300 1093 -704 -383 505 574 1240 100 -521 924 1032 400 366 -346 680 1675 -112 337
3643C37N24j29O85p26q84J317n43k78K27r95K48Q90j327J64J70o97P55j48o34
$$ 337 861 732 1417 691 -193 1124 581 303 530 -465 -217 673 -654 -490 -320 -1017 -262 -410 -1044
3662a044Q43l50j50J032r99p4Q08m88Q96k06j067R69K97n79N55m50L18R81j255
$$ -1044 -201 -551 -701 331 -668 -742 66 -422 474 268 -799 170 467 -112 443 -7 311 1292 37
3681C7N8O54J59K44j88q40J632l09r11L38k44N68N23j797n7Q01o5J67p25q12J712
$$ 37 95 749 908 1152 964 124 1756 1447 536 874 630 1198 1721 -76 -133 668 603 770 45 -767 945
3702I45J5j031J49k49P66M28j467p88J591k6j00p99p91J897m05q47j24j4Q22R12
$$ 945 960 -71 78 -171 595 1023 -444 -1232 359 333 233 -566 -1357 540 135 -712 -836 -850 -28 884
3722H84j613m16J153N7O28p39p98J187L71l76mj008P39J403j385k32K07OJ213
$$ 884 -729 -1145 8 65 693 -46 -844 343 714 338 334 -674 65 1468 83 -149 58 64 1277
3741A277n04j262N79P32j55n8j331M53J123l90n09o13L4J445K05k079L2L78P60
$$ 1277 773 -489 90 822 667 609 -722 -269 854 464 -45 -658 -624 821 1026 -1053 -1021 -643 117
3760A17R17k242k34J538L82l65j070m83J790Q61j863k01j46J111J300j408j167
$$ 117 1034 -1208 -1442 96 478 113 -957 -1440 350 1211 -652 -853 -999 112 1412 4 -1163
3777a163J142O28J73r85j525J573J080n36p90j140J242J721j169j599L16O52J349
$$ -1163 -21 607 780 -205 -1730 -157 923 387 -403 -1543 -301 1420 251 -1348 -1032 -380 969
3794I69n08k252M42J408L85l26j961P8K173J91j438o82M4K207K06k315m37J314
$$ 969 461 -1791 -1349 59 444 118 -1843 -1765 408 599 -839 -1521 -1477 730 936 -1379 -1816 -502
3812e02R88N47j961j124K228Q10j91j916n45J932J518j679j424P1J434J561j820
$$ -502 486 1033 -928 -2052 176 986 795 -1121 -1666 266 1784 105 -1319 -1248 186 1747 -73
3829g3j900J235J320N71j186j845J369J843p27j013r26N55K140o59k268M2J116
$$ -73 -1973 -738 582 1153 -33 -1878 -509 1334 607 -406 -1332 -777 1363 704 -1564 -1522 -406
3846d06J452m37k437M40J711Q23p30j887k66K598M47j233j302l79K124J383k436
$$ -406 1046 609 -1828 -1388 323 1146 416 -1471 -1737 861 1308 75 -1227 -1606 518 1901 -535
3863e35j387J116J601P36k125k203J851K114l70j566j489J767K558j371j828p18
$$ -535 -1922 -806 795 1531 -594 -2797 -946 1168 798 -768 -2257 -490 2068 697 -1131 -1849
3879a849J728K064j488k685P56K132R32j278k852R02L181o8k033j449J134K823
$$ -1849 -121 1943 455 -2230 -1474 658 1590 312 -2540 -1638 1543 1475 -558 -2007 -873 1950
3895A950j27k661q39J653J970k01l232j88K105J162p93j869l36K205J168j829
$$ 1950 1823 -838 -1677 -24 1946 1745 -1487 -1675 430 1592 799 -1070 -1406 799 1967 138
3911A38q57j16K027R80j803j264R51J463N40j697j848J251J918k57j507j908J139
$$ 138 -719 -835 1192 2172 369 -895 56 1519 2059 362 -1486 -235 1683 1426 -81 -1989 -850
3928h50K447m30j969p14J037K192l56k732l97J769J765p19k844J8K597Q86j508
$$ -850 1597 1167 -802 -1516 -479 1713 1357 -1375 -1772 -3 1762 1043 -1801 -1783 814 1700 192
3945A92k135RL165M41k318j294O78K789P45k451j899K649J662q7k460j315K691
$$ 192 -1943 -1934 1231 1672 -646 -1940 -1262 1527 2272 -179 -2078 571 2233 2146 -314 -1629 1062
3962A062J740j567k145n40K195J836j984k200N94K043J309j905k347J355K108
$$ 1062 2802 1235 -910 -1450 745 2581 597 -1603 -1009 1034 2343 438 -1909 -554 1554
3977A554M8j373j773R81K537j014j571r58J080J948m24k421p8J824Q54K9k453
$$ 1554 1602 229 -1544 -563 1974 960 -611 -1569 -489 1459 1035 -1386 -1464 360 1214 1243 -1210
3994a210j80K486M41o12j794r4K251R09k078j023J98J573J334k478j205J277J393
$$ -1210 -1390 1096 1537 925 -869 -963 1288 2197 119 -904 -706 867 2201 -277 -1482 -205 1188
4011A188O02j704j547J236K308j219j046r73Q59K265j356j720j54J030J485p63
$$ 1188 1790 86 -1461 -225 2083 864 -182 -1155 -296 1969 613 -1107 -1261 -231 1254 491
4027D91k657K12J817Q67p79j937LK475M93j580r00J41K276P44k780r64J419J671
$$ 491 -2166 -1954 -137 730 -49 -1986 -1983 492 985 -595 -1495 -1354 922 1666 -1114 -2078 -659 1012
4045A012m5k051j306K317J769p60j698r33K362J817j641j692K36J613J474j701
$$ 1012 967 -1084 -2390 -73 1696 936 -762 -1695 667 2484 843 -849 -613 1000 2474 773
4061G73k166J204J439M7j356k007J467K191j030j307r84R16K196p44k180K17R03
$$ 773 -1393 -189 1250 1297 -59 -2066 -599 1592 562 -745 -1729 -813 1383 639 -1541 -1324 -421
4078d21J098l58k216J61J942J8p84j147j68J907J61j314p5O2J358P22j493o93
$$ -421 677 319 -1897 -1736 206 224 -560 -1707 -1875 32 193 -1121 -1196 -1134 224 946 -547 -1240
4096a240R11M94R12j277j101J338M98j74o39q54O09J394n27j101m58N72J939o50
$$ -1240 -329 165 1077 -200 -1301 37 535 361 -278 -1132 -523 871 344 -757 -1215 -643 1296 646
4114F46j823J97Q90J058l81j699l29K399j65p84j192l55K263L10k000m46P23J227
$$ 646 -1177 -980 -90 968 587 -1112 -1441 958 793 9 -1183 -1538 725 1035 -965 -1411 -688 539
4132E39M72k172m11J667Q85l79j664j64J584R22j673p58J77J341Q61k279m29J298
$$ 539 1011 -1161 -1572 95 980 601 -1063 -1227 357 1279 -394 -1152 -975 366 1227 -1052 -1481 -183
4150a83M82j81p76r34J512N85q83j81n55R54P43q68n53L51J48N07j04j164P65
$$ -183 299 118 -658 -1592 -80 505 -378 -559 -1114 -160 583 -285 -838 -487 -339 168 64 -1100 -335
4169c35K30k05J52n37J84O93J73n36J28o18N84P74j176M33j14M2P85q25n68J093
$$ -335 -105 -310 -158 -695 -511 182 355 -181 -53 -671 -87 687 -489 -56 -170 -128 657 -168 -736 357
4189C57k20J29J31j057N25N55m27N2q6j49J120q24n14N78j67L88k1r91K85P38
$$ 357 137 266 397 -660 -135 420 -7 45 -41 -190 930 106 -408 170 3 391 370 -621 -336 402
4209D02o11K84o88r9J189n96n93P15q75R77J19r19L46L80L2K87m34o96J408l69
$$ 402 -209 75 -613 -712 477 -119 -712 3 -872 105 224 -695 -349 31 63 350 -84 -780 628 259
4229B59o2L4l70R92n5q22K92O50p06O76p30l24J439p50n89L83k78K36N27j435
$$ 259 197 231 -139 853 798 -24 268 918 212 888 158 -166 1273 523 -66 317 39 275 802 -633
4249f33L47R19m24K10j081J8J205m18q74L69j30Q67j07j213Q55N21m08L79j016
$$ -633 -286 633 209 419 -662 -644 561 143 -731 -362 -492 375 268 -945 -90 431 23 402 -614
4268f14L49J144m84q43L62l9P16L37j758O49R66k41J58r09p2J281l39n38J7p5
$$ -614 -265 879 395 -448 -86 -125 591 928 -830 -181 785 544 702 -207 -279 1002 663 125 142 67
4288F7P45J19j392O85O17n86O57q62R9P21n32jK77r33P41J27n46J37K25r98J285
$$ 67 812 931 -461 224 841 255 912 50 149 870 338 337 614 -319 422 549 3 140 365 -633 652
4309F52k71q88N84m58P08J44j042j83Q22k32O77j216q00J593K80k06p76m35J008
$$ 652 381 -507 77 -381 327 471 -571 -754 68 -164 513 -703 -1503 90 370 164 -612 -1047 -39
4328c9J062j389p59R36L80Q71j294j060J470N76m28q62p39J421J464j835j030
$$ -39 1023 -366 -1125 -189 191 1062 -232 -1292 178 754 326 -536 -1275 146 1610 -225 -1255
4345a255P39P48J031j435j462J322J217n32m22j376J087J630j160r88j01N67J496
$$ -1255 -516 232 1263 -172 -1634 -312 905 373 -49 -1425 -338 1292 132 -856 -957 -390 1106
4362A106n90j570N86Q77J55J49j737L63J655l67n45q43j38J814l5j701Q0M23L63
$$ 1106 516 -1054 -468 409 564 713 -1024 -661 994 627 82 -761 -899 915 880 -821 -741 -318 45
4381D5R58j756o41J327K69J61p14j328J349Q61o32o16o91N96J509q71j014o9M62
$$ 45 1003 -753 -1394 -67 202 363 -351 -1679 -330 531 -101 -717 -1408 -812 697 -174 -1188 -1257 -795
4400g95J384m32j964O36J376L9l78j472N87J971k31j232n70M7J808L96k297j55
$$ -795 589 157 -1807 -1171 205 244 -134 -1606 -1019 952 721 -511 -1081 -1034 774 1170 -1127 -1282
4418a282J100Q63L65j878p98J871J085p10j297j140K229R90j246j228N9J042J560
$$ -1282 -182 681 1046 -832 -1630 241 1326 616 -681 -1821 408 1398 152 -1076 -1017 25 1585
4435A585j704j979J604Q91O72j234j935J570J994j091r58p38Q43K021r20j985
$$ 1585 -119 -2098 -494 397 1069 -165 -2100 -530 1464 373 -585 -1323 -480 1541 621 -1364
4451a364N18N64J403m88k322M12J807J89q56j490K61K320Nj442m51J48J597Q56
$$ -1364 -846 -282 1121 633 -1689 -1277 530 719 -137 -1627 -1366 954 959 -483 -934 -786 811 1667
4469A667k361n81J402N67L57j769n61J684M66o02n43p87J000J467j261j004NO01
$$ 1667 -694 -1275 127 694 1051 -718 -1279 405 871 269 -274 -1061 -61 1406 145 -859 -854 -253
4487b53J442o33j757M82Q45Q01l44k016J79J901K59p16j360O0K180N24j974o48
$$ -253 1189 556 -1201 -719 126 927 583 -1433 -1254 647 906 190 -1170 -1110 1070 1594 -380 -1028
4505a028P68J490M67k509l79K063Q83l66j935n94K221R90j559j071k27J965J084
$$ -1028 -260 1230 1697 -812 -1191 872 1755 1389 -546 -1140 1081 2071 512 -559 -786 1179 2263
4522B263k107j442P49J571N09j707j659J439J903o84j317j162J224J898j329j594
$$ 2263 156 -1286 -537 1034 1543 -164 -1823 -384 1519 835 -482 -1644 -420 1478 149 -1445
4538a445K07J000J562r15k095P25J317M31m63j746M63J983k94p17o83j44K093
$$ -1445 -1238 -238 1324 409 -1686 -961 356 787 324 -1422 -959 1024 730 13 -670 -814 1279
4555A279P8j558n60O99R93O14j595r40J328P58R1r41j300J692J130o46j188o41
$$ 1279 1357 -201 -761 -62 931 1545 -50 -990 338 1096 1187 246 -1054 638 1768 1122 -66 -707
4573g07Q04J755j400j240N89M62J452j071j993Q09J495Kl74j736L17J857j20j323
$$ -707 97 1852 452 -788 -199 263 1715 644 -1349 -540 955 957 583 -1153 -836 1021 901 -422
4591d22p24K82J893K7k050m12J377O59J75j871p26K287M21m97j117n37J832Q71
$$ -422 -1146 -864 1029 1056 -994 -1406 -29 630 805 -1066 -1792 495 916 419 -698 -1235 597 1468
4609A468j514p02J47J055J162j418j509J267Q76J92r34j353J231J574p16j305
$$ 1468 -46 -748 -601 454 1616 198 -1311 -44 832 1024 90 -1263 -32 1542 826 -479
4625d79l93Q29J419q65j400RQ99P89m09j743K47J619j37l97j129J51J607j12j352
$$ -479 -872 -43 1376 511 -889 -880 19 808 399 -1344 -1097 522 385 -12 -1141 -990 617 505 -847
4644h47l3M47Q54M04j811n3R13N70J03j128o36J343M31l23n26o18P81R98p30n60
$$ -847 -880 -433 421 825 -986 -1039 -126 444 547 -581 -1217 126 557 234 -292 -910 -129 869 139 -421
4664d21j45M69R05p01j133O45N09N89m93j407N42J276n0p74o67K63J393j2j575
$$ -421 -566 -97 808 107 -1026 -381 128 717 224 -1183 -641 635 585 -189 -856 -593 800 788 -787
4683g87j62P25Q06o4j161m34J001O89l41j114k75J598J35q63n07j07J235K58j130
$$ -787 -949 -224 582 518 -643 -1077 -76 613 272 -842 -1117 481 616 -247 -754 -861 374 632 -498
4702d98n94N35P82K22r05r36J358O91n90p88k89J072M84o69o65M26J22P39l72
$$ -498 -1092 -557 225 447 -458 -1394 -36 655 65 -723 -1012 60 544 -125 -790 -364 -242 497 125
4721A25o87N17k08M32j05n14M2J006n24k04K4n74J150M0m95m16M06K78K28p27
$$ 125 -562 -45 -253 179 74 -440 -398 608 84 -120 -96 -670 480 520 25 -391 15 293 521 -206
4741b06k06N24n1J18j81n70N87L78o21K81m02NJ274j015k73k2K18O28l89o88K95
$$ -206 -412 112 61 179 -2 -572 15 393 -228 53 -349 -344 930 -85 -358 -380 -162 466 77 -611 -316
4762c16P76n21N8o02J07R14m83n48J51P2L77k84m17P13L32p04M15n99J99N43j73
$$ -316 460 -61 -3 -605 -498 416 -67 -615 -464 -392 -15 -299 -716 -3 329 -375 40 -559 -360 183 10
4783A0j11J99j69K55J47m68L81j30j82N69j42j50L6q9j75K11Lj68K38l80N00m42
$$ 10 -101 98 -71 184 331 -137 244 114 -68 501 359 209 245 156 -19 192 195 27 265 -115 385 -57
4805e7j63K97j42J92K17k06l17M54m87M59qo36P14l03m45N25P6J36J36m89L47
$$ -57 -220 77 -65 127 344 138 -179 275 -212 247 239 -397 317 14 -431 94 170 306 442 -47 300
4826C00k86J14K45N4m17J95l8PQ0k75J06M95n99L42l42J0K42J22o73J68J53L5
$$ 300 14 128 373 427 10 205 167 174 254 -21 85 580 -19 323 -19 -9 233 355 -318 -150 3 38
4848C8L79p08m42J116k85K5j85l39M48M97m94%r2n2N66p75J64kM42L17o73m95
$$ 38 417 -291 -733 383 98 123 -62 -401 47 544 50 50 -42 -94 472 -303 -139 -141 301 618 -55 -550
4870e50O69N34l91k43l12L30O64k85p99K97l6M85M86j043K40J27J99K03q30J80
$$ -550 119 653 262 19 -293 37 701 416 -383 -86 -122 363 849 -194 46 173 372 575 -255 -75
4890g5O25K84m02n21j23O67N94j457K1J92M04M35r42n57P99O02m22j60j128J021
$$ -75 550 834 432 -89 -212 455 1049 -408 -387 -195 209 644 -298 -855 -56 546 124 -36 -1164 -143
4910a43Q67r26k34m10K66J037n38r38O29K76M38m63q46O25P36n62K6k92J25J107
$$ -143 724 -202 -436 -846 -580 457 -81 -1019 -390 -114 324 -139 -985 -360 376 -186 -160 -452 -327 780
4930G80l53p25J67j50J019j8r78l00O10M13R1n96q66J305J93m85n52n47J063R92
$$ 780 427 -298 -131 -281 738 720 -258 -558 52 465 556 -40 -906 399 592 107 -445 -992 71 1063
4950A063j028o97K68K41J103o92j473Q02J153j40q41j053M51J670l61r83m56N51
$$ 1063 35 -662 -394 -153 950 258 -1215 -413 740 600 -241 -1294 -843 827 466 -517 -973 -422
4968d22J620o97j495J18J034Q78n33j512K28J251J43q07p79J16J379K22j345l44
$$ -422 1198 501 -994 -876 158 1036 503 -1009 -781 470 613 -194 -973 -857 522 744 -601 -945
4986i45M12O74R06j953j8Q77N30J64j355p04J431P55q53p47j58P42J119r95n53
$$ -945 -533 141 1047 -906 -924 -47 483 647 -708 -1412 19 774 -79 -826 -984 -242 877 -118 -671
5005f71L6M96Q16k95j444N66Q60J61k00j474M59J298q4p68m89M0J375L9j108o00
$$ -671 -635 -139 677 382 -1062 -496 364 525 325 -1149 -690 608 524 -244 -733 -693 682 721 -387 -987
5025i87Q62R75K75j819m73J494R40o88j018q48J707R55j405n47j44J052P95j360
$$ -987 -125 850 1125 -694 -1167 327 1267 579 -439 -1287 420 1375 -30 -577 -721 331 1126 -234
5043b34j194O75J180K36q61j360R53J607n25q80r33J117J327n16j586L35M40J305
$$ -234 -1428 -753 427 663 -198 -1558 -605 1002 477 -403 -1336 -219 1108 592 -994 -659 -219 1086
5061A086o85j790N60J181O54n55j087j53J969J8j229m92j6J571L94j752p64J079
$$ 1086 401 -1389 -829 352 1006 451 -636 -789 1180 1198 -31 -523 -539 1032 1426 -326 -1090 -11
5079a1O07L89j399q34J577K76n3q46p10J268J026j281o81K54M88J049j046j216
$$ -11 596 985 -414 -1248 329 605 552 -294 -1004 264 1290 9 -672 -418 70 1119 73 -1143
5097a143R12P51N13p73j399N78J508k23o72n37k16J785l10r73m63N15J084L18
$$ -1143 -231 520 1033 260 -1139 -561 947 724 52 -485 -701 1084 774 -199 -662 -147 937 1255
5115A255j615l31Q35N46J28j188p46J696O19r48q53k90J203J466j748r48O31O07
$$ 1255 -360 -691 144 690 818 -370 -1116 580 1199 251 -602 -892 311 1777 29 -919 -288 319
5133C19R26j006j417J000J146j99p15j427Q24J785o90q55m16Q32J278q46j650
$$ 319 1245 239 -1178 -178 968 769 54 -1373 -549 1236 546 -309 -725 107 1385 539 -1111
5150a111M27J117L86l79j554L46J585l5q07o68J28J600j11j464k3L00R17K27j613
$$ -1111 -684 433 819 440 -1114 -768 817 782 -25 -693 -565 1035 924 -540 -563 -263 654 881 -732
5169g32l3J168K20J49j069p09J549J83m69j18m20M23P46m18j008L41J13P65j63
$$ -732 -765 403 623 772 -297 -1006 543 726 257 139 -281 142 888 470 -538 -197 -84 681 518
5188E18j248M57P03k5Q1j122J5J469p4p98m76o3J173M19j917K47M87O51K85j488
$$ 518 -730 -273 430 405 486 -636 -621 848 774 -24 -500 -563 610 1029 -888 -641 -154 497 782 -706
5208g06o06J500O91p45n97p12J382P10j226l70J73N27Q44j117q57J078K80K01
$$ -706 -1312 188 879 134 -463 -1175 207 917 -309 -679 -506 21 865 -252 -1109 -31 249 450
5226D50o54j277J298R21p95n08k33N45J171p19j096N65K97P09m33j131N05R47
$$ 450 -204 -1481 -183 738 -57 -565 -798 -253 918 199 -897 -332 -35 674 241 -890 -385 562
5244E62l41J61p33j39J287j25r58O9R7N14K20r16J9L55Q8J70m49m77R06lm94O1
$$ 562 221 382 -351 -490 797 672 -286 -217 -120 394 614 -302 -283 72 160 330 -119 -596 310 307 -187 -126
5266a26l87L39P21q43j61L30r1M98j51j027K36Q53k91M93q69j8O18k47J67l36
$$ -126 -513 -174 547 -296 -457 -127 -218 280 129 -898 -662 191 -100 393 -476 -494 124 -123 44 -292
5286b92j90O98m8o74J05m0L25O90r06l09P06k32M28m22m69Q48K73o74J33k82L23
$$ -292 -482 216 168 -506 -401 -441 -116 574 -332 -641 65 -167 261 -161 -630 218 491 -183 -50 -332 -9
5307iP86j001m77O09lM63j19j213R49J95k54K33m21J44P06n22o50O23J55J25j72
$$ -9 777 -224 -701 -92 -95 368 249 -964 -15 180 -74 159 -262 -118 588 66 -584 39 194 319 147
5328A47q46O44L39l54nk15J18P15o88j30M52k31N00k23o18O72Qk65K65q9k52N43
$$ 147 -699 -55 284 -70 -75 -290 -172 543 -145 -275 177 -54 446 223 -395 277 285 20 285 196 -56 487
5350D87o59P0L08n03M61j57m55R47l35o84M18n2J46L18r41M38M09l08o4k07K05
$$ 487 -172 -102 206 -297 164 7 -448 499 164 -520 -102 -154 -8 310 -631 -193 216 -92 -156 -363 -158
5371a58L60o1p14J94L52j79K82n76N47M67m39l4L8J82O61n82m76N27k11J79J54
$$ -158 202 141 -573 -379 -27 -206 76 -500 47 514 75 41 79 261 922 340 -136 391 180 359 513
5392E13n87K90K53k81m0J80k44M00k53k18R67r52j0N22l42Q6M0o26M93J6k01J26
$$ 513 -74 216 469 188 148 328 84 484 231 13 980 28 18 540 198 284 324 -302 191 207 6 132
5414A32m93L96N62m88k57L89Q6R8n0q94P08L00j49k83o92N43Q00o05q75M47K43
$$ 132 -361 35 597 109 -148 241 327 425 375 -519 189 489 340 57 -635 -92 708 103 -772 -325 -82
5435h2L78J26j134M54N41J21j79o93Q3J381m93n10j49K2Q15j60q46j07N65J44
$$ -82 296 422 -712 -258 283 404 225 -468 -385 996 503 -7 -156 -134 681 521 -325 -432 133 277
5455B77J63q68j28Q30J12j21m45JO50J99n58k30M0J43Q02q46o28M41M98j21j78
$$ 277 440 -428 -556 274 386 265 -180 -179 471 670 112 -118 -78 65 867 21 -607 -166 332 211 33
5476C3r19O66P89n21j83j61M96O56n70q12M18K22M88N9j295J78P01J79j82m65
$$ 33 -886 -220 569 48 -135 -296 200 856 286 -526 -108 114 602 661 -634 -456 245 424 242 -223
5496b23m37Q59L36m07n90j36J077N33r92o54L34L95N90o60r87M85P92j07o56n66
$$ -223 -660 199 535 128 -462 -598 479 1012 20 -634 -300 95 685 25 -962 -477 315 208 -448 -1014
5516a014O84J101n98m62p09R24P54n13j232P33Q57K63p03q86J17J312j18n92j073
$$ -1014 -330 771 173 -289 -998 -74 680 167 -1065 -332 525 788 85 -801 -684 628 510 -82 -1155
5535a155N86J404j91j528L31L43R00Q1j480J3Q86M86l41r36l64J371L88r01m18
$$ -1155 -569 835 644 -884 -553 -210 690 771 -709 -696 190 676 335 -601 -965 406 794 -107 -525
5554e25r2R76K64j080m31O39L76L97p77m86O66N33j46n87m55J06J536r66p22J74
$$ -525 -617 359 623 -457 -888 -249 127 524 -253 -739 -73 460 314 -273 -728 -622 914 -52 -774 -600
5574f00M45O93m05q46J41L48O87p3j063q0J098M36l75j013j27J281M73j240k31
$$ -600 -155 538 133 -713 -572 -224 463 390 -673 -753 345 781 406 -607 -734 547 1020 -220 -451
5593d51l94J226P32j301r75P24Q16L34r37q97J159J065n88j135k32N19J313r93
$$ -451 -845 381 1113 -188 -1163 -439 377 711 -226 -1123 36 1101 513 -622 -854 -335 978 -15
5611a5q41L5Q48Q25r28j250O06J086J79p16n71K65J421j68j232k43M46J284j83
$$ -15 -856 -821 27 852 -76 -1326 -720 366 545 -171 -742 -477 944 776 -456 -699 -253 1031 848
5630H48j373k0Q97L15qj194k52J324L71n87n18m65R76O78j122l37L26L66O41q15
$$ 848 -525 -545 352 667 659 -535 -787 537 908 321 -197 -662 314 992 -130 -467 -141 225 866 51
5650E1r26O06Q08N0n05j351R33J081l60p64p04P70J042k1j183j13N56P09l43j259
$$ 51 -875 -269 539 589 84 -1267 -334 747 387 -377 -1081 -311 731 710 -473 -586 -30 679 336 -923
5670i23K85P95M61k64r43j61J215J61o01n64J11R06M05j458k40M10Q62M78j211
$$ -923 -638 157 618 354 -589 -750 465 626 25 -539 -428 478 883 -575 -815 -405 457 935 -276
5689b76p30J047O39k76k96q75R31P04n72r62K54N89R42p48j050L42P92N27p18
$$ -276 -1006 41 680 404 108 -767 164 868 296 -666 -412 177 1119 371 -679 -337 455 982 264
5708B64q93M52J099L4j182j06k47J440k21j146o5L65P31k28o77m31J311K40n53
$$ 264 -629 -177 922 956 -226 -332 -579 861 640 -506 -571 -206 525 297 -380 -811 500 740 187
5727A87j003M34P19K62o66m81R2P52L83q44m18L19L36L94p60o69P62K57L80o05
$$ 187 -816 -382 337 599 -67 -548 -456 296 679 -165 -583 -264 72 466 -294 -963 -201 56 436 -169
5747a69m72M86Q69m37n52k05K74P65l23p25J86N58J91K11q40m34J020M01l63m60
$$ -169 -641 -155 714 277 -275 -480 -206 559 236 -489 -303 255 446 657 -183 -617 403 804 441 -19
5767a9n75J000L70o15l98l8P89J99j020m55N57Q94j44m94j041R84P53o54l71m84
$$ -19 -594 406 776 161 -237 -275 514 713 -307 -762 -205 689 545 51 -990 -6 747 93 -278 -762
5787g62R40M34p20l37K87J58M23m43q82O06O22l8m38m57L42O83l5m88q1q8P31
$$ -762 178 612 -108 -445 -158 0 423 -20 -902 -296 326 288 -150 -607 -265 418 383 -105 -186 -274 457
5808D57Lp94K03p8O01k20l98r0N13R7J7l68m12O44J22l09r4k25J62O21n34m66
$$ 457 460 -334 -131 -209 392 172 -226 -316 197 294 311 -57 -469 175 297 -12 -106 -331 -169 452 -82 -548
5830e48L99NN79j38p06L81O43p04M9k79J8J010n78k79j58L67R0O7n62J68M94j65
$$ -548 -149 -144 435 297 -409 -28 615 -89 -40 -319 -301 709 131 -148 -306 61 151 218 -344 -176 318 153
5852A53J06m52r5R27m51l24J82p0N83Np78K6N67k80L34k21m70L38L42l63Q8k31
$$ 153 259 -193 -288 639 188 -136 46 -24 559 564 -214 -188 379 99 433 212 -258 80 422 59 147 -84
5874h4l3M87m93J09k51Q8N39m28j96J83j13P7L45n40J74K72l08J46O8m98N81P0
$$ -84 -117 370 -123 -14 -265 -177 362 -66 -262 -79 -192 -115 230 -310 -136 136 -172 -26 42 -456 125 195
5896A95k86J46j42J45J44l20L8L0r3J23R4l06N28k39j55N27k94j44K22q7L10p9
$$ 195 -91 55 -87 58 202 -118 -80 -50 -143 -20 74 -232 296 57 -98 429 135 -9 213 126 436 357
5918C57J8j2J20n31L19n4l67M65k85PJ66l47J27N62o08K55J71k73R0j74LK78n05
$$ 357 375 363 483 -48 271 217 -150 315 30 37 203 -144 -17 545 -63 192 363 90 180 6 9 287 -218
5941b18K09J95n40N91L33p81K32L14n08O16j71n50M69p9k22L58m91N7N17o94L43
$$ -218 -9 186 -354 237 570 -211 21 335 -173 443 272 -278 191 112 -110 248 -243 -186 331 -363 -20
5962b0j74j29L67k7l81K57k5J70N37o59m8K98k31N31o28P5K47J15j94k19m6J95
$$ -20 -194 -323 44 17 -364 -107 -132 38 575 -84 -132 166 -65 466 -162 -87 160 275 81 -138 -184 11
5984A1M97p53j52N49j8J68n77P8K29O01n34J65p14M36O11n40k77Q5n1Q74n00o97
$$ 11 508 -245 -397 152 134 302 -275 -197 32 633 99 264 -450 -14 597 57 -220 -135 -186 688 188 -509
6006e09O84K3l1L10o54K86K83j11j74j20L3N18j38o39K95j52o3P45o89l04M03
$$ -509 175 198 167 477 -177 109 392 281 107 -13 20 538 400 -239 56 -96 -159 586 -103 -407 -4
6027dj06L55l34n48N58K36j08k43n45L79P64k08n04J08J22Q54p07m44J27K91j
$$ -4 -110 245 -89 -637 -79 157 49 -194 -739 -360 404 196 -308 -200 -78 776 69 -375 -248 43 42
6048D2K16o71J50P58k26n16j23l5R58J07j057J1M15K27J66m72p69J172M1l18k92
$$ 42 258 -413 -263 495 269 -247 -370 -405 553 660 -397 -386 29 256 422 -50 -819 353 394 76 -216
6069b16m73R03M22q90k53L90P3O98o87p18N99M08L2l1r29N10P24m51n7o19N1J131
$$ -216 -689 214 636 -254 -507 -117 -44 654 -33 -751 -152 256 288 257 -672 -162 562 111 54 -565 -514 617
6091F17n09n84K44N2M31l5j128O7Q27J41K5m87n06R47K13o64M6l64P04O53r37
$$ 617 108 -476 -232 -180 251 216 -912 -845 -18 123 148 -339 -845 102 315 -349 -303 -667 37 690 -247
6112b47k74K16M00M80j021m86Q66O02l18n18o02O50P67m10m61k58M74P12n02n92
$$ -247 -521 -305 95 575 -446 -932 -66 536 218 -300 -902 -252 515 105 -356 -614 -140 572 70 -522
6132e22oM33O46l20j094J93J125l5n63l70K50R47j5r90k59L32Q79k6j079r9P22
$$ -522 -528 -95 551 231 -863 -670 455 420 -143 -513 -263 684 669 -321 -580 -248 631 605 -474 -573 149
6153A49K53j8o66l41Q23M29n28m91k68M84P76p82n50M40Q57K7p36p73N70P78l02
$$ 149 402 384 -282 -623 200 629 101 -390 -658 -174 602 -180 -730 -290 567 594 -142 -915 -345 433 131
6174A31m28n03N44Q50k86n98k06M39P29l43j064M61L49L77j71o75k25J222k30
$$ 131 -297 -800 -256 594 308 -290 -496 -57 672 329 -735 -274 75 452 281 -394 -619 603 373
6193C73l58k89l84J090M90j133l75L13K82Q32j102m51P29K31L82r24o69Q00Q30
$$ 373 15 -274 -658 432 922 -211 -586 -273 9 841 -261 -712 17 248 630 -294 -963 -163 667
6212F67l49o40p6J24J155m48j057J22O83N61k52j274J48J144L18r14k46j13J401
$$ 667 318 -322 -398 -274 881 433 -624 -502 181 742 490 -784 -636 508 826 -88 -334 -447 954
6231I54k76q90l69J46R93K18j188q1L95P73k01j028l95J435K73o35l86k43Q24
$$ 954 678 -212 -581 -435 558 776 -412 -493 -98 675 474 -554 -949 486 759 124 -262 -505 319
6250C19M55n31p91L91N46M07r74m44N48O32j21m58n55M21P45n01j97m15N20O03
$$ 319 774 243 -548 -157 389 796 -178 -622 -74 558 437 -21 -576 -155 590 89 -108 -523 -3 600
6270F00k22r48K51o7P35J0o07k81P07K6K22q56o2J004J05q40l25J44P12O11j140
$$ 600 378 -570 -319 -386 349 359 -248 -529 178 204 426 -430 -492 512 617 -223 -548 -404 308 919 -221
6291b21n33P77M18L88o84j004O37P16q5n27l15M69R17n59o49l57O20Q04k64j200
$$ -221 -754 23 441 829 145 -859 -222 494 409 -118 -433 36 953 394 -255 -612 8 812 548 -652
6311f52O90L35O2j29o98j00R82J41n19m20j27Q44J06q45j73L63N09O0q61k40Q08
$$ -652 38 373 435 306 -392 -492 490 631 112 -308 -435 409 515 -330 -503 -140 369 429 -432 -672 136
6332A36RJ95n60n51J094J68p76k09M3M44K46n59k71O67q6K27m88j58N06J7k5J14
$$ 136 145 340 -220 -771 323 491 -285 -494 -451 -7 239 -320 -591 76 -10 217 -271 -429 77 94 69 183
6354A83n19J87O14l95k69K5K27M26k85k12L5K69M1Q5n45l91Q77k62J07l90l22
$$ 183 -336 -149 465 70 -199 -174 53 479 194 -18 17 286 327 412 -133 -524 353 91 198 -192 -514
6375e14P33J53o47P4J91mM27m45m19L05K75J36l32m53J59P57m66j60j29j88J075
$$ -514 219 372 -275 -201 -10 -14 413 -32 -451 -146 129 265 -67 -520 -361 396 -70 -230 -359 -547 528
6396E28k52o57J3Q2N03l7q24M67P70n08l63k35KQ29j36m60j15j28P43q2n34J65
$$ 528 276 -381 -368 -286 217 180 -644 -177 593 85 -278 -513 -511 318 182 -278 -393 -521 222 140 -394 -229
6418b29K74p2K00o91J08N75m1k37J44j59M77l79m19M19j21J54P9R7m42N77n24
$$ -229 45 -27 173 -518 -410 165 124 -113 31 -128 349 -30 -449 -30 -151 3 82 179 -263 314 -210
6439b10j20K95K1P1J74n22L59kk48L03j42k1k1k03J39N83m59o2O7J03j0m7k22
$$ -210 -330 -35 -14 57 231 -291 68 66 -182 121 -21 -42 -63 -266 -127 456 -3 -65 2 105 95 48 -174
6462a74J34J33l4km2K33J31r5p5l1o6Q7j17n18M03J63k84K27j91J93J04k75l5
$$ -174 -40 93 59 57 15 248 379 284 209 178 112 199 82 -436 -33 130 -154 73 -118 75 179 -96 -131
6485a31O9j80J88Rj69L38k59m6K3j53J59L53m45O6K65J98k54K6j39L57k77k64
$$ -131 -62 -242 -54 -45 -214 124 -135 -181 -158 -311 -152 201 -244 -178 87 285 31 57 -82 275 -2 -266
6507b66L16l9K07J25o58M76K91l93R7j65rN42l47j16Q0m77N27J33n09J53K68K8
$$ -266 50 11 218 343 -315 161 452 59 156 -9 -18 524 177 61 141 -336 191 324 -185 -32 236 264
6529B64k22j67k38P14J03o87J05j36L72J18m32n0K97j67K09k6l43J63L47l13n3
$$ 264 42 -125 -363 351 454 -233 -128 -264 108 226 -206 -256 41 -126 83 57 -286 -123 224 -89 -142
6550a42k29M17J95k10k20L17j17M74k50n07J71K05J62m7l65k9M03o9k37k32J56
$$ -142 -371 46 241 31 -189 128 11 485 235 -272 -101 104 266 219 -146 -175 228 159 -78 -310 -154
6571a54L63nl07K16MnJ86l22j96J71J70K09m87k17M55O1N0j93l78J17O57n85q0
$$ -154 209 204 -103 113 117 112 298 -24 -220 -49 121 330 -157 -374 81 142 192 -1 -379 -262 395 -190 -270
6594b70J48k87O14j05p47M69K88N1r8k34L4O58k00n36j00L1Q37k01l97m57N00
$$ -270 -122 -409 205 100 -647 -178 110 161 63 -171 -137 521 321 -215 -315 -284 553 352 -45 -502 -2
6615bL08J54r62J10N76L53l87m64p2P54n5m27m53M14M03K34r03k27Q39L48k13
$$ -2 306 460 -502 -392 184 537 150 -314 -386 368 313 -114 -567 -153 250 484 -419 -646 193 541 328
6636C28o91r6N82M52o41j46k11O00K92o68k73L09K28M10m22p74M53N12m84L47
$$ 328 -363 -459 123 575 -66 -212 -423 177 469 -199 -472 -163 65 475 53 -721 -268 244 -240 107
6656A07q99L53N40J11k35r4k32M10L10p42j29M55N7K40n65k37P39J5L4l37l53
$$ 107 -792 -439 101 212 -23 -117 -349 61 371 -371 -500 -45 12 252 -313 -550 189 204 238 -99 -452
6677d52P41K63n42j70j43N82O87r00m73K26J40N31l23p27M06P51j91p67l81N47
$$ -452 289 552 10 -160 -303 279 966 66 -407 -181 -41 490 167 -560 -154 597 406 -361 -742 -195
6697a95Q91m07o92k0K35N73K5j092L0Q65J84l44m48k08R67p6l83k13q5P15J76
$$ -195 696 289 -403 -423 -188 385 410 -682 -652 213 397 53 -395 -603 364 288 -95 -308 -393 322 498
6718D98j037J9N08J63J18m51m33O57J77j03l38k7J49O66o75n09L49J95Q24o27
$$ 498 -539 -520 -12 151 269 -182 -615 42 219 116 -222 -249 -100 566 -109 -618 -269 -74 750 123
6738A23p85O76P6K34k29n11K17P54k35l64k57M3R93k53m48j14L82P4L64j251N7
$$ 123 -662 14 90 324 95 -416 -199 555 320 -44 -301 -258 735 482 34 -80 302 376 740 -511 -454
6759d54N16K10j00o43p7R10M16n80l24k23M54N57q10m18M98O9P48n00q33K35Q95
$$ -454 62 272 172 -471 -548 362 778 198 -126 -349 105 662 -148 -566 -68 1 749 249 -584 -349 546
6780E46j48j95n81P4Q82l82l96Lj5O56k25p70J79L89M48r5q21J55P60j46j49p29
$$ 546 398 203 -378 -304 578 196 -200 -197 -212 444 219 -551 -372 17 465 370 -451 -296 464 318 169 -560
6802e60L43P34K1q77L1M41K96K96r51M0L67L18j77k96m43O98M48l19n35j24M62
$$ -560 -217 517 538 -339 -308 133 429 725 -226 -186 181 499 322 26 -417 281 729 410 -125 -249 213
6823B13M56l70n09J32R2N35k72n97L39L35j74j84j97l04J098j49n36j68j54R70
$$ 213 669 299 -210 -78 14 549 277 -320 19 354 180 -4 -201 -505 593 444 -92 -260 -414 556
6843E56J42r89Q0J04L54N48r58j90L61N44k76p19l53P68N67n09k08j63N81K08
$$ 556 698 -291 -211 -107 247 795 -163 -353 8 552 276 -443 -796 -28 539 30 -178 -341 240 448
6863D48n28n83P21K07J46m55m33J48R17k80n85q5L83P95o70m26J27L59J08K05
$$ 448 -80 -663 58 265 411 -44 -477 -329 588 308 -277 -362 21 816 146 -280 -153 206 314 519
6883E19r84K12M75J98j87p10M06M58J4p19K37p4L85P6m98j35L40m7K97l17m18
$$ 519 -465 -253 222 420 233 -477 -71 387 401 -318 -81 -155 230 306 -192 -327 13 -34 263 -54 -472
6904d72O54J01k55o7n35P40N12p31k35J51K27K70M5r10K13N28P5j06n44R6M71
$$ -472 182 283 28 -39 -574 166 678 -53 -288 -137 90 360 405 -505 -292 236 311 205 -339 -243 228
6925B28r3k1k28l46P21n8m23q1J12L65K0m80J0L42J00k10k43j68N75J41o7k74
$$ 228 135 114 -114 -460 261 203 -220 -301 -189 176 196 -284 -274 68 168 -42 -285 -453 122 263 196 -78
6947g8m36N46L73l52k26P5J15K94k49n94M08M89j77j71k87J76N65j90o11K73j34
$$ -78 -514 32 405 53 -173 -98 17 311 62 -532 -124 365 188 17 -270 -94 471 281 -330 -57 -191
6968a91K63L89o39n5N33l56O06q05n2P15l43k34J40m15P08j4k82j96L27P9o4l55
$$ -191 72 461 -178 -233 300 -56 550 -255 -307 408 65 -169 -29 -444 264 250 -32 -228 99 178 114 -241
6990b41l0L67j09J59j36k02K34q1j86K63l90RO68k51j99J44J1j45L08l20J13L2
$$ -241 -271 96 -13 146 10 -192 42 -39 -225 38 -352 -343 325 74 -125 19 30 -115 193 -127 -14 18
7012A8K5l6j23l37O96k50k71L62l09M68m7k99K6K65m8ql51J23J53J45l91K99k08
$$ 18 43 7 -116 -453 243 -7 -278 84 -225 243 196 -103 -77 188 140 132 -219 -96 57 202 -189 110 -98
7035i8P8K80k33k84K17j71L01k51RK01j34J98j43Q5PR1k50J43o0L1J34k60OL43
$$ -98 -20 260 27 -257 -40 -211 90 -161 -152 49 -85 113 -30 55 62 153 -97 46 -14 17 151 -109 -103 240
7059B40k17m44M21k07M39k75J0R0K59o96L79j48K1L14j77k07j3M87o8l21j14M03
$$ 240 23 -421 0 -207 232 -43 -33 57 316 -380 -1 -149 -128 186 9 -198 -211 276 208 -113 -227 176
7081A76p6k12K66k80N3L85m67R2J74n8j60J79k32K34O5l6k84q7l0L20n2k36L28
$$ 176 100 -112 154 -126 -73 312 -155 -63 111 53 -107 72 -160 74 139 103 -181 -268 -298 22 -30 -266 62
7104F2m51L27J03j96J26L1j36L07r4m25L52M8M4L39n55K7M07j05k35mjM47j31
$$ 62 -389 -62 41 -155 -29 2 -134 173 79 -346 6 54 98 437 -118 -91 316 211 -24 -28 -29 418 287
7127B87l83J18k73M85J01n50O8M01N7j55l39j91K06N37k68k16k98N79l5j28l11
$$ 287 -96 22 -251 234 335 -215 -147 254 311 156 -183 -374 -168 369 101 -115 -413 166 131 3 -308
7148c08K47M48l01l04l14P17P3j52j07l55J23O98o25j23J55o7M69j36o76P26J10
$$ -308 -61 387 86 -218 -532 185 258 106 -1 -356 -233 465 -160 -283 -128 -195 274 138 -538 188 298
7169B98j05P2n80P7P02m19l62m2K55L13J34n86K6k1M46K68m28m92O83M5J3k33
$$ 298 193 265 -315 -238 464 45 -317 -359 -104 209 343 -243 -217 -238 208 476 48 -444 239 284 297 64
7191F4l11L96M77k82n15o8L38L25l51l87K87k7O65k95p33L74N25k32k44k42m1
$$ 64 -247 149 626 344 -171 -239 99 424 73 -314 -27 -54 611 316 -417 -43 482 250 6 -236 -277
7212b77Q83m57r0k69k65Q06p3o66n0L40L03K74p88l02P05K86j01m91m80Q75L78
$$ -277 606 149 59 -210 -475 331 258 -408 -458 -118 185 459 -329 -631 74 360 259 -232 -712 163 541
7233E41o14n38K46M09L75n15m23M90O29k98o47j78N97L90m35k83M2N13j4l26o92
$$ 541 -73 -611 -365 44 419 -96 -519 -29 600 302 -345 -523 74 464 29 -254 -212 301 287 -39 -731
7254g31N27M08K14k30o70J55O74K13o45m24M76O50l36l71m35K98O42O3o93J16
$$ -731 -204 204 418 188 -482 -327 347 560 -85 -509 -33 617 281 -90 -525 -227 415 478 -215 -99
7274i9n9O59l42k51k38L81K55j01p7m41N39O2j55l60p7L22N13n64m11J76K60L00
$$ -99 -158 501 159 -92 -330 51 306 205 128 -313 226 288 133 -227 -304 18 531 -33 -444 -268 -8 292
7296B92l7n87K12N84k58k61l74L14Q65k99r96O3L52N33J05r84j66O71K92j32p05
$$ 292 255 -332 -120 464 206 -55 -429 -115 750 451 -545 -482 -130 403 508 -476 -642 29 321 189 -516
7317e16j93Q75K94p67k5J83L35L95j051l8L37L80L48p30l15L05O85j94m49k8M14
$$ -516 -709 166 460 -307 -332 -149 186 581 -470 -508 -171 209 557 -173 -488 -183 502 308 -141 -169 245
7338B45L09o20l27L47J19K68K4o41J69J82J49k09o51K69Q94l76p0k22m00Q73k2
$$ 245 554 -66 -393 -46 73 341 365 -276 -107 75 224 15 -636 -367 527 151 81 -141 -541 332 310
7359C10m19k77M17R9J70m83l09M70K59R6o93k16N68O24n46m13R0K22M40m27k73
$$ 310 -109 -386 31 130 300 -183 -492 -22 237 333 -360 -576 -8 616 70 -343 -253 -31 409 -18 -291
7380b91K66m8M82j86q05K81P15n1n14l62K04Q08k35m58p4R5N47l9p80J62M25K60
$$ -291 -25 -73 409 223 -582 -301 414 363 -151 -513 -309 499 264 -194 -268 -173 374 335 -445 -283 142 402
7402D02J2p67j03N40K18k22k51l03R84J7p38MNN54K78q59k43P94K21l46l99k42
$$ 402 414 -353 -456 84 302 80 -171 -474 510 527 -211 -207 -202 352 630 -229 -472 322 543 197 -202 -444
7424d44N99L62m53l23l8M29K75k44o58M16K01M74k36p77L45N40j93j85m88K16
$$ -444 155 517 64 -259 -297 132 407 163 -495 -79 122 596 360 -417 -72 468 275 90 -398 -182
7444a82N89k39l86M1P6K19K04n80Q3K06l2K9l69k8P52l60Q1p3n61O07L19l27j19
$$ -182 407 168 -218 -177 -101 118 322 -258 -175 31 -1 28 -341 -369 383 23 104 31 -530 77 396 69 -50
7467e0k84K52M06k89k29KL19K27M9p60m8O52jk56j49q6O02m3q39J93L26Q5m4n72
$$ -50 -334 -82 324 35 -194 -192 127 354 403 -357 -405 247 246 -10 -159 -245 357 314 -525 -332 -6 79 35 -537
7491e37L20R4J52J17l40j88P94J24o00n3l5N69lp89J92L93L3q7p0k47L24Nm51
$$ -537 -217 -123 29 146 -194 -382 412 536 -64 -117 -152 417 414 -375 -183 210 243 156 86 -161 163 168 -283
7514b83L20m15K07M66l21j11O3J40K93k77m33K70J68j22N5k80K75k9k28J17J76
$$ -283 37 -378 -171 295 -26 -137 -74 66 359 82 -351 -81 87 -35 20 -260 15 -14 -242 -125 51
7535E1m09L11J61l71K66o7j24N58o81MK30J3J30k24p8K76l7K6j71N0j17L62q3
$$ 51 -358 -47 114 -257 9 -58 -182 376 -305 -301 -71 -58 72 -152 -230 46 9 35 -136 -86 -203 159 76
7558G6l55L32k23L40m7n10M96j03J19n4m5j73L93k53j55nq7M30j36j27R1m2L63
$$ 76 -279 53 -170 170 123 -387 109 6 125 71 26 -147 246 -7 -162 -167 -254 176 40 -87 4 -38 325
7581C25k39k98K26L57k44k49R3N1Q6j56nj5k05J61J34k18q3M54q3n1J55n68L64
$$ 325 86 -212 14 371 127 -122 -29 22 108 -48 -53 -68 -273 -112 22 -196 -279 175 92 41 196 -372 -8
7604hj55N8ok57J98K42l08K42K01m67J68J10k40K72j77r3L78j56j7pj68J36N17
$$ -8 -163 -105 -111 -368 -170 72 -236 6 207 -260 -92 18 -222 50 -127 -220 158 2 -15 -22 -190 -54 463
7627D63m28p7q9J93P1k05l6K64l6J28j21l03J80L10k51r8k3L14j8j72j03J60K99
$$ 463 35 -42 -131 62 133 -72 -108 156 120 248 127 -176 4 314 63 -35 -58 256 238 66 -37 123 422
7650D22k27l00jK17R0j11o9K27l49K28J1k09Q9q3R9L35l06j65L11l69J02N9l43
$$ 422 195 -105 -106 111 201 90 21 248 -101 127 138 -71 18 -65 34 369 63 -102 209 -160 -58 1 -342
7673c42N36j56q3L8q6l01M48k55r2L12j28L38O2m46o9L30k66O34p16R7L28K1j35
$$ -342 194 38 -45 -7 -93 -394 54 -201 -293 19 -109 229 291 -155 -224 106 -160 474 -242 -145 183 204 69
7696F9j82n5N27p2m13l59P60k5L2m37R2L31o1q8k9k78K93M00n16q1j17K18L75
$$ 69 -113 -168 359 287 -126 -485 275 250 282 -155 -63 268 207 119 90 -188 105 505 -11 -92 -209 9 384
7719C84m46k04M05L08k82O7m21J03O74n65j35j79K06M41k80j33O1j44M26j54m28
$$ 384 -62 -266 139 447 165 232 -189 -86 588 23 -112 -291 -85 356 76 -57 4 -140 286 132 -296
7740b96K5K47J35O5m75l7M88Op9p5j64K90K43l03n31M55j3L99m16j86Q0M90n3
$$ -296 -271 -24 111 176 -299 -336 152 158 79 4 -160 130 373 70 -461 -6 -19 380 -36 -222 -142 348 295
7763B95k30j65k13Q32m65k0k77K61M54l08k93J00J47J64l1p13K78M82J3k35k71
$$ 295 65 -100 -313 519 54 34 -243 18 472 164 -129 -29 118 282 251 -462 -184 298 311 76 -195
7784a95o2O96n6o77M6J24L04K22o04k01O57Q0j38l55l92M71N03l80k95j51M24
$$ -195 -257 439 383 -294 -248 -124 180 402 -202 -403 254 334 196 -159 -551 -80 423 43 -252 -403 21
7805B1K47l76n14M48L74J50j56o20K51K15J54k75k65L76N38k25o28R1J93M96m50
$$ 21 268 -108 -622 -174 200 350 194 -426 -175 40 194 -81 -346 30 568 343 -285 -194 -1 495 45
7826D5m14L22M9K44J42p90J98O57l81k9j18NK51J25m66j39oM27J62l17k08K29
$$ 45 -369 -47 2 246 388 -402 -204 453 72 43 -75 -70 181 306 -160 -299 -305 122 284 -33 -241 -12
7848a2P7K78o60k24O10J94k06J8o20L87P15m27k62l47L00O30j22p17J41N21n8
$$ -12 65 343 -317 -541 69 263 57 75 -545 -158 557 130 -132 -479 -179 451 329 -388 -247 274 216
7869B16R8p16N8P85j96m59J12p3M71J60o90o0J49L20J05n72j78N05N92m90o90
$$ 216 314 -402 -344 441 245 -214 -102 -175 296 456 -234 -294 -145 175 280 -292 -470 35 627 137 -553
7890e53K27N92L42p63k37K62J05M38p02%Q3N00L7o28n83O97O01M2m41n07N30J66
$$ -553 -326 266 608 -155 -392 -130 -25 413 -289 -289 -206 294 331 -297 -880 -183 418 460 19 -488 42 208
7912B08m3o21K56J96J48K10q54M87K95J56l01l49m5K80K89k91l85J40O70q7k80
$$ 208 165 -456 -200 -4 144 354 -500 -13 282 438 137 -212 -257 23 312 21 -364 -224 446 359 79
7933G9l56L85J67J09p48j80L72O20r3n92k46M88N42l77k88k50K97M66m11m73K48
$$ 79 -277 108 275 384 -364 -544 -172 448 355 -237 -483 5 547 170 -118 -368 -71 395 -16 -489 -241
7954b41K26J48p6n95L80N68n3l86k98K8P49j57n70R2K50n4L03n49O7N12OL5k71
$$ -241 -15 133 57 -538 -158 410 357 -29 -327 -299 450 293 -277 -185 65 11 314 -235 -168 344 350 385 114
7977A14l02N01J18m71m8p5R5K45l32m07M99q2K86l44k26N38j26K29l19m93M14
$$ 114 -188 313 431 -40 -88 -163 -68 177 -155 -562 -63 -145 141 -203 -429 109 -17 212 -107 -600 -186
7998a86O31l90k41l0J71L27k70m65J75L37L60j60n93n5P99K0n18Q5j34L08J03
$$ -186 445 55 -186 -216 -45 282 12 -453 -278 59 419 259 -334 -389 410 430 -88 -3 -137 171 274
8019B74k67k18J07J32L78m76l43N60K86k70J59o19L30K93j64k41o9Q4M12j93m07
$$ 274 7 -211 -104 28 406 -70 -413 147 433 163 322 -297 33 326 162 -79 -148 -64 348 155 -252
8040b52J77L4N03n00k67M3N59k23o2m06K41J84j50P2o2k44O65N4o62M8J20L21
$$ -252 -75 -41 462 -38 -305 -262 297 74 12 -394 -153 31 -119 -47 -109 -353 312 366 -296 -248 -128 193
8062A93k79l25M3L46L32l48J35j71M33l7k95l45L30j01L85n65J1M25j60J01r2
$$ 193 -86 -411 -368 -22 310 -38 97 -74 359 322 27 -318 12 -89 296 -269 -258 167 7 108 16
8083A6k7r2J73K5l3O9r6p9l9o1J16Q1J53J17o16O0K60n2j31p6j07O12R2l38j42
$$ 16 -11 -103 70 95 62 131 35 -44 -83 -144 -28 53 206 323 -293 -233 27 -25 -156 -232 -339 273 365 27 -115
8108a15R6Q8K1p9k07J64J50j32m8q7jQ9Pjk78P7L43k39j00L70j33J25j09l9J56
$$ -115 -19 69 90 11 -196 -32 118 -14 -62 -149 -150 -61 -54 -55 -333 -256 87 -152 -252 118 -15 110 1 -38 118
8133A18J62l04J40m15J55M73n88L09L4p2L16l06j6J22l20K72Q6l06K30N7l28K07
$$ 118 280 -24 116 -299 -144 329 -259 50 84 12 328 22 6 128 -192 80 166 -140 90 147 -181 26
8155B6j37J49P2K4j50K07q7j13k2j42N5O3l8J02J69N5k23j3j66L61j46k16J55
$$ 26 -111 38 110 134 -16 191 104 -9 -31 -173 -118 -55 -93 9 178 233 10 -3 -169 192 46 -170 -15
8178a5j17K16J35k46oK2j30oL31j20K9j48L8
$$ -15 -132 84 219 -27 -33 -11 -141 -147 184 64 93 -55 -17
8191a7
$$ Imaginary data points
##PAGE= N=2
##DATA TABLE= (X++(I..I)), XYDATA
0@%%%%%%kKqJ6j6J6k4L2m0N6p2Q8j04J27j54J81k16K56l00L50m07M72n44O25p17
$$ 0 0 0 0 0 0 0 -2 0 -8 8 -8 8 -16 16 -24 32 -40 48 -56 71 -83 98 -118 138 -162 188 -219 253 -291 334 -383
31c83Q19r30J053j191J343j510J692j889K108k351K614k899L212l555L928m335
$$ -383 436 -494 559 -632 711 -799 893 -996 1112 -1239 1375 -1524 1688 -1867 2061 -2274
47b274M779n266N801o390P040p759Q558r454J0463j1603J2910j4427J6205j8329
$$ -2274 2505 -2761 3040 -3350 3690 -4069 4489 -4965 5498 -6105 6805 -7622 8583 -9746
61i746K0922k4160K8338l3967M1998n4452P6530j27265M53810K33469n59403J47952
$$ -9746 11176 -12984 15354 -18613 23385 -31067 45463 -81802 372008 605477 46074 194026
73A94026m5017L04635m5447m64863M8560K32515k576j9506k92514L8567K61679
$$ 194026 149009 453644 408197 -56666 -8106 224409 221833 202327 -90187 -51620 210059
84B10059l6102j29211r6247N47K22551p860k28029l0782Q6355Q1935P1946k20138
$$ 210059 173957 44746 -51501 -50954 171597 163737 -64292 -95074 -8719 73216 145162 -74976
96g4976r7043J94662Q4183R638j10761j23430K06178J48863o1883r4392q4232
$$ -74976 -172019 22643 106826 116464 5703 -117727 88451 237314 175431 81039 -3193
107c193J68806J49970j09988j11462m8394J38674J10959j27161j21818J793J42449
$$ -3193 165613 315583 205595 94133 45739 184413 295372 168211 46393 48186 190635
118A90635P2204j43339q7104L6167J29492P5064j84766p6357J03387O9280M1059
$$ 190635 262839 119500 32396 68563 198055 273119 88353 11996 115383 184663 225722
129B25722j65263j22316J46467Q1164n8886j16081r9056J22917J32901j03921
$$ 225722 60459 -61857 84610 165774 106888 -9193 -108249 14668 147569 43648
139D3648j13055k1012R9948J46382r2493j59582N7121J00099P5213m5523k00582
$$ 43648 -69407 -90419 9529 155911 63418 -96164 -39043 61056 136269 90746 -109836
150a09836O9899J70018l7620n6145j24741K8759K20513n9602j44378k380M1507
$$ -109836 -39937 130081 92461 36316 -88425 -59666 160847 101245 -43133 -45513 -4006
161d006J64862k9581j96933N0102R6872O1402k4351j75422K2776J47273q222o3075
$$ -4006 160856 131275 -65658 -15556 81316 142718 118367 -57055 -34279 112994 104772 41697
173D1697r2150j7145J45100J1138j13870l9678J6446R4441M3088j10818n4881
$$ 41697 -50453 -67598 77502 88640 -25230 -64908 -48462 45979 89067 -21751 -76632
184g6632O7885O5640K2024q9212o7989Q7772O1982k2712p7748m8598Q3803P0952
$$ -76632 -8747 56893 78917 -10295 -78284 9488 71470 48758 -28990 -77588 6215 77167
196G7167n7127p6713k009P8475N5497n9549p1946J4063Q8692K8849p1450m9693
$$ 77167 20040 -56673 -58682 19793 75290 15741 -56205 -42142 46550 75399 3949 -45744
208d5744Q519P4883K6150q6918m5037K8553M7223K7156p6113n9701O3207L9561
$$ -45744 -37225 37658 63808 -23110 -68147 -39594 7629 34785 -41328 -101029 -37822 1739
220A739N847m6599o5601P1243O4468l6284l9149l3724M3787Q9577n6001o9911
$$ 1739 7586 -39013 -104614 -33371 31097 -5187 -44336 -78060 -34273 55304 -697 -70608
232g0608J8015L2096P3041l9341j02387M8604O8391J5021k2857r1476L6301J17886
$$ -70608 -52593 -20497 52544 13203 -89184 -40580 27811 42832 19975 -71501 -35200 82686
244H2686l2323n2289l5011J8954J08874l2829j00150J3077L9163M6647k0060j07356
$$ 82686 50363 -1926 -36937 -17983 90891 58062 -42088 -29011 10152 56799 36739 -70617
256g0617K6334P4224j1359k4393o3164J2550Q5510k5281n5305m410O256M9897
$$ -70617 -44283 29941 18582 -5811 -68975 -56425 29085 3804 -51501 -55911 -49655 242
268B42q59o9403Q944K6845J1219N913m3119p436L9353Q443q110j4769j3205L5724
$$ 242 -617 -70020 -61076 -34231 -23012 -17099 -60218 -67654 -28301 -19858 -27968 -42737 -55942 -20218
282b0218J8374j8930q492j698K3781J8656j5253k0263J0098K1267N871r269k0067
$$ -20218 -1844 -20774 -29266 -30964 -7183 11473 -3780 -24043 -13945 7322 13193 3924 -16143
295a6143K394K7164N860k3564n164r19J6055J8822l3730r851J6416M314J1981
$$ -16143 -13749 13415 19275 -4289 -9453 -10372 5683 24505 -9225 -19076 -2660 1654 13635
308A3635k1894k6299L2265Q971j4288l167k8614K8210K8169l8879k962K959M074
$$ 13635 -8259 -34558 -2293 6678 -7610 -10777 -39391 -11181 16988 -21891 -24853 -21894 -17820
321a7820L4141k9341k8397M0341k61L051o08l6198L9092K1778l1885O722o327
$$ -17820 16321 -13020 -41417 -1076 -1337 1714 1106 -35092 4000 25778 -6107 615 -5712
334e712Q444L6177l8552j3812L5304j1569J3801j3088l1190M2167M595k7955O664
$$ -5712 2732 38909 357 -13455 21849 10280 24081 10993 -20197 21970 26565 -1390 5274
347E274j2281J4605K2569m2860M50K1618o398J0894k4266j2066L3701k738j7301
$$ 5274 -7007 7598 30167 -12693 -12243 9375 2977 13871 -10395 -22461 11240 8502 -8799
360h799K36r343J9100J2112k8828J167R705P886Q723j4657q952J9623J5196n594
$$ -8799 -8563 -17906 1194 13306 -15522 -14355 -4650 3236 11959 -2698 -11650 7973 23169 17575
374A7575q287o210J7696J8938r530j9342L286J9766J0165r257k7502R096L0099
$$ 17575 9288 3078 20774 39712 30182 10840 14126 33892 44057 34800 7298 16394 46493
387D6493l486j6821j5237N582L4523k539l8401K209J1168J5249L607m4471k486
$$ 46493 43007 26186 10949 16531 51054 48515 10114 12323 23491 38740 42347 -2124 -4610
400d610K9758l173r620k3407j5608L8612Q71l1440r89j1064K7481J9898m1892
$$ -4610 25148 21975 12355 -11052 -26660 11952 12823 -18617 -19606 -30670 -3189 16709 -25183
413b5183m219J6879P358K4674k7016l0054L8295J0707K134p721l6283L0655L4659
$$ -25183 -29402 -12523 -5165 19509 -7507 -37561 734 11441 13575 5854 -30429 226 34885
426C4885j5741j2868j6799J7050M9789j9143l2093O104J6013L9913j5246n1322
$$ 34885 19144 6276 -10523 6527 56316 37173 5080 11184 27197 67110 51864 542
438E42J3082L7216J0252k1366m6552O540N5990m163m3219k7670J7098N1418n374
$$ 542 13624 50840 61092 39726 -6826 -286 55704 51541 8322 -19348 -2250 49168 43794
451D3794n4823j7315L5292M1602j0896o0095p730M7198K7409k1797n5134q11N2742
$$ 43794 -11029 -28344 6948 48550 37654 -22441 -30171 17027 44436 22639 -32495 -33306 19436
464A9436K0716l8562m3678J6285M9028J0439l9526l4546K7330N5659j0497m4085
$$ 19436 40152 1590 -42088 -25803 23225 33664 -5862 -40408 -13078 42581 32084 -12001
476a2001j4014K6855M9691j6827n4487m597L6138L3341k0338n3696l2M2959K2360
$$ -12001 -26015 840 50531 33704 -20783 -25380 10758 44099 23761 -29935 -29967 12992 35352
489C5352j6456n0695m18N4581J6553k6213l4868l178M9166K6232m6913l3180J4850
$$ 35352 18896 -31799 -32217 22364 38917 12704 -22164 -25342 23824 50056 3143 -30037 -15187
502a5187L7645K1052m9389l8473L3238M0319K934m5818l4867N0418M5769k0546
$$ -15187 22458 43510 -5879 -44352 -11114 29205 32139 -13679 -48546 1872 47641 27095
514B7095m0770k5412N5296N2541m5187m8465k86M8702M3003m9427o3748K2106
$$ 27095 -13675 -39087 16209 68750 23563 -24902 -25188 23514 66517 17090 -46658 -24552
526b4552N2408K2356m9495n7551L2525N6249M127n0975l9769L5494N6368j4004
$$ -24552 27856 50212 717 -56834 -24309 31940 36067 -14908 -54677 -19183 37185 23181
538B3181n5885j7277L4186M5342k0733o1245m250M7722K7226k5367n2078m10O2415
$$ 23181 -32704 -49981 -15795 29547 8814 -52431 -56681 -8959 18267 -7100 -59178 -59588 2827
551B827K2631l5415m3285R579O4633J8966m4521m0876K0326O0336J2046n4873
$$ 2827 25458 -9957 -53242 -43663 20970 39936 -4585 -45461 -25135 35201 47247 -7626
563g626l7819L0611N5702o12n7575k6811L5878N4946j5250o0984n833M0729M2369
$$ -7626 -45445 -14834 40868 40256 -17319 -44130 -8252 46694 31444 -29540 -35373 5356 47725
576D7725k1242o5756K836N5118K0338l1903n8003L572O6642P724m6556m3715J1942
$$ 47725 26483 -39273 -36437 18681 39019 7116 -50887 -47315 19327 27051 -19505 -63220 -51278
589e1278O6904Q712o1005l0111L1613N1983J0449o3962l0137N4793M0238r275
$$ -51278 15626 24338 -36667 -66778 -35165 16818 27267 -36695 -66832 -12039 28199 18924
601A8924m9757l0170N7168M7593l6182m1257q131M7128N0109m7126m5241K0364
$$ 18924 -30833 -61003 -3835 43758 7576 -33681 -41812 5316 55425 8299 -36942 -16578
613a6578M3536L4300m3421n3202L6610N1091L441l9470m9365L4619O1305j6224
$$ -16578 26958 61258 17837 -35365 1245 52336 55777 16307 -33058 1561 62866 46642
625D6642n2437k7861L3829N3738j5431o4452j1243M5691L7140j8357o0594o787
$$ 46642 -5795 -33656 173 53911 38480 -25972 -37215 8476 45616 27259 -33335 -40122
637d0122N6343K6862l3339m7156p23N5881K2699m8637l6948J6313N0659J3831
$$ -40122 16221 43083 9744 -37412 -38135 17746 40445 -8192 -45140 -28827 21832 35663
649C5663n0869l2956L5595M9412m358m4690k5791M1745N0256k0592m8314o318
$$ 35663 -15206 -48162 -12567 36845 32487 -12203 -37994 3751 54007 33415 -14899 -21217
661b1217L6839L9852j9304n7842O973M2365J9951j6207n1530L804N3725R500k7477
$$ -21217 15622 55474 36170 -21672 -14699 27666 47617 31410 -20120 -16316 37409 46909 19432
674A9432l3435j007N4793J2509m6769k1384Q837M2334J5995n5491k6851L5885
$$ 19432 -14003 -15010 39783 52292 5523 -15861 -7024 35310 51305 -4186 -31037 4848
686D848L1153R91m4526l3650N2185L6905k6417l6448j6504M6886M2064m2726m1997
$$ 4848 36001 36992 -7534 -41184 11001 47906 21489 -14959 -31463 15423 57487 14761 -27236
699b7236J3757L6502K9723m0288m8097L2155L8113L169l2027l6874K8530M6410
$$ -27236 -13479 23023 52746 12458 -35639 -3484 34629 37798 5771 -31103 -2573 43837
711D3837j5368l5852j2648K2001M0077j5402m2928l63K8781K2161j2882l8479
$$ 43837 28469 -7383 -20031 1970 42047 26645 -16283 -16646 12135 34296 21414 -17065
723a7065k894L7709J2050j8016k7927l712L6607J5002k8359k2366P795K6260J7137
$$ -17065 -19959 17750 29800 11784 -16143 -19855 16752 31754 3395 -18971 -11176 15084 32221
736C2221k8870k8126K0991K5825L871k3426k6062J8666L6477j1027k6977j1711
$$ 32221 3351 -24775 -3784 22041 25912 2486 -23576 -4910 31567 20540 -6437 -18148
748a8148J4853L7226j2417l7826P28K2448K3550p273m2948K132L8755N761j1493
$$ -18148 -3295 33931 21514 -16312 -15584 6864 30414 23141 -19807 -17675 21080 26841 15348
761A5348l0975l806M6105M341l2244j4255M521L2469J1641m4844j2304K5121J7381
$$ 15348 -15627 -19433 26672 31013 -1231 -15486 -10965 21504 33145 -11699 -24003 1118 18499
774A8499M706l6919j6710L7006J5555j6029k0750j3038L2403K0661l2732j3448
$$ 18499 23205 -13714 -30424 6582 22137 6108 -14642 -27680 4723 25384 -7348 -20796
786b0796M263J7645J9468k7593k1779K1243J4058K053j2135k2328J9409K0580
$$ -20796 -16533 1112 20580 -7013 -28792 -7549 6509 8562 -3573 -25901 -6492 14088
798A4088j0327j0371j0780J0260K3067r152j9337O01P958J5061j756k5149J188
$$ 14088 3761 -6610 -17390 -7130 15937 6785 -12552 -11951 -3993 11068 9312 -15837 -14649
811a4649J6248O335m173j6346n600K1860P222j5757p738j026J5724R792j8958
$$ -14649 1599 7934 3761 -12585 -18185 3675 10897 -4860 -12598 -13624 2100 11892 -7066
824g066j0041J1125R559L266j1653j4793J6659J1182p681o179r429Q791J7159
$$ -7066 -17107 -5982 3577 6843 -4810 -19603 -2944 8238 557 -5622 -15051 -6260 10899
837A0899j1570j1865N263O77J1778k546k0362Q672Q105j362J524j4817j178J9791
$$ 10899 -671 -12536 -7273 -6596 5182 2636 -17726 -9054 -949 -2311 -787 -15604 -16782 3009
851C009o162p142j793p933J9807J186j9790M747J563N625R569k0300l314J9415
$$ 3009 -3153 -10295 -12088 -20021 -214 972 -18818 -14071 -12508 -6883 2686 -17614 -20928 -1513
865a513m323J234n858j0527K1257J519j4558L090j13O514Q784j8698m32J5290
$$ -1513 -5836 -4602 -10460 -20987 270 1789 -12769 -9679 -9792 -3278 5506 -13192 -13624 1666
879A666l490K047q119n706J8858Qj3548K855M8O640O926j8473J395J2401l939
$$ 1666 -1824 223 -7896 -13602 5256 5264 -8284 -5429 -5381 1259 8185 -10288 -8893 3508 -431
894d31l65n973l017J3584j493j3848M832K411M453J082j4932L016J3391k893o098
$$ -431 -796 -6769 -9786 3798 2305 -11543 -6711 -4300 153 1235 -13697 -10681 2710 -183 -6281
909f281l581k375J4964N79j6340M531L419L203N045j3252k123J5553m072k904
$$ -6281 -9862 -12237 2727 3306 -13034 -8503 -5084 -1881 3164 -10088 -12211 3342 -730 -3634
923c634J074q407J4879J380j4261P036P82N82Q649j3395k891J4657p195L512n5
$$ -3634 -2560 -10967 3912 5292 -8969 -1933 -1151 -569 8080 -5315 -8206 6451 -744 2768 2713
938B713j3323J2879L897q172N996p691l386J7254o851n720L068j0277J5118O367
$$ 2713 -10610 2269 6166 -2006 3990 -3701 -7087 10167 3316 -2404 664 -9613 5505 11872
952A1872j9053J345L315K757J1975j8611j0413K0953J96j547q082j2763K1802
$$ 11872 -7181 -5836 -2521 236 12211 -6400 -16813 4140 4336 2789 -5293 -18056 3746
965C746J0296j9364o744M065J2570J3257k3359j3987K0613J2441j96j6721j5033
$$ 3746 14042 -5322 -12066 -8001 4569 17826 -5533 -19520 1093 13534 13338 -3383 -18416
978a8416K2038K2044j6889j5024k524J4061K3218j7724k3246J1147J4163P330
$$ -18416 3622 25666 8777 -6247 -8771 5290 28508 10784 -12462 -1315 12848 20178
990B0178q899k4243J0588K3411p824j0933j1260N565K4091p085k3238R39J0429
$$ 20178 11279 -12964 -2376 21035 13211 2278 -8982 -3417 20674 13589 -9649 -8710 1719
1003A719J2150O01k8393j349K4630L770n017j7201q744K8896J0437k0809o950
$$ 1719 13869 14470 -13923 -15272 9358 13128 8111 -9090 -17834 11062 21499 690 -6260
1016f260l749J8128J9188k6660j1704J1580Q671J2953j5900k2208K0260J2984
$$ -6260 -10009 8119 27307 647 -11057 523 9194 22147 6247 -15961 4299 17283
1028A7283m884o341j8525J3532K3867j3965j4208k567O549K2221p058k8819O430
$$ 17283 12399 6058 -12467 1065 24932 10967 -3241 -5808 741 22962 15904 -12915 -6485
1041f485J4473J0138j931l0522L77K8964M414j1104j9013n992L3739Q443k6351
$$ -6485 7988 18126 16195 -14327 -13950 15014 19428 8324 -10689 -16681 17058 25501 -850
1054h50j0552K101K4798J1833l0307j5657J8649J7945K079k3923j8196K5854K1091
$$ -850 -11402 -9301 15497 27330 -2977 -18634 15 17960 20039 -3884 -22080 3774 24865
1067B4865j2583k2548p353K3516K3129j9125k8437P897K3117J6296j9451l2646
$$ 24865 12282 -10266 -17619 5897 29026 9901 -18536 -10639 12478 28774 9323 -23323
1079b3323J4865L1138J601k1984k3942J1635L7601o076l1862r264J4898K8640
$$ -23323 -8458 22680 24281 2297 -21645 -10010 27591 21515 -10347 -19611 -4713 23927
1091B3927n651l6082l678K7083J4362j0108k8749l759L3798P116k0640j6912L64
$$ 23927 18276 -17806 -21484 5599 19961 9853 -18896 -22655 11143 18259 -2381 -19293 -18929
1104a8929K8245J0011l0620j1996J4275J5277J0349k5720j7124K4018J3933j169
$$ -18929 9316 19327 -11293 -23289 -9014 6263 16612 -9108 -26232 -2214 11719 10550
1116A0550j5343j7432J9178K1723j0602j4590j0457J1263K6693j1671k2752k204
$$ 10550 -4793 -22225 -3047 18676 8074 -6516 -16973 -5710 20983 9312 -13440 -15644
1128a5644J2454K0131m831l1670O83K4983R436p603k8022k401L4017P508k2307
$$ -15644 -3190 16941 12110 -19560 -18877 6106 15542 7939 -20083 -22484 11533 19041 -3266
1141c266k0006L782L1286Q793l4149j5663J6747K5733L442l5348j4363K9207K1934
$$ -3266 -23272 -19490 11796 20589 -13560 -29223 -12476 13257 16699 -18649 -33012 -3805 18129
1154A8129r902k7693j1049L1747K2614k3361k5505K790K6775J6661k4091k8083
$$ 18129 8227 -19466 -30515 1232 23846 485 -25020 -22230 4545 21206 -2885 -30968
1166c0968J4145K8331K946k2473k2860J8084L0041o527k4409j1941J7904K6997
$$ -30968 -16823 11508 14454 -8019 -30879 -12795 17246 10719 -13690 -25631 -7727 19270
1178A9270r618k9346k94J8467J7573p620l0260J003K6467P922j2018j9565j973
$$ 19270 9652 -19694 -19988 -1521 16052 8432 -21828 -20825 5642 13564 1546 -18019 -19992
1191a9992K7889R053k1352j2268K947K1753J0501k4292j3948J3127J5302O302
$$ -19992 7897 16950 -4402 -16670 -13723 8030 18531 -5761 -19709 -6582 8720 15022
1203A5022k0107j8919K0634J6134m493j4556j6545J8081K3400j2758j8675l203
$$ 15022 -5085 -24004 -3370 12764 8271 -6285 -22830 -4749 18651 5893 -12782 -15985
1215a5985J2594K3327j1304k6930N157J7279J3007r756k7010M360K6788L456j4522
$$ -15985 -3391 19936 8632 -18298 -13141 4138 17145 7389 -19621 -15261 11527 14983 461
1228D61j9287L273L0684J172k4446j0567R331K3273K936k8963r336K0810J4822
$$ 461 -18826 -15553 15131 16303 -8143 -18710 -9379 13894 16830 -12133 -21469 -659 14163
1241A4163k283k4419r826K5409J4743j3400j9081l104K2368J5956k0139j8677
$$ 14163 11880 -12539 -22365 3044 17787 4387 -14694 -17798 4570 20526 387 -18290
1253a8290P793J9346J0077j9465j9732J4598K1968j829j8364j4319J3746K4669
$$ -18290 -10497 8849 18926 -539 -20271 -5673 16295 14466 -3898 -18217 -4471 20198
1265B0198r498k1388m469J3962J8376q041k5008K266J9365P384p661k0545K845
$$ 20198 10700 -10688 -15157 -1195 17181 9140 -15868 -13602 5763 13147 5486 -15059 -12214
1278a2214K2997J792j3399j0461K405J9351M299k0441m830Q405J0491M950j7646
$$ -12214 10783 12575 -824 -11285 -8880 10471 14770 -5671 -10501 -2096 8395 13345 -4301
1291d301p814J4861O842j660r001j0537J3647J0482r225n846o483O966J4592q942
$$ -4301 -12115 2746 9588 7928 -1073 -11610 2037 12519 3294 -2552 -9035 -2069 12523 3581
1305C581j2371J154N718J1212l587j9465L165J3014N494m645j6982J078K0169
$$ 3581 -8790 -7636 -1918 9294 5707 -13758 -10593 2421 7915 3270 -13712 -12634 7535
1318G535K897j3169r761K656J9416L143k0794n025J0730J3162k25j8953n999J8843
$$ 7535 10432 -2737 -12498 -9842 9574 12717 -8077 -13102 -2372 10790 10565 -8388 -14387 4456
1332D456Q353q954j2195l073J7731P558j4630j0211M896J3154M574j3762j0500
$$ 4456 12809 3855 -8340 -11413 6318 13876 -754 -10965 -6069 7085 11659 -2103 -12603
1345a2603J1126J0628j216j1019p816J1372J0975o983j0303r0O586R737p441j2078
$$ -12603 -1477 9151 7935 -3084 -10900 472 11447 4464 -5839 -5929 657 10394 2953 -9125
1359i125N568P027J917m055r481L575R931k861m699l106j01R083j943o833j2J24
$$ -9125 -3557 3470 5387 1332 -8149 -4574 5357 2496 -2203 -5309 -5410 3673 1730 -5103 -5115 -4991
1375d991N103K359q446j661N058L33M127m550o204P543L131j750j117m544L068
$$ -4991 112 2471 -5975 -7636 -2578 -2245 1882 -2668 -8872 -1329 1802 52 -1065 -5609 -2541
1390b541Q498n536l340J043K70P265m585o984M458L157J133j465q575M358Q053
$$ -2541 5957 421 -2919 -1876 -1606 5659 1074 -5910 -1452 1705 2838 1373 -7202 -2844 5209
1405E209m414k033m120K009R011l716p634J185L342L221q97q432K006O334j473
$$ 5209 795 -1238 -5358 -3349 5662 1946 -5688 -4503 -1161 2060 1163 -7269 -5263 1071 -402
1420d02j587k931Q34N611j564m686L111Q83J258O85n711K966L648k242r93j771
$$ -402 -1989 -4920 -4086 1525 -39 -4725 -1614 -731 527 1212 -4499 -1533 2115 -127 -1120 -2891
1436b891n27N338n57n202R71J49L360J440n705m25M582J117r31k693k325O939
$$ -2891 -3418 1920 1363 -3839 -2868 -2719 641 2081 -3624 -4049 533 1650 719 -1974 -4299 2640
1452B640J76o112M53J160K978Q44q190O30Q435j996j825m083r50J1128j307q027
$$ 2640 2816 -3296 -2843 -1683 1295 2139 -6051 -5421 3014 1018 -807 -4890 -5840 5288 3981 -4046
1468d046K43J407N826K116j0557m32O587j60J172o677l249R489j06m431p44j613
$$ -4046 -3803 -2396 3430 5546 -5011 -5443 1144 984 2156 -4521 -7770 1719 1613 -2818 -3562 -5175
1484e175N244M634r474J30N009N03L033o859l471Q944R34l641j057n401O537O298
$$ -5175 69 4703 -4771 -4641 368 871 3904 -2955 -6426 2518 3452 -189 -1246 -6647 -110 6188
1500F188p628j084j169J799Q374m042o721K549J987M542O13j0034P44O589R68
$$ 6188 -1440 -2524 -3693 -1894 6480 2438 -4283 -1734 253 4795 5408 -4626 -3882 2707 3675
1515C675j193o967j770R296K125q416k060M23P689M134j1940l171Q709M786M3
$$ 3675 2482 -4485 -6255 3041 5166 -3250 -5310 -4887 2802 6936 -5004 -8175 534 5320 5363
1530E363q705o966J2411P594p984p425l675J0725R300j0324j0705L649R538O315
$$ 5363 -3342 -10308 2103 9697 1713 -5712 -9387 1338 10638 314 -10391 -6742 2796 9111
1544I111q743j3091R028J1333j664p368q675O406J4848o929j1701J480M554J0255
$$ 9111 368 -12723 -3695 7638 5974 -1394 -10069 -3663 11185 4256 -7445 -5965 -1411 8844
1558H844m430j6026N697R882K272l343j1773J754J5755r63o548n344j506J4166
$$ 8844 4414 -11612 -5915 3967 6239 2896 -8877 -7123 8632 7669 1121 -4223 -5729 8437
1572H437K730j2950l152K388P551O337j3596q285J0853N258J227p988j0409J1280
$$ 8437 11167 -1783 -4935 -2547 5004 11341 -2255 -10540 313 5571 6798 -1190 -11599 -319
1586c19J1052o704q117l827P020J3536r109j2332K410P601R098p565j5557M974
$$ -319 10733 4029 -4088 -7915 -895 12641 3532 -8800 -6390 1211 10309 2744 -12813 -7839
1600g839J3914J802p743j2090L631J8825o86j4306n908O731J4143J010j8435m434
$$ -7839 6075 7877 134 -11956 -8325 10500 9814 -4492 -10400 -3669 10474 11484 -6951 -11385
1614a1385J3574P879k255j4841n329J6676P127r290j0244j526J4072R531j4812
$$ -11385 2189 10068 7813 -7028 -12357 4319 11446 2156 -8088 -9614 4458 13989 -823
1627h23q979N729R740P521j2558j3410J0585J2334j651r153j2011Q757J6502o489
$$ -823 -9802 -4073 5667 13188 630 -12780 -2195 10139 8488 -665 -12676 -3919 12583 6094
1641F094j2145m349P329J5433n297j7829J333J1801P796l570j7834J231J6927
$$ 6094 -6051 -10400 -3071 12362 7065 -10764 -9431 2370 10166 6596 -11238 -10007 6920
1654F920K376p565j1916m71J8056L138j5093o022L547J3372M836j7397o843J1277
$$ 6920 9296 1731 -10185 -10656 7400 10538 -4555 -10577 -7030 6342 11178 -6219 -13062 -1785
1668a785J0213M83j4008r085J5604J1043p655j1697n481J3195J2981j2006j2952
$$ -1785 8428 8911 -5097 -14182 1422 12465 4810 -6887 -12368 827 13808 1802 -11150
1681a1150K509J0861R054r784j5931P282J3436K281q873j2536O208J5880j376
$$ -11150 -8641 2220 11274 1490 -14441 -7159 6277 8558 -315 -12851 -6643 9237 7861
1694G861j2718o674N141J4828k09j7314l283R412J0352j176j5694m944J5870P853
$$ 7861 -4857 -11531 -6390 8438 8229 -9085 -12368 -2956 7396 6220 -9474 -14418 1452 9305
1708I305p189j1292l967J6321Q703j2901j0535K747J2532Q149j4605j2976J0578
$$ 9305 2116 -9176 -13143 3178 11881 -1020 -11555 -8808 3724 11873 -2732 -15708 -5130
1721e130J1343J746j1712j2585J2054J4747n972j1662n311R094J5571q190j5387
$$ -5130 6213 7959 -3753 -16338 -4284 10463 4491 -7171 -12482 -3388 12183 3993 -11394
1734a1394K367R113Q987n771j5998L696J3531J817n506j1799J018J6248O48r892
$$ -11394 -9027 86 9073 3302 -12696 -9000 4531 6348 842 -10957 -9939 6309 6957 -2935
1748b935n708O29J3311L905j4536n232O585P708M256j3671q376J1636Q366k005
$$ -2935 -8643 -8014 5297 9202 -5334 -10566 -3981 3727 7983 -5688 -14064 -2428 5938 3933
1762C933j0853p830J1840J2395q761j1113k127J0714J1903j0467j3802M112J2163
$$ 3933 -6920 -14750 -2910 9485 724 -10389 -12516 -1802 10101 -366 -14168 -10056 2107
1775B107N380q510j4457O434J6550j778j0242q702O295J5973k561j5136k725R572
$$ 2107 7487 -1023 -15480 -9046 7504 5726 -4516 -13218 -6923 9050 6489 -8647 -11372 -1800
1789a800J0062j926j5784j137J3743N110n022j1450j210J4855M764j1496o040
$$ -1800 8262 6336 -9448 -10585 3158 8268 3246 -8204 -9414 5441 10205 -1291 -7331
1802g331J461J0418O174j3421o457P410O544K408q650r104R837Q011m183n199
$$ -7331 -5870 4548 10722 -2699 -9156 -1746 4798 7206 -1444 -10548 -711 7300 3117 -2082
1816b082o655O777J0656o707q011r9M031Q960m150j2423L376O537L392j927j1564
$$ -2082 -8737 -1960 8696 1989 -6022 -6121 -2090 6870 2720 -9703 -6327 210 3602 1675 -9889
1831i889Q48J2142O67n677n595j776J2690L164j1099k796K178Q482M309j1943
$$ -9889 -9041 3101 3768 -1909 -7504 -9280 3410 6574 -4525 -7321 -5143 3339 7648 -4295
1845d295n062R539N064j50p766o991J1896O559o667o301j361P830Q366r032q785
$$ -4295 -9357 182 5246 5096 -2670 -9661 2235 8794 2127 -4174 -5535 2295 10661 1629 -7156
1860g156N424O131M037o727r973O952Q499k099n751n633L186J1286m260q079r8
$$ -7156 -1732 4399 8436 1709 -8264 -1312 7187 5088 -663 -6296 -3110 8176 3916 -4163 -4261
1875d261K737P441j346j0162J004P113R47o53o664j759R681N7n240k254p08O295
$$ -4261 -1524 5917 4571 -5591 -4587 2526 3473 2820 -3844 -5603 4078 4135 -1105 -3359 -4067 2228
1891B228L304q926j707M445J927L414o452n306Q101K676k001j973n864N274P038
$$ 2228 5532 -3394 -5101 -656 1271 4685 -1767 -7073 1028 3704 1703 -270 -6134 -860 6178
1906F178o330k357k05N36P109l991o178M195J597Q87Q32o488K834N389l438K27
$$ 6178 -152 -2509 -2714 -2178 4931 940 -5238 -1043 554 1441 2273 -4215 -1381 4008 570 797
1922G97j859j179O051j624m692K155r12J743L446o789o57L747l05K940l298m657
$$ 797 -1062 -2241 3810 2186 -2506 -351 -1263 480 3926 -2863 -3520 227 -78 2862 -436 -5093
1938e093N687K582k134n69m384L547N920n247k209O96Q84M370k990n479M251L069
$$ -5093 594 3176 1042 473 -3911 -364 5556 309 -1900 -1204 -320 4050 1060 -4419 -168 2901
1954B901j991l1l708K665N310m132k966J429J598L165k203o796M663K912j449
$$ 2901 910 879 -2829 -164 5146 1014 -1952 -523 1075 4240 2037 -4759 -96 2816 1367
1969A367j065m860K878N179m044k313J486j47L769j704m876M524J695k072j30
$$ 1367 302 -4558 -1680 3499 -545 -2858 -1372 -1519 2250 546 -4330 194 1889 -183 -313
1984c13j814K013M219n034k310L578j75K542k831m101N108J845k510M26k851K399
$$ -313 -2127 -114 4105 -929 -3239 339 164 2706 -125 -4226 882 2727 217 643 -2208 191
2000A91M364m735n67J976q54K690k561l174M077M48k517J013k339K131K826m419
$$ 191 4555 -180 -747 1229 375 3065 504 -2670 1407 1855 -662 351 -1988 143 2969 -1450
2016a450M50J181o8K392j517k955K978L98j037J670l094l8K241j324J030p33l222
$$ -1450 -1000 181 113 2505 988 -1967 1011 1409 372 2042 -1052 -1090 1151 -173 857 124 -3098
2033c098K399J940j690L90l111J570M211k023k884M60J686K870j523n411K473
$$ -3098 -699 1241 -449 -59 -3170 -1600 2611 588 -2296 -1836 -150 2720 1197 -4214 -1741
2048a741M021j098j789l763K416N802j990n400M41K757M657j235p571K270M856
$$ -1741 2280 1182 -607 -4370 -1954 3848 1858 -3542 -3101 -344 4313 3078 -4493 -2223 2633
2063B633J455k315n477M94P504m23m913k249o2O877M21p611o31L551L694K92o929
$$ 2633 4088 1773 -3704 -3210 4294 3871 -1042 -3291 -3353 3524 3945 -3666 -4297 -746 2948 3240 -3689
2080c689j866P607J905l343l922j787P456L186o806l266J379M786L838p187m627
$$ -3689 -5555 2052 3957 614 -3308 -5095 2361 5547 -1259 -4525 -3146 1640 5478 -1709 -6336
2095f336N522L023J884n135n190O285N449l161l945k455L590O948m746n599R08
$$ -6336 -814 2209 4093 -1042 -6232 53 5502 2341 -1604 -4059 -469 6479 1733 -3866 -2958
2110b958L403M478l226o825K162N717K39j811n160O68P748n82m080k699Q83N869
$$ -2958 445 4923 1697 -5128 -2966 2751 2990 1179 -3981 -3313 4435 3853 -227 -2926 -2043 3826
2126C826J332o935j554K887L224K042o572l960N629L718o23m566m282N476O067
$$ 3826 5158 -1777 -3331 -444 2780 4822 -1750 -5710 -81 3637 3014 -1552 -5834 -358 5709
2141E709m114n050j489M276P051m729p750J295O030L478l211r628K639R412j1
$$ 5709 1595 -3455 -4944 -668 6383 1654 -6096 -4801 1229 4707 1496 -8132 -5493 3919 3908
2156C908m972o175K301J0833j9j0094k261M761Q455k77j2377q36R439M291l368
$$ 3908 -1064 -7239 -4938 5895 5876 -4218 -6479 -1718 6737 6460 -5917 -6753 2686 6977 3609
2171C609r101j392J1779L539q814n179J139R643L464j1058l987N622O351Q84q516
$$ 3609 -5492 -6884 4895 8434 -380 -5559 -4420 5223 8687 -2371 -6358 -736 5615 6499 -2017
2186b017n310Q727N474l682n544m185P734O180n988n686K16M816N743m976p867
$$ -2017 -7327 1400 6874 3192 -2352 -6537 1197 7377 1389 -4297 -4081 735 6478 1502 -6365
2201f365L216N008K399l022p700K024P295L38m163m428l5Q691N42o941k841J604
$$ -6365 -3149 1859 4258 1236 -6464 -4440 2855 3193 -970 -5398 -5433 3258 3800 -3141 -5982 -4378
2217d378O890K161q245m330O363M955M41o883n444Q315O472l595o823k763P655
$$ -4378 2512 4673 -3572 -7902 -1539 3416 3857 -3026 -8470 -155 6317 2722 -4101 -6864 791
2232G91P860o609q510K147O846N905p056r356N187Q769P99o940p290M673J1507
$$ 791 8651 2042 -6468 -4321 2525 8430 1374 -7982 -2795 5974 6773 -167 -7457 -2784 8723
2247H723l231q739k804M976R012l040j0696m07Q140M427k807j0097M21J0511J458
$$ 8723 5492 -3247 -6051 -1075 7937 4897 -5799 -6206 1934 6361 3554 -6543 -6122 4389 5847
2262E847n356o698J316R939J619r182l613L735O292K242r506m097P297M644j034
$$ 5847 491 -6207 -4891 5048 6667 -2515 -6128 -2393 3899 6141 -3365 -7462 -165 4479 3445
2277C445o812m223P608N981m641n689j803O138O314n905o372J208N507M508m553
$$ 3445 -3367 -7590 18 5999 1358 -4331 -6134 4 6318 413 -5959 -4751 756 5264 711
2292G11q219L458O777Q56l552o599K491Q373j82o107l317K621O997N50q129j821
$$ 711 -7508 -4050 2727 3583 31 -6568 -4077 4296 4114 -1993 -5310 -2689 4308 4858 -3271 -5092
2308e092M576N206l19p796k026O910M339l047n909k279P608M702n780n306L3O371
$$ -5092 -516 4690 4371 -3425 -5451 1459 5798 2751 -3158 -5437 2171 6873 1093 -4213 -4180 2191
2324B191M905o393p242L429O344K682n679p211M724P659r68o283m446M253Q312
$$ 2191 7096 703 -6539 -3110 3234 5916 237 -6974 -2250 5409 4441 -1842 -6288 -2035 6277
2339F277k212q961n97M984O610k999r865R32Q346K548m241p356N83J0543K54p309
$$ 6277 4065 -4896 -5493 -509 6101 3102 -6763 -5831 2515 5063 822 -6534 -5951 4592 4846 -2463
2355b463l467K322Q088L29q466k259N611M067J0o915k552P481K774k724m245j476
$$ -2463 -5930 -3608 4480 4809 -3657 -5916 -305 3762 3772 -3143 -5695 1786 4560 1836 -2409 -3885
2371c885O135L514n126l269J621L079L452m778m216L557K704J031k764m609K664
$$ -3885 2250 5764 638 -2631 -1010 2069 5521 743 -3473 84 2788 3819 1055 -3554 -890
2386h90M917j088k704l442J175O453r55m963j614J671M752J052o551k080M571
$$ -890 4027 2939 235 -3207 -2032 4421 3466 -1497 -3111 -1440 3312 4364 -2187 -4267 304
2401C04K518L74n546k373N612L355l515l231j019N085L947n787l692K448L739
$$ 304 2822 3196 -2350 -4723 889 4244 729 -2502 -3521 1564 5511 -276 -3968 -1520 2219
2416B219K991n730n106N604M336j484l718m369M682O702m798m116q32L780M947
$$ 2219 5210 -520 -5626 -22 4314 2830 -888 -5257 -575 6127 1329 -2787 -3619 161 5108
2431E108l206o635L151L728J375j948n859K927N560k220k274j473L19N114j058
$$ 5108 1902 -4733 -1582 2146 3521 1573 -4286 -1359 4201 1981 -293 -1766 -1447 3667 2609
2446B609n148J454J307J919L26n527Q75L917k1o40k670j605M928N18l051l00j640
$$ 2609 -2539 -1085 222 2141 2467 -3060 -2185 1732 1711 1071 -1599 -3204 1724 2242 -809 -1109 -2749
2463b749K895K492l626j895J849O26J750j114l591L068J393p60j82j986P29L279
$$ -2749 146 2638 -988 -2883 -1034 -408 1342 228 -3363 -295 1098 338 156 -1830 -1101 2178
2479B178j649j932P59j05K568q20l415J681J264R1L09l026m35M385j209r11j99
$$ 2178 529 -1403 -644 -749 1819 999 -2416 -735 529 620 929 -2097 -2532 1853 644 -267 -466
2496d66j411K849J331l793J31J133l17K083k155k224L275j07l00j2k649K707J726
$$ -466 -1877 972 2303 -1490 -1359 -226 -543 1540 -615 -2839 436 329 29 17 -2632 75 1801
2513A801k750K44J00l49L142k691j859K545k9M34l40l141K286K325k632j65p21
$$ 1801 -949 -705 -605 -954 2188 -503 -2362 183 154 588 248 -2893 -607 1718 -914 -1079 -1800
2530a800K44L518k560j951K185M3O98K68l222K081K018k508O88r46N15K821k509
$$ -1800 -1556 1962 -598 -2549 -364 -321 377 645 -2577 -496 1522 -986 -298 -1244 -729 2092 -417
2547d17j857K425K5O20l28k960K875J675k066l10m03P39K244j495k631K200oM08
$$ -417 -2274 151 176 796 468 -2492 383 2058 -8 -318 -721 18 2262 767 -1864 336 330 738
2565G38J52l079K201J541j666m21j26NL020j921j982K137p26J221M0k576J265
$$ 738 890 -2189 12 1553 -113 -534 -660 -655 2365 444 -1538 599 -127 1094 1134 -1442 -177
2582a77J448j382K17q09j088K839p51j789Q99j075J141J701k538n50J174l99K093
$$ -177 1271 -111 106 -703 -1791 1048 297 -1492 -593 -1668 -527 1174 -1364 -1914 -740 -1139 954
2599I54j329l061L021O37m68m36k318J873L229k281j528J19Q68M006k129l687
$$ 954 -375 -3436 -415 222 -246 -682 -3000 -1127 2102 -179 -1707 -1588 -720 3286 1157 -2530
2615b530K199J879J267r42m304J480M968j580k037j427N52M663j371m349L89K224
$$ -2530 -331 1548 2815 1873 -2431 -951 4017 2437 400 -1027 -475 4188 2817 -1532 -1143 1081
2631A081K055j70n415O64M430j62j223k962m88M940m1l977n19O59K682J688m890
$$ 1081 3136 2966 -2449 -1785 2645 2483 1260 -1702 -2190 2750 2709 -1268 -1787 -1128 1554 3242 -1648
2648a648j133L030J432l7k790j923L455K369k211j355j866K911L418k945k782
$$ -1648 -2781 249 1681 1644 -1146 -3069 386 2755 544 -811 -2677 234 3652 707 -2075
2663b075Q36J606K901j747m740K138K954M08q68m273J008N648o38l380j800R12
$$ -2075 -1239 367 3268 1521 -3219 -1081 1873 2281 1413 -2860 -1852 3796 3158 -222 -2022 -1110
2679a110M698M21n725j34K565K729K57n397j133N353R25j585k824j898N712K032
$$ -1110 3588 4009 -1716 -1850 715 3444 3701 -1696 -2829 2524 3449 1864 -960 -2858 2854 4886
2695D886m514j957K20L431K680m301m250L725K499J130l441m443M156L907j533
$$ 4886 372 -1585 -1365 2066 4746 445 -3805 -80 2419 3549 108 -4335 -179 3728 2195
2710B195l093k500L084N046l005m421O84K243L860j871n982J648M410Q15j667
$$ 2195 -898 -3398 -314 4732 1727 -2694 -2010 233 4093 2222 -3760 -2112 2298 3113 1446
2725A446m707J30O354J67l794k588N02N456R31n873j652K991K949J341n584k900
$$ 1446 -3261 -3131 3223 3390 -404 -2992 -2490 2966 3897 -1976 -3628 -637 2312 3653 -1931 -4831
2741d831N434K511j254m044k517N255M071m002l969O91L262M457m309m890K772
$$ -4831 603 3114 1860 -2184 -4701 554 4625 623 -3346 -2655 607 5064 755 -4135 -1363
2756a363L993R91l100m712K582N886j619k937k763J612O006j377n567o19L028
$$ -1363 2630 3621 521 -4191 -1609 4277 2658 -279 -3042 -1430 4576 3199 -2368 -2987 41
2771D1L443j34o595n13N187J848j385m771j467O122K139m108k916p09M927L876
$$ 41 3484 3350 -3245 -3758 1429 3277 1892 -2879 -4346 1776 3915 -193 -3109 -3818 1109 4985
2787D985n956l464K362L833K384m839n185M881M766j360m184l792M797O003l646
$$ 4985 -971 -4435 -2073 1760 4144 -695 -5880 -999 3767 2407 -1777 -5569 -772 5231 1585
2802A585n396m72M000M963l620o703K382N078J438k804n733J740O691q15l947
$$ 1585 -3811 -4283 -283 4680 1060 -5643 -3261 1817 3255 451 -5282 -3542 3149 2334 -1613
2817a613k660J561N543L11o008o05K515L106N58n406j489M754K464j582l332k528
$$ -1613 -4273 -2712 2831 3142 -2866 -3471 -956 2150 2708 -2698 -4187 567 3031 1449 -1883 -4411
2833d411N490K936l534l443l50L980L917m333m805K591L237K174l027n436K545
$$ -4411 1079 4015 481 -2962 -3312 668 4585 252 -4553 -1962 1275 3449 422 -5014 -2469
2848b469M966r6l246l640J640O161q35n246j223K095N228o55o707l91M742K667
$$ -2469 2497 2401 -845 -4485 -2845 3316 2481 -2765 -3988 -1893 3335 2680 -4027 -4418 324 2991
2864B991j551n584p86O697J064m047l270M24N778J898n768l233L346L937J352
$$ 2991 1440 -4144 -4930 1767 2831 -1216 -4486 -4062 1716 3614 -2154 -5387 -2041 1896 3248
2879C248n534l462N063L452j019m184k743M775M321l196l795j37L107M272l816
$$ 3248 -2286 -5748 -685 2767 1748 -2436 -5179 -404 3917 721 -3074 -3211 -104 4168 352
2894C52m216K319K540J812k133m247J989M304q82k505k131J046M487p03l729j516
$$ 352 -3864 -1545 995 2807 674 -3573 -1584 2720 1838 -667 -2798 -1752 2735 2032 -1697 -3213
2910c213J956L273K46m869r91L293K020J10m132k192M612K434k251k703j653L856
$$ -3213 -1257 2016 2262 -2607 -3598 -305 1715 1825 -2307 -4499 113 2547 296 -2407 -4060 -204
2926b04L513l768k979R63L295K129k945l836K669L783m51k369l121K708M342j700
$$ -204 3309 -459 -3438 -2475 820 2949 4 -3832 -1163 2620 2169 -200 -3321 -613 3729 2029
2942B029l342j081K101L827j078m950L60L044J811o86m958M96M456R60k263l010
$$ 2029 -1313 -2394 -293 3534 2456 -2494 -2134 910 2721 2035 -2923 -2427 2029 2989 726 -2284
2958b284j41M664R56m279j336J005L207J176m482j615L216J858m32l097k061M176
$$ -2284 -2425 2239 3195 -1084 -2420 -1415 1792 2968 -1514 -3129 87 1945 1513 -1584 -3645 531
2974E31K062k108k282q09L291K723l178k968J432K462J890k811l714K944K702
$$ 531 2593 485 -1797 -2606 685 3408 230 -2738 -1306 1156 3046 235 -3479 -535 2167
2989B167l08j802k246K296K697j175k068j1J024K443j239k414N28J233P51j65
$$ 2167 1859 57 -2189 107 2804 1629 -439 -450 574 3017 1778 -636 -108 1125 1876 1711
3005A711k373j68K468k54o82p95j333K463O88k000o70j80J378J585k098j879J302
$$ 1711 -662 -830 1638 1384 702 -93 -1426 1037 1725 -275 -945 -1125 253 1838 -260 -2139 -837
3022h37J300Q26j629k445K010J752j47j191j535R85K970j219j838L47P26K168
$$ -837 463 1289 -340 -2785 -775 977 830 -361 -1896 -911 2059 840 -998 -651 75 2243
3038B243n70k969J105J932K85n23k746P8L805p99j946r15K89K773k17l608O07
$$ 2243 1673 -1296 -191 1741 2026 1503 -1243 -1165 2640 1841 -105 -1020 -731 2042 1825 -1783 -1176
3055a176J786Q73j05l204L76L058l96j648n85M9K103P9l119R91Q96N20J52k068
$$ -1176 610 1483 1378 -1826 -1450 1608 1212 -436 -1021 -972 1131 1210 -1909 -918 -22 498 650 -1418
3073a418M74K143p96m11K12q64J860j91j592J000P7J60K65j067m2J207j139P1
$$ -1418 -944 1199 403 -8 204 -660 1200 1009 -583 417 494 654 919 -148 -190 1017 -122 -51
3091e1R22j069J064k86r32J177k38q11P76k55m82P11j280O16P13j180N0L40p32
$$ -51 871 -198 866 580 -352 825 587 -224 552 297 -185 526 -754 -138 575 -605 -555 -215 -947
3110i47Q03n77j102J776n70l54L95r83J240L98j337O1P11j21O50j136n42J917
$$ -947 -144 -721 -1823 -47 -617 -971 -576 -1559 -319 79 -1258 -1197 -486 -607 43 -1093 -1635 282
3128B82n71m94L06m17J173O25j810P46O79LJ189j661p56K174k5p53l85j032J713
$$ 282 -289 -783 -477 -894 279 904 -906 -160 519 522 1711 50 -706 1468 1443 690 305 -727 986
3147I86R00k311j57M18O65J014k268r45J919M07m96j019j417K328J412k368q97
$$ 986 1886 -425 -582 -164 501 1515 -753 -1698 221 628 132 -887 -2304 24 1436 -932 -1829
3164a829j62J194J576k161j745J893J266r8j010k116K305K144j659r89l63J459
$$ -1829 -1991 -797 779 -1382 -3127 -1234 32 -66 -1076 -3192 -887 1257 -402 -1391 -1754 -295
3180b95J892j582k552J351J519Q54j035k673J737K062r01j052j104O11K957p46
$$ -295 1597 15 -2537 -1186 333 1187 152 -2521 -784 1278 377 -675 -1779 -1168 1789 1043
3196A043k567M63P10J538J5k560lK022Pj97j399o29K646o6j074n31p21J941Q91
$$ 1043 -1524 -1061 -351 1187 1202 -1358 -1361 661 668 471 -928 -1557 1089 1023 -51 -582 -1303 638 1529
3215A529j768q08R73K26J569j294k232J842Q04J64m20k319Q92K356j18j608j082
$$ 1529 -239 -1047 -74 152 1721 427 -1805 37 841 1005 585 -1734 -842 1514 1396 -212 -1294
3232a294L1L660q17k748j72Q75K380R3l504p94L467Q69j099k670r82M289J186
$$ -1294 -1263 2397 1580 -1168 -1340 -465 1915 2008 -1496 -2290 1177 2046 947 -1723 -2705 1584 2770
3249B770l177j796N55L195J328m288j694K926K194M41m184j625L748K671k424
$$ 2770 -407 -2203 -1648 1547 2875 -1413 -3107 -181 2013 2454 -1730 -3355 393 3064 640
3264F40k500l94L339K872l913k350J315K643J275k511k904K512K759q94j462k379
$$ 640 -1860 -2254 1085 3957 44 -2306 -991 1652 2927 416 -2488 24 2783 1889 427 -1952
3280a952J890L567k103j892k10Q59K537o57l544P93J539P08K90l287k89K757P67
$$ -1952 -62 3505 1402 -490 -700 159 2696 2039 -1505 -712 827 1535 1825 -1462 -1751 1006 1773
3297A773r70k111j078L272J562k686j426k69K500K595l570j737J639J953O32j475
$$ 1773 803 -1308 -2386 886 2448 -238 -1664 -1933 567 3162 -408 -2145 -506 1447 2079 604
3313F04l766L043K550o57j748k358K081L564j439l416J31J724L048j525m463J063
$$ 604 -3162 -119 2431 1774 26 -2332 -251 3313 1874 -1542 -1411 313 3361 1836 -2627 -1564
3329a564L450J030j472m107L95N057M6l418k029M84M676M80m901j003K109K751
$$ -1564 1886 2916 1444 -2663 -2268 2789 2835 -583 -2612 -2128 2548 3028 -1873 -2876 -767 1984
3345A984Q25m564j700M298J714j306k926j464M613K072l461k339L88K909K425
$$ 1984 2809 -1755 -3455 843 2557 1251 -1675 -3139 1474 3546 85 -2254 -1866 1043 3468
3360C468m001l063K955K307J028k834l020K711L547j446k364j472J401M120j513
$$ 3468 -533 -3596 -641 1666 2694 -140 -3160 -449 3098 1652 -712 -2184 -783 3337 1824
3375A824l571j94J557L053j058m054J80L573L27p29k996j63L981L85k567j300
$$ 1824 -1747 -1941 -384 2669 1611 -2443 -2263 1310 1637 908 -2088 -2251 1730 2115 -452 -1752
3391a752J8L074J257m010j271J948J589R21l434k010K924J986j06k091k400K513
$$ -1752 -1734 1340 2597 -1413 -2684 -736 853 1774 -1660 -3670 -746 1240 1134 -957 -3357 -844
3407h44L361k034j969j027J528L748j395m015L69K861J296o78m336L48M394K00
$$ -844 2517 483 -1486 -2513 -985 2763 1368 -2647 -2278 583 1879 1201 -3135 -2787 1607 1807
3423A807j972l057Q56M652L90m576q85J596L436J22n146q08L889J518j299l260
$$ 1807 -165 -3222 -2366 2286 2676 -1900 -2785 -1189 2247 2369 -2777 -3585 304 1822 523 -2737
3439b737j285M387K112l568j740L4L237K174l705j970K116K315J027k856k721
$$ -2737 -4022 365 2477 -1091 -2831 -2797 440 2614 -1091 -3061 -945 1370 2397 -459 -3180
3454c180L078K484j348j629j854K059L069j931k531M30J258K310j109l371J246
$$ -3180 -102 2382 1034 -595 -2449 -390 2679 748 -1783 -1353 -95 2215 1106 -2265 -1019
3469a019J820P01n88k863P3K958Oj644j447p41L049J082k745r80r3K175J627k897
$$ -1019 801 1502 914 -1949 -1876 1082 1088 -556 -2003 -2744 305 1387 -1358 -2338 -2431 -256 1371 -1526
3487a526j864K430J510N69j910k694K806K672j381k080j167K023L154k044k977
$$ -1526 -3390 -960 550 1119 -791 -3485 -679 1993 612 -1468 -2635 -612 2542 498 -2479
3502b479R12J674K048j439l084J162L429N8j610k126L57M236r49k871n93R75K745
$$ -2479 -1567 107 2155 716 -2368 -1206 2223 2281 671 -1455 -1098 3138 2189 -682 -1275 -300 2445
3519B445m45l537n66K831R77l95k597o27L185O81j691j635l03K511J682l232r44
$$ 2445 2000 -1537 -2103 728 1705 1310 -1287 -1914 1271 1952 261 -1374 -1677 834 2516 -716 -1660
3536a660J052Q77J052k172j911K325J472n13j006j809J741K775j651r02n49J079
$$ -1660 -608 269 1321 -851 -2762 -437 1035 522 -484 -2293 -552 2223 572 -330 -879 200
3552B00K355j409k322R48R74P20j45k880Q89K035m63p05r63J6K219J57k081K44
$$ 200 2555 1146 -1176 -228 746 1466 1321 -1559 -670 1365 902 197 -766 -750 1469 1626 -455 -211
3570b11p2J193R32k292n23J090K41O66j790j144K002O40r56l99p96R98K290j623
$$ -211 -283 910 1842 -450 -973 117 358 1024 -766 -1910 92 732 -224 -623 -1419 -421 1869 246
3588B46p38N72M46J267m86j876P70J287L4r3k244P71K068n80j091p22K62K431
$$ 246 -492 80 526 1793 1307 -569 201 1488 1522 1429 -815 -44 2024 1444 353 -369 -107 2324
3606B324n63k143M43N16J015J24k404O7J943j55j207o76p73K215j15k029l3N23
$$ 2324 1761 -382 61 577 1592 1716 -688 -621 1322 1167 -40 -716 -1489 726 611 -1418 -1451 -928
3624i28J034L04j716k15J917k67p6p42m82J667J85j282J91l2L11Q65r11n49J301
$$ -928 106 410 -1306 -1521 396 129 53 -689 -1171 496 681 -601 -410 -442 -131 734 -177 -726 575
3643E75n71L90q1o94J166K75j039P48j47k29J044r60K75L99q80M13J18r72L88
$$ 575 4 394 313 -381 785 1060 21 769 622 393 1437 477 752 1151 271 684 802 -170 218
3662B18M32p89R59j112l11J057n26q9L15r05O68O40j426M09Pk59R45j089l78J114
$$ 218 650 -139 820 -292 -603 454 -72 -161 154 -751 -83 557 -869 -460 -453 -712 233 -856 -1234 -120
3682a20l46k20K43q77J127Q71j690P13K75K93N81r45o34J540j73n28k00n03J224
$$ -120 -466 -686 -443 -1320 -193 678 -1012 -299 -24 269 850 -95 -729 811 638 110 -90 -593 631
3701F31R6j240K40L34M33O9j180n21J689j04m44l15o05J132L46j600R3L69K05
$$ 631 727 -513 -273 61 494 563 -617 -1138 551 447 3 -312 -917 215 561 -1039 -946 -577 -372
3720c72K67j093n17J347k80J94j86j125J295Q13r88l35J70L59J252j004r28P50
$$ -372 -105 -1198 -1715 -368 -648 -454 -640 -1765 -470 343 -645 -980 -810 -451 801 -203 -1131 -381
3738c81L38N77l22j543O50J351l02l79r76J42K065p45j320J38L38J189Q7k192
$$ -381 -43 534 212 -1331 -681 670 368 -11 -987 -845 1220 475 -845 -707 -369 820 907 -1285
3756a285J49J501j27J56j534p01J986J52p55o39l29J272J101j949n16P63R52N91
$$ -1285 -1136 365 238 394 -1140 -1841 145 297 -458 -1097 -1426 -154 947 -1002 -1518 -755 197 788
3774G88j518j091J442J130o68o34j197J167K002j378j363Q9Q70J196n07k251R61
$$ 788 -730 -1821 -379 751 83 -551 -1748 -581 1421 43 -1320 -1231 -361 835 328 -1923 -962
3791i62J389M43n65k126R06J892n8j013j230L75K104Q6k039j45Q19J127K55k364
$$ -962 427 870 305 -1821 -915 977 919 -94 -1324 -949 1155 1241 -798 -943 -124 1003 1258 -1106
3809a106j71J565Q02l52j741o71K168J337j774j241j5K044J216k268j437J117
$$ -1106 -1277 288 1090 738 -1003 -1674 494 1831 57 -1184 -1199 845 2061 -207 -1644 -527
3825e27J594M44j738j958K061J479l86j216j236J073K312q45j929K17Q73J867
$$ -527 1067 1511 -227 -2185 -124 1355 969 -247 -1483 -410 1902 1057 -872 -655 218 2085
3841B085j052k329P13J117Q76n12j889p9K108Nj214j271k1K425M74j954j173O91
$$ 2085 1033 -1296 -583 534 1410 898 -991 -1070 1038 1043 -171 -1442 -1463 962 1436 -518 -1691 -1000
3859a000J866O19k280j044J556J712Rj711j794K032J713p56j932o28J694K278
$$ -1000 866 1485 -795 -1839 -283 1429 1438 -273 -2067 -35 1678 922 -1010 -1638 56 2334
3875B334j593j978M92J766J455k080j978J282K389L1j969k006J244K956r36k485
$$ 2334 741 -1237 -745 1021 2476 396 -1582 -300 2089 2120 151 -1855 -611 2345 1409 -1076
3891a076p03J368K306o52k732k55K132J133j19l027J22K446N89j341j562M68J950
$$ -1076 -1779 -411 1895 1243 -1489 -1744 388 1521 1402 -1625 -1503 943 1532 191 -1371 -903 1047
3908A047P18j999j151Q42J529P25k194j201J304J944l44j197j625J867J715r31
$$ 1047 1765 -234 -1385 -543 986 1711 -483 -1684 -380 1564 1220 23 -1602 265 1980 1049
3924A049j304j105J369K076j036k239j96J451J390l90l114L16K410J152j325k567
$$ 1049 -255 -1360 9 2085 1049 -1190 -1386 65 1455 1065 -2049 -1733 677 1829 504 -2063
3940b063L26K930Q94k162j828O78K597N32l086r55J380K064j81k688j184K841
$$ -2063 -1737 1193 2087 -75 -1903 -1225 1372 1904 -1182 -2137 -757 1307 1126 -1562 -2746 95
3956I5J728j283j841j100L185J611k095j624J87J921J467k084k406J737J986J59
$$ 95 1823 540 -1301 -2401 784 2395 300 -1324 -1137 784 2251 167 -2239 -502 1484 1643
3972A643j989j918K212K101p49j932o12R35K637j134k267j93J504J227p12k597
$$ 1643 -346 -2264 -52 2049 1300 -632 -1244 -309 2328 1194 -1073 -1266 238 1465 753 -1844
3988a844R5K182L19j061j772l24K889L18j512j556M01K094R44k376j124J615J004
$$ -1844 -1749 433 752 -309 -2081 -2405 484 802 -710 -2266 -1865 229 1173 -1203 -2327 -712 292
4005B92N67j667j418J480J728m71j391j271J655K248j349j914K97J426J832j243
$$ 292 859 -808 -2226 -746 982 511 -880 -2151 -496 1752 403 -1511 -1214 212 2044 801
4021H01k092O71J723M44q04k291N46K110k28j094j459K90K349j36k164m91P23
$$ 801 -1291 -620 1103 1547 743 -1548 -1002 1108 880 -214 -1673 -1383 966 830 -1334 -1825 -1102
4038a102J900L16k650o80K081J064j58k002j210K265J474j567j396l34J748J713
$$ -1102 798 1114 -1536 -2216 -135 929 771 -1231 -2441 -176 1298 -269 -1665 -1999 -251 1462
4054A462k012j496Q93J840Q55j849k085K340J613n81j362j324J348K402j628j405
$$ 1462 -550 -2046 -1153 687 1542 -307 -2392 -52 1561 980 -382 -1706 -358 2044 416 -989
4070i89K8J046J341q32k624J262J276K01k91j904M98K034n5j485k74J22J409J46
$$ -989 -961 85 1426 594 -2030 -768 508 709 418 -1486 -988 1046 991 -494 -768 -646 763 909
4088I09j761j37J63R28N32j728q54J580L35R6m14j380J431J027p56j84o40N34
$$ 909 -852 -989 -826 102 634 -1094 -1948 -368 -33 63 -351 -1731 -300 727 -29 -213 -853 -319
4106c19J433p41j248N28K94J156l87k088P00J665J54m22j468j2K423k70j413n62
$$ -319 1114 373 -875 -347 -53 1103 716 -1372 -672 993 1147 725 -743 -755 1668 1398 -15 -577
4124e77j5J957L09k356k36J479M01L0k053n26K255L18p51j578K79J731O46j655
$$ -577 -592 1365 1674 -682 -918 561 962 992 -1061 -1587 668 986 235 -1343 -1064 667 1313 -342
4142c42j129J501N85M83j586p85J791L89o00o58o74J403O14j246j39O7K31J189
$$ -342 -1471 30 615 1098 -488 -1273 518 907 307 -351 -1025 378 992 -254 -393 -326 -95 1094
4160A094p45j036J103Rm9l9j145N89O56l71R6l56j63J067n92p01M34k13M02P18
$$ 1094 349 -687 416 425 376 337 -808 -219 437 66 162 -194 -357 710 118 -583 -149 -362 40 758
4180G58j292K89N10k32O80n93n71R56L11m80Qn50L21Q87q64K65k82K11M65q0r84
$$ 758 -534 -245 265 33 713 120 -451 505 816 336 344 -206 115 1002 138 403 121 332 797 717 -267
4201b67N61K03P6M63j489N30R21p17j07j63j29O74N9j315M01L47P9K41j094M58
$$ -267 294 497 573 1036 -453 77 998 281 174 11 -118 556 615 -700 -299 48 127 368 -726 -268
4221b68N15l27j22k54k94R19j63o63K08j79P95J18r21L6R41n94J47j02o20J267
$$ -268 247 -80 -202 -456 -750 169 6 -657 -449 -628 167 285 -636 -600 341 -253 -106 -208 -828 439
4241D39k45p43N25O6K95J93j013K75J089o83P7k09k41J393o05r24L68J74K35J28
$$ 439 194 -549 -24 42 337 530 -483 -208 881 198 275 66 -175 1218 613 -311 57 231 466 594
4261E94j144L67R08o93k51l28r2J232k87j433P17n0J04J45j147N29Q08j97m43
$$ 594 -550 -183 725 32 -219 -547 -639 593 306 -1127 -410 -460 -356 -211 -1358 -829 -21 -218 -661
4280f61j62k78J253k89j057O77k35K42N19j197N09P84l54j1K8o58R68q9p86R52
$$ -661 -823 -1101 152 -137 -1194 -517 -752 -510 9 -1188 -679 105 -249 -260 -232 -890 78 -11 -797 155
4300A55r95N12O10r03l8M78n63P47J67j155K65J86L91N51j324k61J369l28j41
$$ 155 -840 -328 282 -621 -659 -181 -744 3 170 -985 -720 -534 -143 408 -916 -1177 192 -136 -277
4319b77n73n23J379O97j390M5l65R27O32j193q83J613K87k11o18r62J430J090
$$ -277 -850 -1373 6 703 -687 -642 -1007 -80 552 -641 -1524 89 376 165 -453 -1415 15 1105
4337A105j681m43k5R95J090j735j031J086P12L70j143j294J354J267o66r74o77
$$ 1105 -576 -1019 -1044 -49 1041 -694 -1725 -639 73 443 -700 -1994 -640 627 -39 -1013 -1690
4354a690Q56J843j242j347N95O20O70k61j737N60J404j82o16p93K52J769n96q26
$$ -1690 -834 1009 -233 -1580 -985 -365 305 44 -1693 -1133 271 89 -527 -1320 -1068 701 105 -721
4372g21k24L29Q90L51j757M0J125r0M65j108r40J669N44n18m45r02J341J009j188
$$ -721 -945 -616 274 625 -1132 -1092 33 -57 408 -700 -1640 29 573 55 -390 -1292 49 1058 -130
4391a30n20LN95J375j241r22O44N49K33j74j587L20J835l74q08p74P3J954k57
$$ -130 -650 -647 -52 1323 82 -840 -196 353 586 412 -1175 -855 980 606 -202 -976 -903 1051 794
4410G94j955K30M73J249K5j851l90J681M02k78j167p47K128P24j306n12p24K003
$$ 794 -1161 -931 -458 791 816 -1035 -1425 256 658 380 -787 -1534 594 1318 12 -500 -1224 779
4428G79Q91j638j134J136P93J020j572j902J759J427o44q52j614J338J972r57
$$ 779 1670 32 -1102 34 827 1847 275 -1627 132 1559 915 63 -1551 -213 1759 802
4444H02j443l70J055J547r20k181N52J393N77q24j628M33K442m46j542q19P83
$$ 802 -641 -1011 44 1591 671 -1510 -958 435 1012 188 -1440 -1007 1435 989 -553 -1372 -589
4461e89J831M4k379J24R46J420k69j743o48J859M84j66j018p17J650P46j121p38
$$ -589 1242 1286 -1093 -969 -23 1397 1128 -615 -1263 596 1080 914 -104 -821 829 1575 454 -284
4479b84m1Q38J255j241j242N52O51P73o39j872J146Q57M61o52j533K71K130k47
$$ -284 -325 513 1768 527 -715 -163 488 1261 622 -1250 -104 753 1214 562 -971 -700 1430 1183
4497A183j394n60M35J668j9j840q15J464Q42J22k070p01K146Q27j038j286l75
$$ 1183 -211 -771 -336 1332 1313 -527 -1342 122 964 1086 -984 -1685 461 1288 250 -1036 -1411
$$ [...]
8191b49
##END NTUPLES=NMR FID
##END=
