##TITLE=1H_SA_sl.BF3TBuCl
 CDCl3, 8 sc, 
 18.12.2020
##JCAMPDX= 6.0         $$ Bruker NMR JCAMP-DX V2.0
##DATA TYPE= NMR FID
##DATA CLASS= NTUPLES
##ORIGIN= UXNMR, Bruker Analytische Messtechnik GmbH
##OWNER= root
$$ XWIN-NMR		Version 3.5
$$ Fri Dec 18 11:56:23 2020 Russian Standard Time (UT+4h)  she@DPX200
##.OBSERVE FREQUENCY= 200.1315066352
##.OBSERVE NUCLEUS= ^1H
##.DELAY= (6, 6)
##.ACQUISITION MODE= SIMULTANEOUS
##.ACQUISITION SCHEME= undefined
##.AVERAGES= 8
##.DIGITISER RES= 18
##SPECTROMETER/DATA SYSTEM= spect
##.PULSE SEQUENCE= zg30
##.SOLVENT NAME= CDCl3
##.SHIFT REFERENCE= (INTERNAL, CDCl3, 0, 15.7039)
##AUDIT TRAIL= $$ (NUMBER, WHEN, WHO, WHERE, WHAT)
$$ ##TITLE= Audit trail, XWIN-NMR		Version 3.5
$$ ##JCAMPDX= 5.01
$$ ##ORIGIN= Bruker BioSpin GmbH
$$ ##OWNER= she
$$ F:/spectra/data/she/nmr/H-F/1/audita.txt
$$ ##AUDIT TRAIL=  $$ (NUMBER, WHEN, WHO, WHERE, WHAT)
(   1,<2020-12-18 11:55:08.64 +0400>,<she>,<DPX200>,
      <created by zg, POWCHK disabled, PULCHK disabled
       configuration hash MD5:
       00 E9 B6 7A A2 85 ED C7 34 08 36 98 17 FE 4E 26
       data hash MD5: 16K
       9F 2A 90 5D A4 0D D1 B9 91 EA 64 51 07 CB 02 77>)
$$ ##END=
$$ 
$$ hash MD5
$$ B3 91 14 12 93 54 BF FA BC F6 9D F6 C7 9A CE B8
##$RELAX= 
##$RELAX= 
##$RELAX= 
##$RELAX= 
##$RELAX= 
##$RELAX= 
$$ Bruker specific parameters
$$ --------------------------
##$DU= <F:/spectra>
##$EXPNO= 1
##$NAME= <H-F>
##$PROCNO= 1
##$TYPE= <nmr>
##$USER= <she>
##$AMP= (0..31)
100 100 100 100 100 100 100 100 100 100 100 100 100 100 100 100 100 100 
100 100 100 100 100 100 100 100 100 100 100 100 100 100 
##$AQSEQ= 0
##$AQ_mod= 1
##$AUNM= <au_zg>
##$AUTOPOS= <>
##$BF1= 200.13
##$BF2= 200.13
##$BF3= 200.13
##$BF4= 200.13
##$BF5= 200.13
##$BF6= 200.13
##$BF7= 200.13
##$BF8= 200.13
##$BYTORDA= 1
##$CFDGTYP= 0
##$CFRGTYP= 5
##$CHEMSTR= <none>
##$CNST= (0..31)
1 1 145 1 1 1 1 1 1 1 1 1 1 1 1 1 1 1 1 1 1 1 1 1 1 1 1 1 1 1 1 1 
##$CPDPRG= <>
##$CPDPRG1= <>
##$CPDPRG2= <>
##$CPDPRG3= <>
##$CPDPRG4= <mlev>
##$CPDPRG5= <mlev>
##$CPDPRG6= <mlev>
##$CPDPRG7= <mlev>
##$CPDPRG8= <mlev>
##$CPDPRGB= <>
##$CPDPRGT= <>
##$D= (0..31)
0 1.2 0 0 0 0 0 0 0 0.06 0 0.03 0 0 0 0 0.0002 0 0 0 0 0 0 0 0 0 0 0 0 
0 0 0 
##$DATE= 1608278107
##$DBL= (0..7)
120 120 120 120 120 120 120 120 
##$DBP= (0..7)
150 150 150 150 150 150 150 150 
##$DBP07= 0
##$DBPNAM0= <>
##$DBPNAM1= <>
##$DBPNAM2= <>
##$DBPNAM3= <>
##$DBPNAM4= <>
##$DBPNAM5= <>
##$DBPNAM6= <>
##$DBPNAM7= <>
##$DBPOAL= (0..7)
0.5 0.5 0.5 0.5 0.5 0.5 0.5 0.5 
##$DBPOFFS= (0..7)
0 0 0 0 0 0 0 0 
##$DE= 6
##$DECBNUC= <off>
##$DECIM= 32
##$DECNUC= <off>
##$DECSTAT= 4
##$DIGMOD= 1
##$DIGTYP= 9
##$DL= (0..7)
0 120 120 120 120 120 120 120 
##$DP= (0..7)
150 150 150 150 150 150 150 150 
##$DP07= 0
##$DPNAME0= <>
##$DPNAME1= <>
##$DPNAME2= <>
##$DPNAME3= <>
##$DPNAME4= <>
##$DPNAME5= <>
##$DPNAME6= <>
##$DPNAME7= <>
##$DPOAL= (0..7)
0.5 0.5 0.5 0.5 0.5 0.5 0.5 0.5 
##$DPOFFS= (0..7)
0 0 0 0 0 0 0 0 
##$DQDMODE= 0
##$DR= 18
##$DS= 0
$$ [...]
##$SUBNAM2= <"">
##$SUBNAM3= <"">
##$SUBNAM4= <"">
##$SUBNAM5= <"">
##$SUBNAM6= <"">
##$SUBNAM7= <"">
##$SUBNAM8= <"">
##$SUBNAM9= <"">
##$SW= 16.9725356469052
##$SWIBOX= (0..15)
0 0 2 0 0 0 0 0 0 0 0 0 0 0 0 0 
##$SW_h= 3396.73913043478
##$TD= 16384
##$TD0= 1
##$TE= 0
##$TE2= 300
##$TE3= 300
##$TEG= 300
##$TL= (0..7)
0 120 120 120 120 120 120 120 
##$TP= (0..7)
150 150 150 150 150 150 150 150 
##$TP07= 0
##$TPNAME0= <>
##$TPNAME1= <>
##$TPNAME2= <>
##$TPNAME3= <>
##$TPNAME4= <>
##$TPNAME5= <>
##$TPNAME6= <>
##$TPNAME7= <>
##$TPOAL= (0..7)
0.5 0.5 0.5 0.5 0.5 0.5 0.5 0.5 
##$TPOFFS= (0..7)
0 0 0 0 0 0 0 0 
##$TUNHIN= 0
##$TUNHOUT= 0
##$TUNXOUT= 0
##$USERA1= <user>
##$USERA2= <user>
##$USERA3= <user>
##$USERA4= <user>
##$USERA5= <user>
##$V9= 5
##$VALIST= <valist>
##$VCLIST= <CCCCCCCCCCCCCCC>
##$VD= 0
##$VDLIST= <DDDDDDDDDDDDDDD>
##$VPLIST= <PPPPPPPPPPPPPPP>
##$VTLIST= <TTTTTTTTTTTTTTT>
##$WBST= 1024
##$WBSW= 4
##$XGAIN= (0..3)
0 0 0 0 
##$XL= 0
##$YL= 0
##$YMAX_a= 967958
##$YMIN_a= -756306
##$ZGOPTNS= <>
##$ZL1= 120
##$ZL2= 120
##$ZL3= 120
##$ZL4= 120
##$ABSF1= 10
##$ABSF2= 0
##$ABSG= 5
##$ABSL= 3
##$ALPHA= 0
##$AQORDER= 0
##$ASSFAC= 0
##$ASSFACI= 0
##$ASSFACX= 0
##$ASSWID= 0
##$AUNMP= <proc_1d>
##$AZFE= 0.1
##$AZFW= 0.1
##$BCFW= 1
##$BC_mod= 2
##$BYTORDP= 1
##$COROFFS= 0
##$CY= 11.3945322036743
##$DATMOD= 1
##$DC= 2
##$DFILT= <>
##$DTYPP= 0
##$F1P= 15.9154993809931
##$F2P= -4.1035820241983
##$FCOR= 0.5
##$FTSIZE= 0
##$FT_mod= 4
##$GAMMA= 1
##$GB= 0.15
##$INTBC= 1
##$INTSCL= 1
##$ISEN= 128
##$LB= 0.24
##$LEV0= 0
##$LPBIN= 0
##$MAXI= 10000
##$MC2= 0
##$MEAN= 0
##$ME_mod= 0
##$MI= 1.114404
##$NCOEF= 0
##$NC_proc= 0
##$NLEV= 6
##$NOISF1= 3.799351
##$NOISF2= 2.8
##$NSP= 1
##$NTH_PI= 0
##$NZP= 0
##$OFFSET= 15.70392
##$PC= 1
##$PHC0= -10760.51
##$PHC1= 10.40095
##$PH_mod= 1
##$PKNL= yes
##$PPARMOD= 0
##$PSCAL= 0
##$PSIGN= 0
##$REVERSE= no
##$SF= 200.130013532006
##$SI= 16384
##$SIGF1= 3
##$SIGF2= 2
##$SINO= 400
##$SIOLD= 16384
##$SREGLST= <1H.CDCl3>
##$SSB= 0
##$STSI= 0
##$STSR= 0
##$SW_p= 3612.71676300578
##$SYMM= 0
##$S_DEV= 0
##$TDeff= 0
##$TDoff= 0
##$TI= <>
##$TILT= no
##$TM1= 0
##$TM2= 0
##$TOPLEV= 0
##$USERP1= <user>
##$USERP2= <user>
##$USERP3= <user>
##$USERP4= <user>
##$USERP5= <user>
##$WDW= 1
##$XDIM= 8192
##$YMAX_p= 0
##$YMIN_p= 0
$$ End of Bruker specific parameters
$$ ---------------------------------
##NTUPLES= NMR FID
##VAR_NAME=  TIME,          FID/REAL,        FID/IMAG
##SYMBOL=    X,             R,               I
##VAR_TYPE=  INDEPENDENT,   DEPENDENT,       DEPENDENT
##VAR_FORM=  AFFN,          ASDF,            ASDF
##VAR_DIM=   8192,          8192,            8192
##UNITS=     SECONDS,       ARBITRARY UNITS, ARBITRARY UNITS
##FACTOR=    0.0002944,     1,               1
##FIRST=     0,             0,               0
##LAST=      2.4114304,     0,               0
##MIN=       0,             -756306,         0
##MAX=       2.4114304,     967958,          0
$$ Real data points
##PAGE= N=1
##DATA TABLE= (X++(R..R)), XYDATA
0 0 0 0 0 0 0 0 -8 0 0 8 -8 13 -16 24 -24 32 -40 48 -56 72 -88 103 -120 144 -168 193 -227 262 -302 345 -398
31 -398 449 -510 580 -652 732 -823 924 -1031 1149 -1280 1421 -1576 1746 -1929 2129 -2351
47 -2351 2592 -2855 3146 -3465 3820 -4208 4645 -5139 5688 -6323 7049 -7896 8900 -10112
61 -10112 11606 -13504 16004 -19466 24583 -32953 49032 -91229 446144 967958 -75910
72 -75910 -756306 -704497 -163996 22965 -85863 -110272 357709 764630 491966 -349329 -710134
83 -710134 -278345 264053 218115 -122730 -187351 147296 312183 -27599 -440305 -279508
93 -279508 306439 583628 170421 -354241 -302365 108224 161459 -202384 -393692 -48033
103 -48033 416719 370574 -133366 -388499 -17778 462547 341379 -191714 -388325 -106526
113 -106526 108109 -88517 -400444 -257783 358402 739311 402158 -211231 -364754 -84025
123 -84025 25863 -236630 -392478 -62071 449601 511919 12972 -405594 -226417 211637
133 211637 261323 -79334 -241330 20488 257752 44805 -358450 -374914 86506 474741
143 474741 321905 -129609 -269776 1029 168364 -65153 -308162 -117456 297776 370808
153 370808 -27835 -410081 -290341 168688 354647 76331 -168714 -5818 223839 49553
163 49553 -359445 -431516 -5316 437845 381465 -44215 -255003 -49749 153020 -7851
173 -7851 -265618 -152619 237106 360136 13757 -382581 -331621 90631 335053 154648
183 154648 -90414 -21766 188061 90951 -295967 -439553 -87843 349800 367999 2169
193 2169 -240740 -80580 150786 55819 -203635 -174389 171159 347529 66417 -315527 -318101
204 -318101 33445 283992 136832 -136405 -99978 153209 169524 -131625 -325157 -93259
214 -93259 286963 312405 -34674 -299688 -173574 118468 137560 -96064 -130671 156726 348079
225 348079 113176 -300137 -379407 -61521 207492 134588 -74482 -57492 178903 231143 -69506
236 -69506 -332766 -192013 166012 273412 17278 -217680 -116474 130788 153620 -76125
246 -76125 -195816 27641 281761 157831 -200615 -314960 -48697 229640 159813 -102310
256 -102310 -149501 65270 189840 -2596 -251141 -153108 194293 316063 56909 -235346
266 -235346 -208921 35376 111968 -63238 -165867 30159 292543 238572 -105874 -294240
276 -294240 -108779 146394 120918 -104272 -163946 52835 223745 74611 -193670 -189094 100648
287 100648 265979 72219 -195685 -177009 56936 147378 -27684 -187892 -58150 204992
297 204992 225075 -47550 -245065 -98891 162654 163638 -68458 -182199 -26784 158634 79298
308 79298 -159489 -190979 73075 282251 142560 -148834 -199377 12186 132185 -13212
318 -13212 -181456 -88305 170218 234986 131 -220744 -125039 128140 169024 -44201 -176211
329 -176211 -37343 156411 108659 -124363 -208756 -2702 220001 153547 -97552 -167987 30127
340 30127 173929 39254 -181747 -168316 65694 190024 28735 -169570 -102187 146179
350 146179 216963 1093 -189301 -99638 99914 99730 -95679 -193461 -16262 216018 183661
361 183661 -60141 -175135 -21435 144310 52614 -158527 -163492 58399 205105 77634
371 77634 -148179 -144961 77092 181763 16422 -171244 -98113 130004 167297 -42774 -196497
382 -196497 -88945 121518 137981 -57688 -159194 1548 195439 140286 -95352 -188072
392 -188072 -26559 126962 46526 -134591 -139047 71829 217866 86529 -129417 -122470 70470
403 70470 144285 -29534 -204610 -118015 110262 167560 -307 -133134 -23919 165348 129996
414 129996 -98553 -201361 -45259 143005 100795 -95209 -144020 25640 166996 76117
424 76117 -123438 -134665 67874 181899 38420 -157351 -136448 57487 136472 -10746 -150945
435 -150945 -62703 145512 180661 -18092 -168068 -65953 108551 85965 -94402 -160726 -1482
446 -1482 165685 107644 -86071 -137855 25519 163651 66714 -124149 -129312 43732 129190
457 129190 -3010 -158776 -97778 112776 185258 22974 -142354 -79992 101677 114697 -66298
468 -66298 -166957 -35973 138090 106279 -82399 -149378 10448 175909 113859 -84820 -142189
479 -142189 -1736 99947 2204 -142014 -97817 105439 203713 63081 -128283 -123491 37455
490 37455 94884 -32519 -129949 -23231 151599 140435 -58989 -181521 -68940 109657 107369
501 107369 -48499 -104939 31935 146671 47140 -136063 -146547 33500 156388 55654
511 55654 -115255 -112353 52217 138304 23417 -111688 -54958 101040 105905 -71125 -193599
522 -193599 -82831 130465 176996 25478 -91997 -28573 74497 11764 -148864 -149846 51432
533 51432 210784 136529 -66726 -141018 -29316 61161 -7878 -106378 -45844 129450 174661
544 174661 6202 -158466 -114408 56933 117094 -5472 -113572 -39327 96990 83780 -64624
555 -64624 -122627 21066 170410 100910 -103737 -183162 -53880 95208 69128 -44504 -29476
566 -29476 105007 140402 -21934 -197865 -156827 48767 159754 73283 -55289 -46413 53991
577 53991 44947 -95265 -152625 -9516 172709 164474 -21594 -140389 -65952 54054 38661
588 38661 -73538 -83843 59928 151763 41501 -123663 -118264 47916 145227 46143 -97302
599 -97302 -92624 22604 63324 -34630 -109713 -5839 163690 161158 -24102 -161889 -99719
610 -99719 42537 58139 -42995 -72291 42940 145428 64336 -116633 -151270 6974 139574
621 139574 83006 -57448 -76657 26384 64566 -42884 -140351 -62299 119382 174590 35600
632 35600 -105597 -80331 33776 48653 -52668 -97448 9739 129401 84425 -80621 -143559
643 -143559 -16886 128457 103589 -33037 -78616 8579 61568 -30256 -142488 -88989 97395
654 97395 183344 61961 -97314 -94797 24056 64410 -23499 -84599 -3397 110461 78966
665 78966 -81397 -164670 -48978 120445 133409 11141 -57019 -288 50600 -26627 -141119
676 -141119 -112856 60210 175381 93475 -68823 -97736 10050 64616 -12310 -85144 -19078
687 -19078 102836 95649 -55230 -156497 -74712 86664 127002 19286 -56748 -991 65832
698 65832 9451 -112375 -118285 29527 148547 87495 -67930 -118032 -13744 77979 28954
709 28954 -54788 -17327 92435 97796 -47261 -172711 -110424 60987 130821 48049 -36386
720 -36386 -1777 66631 19596 -104006 -130203 -810 131911 102685 -43477 -108063 -24681
731 -24681 64600 33367 -51783 -35971 77545 113150 -8059 -142247 -121728 29840 117437
742 117437 46045 -48827 -22994 62033 49116 -69937 -122425 -11208 124406 110327 -30680
753 -30680 -120618 -56630 48069 41377 -35430 -31007 73479 123930 15264 -134657 -137702 -175
765 -175 102701 61235 -34782 -31754 51545 56835 -50597 -118747 -31528 113310 123916 -12136
777 -12136 -113836 -68774 33121 43017 -32238 -45386 52308 122225 43849 -101472 -131843 -12895
789 -12895 93464 60277 -37169 -49625 31017 65004 -19385 -101094 -44215 91224 125707 8331
801 8331 -108138 -82793 23379 49567 -22682 -54012 31206 117541 62579 -80169 -129214 -26549
813 -26549 86497 70259 -25901 -52035 18698 58446 -15931 -104112 -63120 75058 135500 42535
825 42535 -79432 -80977 8709 41745 -24160 -70405 884 104976 85766 -45754 -115939 -35465
837 -35465 79148 75810 -23746 -66858 -3874 52415 3479 -84372 -66272 60336 131545 52410
849 52410 -72064 -88189 -365 48631 -6442 -61439 -11949 83518 83526 -34286 -118560 -52641
861 -52641 70315 89345 -202 -57871 -5244 57227 11363 -87695 -91900 23706 119324 71825
873 71825 -45414 -71123 6317 55178 1544 -71915 -42985 55878 80310 -10527 -94992 -54996
885 -54996 60417 94136 11174 -58148 -23371 44651 26012 -65800 -91114 5767 104913 75509
897 75509 -37316 -80220 -6155 60289 18078 -53737 -41354 46922 80758 -4247 -98972 -71644
909 -71644 38531 89823 26533 -46324 -18305 53107 40737 -53588 -102840 -29328 79213 80446
921 80446 -16980 -68396 -7882 66039 37468 -52620 -63616 23258 78721 18767 -78714 -77997
933 -77997 23132 83638 30254 -46309 -32823 43503 55568 -27934 -88385 -34801 63934 76414
945 76414 -13762 -78141 -28794 55183 50590 -26916 -52205 20295 81233 26192 -81181 -98902
957 -98902 -3885 77260 44900 -33094 -28903 47604 69397 -12344 -91725 -58756 40525 70652
969 70652 -1533 -65961 -28407 55990 62078 -18226 -64887 -8968 64620 41986 -49451 -81665
981 -81665 -7870 69567 45004 -39064 -54319 20896 70740 16102 -64351 -50835 38868 72862
993 72862 1128 -76777 -54301 32379 59006 -5155 -51181 -572 77030 62965 -36504 -92042
1005 -92042 -36045 44116 38617 -31987 -51767 21123 83588 39452 -51871 -65605 12436 64118
1017 64118 10427 -68813 -54646 30848 69440 11097 -54984 -25890 50720 58141 -18189 -72189
1029 -72189 -27438 51714 49166 -28559 -67292 -12901 57954 43742 -32530 -51936 18616 72835
1041 72835 28863 -57485 -67445 8955 57554 8535 -59121 -40957 46669 79609 9490 -59444
1053 -59444 -32408 39777 44909 -31682 -78972 -22828 60601 60472 -14126 -54615 -2756 59534
1065 59534 32501 -45949 -62553 6196 63308 25073 -54129 -57509 18275 65218 20470 -47330
1077 -47330 -33119 42084 60232 -10993 -73332 -40869 41189 55542 -14099 -58352 -12174 56663
1089 56663 47523 -28583 -58174 2053 60564 30119 -50075 -69285 1559 62462 30498 -37122
1101 -37122 -36607 31790 62909 1083 -70411 -48671 34145 63971 2720 -59213 -31093 40556
1113 40556 45609 -20768 -55713 -669 67870 48431 -35141 -70723 -17634 44045 28428 -33860
1125 -33860 -40097 25687 67129 17828 -57172 -53737 21761 61179 11969 -52206 -38786 29349
1137 29349 47716 -12757 -58300 -13219 63962 61659 -20736 -71152 -27281 39612 33548 -27043
1149 -27043 -43547 14839 62123 22811 -54145 -60485 15818 71038 33725 -36964 -44324 9288
1161 9288 33265 -15413 -59937 -20138 61441 77110 1713 -64990 -39597 27152 36206 -18162
1173 -18162 -45291 3178 56595 27972 -47333 -62184 8199 71331 45071 -30012 -49652 -983
1185 -983 31501 -4566 -54054 -29339 49472 75381 10531 -59404 -45646 23927 46309 -4355
1197 -4355 -43253 -9550 45314 32624 -41561 -71590 -6735 67572 57371 -12693 -43142 -1296
1209 -1296 32853 -3099 -56806 -43156 31848 73867 24386 -47869 -45164 17366 46199 4233
1221 4233 -40350 -15447 39674 34340 -34100 -73864 -23536 58818 67378 2321 -38642 -8056
1233 -8056 31315 5929 -53811 -51793 22160 71961 32833 -43207 -56025 4779 46357 15669
1245 15669 -28519 -14304 38074 41052 -27192 -78909 -40075 41622 67100 14911 -31880 -9480
1257 -9480 31069 14033 -43783 -55543 8153 67678 39043 -38634 -61608 -6562 45172 25310
1269 25310 -21460 -14070 35515 44248 -18137 -77624 -52368 29611 67003 23026 -28479 -18101
1281 -18101 24809 20502 -32772 -50559 2207 63083 48775 -28138 -68615 -24705 34776 31002
1293 31002 -13767 -16996 32485 52052 -4812 -71195 -59572 16835 61061 25942 -27401 -22530
1305 -22530 21829 27942 -21383 -50071 -5758 57400 51495 -19929 -64567 -30751 28691 33389
1317 33389 -9624 -22443 21743 52976 10227 -60571 -64327 5859 60735 35029 -22846 -28408
1329 -28408 13628 27152 -16833 -52250 -15465 53832 63049 -1308 -58691 -41655 14693 27840
1341 27840 -9309 -23323 17771 55794 24228 -48089 -66717 -7155 52171 39880 -16189 -33351
1353 -33351 6032 28688 -8759 -48870 -21385 48536 67842 6041 -57551 -48011 7848 30809
1365 30809 -360 -23548 10285 51333 29072 -40272 -69519 -18062 48238 47021 -6035 -31497
1377 -31497 -2501 25885 -1269 -46720 -32003 35216 68914 22301 -46226 -50517 2824 29978
1389 29978 831 -26169 -702 45374 35294 -30419 -66074 -22796 44236 52639 1869 -31465
1401 -31465 -7993 20444 -550 -43788 -37259 28309 72358 34381 -36582 -54253 -9040 27632
1413 27632 6609 -26694 -7580 40350 42455 -16976 -63650 -32563 36276 53265 7969 -30981
1425 -30981 -14675 19976 9091 -34327 -38654 15424 62120 36752 -31620 -55262 -12319 29863
1437 29863 17818 -17028 -11489 31056 39811 -13690 -64311 -42761 27553 58222 18673 -25035
1449 -25035 -13881 20552 12760 -33635 -48933 1235 56493 44423 -18194 -49038 -14017 29769
1461 29769 19958 -19008 -21306 20033 40670 461 -52316 -43717 18253 54199 21935 -27062
1473 -27062 -24953 13956 21449 -17639 -41176 -3098 50960 45134 -16264 -55209 -25707 23753
1485 23753 25097 -10862 -18277 20156 45285 8980 -49091 -52655 3172 45076 24035 -20765
1497 -20765 -20910 19343 32001 -8361 -44295 -20216 35346 45131 -6001 -47407 -25044 24247
1509 24247 30332 -9907 -28060 7865 42349 19029 -35866 -49982 -2466 42646 27653 -17638
1521 -17638 -27033 7905 27742 -3227 -39899 -20612 34083 51369 6669 -44558 -36421 9966
1533 9966 24290 -6149 -25673 6499 48182 32543 -28018 -53440 -14786 33201 27248 -17200
1545 -17200 -29290 7355 33651 7664 -34047 -27688 23855 47953 9672 -39713 -37862 7631
1557 7631 29929 1561 -26549 -4750 36506 34059 -17525 -50272 -18339 32075 33780 -8897
1569 -8897 -31801 -3684 28473 9816 -31899 -30386 19398 52884 23305 -31170 -39515 -1280
1581 -1280 22081 -812 -29327 -11137 35470 42633 -4281 -43253 -24078 24993 34117 -7091
1593 -7091 -35304 -11521 25426 19159 -22365 -32228 11574 49384 26973 -27990 -43769 -5731
1605 -5731 26876 8894 -24111 -16951 24124 37944 -395 -40134 -25033 23921 39564 2896
1617 2896 -32834 -18991 18228 19273 -17783 -34861 1077 43666 33373 -17300 -38759 -6228
1629 -6228 28550 14681 -26065 -29762 11302 37146 8662 -31813 -25208 21542 40035 5061
1641 5061 -34172 -24758 15033 24771 -8872 -32642 -7844 34831 33218 -10879 -36348 -8949 29146
1654 29146 22104 -19625 -33225 1314 32345 13966 -27657 -29289 13997 39938 11039 -30370
1666 -30370 -25984 15140 31191 -1677 -34029 -17628 23736 31328 -6384 -33880 -9718 30320
1678 30320 27268 -14750 -36282 -6820 30728 21365 -19974 -31452 3341 33962 14387 -27181
1690 -27181 -27263 14620 37808 9037 -31938 -26870 14429 28531 -3187 -31995 -13183 27313 32591
1703 32591 -7248 -32680 -9596 25613 22266 -16104 -34146 -3289 31357 19761 -19767 -29405
1715 -29405 6505 35118 12889 -27576 -28529 10289 33070 5196 -31366 -21064 20561 32151
1727 32151 -2473 -34293 -16061 25568 30099 -5562 -29261 -8161 25254 17039 -23925 -37238
1739 -37238 -1728 36915 27974 -12055 -23835 5184 25074 1579 -34046 -28882 15686 38247
1751 38247 9137 -27605 -19658 19342 30295 -3481 -31439 -12843 22181 21009 -16042 -34974
1763 -34974 -4222 35293 29317 -11107 -30694 -5267 24178 11444 -22493 -24253 12396 35676
1775 35676 9277 -32959 -32526 8966 33594 12022 -18194 -10135 22168 23060 -16492 -44212 -19660
1788 -19660 26158 33427 -827 -22233 -1350 25569 14319 -22136 -31569 1776 30978 13745
1800 13745 -25748 -30940 6816 34960 16485 -17024 -16436 13817 22403 -9668 -39823 -21805 24164
1813 24164 38281 3717 -27511 -13231 18771 18024 -14264 -26744 3371 34489 20275 -22879
1825 -22879 -38743 -7450 25812 17634 -11751 -13774 16322 29977 488 -36637 -29252 12008
1837 12008 31910 6998 -24187 -15000 18137 22914 -7962 -27150 -2395 33007 25406 -18771
1849 -18771 -40625 -14355 20831 19167 -8951 -13955 14742 31570 6211 -33188 -33737 7362 33816
1862 33816 13492 -20336 -20473 8803 20643 -4832 -25662 -5361 31524 32709 -8576 -40748
1874 -40748 -22441 15463 20807 -5209 -15985 8335 30341 9646 -29222 -33103 4124 35409
1886 35409 20650 -16397 -23873 1225 14783 -4715 -26229 -8725 32168 40265 1909 -34412
1898 -34412 -27068 7399 18235 -5293 -19619 3279 30944 19297 -21432 -36109 -2247 32895
1910 32895 24178 -12203 -26170 -3515 15321 -358 -23119 -11309 26747 41210 7734 -33749
1922 -33749 -32444 1503 20058 3799 -13917 823 25562 16205 -22214 -40177 -9387 33982
1934 33982 35363 -1126 -23187 -8331 9799 -2567 -27021 -17934 23323 44553 16295 -26835
1946 -26835 -32829 -830 20079 4935 -16130 -6859 19666 19864 -13846 -35432 -10690 30618 36383
1959 36383 1773 -26181 -16078 7415 4167 -18789 -18954 16158 41507 19087 -25156 -35879
1971 -35879 -4789 22122 12264 -10743 -7831 15512 18321 -13353 -38302 -18452 25896 40128
1983 40128 10897 -19666 -14823 6758 4043 -19833 -25421 6111 38155 26013 -15509 -32444
1995 -32444 -6785 21984 14593 -12898 -15326 9918 20430 -4609 -32345 -21125 19796 37555
2007 37555 11731 -19427 -17661 6486 11433 -11342 -23014 794 30648 24879 -13238 -34959
2019 -34959 -12939 19100 19309 -4632 -11825 10066 23479 -1092 -35383 -32140 7427 35401 19378
2032 19378 -11162 -11393 10100 13521 -12202 -30415 -10335 26111 29591 -4091 -29190 -15250 15422
2045 15422 18698 -5026 -14736 5170 23617 7490 -26911 -31858 2409 32014 21444 -10944
2057 -10944 -19998 2081 13650 -5488 -23390 -7506 27364 33846 -822 -32892 -26086 5061
2069 5061 16593 440 -9521 8808 29066 12769 -24094 -37484 -9335 24144 21850 -5623
2081 -5623 -15814 3080 16935 620 -23659 -15844 19110 33333 6111 -28632 -26437 4901
2093 4901 19546 2322 -12164 856 22952 15025 -19502 -35246 -8942 26314 28352 -909
2105 -909 -18910 -6152 9245 -794 -20936 -14477 19838 38699 14421 -24977 -31695 -4300 15653
2118 15653 3846 -12544 -1687 23030 20691 -12503 -33820 -13161 22832 27794 -432 -21122
2130 -21122 -9094 10819 5869 -15822 -16411 12204 33489 15298 -21137 -30340 -4394 18328 9432
2143 9432 -11331 -8249 15030 20069 -6624 -29896 -15301 20034 29691 3221 -20960 -12902 9358
2156 9358 7820 -14339 -19396 7148 32089 20127 -15375 -28985 -6862 16130 9736 -11206 -11320
2169 -11320 12234 22663 -692 -27765 -20415 12793 29361 8291 -17544 -12937 9424 12015
2181 12015 -11118 -24229 -2409 26557 22697 -8522 -24616 -6176 17982 12460 -11648 -16670
2193 -16670 4150 18711 2983 -22945 -19360 12127 29775 12118 -15475 -16973 4717 11183
2205 11183 -8687 -22844 -5166 25626 27667 -3891 -26605 -12619 12675 13215 -8407 -15763 6088
2218 6088 23804 8964 -21346 -26026 1605 24476 13026 -11851 -13038 7855 17696 -1645 -22395
2231 -22395 -12643 14884 21238 -2780 -24569 -12245 16840 21612 -903 -15554 -2324 16278
2243 16278 6993 -20831 -26236 1437 27641 19094 -9085 -16608 2978 14893 -520 -21159 -14484
2256 -14484 13725 25131 3697 -20768 -15302 10003 18376 -2195 -18679 -5140 18867 17524
2268 17524 -9441 -24303 -6111 18494 14155 -11044 -19199 2066 21632 9714 -15036 -15936 7603
2281 7603 21326 3448 -21585 -17965 7786 19845 3154 -14988 -6545 16095 17101 -7991 -25320
2294 -25320 -10264 16803 17978 -5434 -18164 -1459 18677 11095 -14217 -19952 3916 22738
2306 22738 9600 -17115 -19433 4526 19529 3804 -16551 -11102 13367 20341 -1270 -21057
2318 -21057 -11571 12858 17877 -3778 -19360 -5884 16441 14698 -9134 -20135 -758 19623
2330 19623 11756 -11959 -18569 2988 20101 7287 -16561 -15598 7807 20370 2610 -18427 -11598
2343 -11598 12483 19455 -1167 -20801 -10810 13033 15309 -5590 -18272 -3706 19584 16324 -8742
2356 -8742 -20362 -3434 16117 9771 -13510 -17443 5181 21471 8181 -16019 -15517 6676 17689
2369 17689 333 -18170 -10452 13907 19905 -1187 -19321 -9353 11733 13477 -6545 -18074 -1003
2382 -1003 19755 14805 -9832 -19845 -4435 14822 8053 -13547 -14725 7576 21414 7326 -16274
2395 -16274 -14640 7291 17812 280 -19134 -12191 12656 17847 -2121 -16759 -6123 15539
2407 15539 15588 -8620 -20884 -5431 15548 13280 -8416 -15263 1993 17505 7095 -15356 -17331
2420 -17331 6212 21772 8026 -14495 -14863 4785 12973 -2882 -18639 -5810 19422 21874 -1883
2433 -1883 -20568 -11203 10576 11254 -6783 -14158 596 17920 9983 -13823 -19123 2561 21563
2446 21563 13232 -10744 -16586 679 11880 838 -15488 -8876 14876 21489 620 -21635 -14000
2459 -14000 10354 16996 -886 -13892 -3841 12065 8137 -12949 -18678 2255 23888 17123 -7304
2472 -7304 -18295 -4539 9699 1723 -13594 -9471 13470 22687 4571 -19288 -16913 6205 16882
2485 16882 3164 -12517 -5146 12059 12094 -9903 -21602 -4141 19564 18269 -4521 -16975 -3960
2498 -3960 11448 6552 -11555 -12659 5917 18457 5103 -18043 -17215 6286 20674 9440 -9841
2511 -9841 -9426 6078 8571 -10073 -21636 -6407 20326 24259 1066 -16334 -8152 7735 4764
2524 4764 -11784 -14607 5200 21916 11305 -12680 -18831 85 16196 6973 -10515 -9226 7029
2537 7029 13927 -2148 -19722 -10665 12689 19367 1924 -16121 -9603 8973 11162 -5415 -13481
2550 -13481 1054 18172 9807 -14990 -22387 -3557 16137 13345 -3284 -6965 6875 11946 -4596
2563 -4596 -22864 -17029 9013 22844 9016 -10224 -8733 6599 9443 -6188 -16554 -2276 18027
2576 18027 15140 -7628 -21540 -7264 13638 13028 -2963 -8664 4787 13659 1201 -18498 -16291
2589 -16291 5952 20814 9538 -11606 -13032 2996 9992 -1455 -11850 -1815 16999 16585 -6454
2602 -6454 -23917 -13340 8714 14375 482 -6348 5046 15765 3968 -17810 -21217 1343 20128
2615 20128 12190 -7922 -12674 1511 9417 -1437 -13141 -4017 15920 18895 -2115 -22031 -16269
2628 -16269 5553 13723 2336 -7616 971 12894 6300 -13708 -19817 30 19932 15100 -6845
2641 -6845 -15502 -3029 8727 1363 -9961 -3983 14514 19477 119 -21428 -17748 3344 14246
2654 14246 4552 -7100 -590 11718 7937 -11754 -20014 -3545 18463 18326 -2958 -14837 -5368
2667 -5368 7517 2106 -11921 -9746 10472 21352 6556 -15866 -17598 1286 13302 4077 -8451
2680 -8451 -3950 9788 10195 -7361 -18680 -5455 15849 18113 -685 -15260 -8376 5982 4056
2693 4056 -8127 -9017 8061 21020 8118 -15308 -20205 -2396 13144 8158 -5800 -4096 9524
2706 9524 10775 -6755 -20883 -10833 12832 20096 3999 -11310 -7167 5680 5898 -8336 -12471
2719 -12471 3226 17789 11047 -10329 -18596 -3178 13190 9237 -5035 -7663 4717 11058 -3608
2732 -3608 -18348 -11098 11035 20104 6191 -11241 -9325 4313 5854 -5982 -11883 1656 17256
2745 17256 12029 -8676 -18974 -6135 11234 10970 -2309 -6734 4235 11076 -52 -17622 -14725
2758 -14725 6177 18939 8873 -9289 -10341 3766 8948 -3486 -12723 -2915 14035 13690 -5773
2771 -5773 -18336 -7827 9735 11585 -1249 -7250 2627 11840 3060 -14767 -16441 1821 16225
2784 16225 8927 -8047 -10390 3419 10487 -177 -11447 -5190 12033 13916 -3832 -18494 -10906
2797 -10906 8008 13244 1263 -6688 2244 12312 4534 -13500 -17777 -1324 14654 11242 -4496
2810 -4496 -9762 1001 9293 1294 -10794 -6925 9957 15287 897 -15416 -13114 4351 11886
2823 11886 404 -7796 -1556 11191 8496 -8596 -15401 -1717 13728 10580 -5614 -13705 -2170
2836 -2170 8657 4912 -6933 -5762 7683 15413 1952 -15038 -15100 910 11751 3090 -7789
2849 -7789 -2760 11449 10605 -4655 -15890 -6239 10588 11538 -4132 -11909 -2125 8912 5030 -8176
2863 -8176 -9321 4492 14850 5773 -10887 -12720 772 10920 2487 -8332 -6111 7684 11349
2876 11349 -2387 -13902 -6051 10743 13397 -296 -13430 -5959 6426 5958 -6892 -10005 3183
2889 3183 15855 8264 -9097 -14038 -1523 10935 4622 -7511 -7203 5698 10321 -657 -13285
2902 -13285 -9000 8116 13861 2086 -9957 -6678 6090 6709 -4931 -11176 -1369 13441 10329
2915 10329 -5414 -12617 -2005 9420 5626 -7513 -9390 3198 11555 1800 -11041 -8514 6625
2928 6625 12315 2455 -10294 -9390 5373 9511 -1055 -10339 -2064 10364 10230 -5135 -13802 -3701
2942 -3701 10013 9756 -3613 -9255 708 10106 3191 -10455 -10845 3423 13331 5016 -8365 -7748
2956 -7748 4984 9365 -41 -11780 -7029 7060 10930 -913 -10272 -2427 10327 8763 -5090
2969 -5090 -12740 -3220 9035 6687 -6615 -10476 2478 11573 5366 -8509 -10014 2535 11138 2201
2983 2201 -8978 -7446 5523 10665 -548 -11575 -7519 6893 9590 -916 -9291 -2059 10362
2996 10362 9126 -5094 -12518 -3038 8761 5939 -5838 -8237 3406 12262 5410 -8600 -9732
3009 -9732 2104 9304 1737 -10056 -6028 7453 11154 718 -10757 -6525 6296 9098 -3011
3022 -3011 -9754 -1744 8453 6235 -7041 -11887 -823 10409 7132 -5000 -8790 1532 10653
3035 10653 4488 -8870 -8663 3776 9693 332 -10955 -6630 7760 12117 1410 -8613 -4274
3048 -4274 6291 5910 -5546 -11402 -1634 10986 8752 -4030 -9984 -1017 8857 5390 -6843 -8144
3062 -8144 3020 10278 2531 -11168 -10216 3679 11437 3160 -7211 -4507 6922 8393 -3985 -12055
3076 -12055 -4997 7767 9459 -2476 -9512 -2025 8460 7064 -4018 -7992 1344 9589 2902 -9930
3090 -9930 -11075 1227 11589 5930 -5297 -5352 5007 8101 -1739 -11816 -5681 8544 10576 -1745
3104 -1745 -11481 -5872 6380 7374 -2838 -6513 1833 10507 5567 -8497 -13264 -2197 9434 6630
3118 6630 -3843 -5349 3920 9112 798 -10062 -7602 4903 10485 476 -10021 -7294 5146
3131 5146 8280 -376 -6482 514 9788 6408 -7614 -13511 -3659 8076 7860 -2523 -5926 2264
3145 2264 8107 1052 -9495 -7818 4672 12474 3190 -9660 -9840 1331 6781 411 -6378 -579
3159 -579 10440 8548 -4118 -13616 -6057 7456 6918 -2760 -6044 -569 7829 3545 -6787 -7686 3920
3174 3920 11513 4969 -7459 -10490 -1136 6237 291 -5699 -1685 9532 9255 -2414 -12686 -7359
3188 -7359 4943 8231 -515 -5615 -868 7726 3664 -7674 -9169 2290 12902 6220 -4527 -9501
3202 -9501 -2697 5503 1071 -6212 -3094 7311 9414 -298 -10953 -9024 3647 9567 1934 -5392
3216 -5392 -2476 4865 3525 -6193 -10031 592 11907 10214 -2930 -9829 -3227 3840 2257 -5476
3230 -5476 -4406 5687 10588 2049 -9414 -8433 2748 9655 3134 -5863 -4418 2997 4377 -4751
3244 -4751 -9953 -1888 10973 11597 -1370 -10119 -5156 4176 3185 -4497 -5588 3840 10722 3369 -10143
3259 -10143 -11278 -18 9383 5726 -2742 -3514 3702 4879 -3775 -10832 -5169 8041 11623 1774
3273 1774 -7863 -4519 4016 4693 -3041 -6786 1617 9032 4685 -8243 -11296 -808 9996 7180
3287 7180 -2388 -4543 2252 5221 -2890 -10655 -6177 7526 12557 3576 -7584 -6986 1549 4260 -2117
3302 -2117 -5758 1227 9722 7100 -5876 -12664 -4138 6781 7621 -323 -4246 2083 6452 -712 -9849
3317 -9849 -8025 4473 11087 4145 -6365 -7307 1427 5364 -497 -5004 49 8178 6674 -4913
3331 -4913 -12418 -5862 6401 9021 1213 -4169 244 5064 1086 -8395 -8939 2995 12060 5936 -5642
3346 -5642 -8609 -463 5191 580 -4559 -1131 8041 8171 -2865 -11754 -7265 4316 7958 1185 -4236
3361 -4236 -328 5579 3140 -6398 -8522 727 10026 6616 -4664 -8710 -1215 4940 2054 -4666 -2922
3376 -2922 6716 8834 -220 -10311 -7944 3165 7987 2136 -4571 -1815 4834 3807 -5191 -8842
3390 -8842 -83 9584 7907 -2380 -9393 -4155 3309 1887 -3633 -3255 5921 10227 2195 -9226 -9331
3405 -9331 1037 7027 2481 -5286 -2553 4924 4780 -3467 -8306 -1909 8636 8480 -1742 -8404 -3844
3420 -3844 3752 3243 -3422 -5069 2818 9070 3696 -6793 -8708 269 7839 3817 -4264 -4407 2808
3435 2808 4927 -2604 -8294 -3622 8014 10095 1368 -7106 -4527 1791 2508 -3520 -5965 1715 8742
3450 8742 5680 -4490 -8176 -1342 6856 3866 -3714 -5046 1583 5518 -59 -7523 -3792 5062 9043
3465 9043 1313 -6343 -5288 2954 4151 -2059 -5820 -100 7216 5363 -3789 -8927 -2208 6564 6132
3480 6132 -1742 -4500 904 5134 -171 -7821 -6841 3398 9601 4546 -4401 -5472 1252 4214 -1873
3495 -1873 -6838 -1816 7131 7082 -2279 -8876 -3277 5345 5949 -1385 -5002 477 5408 1603 -6832 -7026
3511 -7026 1984 8728 5138 -4501 -6340 261 4827 710 -4929 -3043 5394 6751 -1672 -8487 -4833
3526 -4833 5205 7128 462 -4774 -1368 4674 2302 -5706 -6962 1253 8213 5096 -3692 -6530 244
3541 244 5064 1298 -4212 -4097 3960 6656 -34 -7651 -4772 3645 6366 864 -5680 -2054 4796
3556 4796 4124 -3693 -7193 -1041 6720 5232 -3511 -6325 -647 5713 3129 -4224 -4238 2466 6251 1042
3572 1042 -6574 -5954 2367 6784 1947 -4063 -3579 3547 4600 -2305 -6710 -3192 5345 5844 -2318 -7142
3588 -7142 -1663 5266 3656 -3297 -5043 1308 6564 3279 -5002 -6473 1310 6490 2131 -4840 -4479
3603 -4479 3509 5870 124 -5818 -3287 4398 5982 -1379 -6557 -2407 4660 5115 -2666 -6056 -333
3618 -333 6527 4680 -4117 -6156 140 5766 2519 -5270 -5020 2312 5734 812 -4893 -3587 3063
3633 3063 6132 72 -5768 -3191 4188 4584 -1504 -6234 -1957 5287 4781 -2206 -5294 -601 5475
3648 5475 3445 -3935 -5990 518 5704 2329 -4744 -4719 2923 6568 1739 -5032 -3976 2813 5526
3663 5526 -729 -6691 -3429 4064 5402 -972 -4695 -692 5425 4410 -3489 -6368 -802 5494 3803
3678 3803 -3544 -5194 1598 6088 1662 -5157 -4399 2825 6309 118 -5927 -4067 2472 5161 -436
3693 -436 -5217 -1487 5359 5175 -1773 -6488 -1644 5011 4346 -2742 -5687 -698 4896 2840 -3897 -4446
3709 -4446 2329 7135 2741 -5418 -5710 1050 4341 302 -4571 -1802 5022 5883 -1327 -6359 -3447
3724 -3447 4048 4873 -1349 -4862 -806 4345 2927 -3357 -5138 1147 6450 3303 -4353 -6392 43
3739 43 5065 1583 -3933 -3172 3429 5488 -355 -6255 -3417 4303 6314 178 -4926 -2617 3029 2577
3755 2577 -2740 -5213 315 6927 5053 -2803 -5983 -1048 4018 1592 -3853 -3730 2762 6311 1096
3770 1096 -5453 -4489 2589 5838 550 -4947 -2998 3074 3755 -2254 -5553 -878 6037 5445 -1805 -6212
3786 -6212 -1785 3835 3279 -2393 -3531 1650 5557 1270 -5653 -6225 1278 6308 3204 -2829 -3060 2193
3802 2193 3278 -2242 -6439 -2137 5478 6495 -196 -5309 -2506 2920 2810 -2169 -4232 1179 5796
3817 5796 2323 -4801 -6124 293 5866 3507 -2551 -3496 1281 3473 -787 -5575 -2887 4862 6823
3832 6823 335 -5855 -4031 2113 3571 -1035 -2829 1293 5530 3151 -4883 -7597 -1578 4933 4608
3847 4608 -918 -2952 821 3350 -325 -5681 -3743 3654 7010 1529 -5223 -4579 925 4101 -183
3862 -183 -3635 153 5254 3655 -3335 -7411 -2341 5225 4766 -888 -3780 -561 3174 1303 -4030
3877 -4030 -3574 3345 6981 2793 -4954 -5655 170 3259 804 -2119 -952 4506 4186 -2608 -7509 -4334
3893 -4334 2660 5213 167 -3569 -431 2988 1051 -4405 -4421 2396 7354 3753 -3763 -5678 -844
3908 -844 3104 1045 -2873 -1241 3916 4608 -951 -6596 -4043 3318 5735 1132 -3960 -2496 2086
3923 2086 1712 -3108 -4098 1384 7091 4536 -3233 -6363 -1909 2857 1579 -2249 -1877 3328 5207 33
3939 33 -5888 -4679 2052 5658 1848 -3494 -2158 2186 2295 -2550 -5116 -252 5938 5281 -1482 -5525
3955 -5525 -2198 3045 1960 -2854 -3002 2161 5613 1333 -5073 -4839 1149 5243 2142 -2903 -2832 1443
3971 1443 2502 -1958 -4899 -1051 5426 6057 45 -5130 -3353 1804 2008 -1777 -3312 1568 5653
3986 5653 2535 -4423 -5687 43 5003 3015 -2072 -2555 1437 2453 -1892 -5532 -2245 4414 6584
4001 6584 1103 -4437 -3207 1139 2518 -1359 -3335 541 5031 2758 -4047 -6337 -921 4840 4540
4016 4540 -556 -2682 704 2405 -1038 -5754 -3691 3772 6712 2411 -3811 -4136 995 2392 -401
4031 -401 -2956 122 4550 3213 -3253 -6366 -2315 4356 4964 101 -2660 -74 2638 -260 -4768
4046 -4768 -4010 2589 6343 2827 -3894 -4600 477 3544 406 -2783 -482 3857 3544 -2149 -6324 -2953
4062 -2953 3522 4688 485 -2880 -552 2829 1443 -3665 -4193 983 5612 3154 -3293 -4908 -316
4077 -316 3332 1348 -2504 -1486 3516 4135 -1366 -6078 -3530 2765 4680 793 -2749 -999 2750
4092 2750 1777 -2912 -4478 200 5464 3828 -2133 -4896 -989 3001 1698 -2198 -2018 2500 4517
4107 4517 168 -5127 -4240 1772 4779 1194 -2958 -1505 2264 2506 -1870 -3939 -322 4648 3789 -1797
4123 -1797 -4765 -1725 2312 2019 -1814 -2131 2028 4592 1201 -4404 -4484 835 4393 1567 -2876 -2258
4139 -2258 2137 3205 -1086 -4424 -1406 4056 4754 -744 -4373 -1841 2232 2105 -1720 -2923 1183
4154 1183 4166 1920 -3442 -4659 -219 3941 2244 -2397 -2654 1353 3118 -171 -4205 -2360 3294
4169 3294 4814 314 -4178 -2627 1986 2445 -1417 -3626 187 3858 2745 -2810 -4220 -205 4177
4184 4177 2728 -1812 -3064 233 2918 285 -3551 -3171 2323 5170 1465 -3537 -3064 1287 2783
4199 2783 -678 -3699 -919 3484 3497 -1718 -4689 -875 3571 2839 -1303 -3307 48 3178 1173 -3557
4215 -3557 -3417 1157 4392 1557 -2852 -2744 1604 3632 444 -3319 -1936 2369 3210 -1333 -4602 -2161
4231 -2161 3592 4240 -543 -3047 -458 2847 1438 -3034 -4576 6 3854 2091 -2150 -2890 658
4246 658 3416 243 -3160 -3397 1344 2981 -292 -3256 -2305 2695 3071 -71 -3040 -1136 3505 2648
4262 2648 -2444 -3922 -353 3324 1909 -2010 -3531 131 3450 1280 -2566 -2431 1262 3574 -53
4277 -53 -4230 -3499 1262 3359 508 -2258 -742 2945 3350 -873 -4078 -1939 2878 2570 -1968 -3358
4293 -3358 -228 3804 2720 -1587 -2686 830 2964 737 -3227 -3101 1275 3851 1125 -2781 -2109
4308 -2109 1952 3256 -345 -3340 -1457 2342 3127 -1311 -3775 -1336 2989 2737 -1301 -3270 108
4323 108 3418 2029 -2325 -3083 359 2908 951 -3171 -2625 1490 3943 1452 -2532 -1921 1526 2236
4339 2236 -1338 -3862 -1482 2818 3650 -75 -2802 -794 2404 2076 -1704 -3543 -211 3303 1692
4354 1692 -2686 -3148 557 3774 1501 -2455 -2195 1135 2851 -226 -3310 -1880 2291 3495 47
4369 47 -3589 -2135 2166 2870 -482 -2333 -317 2874 1732 -2668 -4144 -300 3571 2693 -1328 -2336
4385 -2336 478 2782 -69 -3130 -2259 1942 3656 93 -3446 -2307 1341 2878 1217 -2178 -271
4400 -271 2748 2235 -1906 -3971 -559 3658 2891 -907 -2922 -388 2608 901 -2327 -2154 1428 3949
4416 3949 834 -3459 -3221 841 2763 762 -1927 -898 2308 2462 -1325 -4120 -1591 2888 3401 -218
4432 -218 -2739 -1041 1821 1135 -2172 -2498 1167 3766 1496 -2631 -3544 484 2934 865 -2318 -1683
4448 -1683 1935 2999 -576 -3595 -1629 2775 3374 -404 -3068 -1753 1534 1447 -1510 -2515 658 3652
4464 3652 2386 -1906 -3285 -808 2065 1305 -1714 -1785 1996 3375 15 -3246 -2639 1458 3259 515
4480 515 -2339 -1351 1629 1326 -1177 -2688 -160 3450 2906 -1331 -3272 -1090 2107 1497 -1520 -1919
4496 -1919 1108 2943 167 -3522 -3090 1267 3830 1538 -1838 -1740 968 1752 -1551 -3307 -307 3295
4512 3295 3500 -239 -3458 -1655 1381 1377 -1088 -1830 613 2959 1045 -3054 -3441 327 3286 2108
4528 2108 -1665 -2310 501 1414 -517 -3107 -914 3022 3934 198 -3688 -2542 1287 2467 -197 -1641
4544 -1641 198 2848 1173 -3055 -3958 -198 3412 2862 -672 -2107 20 1609 -293 -3006 -1872
4559 -1872 2186 3856 603 -3041 -2576 718 2380 21 -1767 -426 2435 1429 -2223 -3744 -661
4574 -661 3251 3122 -360 -2204 -347 1423 443 -2663 -2200 1832 3901 1236 -2549 -2944 429 2387
4590 2387 534 -1627 -413 2346 2043 -1821 -3990 -1626 2368 3259 63 -2105 -618 1732 637
4605 637 -2320 -2300 1389 3615 1531 -2396 -3361 -430 2013 970 -1074 -363 2026 2117 -962 -3978 -2440
4622 -2440 1819 3366 715 -1564 -1048 1512 1294 -1938 -2524 669 3463 1975 -2085 -3433 -750 1992
4638 1992 1378 -924 -788 1773 2387 -703 -3515 -2693 1534 3042 1248 -1791 -1463 1364 1135 -1308
4654 -1308 -2776 58 3311 2699 -1273 -3468 -1186 1382 1123 -1182 -1098 1612 2654 319 -2924 -2840
4670 -2840 578 2941 1007 -1727 -1337 858 1505 -780 -2287 -388 3013 2917 -678 -3210 -1955 1075
4686 1075 1778 -434 -1225 1169 2659 693 -3033 -3478 44 3095 1376 -1281 -1527 630 1342 -824
4702 -824 -2307 -1068 2386 2954 497 -3117 -2089 843 1879 -289 -1647 237 2424 1214 -2119
4717 -2119 -3412 -262 2843 2189 -967 -1936 22 1559 -89 -2413 -1108 2134 3395 546 -2747
4732 -2747 -2440 478 1510 -236 -1495 -85 2442 2044 -1733 -3230 -778 2320 2295 -969 -2008 -53
4748 -53 1598 343 -2247 -1803 1354 3310 672 -2315 -2421 272 2228 229 -1576 -256 2037 1888
4764 1888 -1014 -3402 -1315 2254 2665 -164 -1820 -498 1734 675 -1855 -2218 706 3076 1650
4779 1650 -1774 -2223 354 1593 592 -1568 -1073 1615 2046 -537 -3116 -1273 1832 2715 192 -1690
4795 -1690 -624 1584 630 -1652 -1933 329 2941 1554 -1417 -2712 -240 2191 884 -1089 -1325 1477
4811 1477 2376 -156 -2967 -2019 1083 2416 150 -1802 -751 1486 1502 -950 -2384 -490 2188 1454
4827 1454 -1283 -2502 -447 1920 1307 -947 -1293 785 2233 213 -2590 -2265 835 2594 690 -1429
4843 -1429 -1037 1420 1578 -561 -2397 -519 2234 2071 -757 -2770 -812 1575 1347 -1029 -1577 791
4859 791 2463 892 -1960 -2192 197 2186 653 -1797 -1534 614 1954 171 -2073 -978 1783 2367
4875 2367 -872 -2702 -1315 1376 1749 -943 -1463 -90 2093 1129 -1775 -2243 288 2248 1089 -1404
4891 -1404 -1691 507 1797 363 -2116 -1455 1324 2641 224 -2314 -1515 1249 1815 -604 -2139 -235
4907 -235 1998 1726 -646 -2159 -116 2149 1070 -1409 -2141 195 2129 749 -1376 -1675 1036 2566
4923 2566 387 -1883 -1441 822 2024 -199 -1733 -1183 1580 1630 -431 -1993 -555 1765 1202 -822
4939 -822 -2073 -86 1936 907 -1379 -2358 440 2584 1082 -938 -1181 363 1976 254 -2174 -1191
4955 -1191 868 1614 -57 -1356 -7 2248 2083 -492 -2342 -1302 1688 1427 -912 -1894 205 2204
4971 2204 945 -1508 -1493 319 1835 326 -1733 -1283 794 1894 144 -1722 -1069 1221 1727 -383
4987 -383 -1962 -553 1657 1820 -692 -2077 -857 1332 1218 -1109 -1768 517 2190 981 -1327 -2220
5003 -2220 83 1545 538 -1418 -886 1336 2048 215 -1958 -1259 991 1943 106 -1847 -607 1089
5019 1089 1129 -700 -1863 205 2288 980 -1299 -2082 82 1921 1067 -1280 -1430 803 1673 152
5035 152 -2105 -1253 1256 2301 421 -1771 -1231 861 1181 -287 -1558 -194 2177 1672 -966 -2324
5051 -2324 -597 1450 1124 -774 -1406 480 1735 469 -1864 -1779 973 2414 929 -1377 -1403 447
5067 447 1361 -132 -1955 -469 1724 1705 -539 -2024 -530 1317 1422 -642 -1295 32 1526 747 -1513
5084 -1513 -1994 595 2491 1090 -1273 -1434 470 1031 -97 -1576 -468 1834 1957 -84 -1933 -1123
5100 -1123 1097 1292 -73 -1112 238 1430 904 -1634 -2255 31 2069 1438 -504 -1148 226 1340
5116 1340 69 -1505 -1032 1322 2041 -2 -2119 -1519 930 1731 437 -908 -115 1105 663 -1306
5132 -1306 -2151 -443 1893 1987 -241 -1548 -363 975 381 -1222 -809 716 2300 637 -2185 -1919
5148 -1919 391 1514 466 -821 -336 1479 1205 -1158 -2286 -546 1742 1774 -245 -1448 -332 1391
5164 1391 823 -980 -1427 631 2144 796 -1503 -2193 -77 1406 909 -585 -494 1358 1425 -542 -2145
5181 -2145 -1150 1132 2181 182 -1373 -823 724 690 -923 -1147 608 2223 1074 -1481 -2279 -602
5197 -602 1200 595 -849 -832 988 1337 -508 -2071 -1437 912 2043 360 -1566 -1139 535 896 -850
5214 -850 -1206 452 2154 1367 -981 -2247 -797 1193 1007 -644 -920 705 1155 358 -1800 -1508 787
5231 787 1959 971 -941 -1168 125 902 -271 -1226 -66 2008 1768 -708 -2273 -885 674 1161 -110
5248 -110 -805 264 1960 633 -1631 -1193 270 2239 1294 -124 -1254 376 1125 -386 -1450 -772
5264 -772 1608 2067 303 -1762 -1788 1262 1264 48 -1002 -24 1119 587 -1390 -1586 355 2134 1636 -576
5282 -576 -1374 -227 949 -116 -1189 -398 1191 2052 152 -1848 -1497 254 1184 355 -696 98 1436
5299 1436 794 -1340 -1888 -362 1553 1718 -311 -1247 -442 972 -17 -1451 -1001 1150 2114 421 -1266
5316 -1266 -1530 373 1340 493 -720 -527 787 766 -739 -2059 -403 1566 1725 219 -1470 -520 665
5333 665 347 -749 -762 845 1818 656 -1688 -1595 32 1227 931 -806 -351 1041 1218 -665 -1915
5350 -1915 -1038 1173 1811 154 -1181 -620 700 785 -648 -1172 504 1595 902 -1105 -1557 -238 1211
5367 1211 822 -738 -726 653 1063 -514 -1721 -1188 1083 1956 452 -1148 -966 585 581 -658 -1020 92
5385 92 1622 1469 -691 -1722 -791 822 753 -619 -417 747 1424 63 -1581 -1504 514 1603 389
5402 389 -1075 -843 503 830 -347 -1288 -114 1384 1331 -625 -1768 -844 486 1138 -406 -946 291
5419 291 1076 638 -1407 -1618 672 2013 633 -933 -1165 65 802 -86 -1474 -413 1536 1756 19
5436 19 -1585 -1135 522 788 -114 -945 -3 1206 709 -1011 -1463 -25 1320 976 -862 -1255 -136 956
5454 956 55 -970 -508 1048 1322 -83 -1852 -852 536 1077 18 -793 -155 998 473 -1008 -1573
5471 -1573 53 1431 1194 -683 -1432 -97 673 204 -1015 -927 549 1685 521 -1068 -1064 312 1399
5488 1399 92 -1122 -599 1117 1060 -392 -1207 -152 1154 1321 -423 -1303 -456 913 620 -692 -805
5505 -805 340 1459 519 -1306 -1013 721 1194 -220 -775 -298 469 1254 -324 -1237 -398 1133 1343 -175
5523 -175 -1032 -126 834 548 -704 -1249 -101 1391 756 -765 -1166 401 1205 296 -1113 -811 338 1203
5541 1203 4 -1069 -856 590 1319 91 -996 -467 1106 532 -600 -1074 -11 923 1238 -992 -949
5558 -949 -341 1078 759 -626 -912 441 1042 617 -1287 -1188 507 1944 1322 -971 -1720 2000 1766 -618
5576 -618 610 -1026 732 716 108 -1239 -836 1087 665 -537 -1023 77 943 588 -1036 -719 192 789
5594 789 1386 -1083 -983 497 1311 295 -876 -493 825 802 -343 -945 -700 932 854 -505 -1062 -42
5612 -42 966 709 -621 -1215 -125 949 404 -912 -848 435 1296 488 -1102 -670 245 711 144 -1207
5630 -1207 -471 794 725 -175 -1239 -810 1161 874 -449 -1247 -226 948 568 -823 -1150 1 1001
5647 1001 377 -804 -694 438 960 263 -762 -442 568 930 81 -1270 -728 703 1053 114 -964
5664 -964 -187 976 660 -679 -1223 -208 1007 961 -945 -1317 -72 892 414 -728 -1143 456 829 46
5682 46 -1165 -827 426 968 -107 -998 -295 705 671 -461 -1040 -163 1159 1085 -265 -887 -554 723
5700 723 484 -597 -930 344 1200 394 -1209 -1074 175 976 305 -669 -527 767 751 -453 -1109 -291
5718 -291 590 1233 -298 -1153 -575 647 716 -510 -665 341 1002 478 -766 -1546 -56 1059 715 -568
5736 -568 -361 596 842 -360 -1232 -551 846 1442 231 -914 -532 359 589 -404 -792 -73 1205 862
5754 862 -472 -1164 -610 703 607 -631 -726 227 962 6 -1081 -705 541 1260 263 -1156 -820 288
5772 288 701 30 -763 133 979 957 -597 -1347 -394 635 881 -241 -512 69 1044 52 -1183 -997 384
5791 384 1481 897 -777 -818 -19 431 -194 -1000 -124 1073 982 -195 -1546 -655 802 646 -168 -636 -72
5810 -72 709 358 -712 -901 351 1415 827 -694 -1046 -247 618 112 -622 -286 973 1062 -537 -1245 -694
5829 -694 606 1174 143 -686 -98 637 519 -705 -1338 92 1311 911 -486 -967 -396 776 234 -564
5847 -564 -738 279 1056 122 -940 -999 443 819 101 -766 -481 558 486 -623 -976 -45 863 1178 131
5866 131 -800 -347 492 36 -630 -530 445 1247 324 -1124 -1105 200 822 577 -270 -364 843 625 -806
5885 -806 -1042 -481 1338 1354 200 -791 201 440 426 -576 -987 1418 1326 523 -129 -1482 18 648 952
5904 952 184 -330 217 373 -1174 -1471 -500 501 1495 17 -882 -750 319 328 -196 -686 294 1024 715
5923 715 -476 -1455 -228 716 805 -90 -478 363 705 -84 -1117 -1097 460 1075 582 -773 -495 334 331 -136
5943 -136 -903 26 1033 711 -615 -1120 -642 504 480 -370 -676 202 672 -96 -925 -897 553 1254 603
5962 603 -480 -851 -160 731 -203 -549 35 1118 997 -182 -1324 -731 601 942 193 -529 141 680
5980 680 141 -959 -835 233 1163 654 -560 -752 -213 501 152 -496 -195 649 954 -196 -1030 -756 326
5999 326 726 167 -639 -202 596 117 -678 -660 212 1111 1010 -207 -1078 -173 389 89 -491 -261 647 1007
6019 1007 250 -1274 -851 403 821 26 -429 -169 647 705 -525 -1090 -419 1199 810 -58 -877 -437 403
6038 403 78 -824 -464 315 995 182 -688 -855 348 874 348 -572 -392 438 490 -224 -1030 -502 962 969
6058 969 -77 -753 -635 439 413 -395 -908 408 1061 622 -783 -1096 -127 733 617 -489 -665 582
6076 582 793 -154 -962 -474 811 948 146 -641 -354 608 535 -304 -806 54 838 378 -903 -1056 -225 1066
6096 1066 666 -351 -570 -165 676 -11 -812 -627 636 1092 339 -590 -674 353 453 -122 -867 -85 1026
6115 1026 675 -563 -804 -153 812 718 -222 -618 206 899 121 -614 -840 344 839 550 -654 -501 259
6134 259 519 102 -763 -301 696 760 -185 -976 -487 389 768 -289 -355 -57 839 353 -569 -837 120 853
6154 853 509 -467 -633 -4 932 297 -567 -303 559 795 -164 -1053 -365 661 597 52 -430 -85 513 394
6174 394 -188 -771 -416 759 541 -282 -467 -126 567 357 -500 -370 473 1017 299 -691 -356 389 456 -36
6194 -36 -684 -300 762 545 -220 -757 -335 518 705 -330 -856 -258 563 456 -415 -346 156 936 304 -756
6214 -756 -790 60 500 229 -774 -676 458 941 108 -460 -303 517 544 -198 -716 -214 694 590 -272 -692
6234 -692 -4 620 466 -577 -555 270 918 18 -710 -575 149 792 225 -432 -651 585 845 107 -1148
6253 -1148 -568 318 505 -185 -615 -255 971 672 -382 -656 -80 551 315 -249 -507 33 600 173 -450
6272 -450 -691 95 567 -37 -767 -540 693 569 -37 -553 -484 366 628 -277 -606 52 603 488 -517 -952
6292 -952 -108 311 165 -647 -606 498 775 147 -727 -639 413 650 145 -627 -553 349 604 -118 -335 -237 712
6313 712 413 -345 -811 -108 637 483 -283 -531 167 608 282 -542 -662 59 953 236 -477 -777 121 534
6333 534 -238 -776 -249 672 665 -130 -718 -122 589 566 -93 -526 -301 571 297 -837 -504 278 685 739 -623
6354 -623 -664 228 495 270 -737 -485 290 812 -173 -830 -517 551 875 -179 -663 -485 453 181 -593
6373 -593 -682 65 891 999 -410 -886 -251 467 143 -365 -646 310 1032 321 -873 -646 246 730 261 -420
6393 -420 -158 364 340 -336 -790 -182 703 647 -52 -649 -393 400 429 -271 -559 328 572 242 -655 -814 271
6414 271 703 423 -369 -202 576 447 -241 -899 -566 687 867 17 -953 -390 492 248 -217 -501 220 561
6434 561 291 -546 -955 -6 620 589 -243 -360 152 429 -12 -1018 -399 369 802 -167 -759 -333 228 545
6454 545 -216 -531 11 798 365 -612 -966 -103 700 455 -220 -222 199 549 -149 -863 -553 537 821 258
6474 258 -464 -788 21 518 -16 -417 145 654 431 -378 -1016 -154 704 673 -34 -452 137 615 157 -761
6494 -761 -693 477 1094 412 -883 -702 153 429 407 -421 4 707 764 -343 -820 -514 549 857 -107 -463
6514 -463 -131 623 118 -708 -488 91 941 518 -434 -895 -96 367 91 -454 -366 333 471 -22 -759 -652
6534 -652 525 798 -91 -363 -90 256 392 -635 -616 83 713 830 -148 -927 -86 294 365 -80 -179 454
6554 454 695 -59 -784 -585 87 734 113 -458 181 505 -267 -117 -629 387 827 361 -363 -678 -421 976
6574 976 307 -383 617 -41 -155 516 -263 -1041 78 427 360 -533 -204 79 380 -110 -963 -272 703 662
6594 662 109 -862 -336 231 248 -342 -492 237 961 276 -666 -699 89 848 503 -63 -399 133 517 -262 -927
6615 -927 -291 488 963 155 -546 -431 470 210 -187 -580 52 881 388 -430 -892 -152 621 454 -265 -574
6635 -574 38 411 -232 -881 -420 233 948 691 -634 -537 188 331 117 -751 17 505 568 -295 -943 -459
6655 -459 640 390 183 -369 -137 499 6 -635 -800 166 952 331 -505 -614 66 523 -216 -460 -262 914
6675 914 630 -158 -878 -487 409 629 -160 -271 -213 447 425 -597 -451 163 721 517 -550 -826 -74 560
6695 560 427 -596 -355 457 639 -186 -573 -660 174 693 206 -351 -188 281 82 -560 -1059 -154 867 817
6715 817 -309 -523 73 457 258 -537 -373 409 799 227 -499 -550 46 616 131 -315 -324 137 457 -21 -745
6736 -745 -261 666 735 -251 -707 -213 659 354 -294 -167 154 673 306 -529 -906 -42 644 201 -436 -466 247
6757 247 539 -371 -554 -381 577 915 29 -662 -386 388 228 -302 -495 135 560 345 -308 -561 74 887
6777 887 514 -472 -580 288 484 -104 -241 -242 377 815 230 -537 -573 125 326 -14 -565 -318 323 785 -374
6798 -374 -799 -218 638 539 -276 -573 208 383 182 -529 -539 375 762 -100 -515 -431 200 489 -113 -549 -154
6819 -154 219 677 -249 -615 -180 766 789 -169 -614 -64 352 386 -579 -522 160 754 279 -280 -398 68 670
6840 670 74 -498 -551 344 619 68 -677 -465 324 701 -34 -499 -86 411 408 -278 -794 -78 536 463 -419
6861 -419 -531 329 563 50 -470 -310 221 697 142 -457 -434 214 728 22 -455 -260 242 616 -301 -500
6881 -500 -265 376 441 -316 -519 -101 612 334 -497 -539 13 522 296 -670 -505 146 616 -52 -674 -174 258
6902 258 650 178 -824 -112 476 346 -187 -722 -138 493 399 -145 -498 20 620 222 -457 -388 187 472
6922 472 18 -554 -745 210 478 187 -570 -63 452 407 20 -468 -126 409 403 -177 -660 -238 279 254 -212
6943 -212 -524 -53 554 294 -496 -692 295 666 195 -596 -294 382 321 -367 -324 -230 296 348 -15 -458 -393 709
6965 709 338 -234 -587 -5 530 386 -320 -543 28 619 309 -349 -289 143 536 161 -794 -435 539 623 -72
6986 -72 -465 -539 72 590 8 -461 127 518 456 -360 -797 -5 478 581 -139 -610 -58 659 43 -429 -185
7007 -185 419 728 134 -405 -620 272 119 228 -449 -304 459 290 -177 -707 -259 303 798 5 -569 154
7027 154 444 418 -190 -913 296 739 30 -607 -872 -280 628 -301 -253 201 938 679 -188 -295 -166 112
7047 112 305 -41 -533 -1297 576 -773 -631 -141 -121 755 753 -573 -883 222 441 95 -190 -31 314 705
7067 705 -270 -451 -383 273 837 40 -647 -70 279 364 -548 -573 -69 839 379 -413 -684 -66 360 421 -309
7088 -309 -76 130 349 340 -848 -539 284 716 396 -467 -293 419 528 -81 -803 -269 875 610 -188 -440
7108 -440 -217 144 331 -281 -497 299 599 -140 -609 -657 -45 742 353 -425 -336 22 561 -159 -729 -217 487
7129 487 755 81 -611 -360 389 457 -417 -519 49 620 529 -640 -570 133 482 571 -101 -567 38 432 -276
7150 -276 -523 -169 438 761 235 -531 -618 324 310 -2 -321 37 519 618 -475 -846 -200 403 595 51 -134
7171 -134 -3 201 45 -589 -508 296 939 274 -382 -607 25 446 139 -557 30 717 358 -227 -797 -217
7191 -217 489 539 273 -447 -274 390 1 -451 -335 218 821 397 -282 -850 72 370 388 -93 -251 515 223
7212 223 -61 -804 -248 441 191 -114 -290 68 293 78 -156 -626 177 662 420 -446 -427 37 462 387 -253
7233 -253 -22 420 593 -12 -559 -516 201 514 153 -204 -370 391 150 -381 -611 -174 529 635 -88 -282
7253 -282 -279 201 -127 33 -170 324 366 137 -762 -494 6 317 -176 -79 51 -20 843 -604 -160 216 392
7274 392 610 105 -439 -162 68 565 -344 -184 257 360 104 -435 -579 -7 382 433 -100 -110 16 451 -45
7295 -45 -606 -224 577 676 132 -577 -271 217 343 -111 -452 47 587 388 -356 -605 -116 367 344 -514 -419
7316 -419 100 300 10 -373 -361 320 853 85 -467 -386 138 381 126 -279 4 415 278 -194 -425 -142 418
7337 418 327 -223 -449 -106 248 -77 -461 -139 476 502 255 -495 -392 234 360 -7 -152 -93 446 343 -170
7358 -170 -346 -309 625 501 -14 -157 -290 254 164 -339 -589 536 608 457 -290 -479 32 267 -36 -281 -260
7379 -260 194 400 -150 -701 -185 -23 389 -283 -420 -558 558 770 -484 -414 -8 669 355 66 -566 -44
7399 -44 412 58 -486 -374 149 239 75 -625 -334 445 577 89 -392 -160 289 -27 -115 -700 237 313 270 -168
7421 -168 -745 -230 293 348 -241 -303 196 364 171 -106 -499 134 727 -5 -226 -198 210 392 -290 -369 81
7442 81 277 305 64 -879 0 372 553 -154 -401 251 522 209 -385 -406 85 662 251 -84 -331 246 199
7463 199 -286 -480 -446 401 589 -27 -518 -389 335 362 -148 -170 284 582 281 -188 -430 -157 455 216 -317
7484 -317 -224 139 380 66 -394 -148 227 420 40 -317 -323 327 530 124 -550 -185 318 265 -190 -577 94
7505 94 351 141 -120 -624 -119 322 237 -212 27 203 275 21 -402 -421 167 88 -14 -332 -54 134 340 154
7527 154 -498 -307 468 214 -32 -333 26 399 269 -67 -349 280 413 190 -471 -279 -110 612 44 -420
7547 -420 -363 111 385 -17 -513 -37 233 46 22 -545 -219 122 52 171 -354 -70 561 195 -146 -419 259
7568 259 322 124 -494 -305 72 464 31 -295 162 368 307 -221 -299 -336 271 550 66 -209 0 128 520
7589 520 -230 -649 77 112 176 -147 -473 14 149 162 -283 -115 333 150 199 -595 -225 112 301 -95 -364
7610 -364 -43 187 401 -45 -377 -31 337 287 -110 -361 5 455 334 -254 -258 28 516 184 -481 -402 404
7631 404 249 121 -122 -255 378 299 -129 -333 -2 384 158 43 -569 -263 244 248 -102 -308 28 301 317
7652 317 -333 -106 138 507 333 -257 -614 -167 221 -94 -562 -165 332 526 77 -355 -274 300 501 -123
7672 -123 -130 162 286 231 -409 -508 65 767 311 -55 -150 299 282 -157 -755 -237 643 780 697 -1101 -405 146
7694 146 753 -11 389 -868 -384 319 -513 -187 16 520 601 -138 -489 47 360 89 -408 -344 124 537
7714 537 216 -397 -576 61 214 114 -604 -43 157 122 -115 -492 -21 564 798 -100 -347 -205 51 -74
7734 -74 -334 -200 26 358 497 -188 -388 242 221 -10 -200 -376 467 280 -213 -341 -182 175 599 1 -273
7755 -273 -88 95 493 -378 -311 -154 603 152 -161 -341 -193 411 262 -259 -138 395 323 -34 -467 -406 187
7776 187 590 246 -202 -132 230 232 22 -219 102 544 535 132 -238 -124 125 207 -316 -169 201 429 261 -462
7798 -462 -197 182 325 274 -118 -474 518 -4 -202 -327 -33 420 573 -72 -404 -226 -21 458 -472 -413 74
7819 74 316 501 -161 -400 -278 207 316 84 -548 38 2 -154 -256 -283 242 342 451 -539 -568 110 -142
7840 -142 -259 -384 69 188 495 -631 -99 398 -427 632 129 -95 116 65 369 -198 -358 -603 493
7859 493 171 -431 -173 172 171 -114 -92 -62 110 117 -481 -589 -461 546 124 191 -165 -235 203 126 -74 -367 169
7882 169 688 433 -249 -524 -61 423 -58 -78 -219 441 518 -42 -331 -279 379 357 -32 -272 -290 250 58 -279
7904 -279 -373 -80 396 221 -437 -348 -98 230 83 -389 -19 377 448 -16 -542 -345 365 194 162 -42 -6 431
7926 431 238 -252 -455 78 476 501 -62 -555 -126 194 280 -353 -524 131 401 213 -404 -282 278 279 77
7947 77 -142 -332 287 141 -31 -433 26 345 171 0 -255 -137 119 -9 -130 -330 98 293 42 -247
7967 -247 -502 -64 435 147 -423 -361 410 214 38 -284 -225 340 378 92 -387 -247 294 429 -86 -159 -26
7988 -26 146 178 -215 -384 -50 447 461 -107 -200 -18 164 38 -304 -232 370 48 -69 -299 -756 447 430 -269
8010 -269 286 -494 -217 344 146 -367 -62 -46 477 283 -241 671 498 150 45 -54 318 -186 163 -1129
8030 -1129 -773 -161 -106 317 -106 31 539 -121 -77 3 38 128 88 450 -545 -301 233 778 235 -162 -252 434
8052 434 94 -287 -385 -44 654 -85 -135 -113 266 279 4 -428 -206 57 424 109 -404 -88 148 107 -116 -227
8074 -227 4 382 300 -36 -383 94 181 27 -420 -127 286 452 122 -450 -394 160 364 -1 -301 -400 198
8095 198 274 -103 -330 -265 489 340 -162 -201 51 103 257 -232 -224 -41 223 146 -106 -308 413 405 293 -580 -161
8118 -161 255 294 -192 -298 9 407 460 -164 -297 -24 121 189 -390 -281 32 139 30 -376 -407 66 304
8139 304 -1 -144 -141 231 524 -58 -224 -75 78 534 330 -203 -139 462 222 -11 -247 223 314 200 -124
8160 -124 -529 115 485 341 -253 -280 10 172 66 -455 -338 -32 447 -49 -319 -145 -15 246 83 -125
8180 -125 4 452 224 -137 -311 -60 165 363 -185 -482 110
8191A10
$$ Imaginary data points
##PAGE= N=2
##DATA TABLE= (X++(I..I)), XYDATA
0 0 0 0 0 0 0 0 0 8 -8 8 -8 16 -16 24 -27 32 -40 56 -64 73 -95 112 -129 154 -181 212 -245 285 -329 376
30 376 -432 493 -558 632 -716 804 -904 1014 -1134 1264 -1406 1566 -1734 1920 -2128 2349
46 2349 -2591 2858 -3152 3472 -3821 4213 -4643 5122 -5660 6267 -6952 7743 -8663 9741
60 9741 -11035 12623 -14619 17212 -20746 25874 -34005 48962 -85748 381009 267284 -425757
72 -425757 -76636 191016 64440 -409857 -455613 -40753 377349 129621 -390151 -395274 291644
83 291644 718348 400020 -188708 -324317 -81827 23410 -268527 -440537 -61789 528694
93 528694 567754 -24310 -532270 -321352 208315 318175 14988 -90134 181058 343999
103 343999 -46143 -645408 -701521 -58851 570892 522793 67781 -52973 174220 164532 -245963
114 -245963 -572112 -351753 245660 495866 101469 -347052 -218929 249212 363973 18354
124 18354 -221110 -32795 216629 48362 -417853 -534460 -28466 532086 490880 20094
134 20094 -213480 -23274 121681 -112223 -382468 -211203 273867 467859 102102 -374754
144 -374754 -368881 56318 290786 89294 -115688 53989 309367 166275 -301161 -525005
154 -525005 -205092 296704 379974 17122 -212991 -1004 232666 52798 -280510 -240532
164 -240532 165934 399903 123796 -329134 -381373 -3292 263003 107160 -130341 -14132
174 -14132 280434 246237 -163059 -440045 -230624 204491 319959 22855 -210433 -58231
184 -58231 197714 122566 -194438 -247122 96599 358113 161237 -253947 -363365 -49122
194 -49122 239419 134138 -115634 -70244 209114 250637 -99900 -397308 -239262 168261
204 168261 328799 89656 -181338 -102120 144805 109568 -185217 -280556 25082 356965
214 356965 268622 -116370 -299532 -101328 147170 77257 -178394 -162160 162565 321722
224 321722 68343 -259010 -216852 117150 258732 32028 -219473 -160529 96493 151151
234 151151 -90576 -225198 16379 325878 272701 -96291 -320573 -156316 106736 107907
244 107907 -85036 -118464 126094 296394 71062 -286684 -297025 41672 282099 144601
254 144601 -121580 -125515 84078 132197 -101005 -286937 -101947 253483 301538 342 -226500
265 -226500 -111219 131793 130633 -102596 -196896 5314 211224 103620 -186937 -231782 60152
276 60152 290095 159957 -126779 -187088 12338 125806 -42787 -229413 -106391 210958
286 210958 299151 27442 -229950 -147217 100908 142790 -53804 -172225 -11699 199497
296 199497 127743 -158396 -264146 -25522 239455 186175 -64869 -142462 27915 146852
306 146852 670 -224743 -187463 101113 256114 70562 -178443 -133996 113921 185483
316 185483 -18905 -184026 -69655 149254 138593 -106096 -236628 -46989 211048 184988
326 184988 -65535 -169359 -3240 155898 57732 -158974 -169466 61025 217663 70106
336 70106 -179764 -180110 67014 198813 45561 -135299 -68861 137901 158463 -78091 -260164
347 -260164 -128655 138534 186249 -13787 -133231 15619 185198 95545 -145375 -215152
357 -215152 -18590 172555 92631 -125749 -147667 65230 206585 65783 -150456 -125496
367 -125496 82358 153313 -22667 -200601 -113061 136038 193767 -13654 -178641 -68340
377 -68340 143307 132525 -78560 -162757 4701 178621 104766 -133580 -210266 -17112 164604
388 164604 91670 -96758 -102019 94104 192168 27470 -179572 -157860 46129 143045 -6050
399 -6050 -162815 -64052 162221 196549 -9297 -168656 -69083 111033 80962 -115644 -186046
410 -186046 -6099 194346 135861 -86470 -143015 29146 159817 50516 -143721 -136113 61158
421 61158 158358 16006 -166951 -123800 98631 183518 19840 -136687 -63516 114853 120794
432 120794 -72636 -188676 -55163 142803 131893 -67746 -159022 -606 168468 101801
442 101801 -89305 -127432 27786 130156 9056 -170285 -142289 74089 197490 70797
452 70797 -111621 -87605 76961 110392 -45854 -160152 -50094 141122 137653 -67529 -193343
463 -193343 -64385 140990 142549 -32502 -101509 28501 131325 16974 -178401 -178148 38174
474 38174 194947 102225 -85269 -98167 55840 118697 -17519 -150765 -78745 103399 136369
485 136369 -31138 -164857 -70575 124498 150183 -17384 -125572 -29374 101924 52499 -113267
496 -113267 -140261 38597 188310 101806 -105804 -157085 -4886 107655 21528 -101545 -44422
507 -44422 129484 166207 -15075 -191306 -139857 52253 125026 9338 -86980 4642 144468
518 144468 96485 -100035 -186709 -48942 127130 108220 -57097 -114953 15951 135157 56285
529 56285 -109891 -110482 54818 135165 12632 -141057 -108223 73557 154018 33828 -100459
540 -100459 -64109 65426 68549 -81862 -155714 -17006 167926 167054 -10931 -131191 -58384
551 -58384 53151 11459 -113091 -102216 81929 210455 98340 -108526 -149230 -10816 87662
562 87662 10152 -102383 -46995 111084 134072 -26452 -158556 -78620 102642 135587 -5843
573 -5843 -113627 -50842 73984 62103 -72639 -107704 31799 152621 75709 -109303 -157699
584 -157699 -9805 125460 84850 -39076 -54037 53214 80929 -62908 -187853 -98847 111881
595 111881 192986 67138 -74229 -57617 33688 23013 -92123 -134215 5695 164671 127617
606 127617 -56979 -142707 -33730 99536 72251 -50535 -70187 39419 99776 -9842 -157811
617 -157811 -123434 70312 174124 71586 -74539 -71023 37821 56577 -54118 -117500 -13753
628 -13753 133817 118053 -55945 -159854 -65754 85745 100437 -2022 -42481 38862 90669
639 90669 -13101 -164556 -154681 30210 170391 108951 -40998 -71187 20646 56425 -38426
650 -38426 -116158 -31521 125387 134843 -36008 -169126 -99564 63448 106495 16376 -35564
661 -35564 36489 100705 17497 -138608 -163757 -6023 143000 104991 -39184 -80535 10100
672 10100 70912 1459 -87833 -40956 93990 122523 -20004 -161296 -118138 47789 115296
683 115296 32271 -37054 17880 93549 35992 -114892 -157463 -22008 127755 115050 -25483
694 -25483 -92944 -14406 60185 7588 -78943 -46209 92760 146856 21338 -136756 -137277 1476
706 1476 88233 27491 -48166 5277 102999 76970 -67970 -147775 -48528 102061 105637 -23486
718 -23486 -98686 -29454 61459 30494 -62206 -50315 73124 139264 40113 -119349 -141295 -15295
730 -15295 79815 38611 -39242 -12195 84739 83158 -48890 -142119 -66743 88128 127801 12108
742 12108 -88369 -45392 41750 24346 -71042 -77520 53717 153500 80164 -78977 -135556 -38896
754 -38896 63298 36239 -44432 -27203 70759 92876 -22175 -129915 -75845 74603 128625
765 128625 31507 -79849 -65487 23937 29750 -56217 -79372 32503 144510 96603 -62920
776 -62920 -133733 -45410 62443 51883 -32596 -41829 45373 83317 -10832 -119300 -86293 60828
788 60828 136365 53084 -65331 -70379 10017 32131 -43709 -87200 2701 125138 111979 -28973
800 -28973 -120527 -57343 54461 57316 -29249 -54666 28202 87448 12711 -106221 -99141 34500
812 34500 123709 63364 -49443 -62643 15236 44910 -29936 -92053 -25849 95698 106768 -14337
824 -14337 -110218 -61370 52252 73703 -6327 -52558 8379 74265 20123 -100604 -115866 11296
836 11296 123716 89139 -25419 -60095 5302 41305 -23299 -93761 -47464 76960 113944
847 113944 9065 -95794 -68739 37477 71503 -687 -52958 174 73651 41542 -72977
858 -72977 -116731 -16367 99036 81823 -24323 -65463 3612 61374 7320 -76855 -54911
869 -54911 54928 102765 13108 -99896 -84927 26437 79146 22923 -37455 -3255 69347
880 69347 47615 -64967 -123114 -44848 77620 91738 -2437 -56512 -4166 55138 19935 -65012
892 -65012 -65814 36136 100188 32690 -80507 -91044 8448 72033 22055 -42819 -14304 62814
904 62814 64247 -34878 -106124 -47529 62615 78971 -7995 -70102 -20584 59025 43000 -39500
916 -39500 -59731 19639 89491 38914 -76054 -102174 -9777 71549 41381 -35030 -27613 53856
928 53856 73502 -14421 -98641 -65156 45018 83491 7315 -63493 -30929 45904 45970 -33568
940 -33568 -67620 5810 86771 59777 -45737 -92167 -22797 55592 32938 -42562 -45013 39224
952 39224 86702 19806 -72612 -62223 31959 73200 1241 -80337 -52694 41067 65081 -5885
964 -5885 -55707 -2602 77003 59982 -41610 -96204 -35786 51353 47701 -27160 -49333 21291
976 21291 78403 30196 -62306 -71357 13858 72241 24621 -57106 -52098 29098 61259 -6325
988 -6325 -71250 -30984 63576 78485 -5229 -68690 -29891 43869 37542 -43117 -75502 -4607
1000 -4607 73830 52806 -32367 -55781 16643 73596 27458 -61307 -73232 4506 57323 10151
1012 10151 -56429 -31966 57436 86012 6145 -74156 -49435 32297 46067 -20365 -65687 -13725
1024 -13725 63521 51954 -30155 -64106 -3135 66228 42031 -39909 -59600 4636 56877 17796
1036 17796 -59390 -59064 24520 70876 20036 -48582 -32535 45448 65751 -11011 -79102 -47622
1048 -47622 37149 53981 -16175 -58685 -1367 71685 54445 -32095 -69860 -8654 56103 27666
1060 27666 -49285 -63087 9301 68588 30422 -43507 -40877 31099 64621 5753 -67463 -49926
1072 -49926 31233 58577 -2413 -60403 -28392 48908 53524 -19462 -59142 -6161 64937 48792
1084 48792 -37192 -72560 -13541 48218 27309 -38918 -42562 31096 74551 21151 -58279 -58861
1096 -58861 16610 58670 7785 -54990 -34781 38060 55635 -10919 -63592 -19458 59463 61061
1108 61061 -17120 -68343 -24617 43907 32996 -35619 -53134 12709 68468 31255 -47280 -55417
1120 -55417 14081 62122 22712 -46443 -45232 19856 46869 -7422 -60611 -27409 53875 71322
1132 71322 1246 -59633 -32962 31622 34597 -28538 -56396 2571 68852 44168 -40181 -66926
1144 -66926 -2131 58772 33971 -32544 -40134 18389 48254 -4455 -67767 -46740 37907 74950
1156 74950 18889 -46306 -33684 26668 38386 -17513 -54639 -9824 55601 44351 -34390 -72801
1168 -72801 -15619 58670 52276 -12517 -37888 6557 40797 -2537 -67551 -53326 30680 78576
1180 78576 32024 -41467 -42566 16013 39124 -6136 -48247 -16400 50143 49889 -25998 -74823
1192 -74823 -30819 47005 57310 -2826 -35618 3209 44664 13852 -56229 -64878 10731 69861
1204 69861 35240 -37085 -46782 11146 45319 5390 -40725 -17643 43582 51779 -17810 -77789
1216 -77789 -45853 32773 56416 10240 -26614 3029 45753 19780 -50932 -70457 -5987 63309
1228 63309 47011 -26601 -51122 -1354 41387 14220 -35991 -22419 43294 61000 -4899 -74226
1240 -74226 -59896 16771 53951 14241 -25301 -2928 42032 30241 -37451 -67745 -11613 58190
1252 58190 51854 -18250 -56687 -17191 32312 18060 -27023 -21478 39040 68282 9707 -70061
1264 -70061 -70354 1917 49631 20420 -23507 -7433 39657 34874 -27705 -65732 -20393 53735
1276 53735 60099 -6655 -55834 -28460 22562 19325 -24080 -27050 30264 67492 25086 -54017
1288 -54017 -71676 -8908 46834 27799 -21783 -20007 27973 37614 -18109 -61634 -24116 50943
1300 50943 66000 3201 -54120 -38031 13292 19543 -20158 -29526 23454 69282 36059 -43307
1312 -43307 -70895 -16931 40085 30928 -16599 -22988 20570 40352 -7733 -60815 -38684 37706
1324 37706 69823 18276 -44129 -38630 10624 22251 -17545 -37364 8011 62341 45076 -29644
1336 -29644 -67608 -25703 36227 37814 -8765 -24623 11412 34338 -4112 -57513 -44475 30995
1348 30995 74212 33540 -33794 -44803 -756 19821 -14083 -38309 1357 60266 53222 -20714
1360 -20714 -68804 -33178 30695 40888 -1845 -26240 4651 35126 5098 -49910 -49192 17682
1372 17682 68738 39005 -28321 -45789 -6201 22969 -1705 -34781 -10725 47518 53862 -9333
1384 -9333 -64287 -41505 25369 45714 5530 -23627 446 33426 12045 -46475 -56841 4564
1396 4564 61564 45163 -16853 -41628 -5324 25037 1280 -34933 -20331 35975 55273 1064
1408 1064 -58041 -45104 18195 48741 14416 -24858 -8252 28831 17468 -37748 -59636 -7114
1420 -7114 57557 52849 -7709 -40797 -14045 21074 6406 -31682 -23993 30170 57604 14449
1432 14449 -49040 -51742 4008 38743 14317 -21202 -9146 31277 30676 -23079 -57587 -20383
1444 -20383 43002 49657 -5459 -42188 -15238 25377 16430 -24340 -27508 22068 55331 18043
1456 18043 -47398 -59018 -5408 40058 24501 -12881 -9616 26863 29813 -19617 -59896 -31412
1468 -31412 35840 57460 11834 -35046 -23716 14730 14296 -24366 -33691 13425 57559 33727
1480 33727 -31400 -55064 -12424 33445 21784 -18594 -19434 19399 34487 -4980 -47614 -28675
1492 -28675 32300 54900 10717 -40502 -34685 8620 20275 -12332 -27909 9993 54821 39019
1504 39019 -27101 -61170 -23741 28630 29422 -10006 -20565 15184 35876 -137 -47561 -38957
1516 -38957 20462 55549 22896 -28256 -31378 5355 20241 -10436 -34671 -3787 44546 41775
1528 41775 -12656 -50147 -22691 29028 32816 -9309 -30630 -1705 29675 8794 -36862 -34245
1540 -34245 21373 58047 27385 -30741 -42143 -2378 21239 -2902 -30072 -9042 39635 45413
1552 45413 -6512 -47436 -27560 22149 34428 -3924 -31178 -6219 29480 18581 -26814 -39560
1564 -39560 4445 47304 29442 -21453 -35923 168 28718 4621 -34531 -24714 23315 41765
1576 41765 4503 -36950 -23401 24533 37088 -813 -33966 -16517 22697 20455 -22318 -40384
1588 -40384 -2042 45004 38816 -11766 -35179 -5970 24663 7216 -32678 -32044 16801 46620
1600 46620 15182 -31690 -29905 14268 35776 3375 -31818 -17601 22368 27132 -13677 -41548
1612 -41548 -13248 34065 36141 -5430 -31332 -6081 28302 17341 -24838 -35528 3282 37459
1624 37459 16857 -28722 -33159 10390 39429 14234 -25978 -22082 17639 29306 -8893 -43305
1636 -43305 -21881 27812 38870 920 -29135 -9621 26537 21261 -18849 -36788 -3748 34042
1648 34042 22079 -22480 -34742 2456 35630 18696 -21733 -25080 12787 32756 2108 -36776
1660 -36776 -27485 18868 36718 1937 -32210 -15798 24956 29855 -9444 -34187 -8433 29561
1672 29561 23945 -18040 -36551 -3286 33822 21469 -19757 -29567 5713 34388 12542 -28680
1684 -28680 -28707 11736 34341 6002 -32957 -23740 19877 32856 -894 -31780 -13203 27831 30262
1697 30262 -10922 -36273 -11092 25675 21903 -17269 -30604 2654 34668 19864 -19710 -29704
1709 -29704 4361 30951 7859 -29595 -27026 14694 36426 6618 -29666 -20257 18405 29336
1721 29336 -4693 -34233 -12236 29203 29596 -11925 -37608 -11698 26758 22161 -14195 -25076
1733 -25076 6264 34663 16251 -26882 -33215 3905 30646 9969 -27238 -25005 15052 33735
1745 33735 7023 -24247 -14227 22001 25964 -13914 -43255 -19074 26399 33825 -890 -22868
1757 -22868 -290 26310 11488 -27925 -35939 3227 37331 20927 -20254 -29046 3401 27238
1769 27238 7597 -23943 -16593 21448 33992 -418 -37123 -25603 16235 28746 -1701 -27547
1781 -27547 -8533 26888 24410 -13401 -30393 -867 32311 19657 -23600 -37725 -5322 26108
1793 26108 15848 -13043 -11937 20911 33708 432 -40667 -35648 7293 30732 8297 -18851
1805 -18851 -7672 23537 23871 -12974 -35566 -9788 30619 29818 -11607 -35502 -11178 21487 14669
1818 14669 -16051 -19761 14219 36598 11667 -30011 -33223 4009 30390 10794 -20933 -17461
1830 -17461 13675 22590 -6427 -30600 -9203 31741 35685 -3740 -35869 -21646 11544 13410
1842 13410 -13062 -18957 13308 40673 19957 -26737 -37949 -2707 27791 15667 -16181 -18658
1854 -18658 9624 20659 -6334 -31564 -13923 29677 42539 5857 -32170 -26697 5084 14771
1866 14771 -7839 -19775 6568 35658 22024 -21766 -40342 -8652 29906 24612 -9330 -20434
1878 -20434 2329 18240 -3456 -31383 -18275 24435 42062 12316 -27134 -26309 5575 17427
1890 17427 -4084 -21688 -3428 27413 21842 -17490 -36638 -8982 30420 31428 -3774 -23048
1902 -23048 -4404 14920 -286 -29609 -24897 18565 45209 20505 -20822 -27772 -427 16211
1914 16211 -2824 -22849 -7005 25936 28363 -7661 -35872 -17601 21050 28553 632 -19438
1926 -19438 -4196 18487 6764 -25800 -30034 6001 37816 23511 -16552 -27252 202 20667
1938 20667 4608 -20394 -11924 20697 26793 -7348 -37690 -22754 18649 33881 8950 -15251
1950 -15251 -6006 14314 6685 -26005 -35402 -1130 36955 31702 -5832 -25173 -6301 15663 4795
1963 4795 -20044 -16096 17223 33291 3669 -33875 -29760 8293 29155 10780 -11864 -4023 17583
1976 17583 13131 -20295 -36767 -9136 30442 31643 -2924 -25775 -9407 15481 10210 -13447
1988 -13447 -14366 13768 31025 5135 -35486 -37759 1370 32376 21389 -5475 -6183 13818 12334
2001 12334 -19189 -38748 -14360 28894 37314 3866 -25390 -16544 8084 9574 -11118 -14024 13214
2014 13214 34043 13858 -27027 -39339 -7639 24580 18688 -5934 -9403 11897 18885 -7376
2026 -7376 -32676 -16719 22778 34821 3582 -29829 -22663 7651 15400 -2665 -10900 10868 32288
2039 32288 14619 -27651 -43152 -13521 23958 25963 16 -9560 6572 14980 -6069 -31646
2051 -31646 -21214 19368 39190 13756 -22061 -24897 783 13228 -4477 -17261 2601 28845
2063 28845 22653 -14466 -35423 -12580 21505 22038 -4699 -18296 -1209 16024 2402 -21451
2075 -21451 -17344 15438 37129 13757 -22349 -29344 -3474 14031 961 -15295 -1131 27551
2087 27551 26374 -8986 -35776 -20057 15894 24581 459 -14868 -295 17763 6206 -23148
2099 -23148 -26929 5422 32630 20745 -12225 -22930 -2132 14378 884 -18685 -10325 18919
2111 18919 27075 -1442 -29682 -19189 14588 26640 4204 -17441 -7231 13648 7643 -20049
2123 -20049 -27367 2940 34394 25945 -8985 -24876 -6774 12671 3761 -17004 -12095 16615 28812
2136 28812 3693 -27546 -23970 7831 24810 7825 -13871 -7913 13411 12358 -15032 -29627
2148 -29627 -6135 27652 27923 -3232 -22067 -7271 13289 6747 -16233 -17156 10596 27832 8255
2161 8255 -23476 -25456 4374 24451 10317 -12036 -9963 11329 14892 -10503 -28756 -10904 22940
2174 22940 29120 396 -23417 -11767 12100 11574 -9848 -16646 6679 26676 10284 -23421 -29882
2187 -29882 -1701 24134 15995 -7027 -8239 10575 15098 -8039 -30412 -18187 16348 27880
2199 27880 5618 -17489 -10925 12341 13926 -9273 -20253 -790 22846 15352 -16229 -27532
2211 -27532 -2645 23077 16337 -9294 -15363 5044 17175 -1008 -23737 -15821 14832 28986
2223 28986 5340 -21707 -18397 5675 14956 -1463 -14371 1290 24329 18304 -13915 -31790
2235 -31790 -13184 15967 16642 -5050 -12435 6588 21702 6529 -20914 -21734 6552 22888 6184
2248 6184 -19375 -16580 9612 20279 1838 -16814 -7835 16110 17522 -8371 -25965 -9769 17876
2261 17876 19876 -4260 -18691 -2585 17108 9707 -15179 -20222 5120 26170 12720 -16070
2273 -16070 -20884 1470 16206 1509 -18295 -9298 17425 24508 451 -22584 -14514 10557 15242
2286 15242 -4873 -18365 -3390 18798 14767 -10702 -20690 -214 21784 13727 -13608 -21225 -263
2299 -263 17840 6907 -15248 -13529 11616 23160 2746 -21690 -16017 10732 20277 41 -18985
2312 -18985 -9282 13632 14829 -7425 -20004 -2918 20231 16606 -9786 -21278 -3800 17337
2324 17337 10763 -12298 -16114 4870 20137 5172 -18044 -16705 8701 21296 3884 -18204
2336 -18204 -12532 11129 16820 -3578 -20557 -7182 16850 17067 -5726 -19202 -3753 18455 13269
2349 13269 -11148 -20833 -2385 17434 9684 -12215 -14133 7756 21080 5381 -19272 -18609 6178
2362 6178 19280 4065 -14945 -8956 12985 16819 -5712 -21382 -7421 16490 17474 -5396 -18856
2375 -18856 -4147 15645 10673 -10883 -16987 1506 18551 6989 -15282 -15479 7420 21954 7271
2388 7271 -16286 -16598 5008 13211 -1154 -16918 -6103 18982 20904 -3102 -22636 -11652 11460
2401 11460 13320 -6749 -15180 800 18376 10956 -13405 -19535 1052 19344 10448 -11583 -15609
2414 -15609 4687 15887 2425 -16239 -11832 11315 19965 642 -18370 -11011 12661 16878 -4035
2427 -4035 -18018 -5005 14689 11855 -10755 -19541 93 20939 15036 -8692 -16144 111 13577
2440 13577 2999 -16786 -14009 10113 22737 6326 -16740 -14490 6496 15725 316 -15246
2452 -15246 -6806 13753 14348 -8664 -22410 -6686 17055 17500 -3806 -14364 -1058 13326 4613
2465 4613 -15870 -17586 4271 20258 9478 -12602 -13947 5402 16252 1698 -14755 -8766 10764
2478 10764 14225 -4692 -21283 -8961 14020 18450 -165 -15880 -4813 12353 7272 -13242
2490 -13242 -18134 3322 22877 12663 -11541 -19027 -2023 13104 5724 -9770 -6039 12872 18091
2503 18091 -2445 -24005 -18186 7590 18372 5023 -9195 -2970 13268 9968 -11439 -21339 -3655
2516 -3655 18657 14748 -8505 -19027 -2203 15245 8720 -8460 -9470 7964 15803 -1807 -22241
2529 -22241 -17279 7729 22187 9289 -9129 -7749 6065 7226 -9164 -19456 -2478 20493
2541 20493 20053 -3714 -20636 -11296 8123 8025 -6317 -7227 10030 21008 5516 -19460 -21852 1027
2555 1027 16293 7945 -8460 -8552 7985 12155 -3238 -16018 -5001 15849 18355 -4636 -22034
2568 -22034 -12928 7661 12377 -689 -6659 5791 18232 5190 -19065 -23908 -1447 19738 13313
2581 13313 -5647 -10421 2648 9746 -3670 -16387 -6867 15891 22352 2635 -18900 -15217 3880
2594 3880 9421 -2765 -9300 2078 17200 11329 -11491 -20765 -3698 15957 12732 -7037 -13643
2607 -13643 212 10849 1275 -14355 -8691 13448 22470 4722 -17897 -17485 1321 10523 -253
2620 -253 -9795 1039 16604 12455 -9886 -21997 -7585 14962 16472 -2066 -11655 -2401 8498
2633 8498 1095 -14478 -11932 10142 23638 10527 -13162 -17364 -835 9942 495 -10351 -1907
2646 -1907 14852 14484 -6016 -20714 -9122 12387 16143 84 -12126 -3568 9220 3847 -12437
2659 -12437 -14042 5172 21152 12091 -10863 -17705 -1688 11051 4374 -8941 -5724 11618 14841
2672 14841 -3791 -21163 -13192 10005 18905 4996 -8838 -4038 6996 3336 -12652 -16868 1859
2685 1859 21299 16361 -5298 -16376 -5410 7939 3568 -8647 -6442 9941 17086 798 -19147
2698 -19147 -15649 5940 17317 6051 -9248 -5990 7495 7400 -8662 -15805 -1139 18460 16132
2711 16132 -5906 -17978 -7747 8105 7932 -4114 -5885 8459 15416 1716 -18434 -18952 2186
2724 2186 17715 9745 -5720 -5916 6082 7961 -7084 -17629 -5193 15214 17578 -1615 -16086
2737 -16086 -7721 7389 8221 -4423 -7603 5124 15690 4947 -15453 -18186 -828 15320 10032
2750 10032 -6230 -8114 3969 9341 -2461 -14720 -7411 12788 17891 111 -16673 -11587 5074
2763 5074 9951 -1887 -7999 3178 15078 7848 -12742 -19808 -3467 13597 10426 -4465 -8640
2776 -8640 2600 10095 -155 -13187 -8296 10256 17787 3936 -14382 -13683 2097 8608 -1443
2789 -1443 -9199 1501 16481 13217 -7850 -19098 -7364 10998 10374 -4556 -9928 1444 10780
2802 10780 3164 -11059 -10177 7302 17802 5796 -12706 -14852 85 9266 988 -7193 -1547
2815 -1547 12694 12112 -5951 -18247 -8010 9952 13981 -749 -10083 -2459 7671 2676 -11312
2828 -11312 -10785 7302 18460 9725 -9651 -14160 -948 8044 485 -8790 -3521 10032 13581 -1466
2842 -1466 -14111 -8302 8686 12364 -1248 -12241 -5755 7690 6169 -6566 -11236 2286 16390
2855 16390 10404 -8366 -14489 -2191 8811 4175 -8272 -6819 7630 12105 180 -13346 -9842
2868 -9842 6644 14011 2749 -9464 -5430 6804 7291 -6776 -13133 -1510 14312 11790 -4557
2881 -4557 -13390 -2353 8913 3787 -8959 -10540 4447 14074 2943 -12268 -10644 4769 13240
2894 13240 3846 -9320 -7094 5893 8764 -3313 -13151 -4682 10920 12075 -3317 -12458 -3760
2907 -3760 8808 6489 -5914 -9776 2394 11536 5283 -10749 -12084 3764 13258 4449 -8150
2920 -8150 -7415 4870 8414 -2273 -12430 -6264 9389 13508 21 -11906 -5620 7797 7466 -4956
2934 -4956 -10694 -69 11767 7639 -7288 -12706 -662 11044 5649 -7961 -9242 3473 11788
2947 11788 2933 -10575 -8008 6529 10639 -729 -11758 -6460 8267 11335 -800 -9432 -2728
2960 -2728 8856 6898 -6823 -12980 -2175 10625 8983 -5286 -8874 2461 11270 3622 -10023
2973 -10023 -10433 3458 11832 4059 -8749 -6962 6887 10625 -1845 -11357 -5457 8312 11192 -2317
2987 -2317 -10210 -2786 8397 6556 -5733 -11165 -837 10643 7657 -5852 -9540 1607 10863
3000 10863 2926 -9757 -10462 2462 10392 2412 -8847 -5708 7749 10749 -1383 -12175 -5643
3013 -5643 7565 8105 -3788 -10381 -2364 9435 8190 -4937 -10060 -463 9442 5602 -7447 -9026
3027 -9026 3618 11354 2593 -9370 -9686 3191 10145 2808 -8227 -5017 6879 9042 -3348 -13126
3041 -13126 -5880 7315 9804 -2192 -9077 -743 9927 6469 -6005 -9425 822 10457 4757
3054 4757 -8888 -10817 1578 10596 3683 -6887 -5711 6055 10002 -651 -11524 -7278 6956
3067 6956 10443 -1237 -10789 -4407 7225 7592 -3628 -8868 1414 11591 6312 -7896 -13172 -2246
3081 -2246 8357 5100 -4489 -5257 5749 11099 990 -11196 -8777 4080 10346 1261 -9223 -5879
3095 -5879 5207 7548 -2456 -9150 -498 11335 8820 -5479 -12450 -3798 7839 5940 -4927
3108 -4927 -7219 2849 10657 3058 -8432 -8709 4013 11419 3085 -9020 -8754 2392 6644 -640
3122 -640 -7341 -745 10661 11441 -2482 -12644 -7418 4670 5760 -3419 -6822 2552 10704 4465
3136 4465 -7978 -10298 1704 10960 5021 -6476 -8075 1158 6044 -886 -8401 -3326 9176 12116
3150 12116 -235 -11421 -7586 4494 7664 -1089 -6834 -977 8617 5366 -7422 -11014 1121
3163 1121 12206 8487 -4359 -9125 -1350 4444 -432 -8075 -4541 7774 12701 2875 -9615 -7855
3177 -7855 2836 6431 -826 -6619 -1192 6983 6003 -5931 -10485 -1719 10270 10145 -2259 -8745
3191 -8745 -1948 5106 -576 -8040 -5935 6572 13903 3479 -9379 -9607 758 8069 1169 -5456
3205 -5456 -2030 6028 5766 -4726 -12353 -4956 8431 11197 367 -7408 -3462 3965 2183 -7011
3219 -7011 -7614 3297 12130 5560 -7839 -10533 -367 8112 3249 -4045 -3006 4766 6530 -4203
3233 -4203 -12615 -6762 7753 12279 2632 -6467 -3143 3727 2613 -5886 -9013 1227 11396 7835
3247 7835 -5479 -10926 -2226 7017 4654 -3804 -4094 3936 7910 -1243 -11029 -7966 4795 11339 3691
3262 3691 -6301 -5034 2971 4037 -3495 -7493 469 10382 7606 -4665 -12249 -4975 5883 6362 -1164
3277 -1164 -2926 4338 8407 74 -11864 -11016 1954 10917 5241 -4592 -4616 2591 5180 -2529 -8320
3292 -8320 -1778 8949 9274 -2570 -11454 -5687 5009 6351 -612 -4460 1972 8104 2711 -9357
3306 -9357 -10273 905 10857 6727 -4200 -6654 361 4495 -1360 -7938 -2199 9590 11187 -678
3320 -678 -11213 -7584 2248 5592 -130 -4276 2302 8780 4393 -7472 -11097 -1289 8977 7405
3334 7405 -2032 -6826 -493 4720 36 -6762 -4016 6781 11157 1278 -9864 -8473 1508 6244
3348 6244 284 -4578 -625 7100 5159 -5060 -10121 -2101 8723 7804 -1758 -7101 -2445 4267 1044
3363 1044 -6864 -4949 5683 11105 3868 -7921 -9381 106 5730 1379 -5240 -1599 7024 7089 -3888
3378 -3888 -10949 -4524 6772 8956 498 -5554 -1912 3655 1174 -6706 -7229 3273 11451 6590 -4842
3393 -4842 -8825 -1391 5192 2126 -4504 -3330 4687 6443 -1892 -9601 -5271 6406 9945 1862 -5790
3408 -5790 -4466 2568 1646 -5589 -6544 2505 11270 7014 -4501 -9695 -3014 4900 3515 -3306 -2880
3423 -2880 4245 7188 -1024 -9822 -7502 4184 10192 4220 -4414 -4061 3101 3534 -4855 -8398 -1094
3438 -1094 8309 6951 -3288 -8390 -2714 5613 4813 -2329 -4519 1332 5382 -283 -8477 -7563 3567
3453 3567 10124 5129 -4075 -5796 1187 3443 -2702 -6899 -1184 7600 7521 -2299 -7974 -4185 4053
3468 4053 6035 -984 -5074 1672 5385 1623 -7843 -8334 505 8033 4847 -3489 -4718 1979 5520
3483 5520 -21 -6586 -4210 5020 7378 -520 -7519 -4615 4267 6406 -660 -5251 -201 6055 3064
3498 3064 -6028 -8880 -448 7899 5821 -2941 -5100 938 5362 403 -6239 -4661 4378 8181 1086
3513 1086 -6990 -5755 2640 5159 413 -4469 -1117 6140 5282 -4109 -8413 -2690 6069 6243 -1950
3528 -1950 -5728 -57 5872 1841 -5078 -5776 2367 7325 1454 -6114 -5946 2234 6663 1062 -4843
3543 -4843 -2174 4622 5672 -2040 -8154 -3354 5251 6266 -1593 -5550 -1265 4929 3473 -4318 -6171
3558 -6171 1825 7701 3669 -5294 -7084 213 5632 1366 -4656 -2802 4707 6443 218 -7521 -4422
3573 -4422 3577 5883 -318 -5380 -2517 4602 4231 -2805 -5864 -259 6712 4730 -3634 -6807 -651
3588 -651 5341 2610 -4162 -4627 2341 6486 926 -6231 -4214 3683 7128 552 -6069 -3992 2854
3603 2854 4393 -1685 -6210 -1562 6382 5514 -2335 -6495 -1479 5359 3856 -4087 -5968 751 6860
3618 6860 1970 -4654 -4568 2228 6445 722 -5681 -4684 3200 4993 -651 -6068 -2581 5054 5381 -1418
3634 -1418 -6079 -1582 5224 4613 -2369 -5842 -561 5195 3381 -4226 -5456 1461 6889 2704 -5222
3649 -5222 -5069 2504 6067 727 -5690 -3700 2784 5562 -769 -5548 -1644 5359 6397 -1928 -6101
3664 -6101 -2131 4536 3365 -3382 -5502 406 5709 3474 -4026 -5062 1505 6004 2076 -5138 -5367
3679 -5367 1967 5218 462 -5471 -2899 4275 5648 -809 -6331 -2783 4230 4759 -1544 -5114 -1289
3694 -1289 5161 3183 -3814 -6002 527 6973 3363 -3397 -4794 333 4584 708 -5251 -3934 3245
3709 3245 6650 885 -5561 -3563 3534 5203 -946 -5526 -2047 4235 3381 -3315 -5891 -81 6646
3724 6646 4866 -2743 -5353 -964 3865 1598 -4344 -3806 3289 6888 1875 -5879 -5210 1792 5732
3739 5732 882 -4429 -2210 3966 4335 -2657 -6861 -1964 5589 5614 -1105 -5162 -1017 4021 2248 -3781
3755 -3781 -4674 1357 5800 2432 -5039 -5309 1551 5846 2606 -3729 -3011 2542 3555 -2091 -6769 -2711
3771 -2711 5296 6979 193 -4955 -2291 3042 2334 -3503 -4860 1199 6552 3533 -4397 -6567 -757
3786 -757 4717 2800 -2553 -2743 2671 4642 -779 -6082 -4140 3584 6440 980 -4951 -3046 2598
3801 2598 3489 -1678 -4352 463 5720 3542 -4291 -7202 -1047 5257 4022 -1164 -2845 1567 4060
3816 4060 -386 -6568 -4645 3131 6997 2227 -4072 -4191 1535 3155 -1249 -4375 -412 6099 5475
3831 5475 -2122 -7142 -2846 3783 3967 -1423 -3538 812 4693 1151 -4995 -5199 1915 6413 2328
3846 2328 -4007 -4598 578 3630 17 -3856 -866 4891 5280 -1563 -7043 -3704 3188 4320 -296
3861 -296 -3512 -45 4298 1766 -5036 -5713 1279 7062 4253 -2983 -4370 13 2797 -450 -4921
3876 -4921 -2377 3931 6061 189 -5772 -4127 1768 4337 -319 -3650 -230 4349 2692 -3895 -5609
3891 -5609 -144 5347 5419 -1961 -4654 -776 2688 -233 -4246 -2844 3720 6932 1416 -5660 -5115 941
3907 941 4425 1240 -2559 -674 3656 2443 -3961 -6903 -1903 5901 6583 115 -4005 -1906 2145
3922 2145 513 -4214 -3571 3132 7218 2955 -4747 -5926 202 4373 1835 -2497 -1376 2795 2976
3937 2976 -2565 -6314 -2423 4930 6382 800 -4044 -2699 1524 929 -3085 -3585 2153 6240 3058
3952 3058 -4294 -6463 -1052 4576 2967 -1679 -1596 2482 3385 -2401 -6964 -3598 3817 6934 2178 -3427
3968 -3427 -2621 1253 1751 -2338 -4187 664 5978 4039 -2844 -6459 -1715 3980 3740 -829 -2192 1484
3984 1484 3308 -951 -5935 -4096 2903 6798 2565 -3056 -3424 1151 2133 -1522 -3645 2 5198
3999 5198 4080 -2427 -6128 -2409 3208 4059 -310 -2441 1126 3680 134 -5385 -5290 1461 6268 3215
4015 3215 -2593 -3393 713 2910 -691 -3537 -1006 4448 4547 -1353 -6184 -3596 2689 3789 -114 -1980
4031 -1980 530 3811 1465 -4478 -5539 358 5576 3587 -1874 -3900 312 3192 374 -3675 -1819
4046 -1819 3767 5368 -278 -5924 -3893 1877 4029 429 -2715 87 3744 2434 -3055 -5193 -683
4061 -683 4996 4110 -1686 -3975 -552 2521 800 -3441 -2205 2995 5844 1106 -4793 -4812 723 3477
4077 3477 722 -2505 -689 4093 3343 -2383 -5504 -1533 3809 4258 -1123 -3680 -875 2524 996
4092 996 -2983 -2872 2411 5725 2076 -4246 -5222 -68 3665 1308 -2222 -1362 2847 3406 -1758 -5786
4108 -5786 -2455 4059 5116 263 -3837 -1907 2075 1260 -2882 -3191 1522 5430 2975 -2954 -5188
4123 -5188 -626 3269 1655 -2258 -2048 2195 3598 -575 -4915 -2801 3116 5445 1058 -3362 -2618
4138 -2618 1525 1924 -1891 -4054 346 5048 3632 -2492 -5173 -1135 3009 2450 -1761 -2512 1076 3437
4154 3437 283 -4299 -3508 1928 4960 1775 -3388 -2589 1233 2722 -968 -3811 -554 4089 3874 -1733
4170 -1733 -4875 -1513 3391 3119 -1331 -2739 781 3710 791 -4076 -4050 1049 4696 2125 -2579 -2782
4186 -2782 1603 3183 -545 -3616 -1905 2997 3910 -638 -4404 -2053 2845 3660 -652 -3329 -172
4201 -172 3033 1630 -3125 -4661 272 4393 2595 -2217 -2854 683 3044 259 -3274 -2024 2519
4216 2519 4240 -235 -4606 -3002 1749 3310 -48 -2578 -427 3187 2776 -2186 -4586 -1117 3188
4231 3188 2624 -2217 -3718 418 3734 2041 -2398 -2735 1547 3435 -108 -4308 -3532 1502 3426 850
4247 850 -2270 -1826 2863 3014 -1676 -4928 -1826 2861 3106 -1622 -3379 -644 3169 2036 -2807 -2909
4263 -2909 -11 4253 1304 -3151 -3370 280 2850 432 -3668 -2332 2255 3751 -121 -3466 -1925
4278 -1925 2676 2856 -1775 -4577 -1694 2820 3207 -762 -2316 455 3506 2020 -2502 -4250 73
4293 73 3253 1643 -2878 -2478 2005 3981 861 -2915 -2232 1763 2681 -760 -3505 -1316 3031 3524
4309 3524 -542 -3466 -855 2796 2252 -1571 -2990 31 3464 1560 -3040 -3495 432 3983 1644
4324 1644 -2250 -2103 1622 3130 -129 -3630 -2362 1882 2903 -492 -3336 -1446 3062 3169 -757
4339 -757 -2925 -814 2243 1517 -2363 -3591 160 3740 2501 -1603 -2657 636 2862 376 -3324
4354 -3324 -2752 1902 3641 592 -3537 -2061 2000 3063 -182 -3131 -592 2913 2466 -1684 -3899
4369 -3899 -1217 3021 2352 -1524 -2771 261 3455 1901 -2630 -3292 1017 3551 917 -3169 -2818 1493
4385 1493 3357 100 -2778 -1163 2376 3047 -690 -3744 -1626 1909 2615 -642 -2415 -132 2375
4400 2375 1917 -2485 -2888 284 3944 1790 -2165 -2902 -61 2696 100 -3008 -1954 2622 3793 -8
4416 -8 -4048 -2623 1762 2836 -157 -2392 -363 2466 1699 -2019 -3309 -169 3698 2503 -1504 -2878
4432 -2878 -437 1993 723 -2378 -1684 1994 3597 226 -3683 -3204 1402 3313 993 -2157 -979
4447 -979 2009 1947 -1965 -3823 -696 3492 3074 -619 -3184 -685 1866 1272 -2068 -2291 1221 3865
4463 3865 1232 -3099 -3220 795 3399 1154 -1962 -1499 1419 1909 -1124 -3604 -864 3340 3941 -212
4479 -212 -3168 -1872 1382 1153 -1536 -1992 1277 3612 1616 -2998 -3603 -238 2890 2251 -855 -1001
4495 -1001 1165 2120 -1313 -3771 -1850 2249 3932 696 -2916 -2017 1604 1941 -875 -2218 226 3471
4511 3471 1849 -2394 -3845 -535 3273 2471 -699 -2063 322 1512 -923 -3522 -2019 1721 3890
4526 3890 1395 -2935 -2640 742 1825 -659 -2339 119 3221 2208 -1609 -3564 -904 2107 2444
4541 2444 -858 -2369 -22 2354 10 -3284 -2257 1439 3829 1432 -2271 -2213 488 1930 -20
4556 -20 -1902 -474 2426 2573 -1378 -4310 -2181 1983 2864 327 -1702 189 2198 567 -2798 -3191
4572 -3191 282 3686 1962 -1598 -2678 203 2119 188 -2335 -1007 2531 2914 -491 -3923 -2825
4587 -2825 1110 2818 347 -1661 -362 2213 1307 -2419 -3415 -143 3560 2570 -1027 -3104 -598 1575
4603 1575 547 -1801 -1093 2450 3799 26 -3417 -3302 699 2397 842 -1324 -363 1733 1550 -1826
4619 -1826 -3029 -470 3386 3068 -788 -2908 -1386 1246 706 -1464 -1333 2001 3711 871 -3438 -3580
4635 -3580 118 2236 938 -1248 -834 1612 1642 -1329 -3161 -1110 2745 3088 132 -2778 -1590 1143
4651 1143 1287 -1431 -1776 1284 3233 1466 -2202 -3546 -50 2532 1401 -1406 -1298 1195 1890 -613
4667 -613 -3343 -1261 2462 3751 557 -2329 -1861 811 854 -1198 -2103 641 3392 2221 -1608 -3441
4683 -3441 -818 2110 1508 -1106 -1453 835 2104 -137 -2692 -2018 2213 3534 674 -2369 -1762 502
4699 502 1390 -629 -1903 647 2908 2090 -1298 -3497 -2121 2135 1950 -301 -1208 623 1761 28
4715 28 -2767 -2775 1397 3478 1586 -1885 -2099 559 1266 -141 -2155 -621 2673 2513 -626 -3448 -1429
4732 -1429 1862 2292 -375 -1646 -198 1610 397 -2596 -2543 732 3382 2310 -1500 -2512 -2 1331
4748 1331 -101 -2007 -942 2222 3003 -430 -3233 -1791 1141 2154 58 -1825 -162 1929 1241
4763 1241 -1864 -2694 -28 2883 1987 -1480 -2606 -309 1588 501 -1737 -1251 1750 2835 55 -2986
4779 -2986 -2193 1066 2546 699 -1570 -528 1704 1392 -1443 -2698 -481 2570 2297 -599 -2173 -533
4795 -533 1656 671 -1674 -1581 1048 2720 808 -2351 -2294 692 2347 492 -1811 -1203 1439 1661 -603
4812 -603 -2532 -517 2315 2262 -684 -2632 -798 1431 1117 -1014 -1392 930 2725 1133 -1843 -2553
4828 -2553 157 1728 620 -1495 -1123 1470 2016 0 -2434 -1089 1470 2644 -436 -2061 -1108 1270
4844 1270 1156 -1399 -2040 285 2332 1667 -1571 -2271 164 1916 948 -1602 -1917 704 2057 -33
4860 -33 -1952 -1610 1571 2620 561 -2138 -1507 668 1419 -706 -1932 -188 2324 2226 -957 -2139 -726
4877 -726 1690 1367 -1435 -1753 546 2002 400 -2027 -1649 1036 2336 688 -1825 -1575 1125 1921
4893 1921 -376 -1879 -1057 1708 1952 -641 -2200 -444 2065 1815 -771 -2008 -440 1601 750 -1717
4909 -1717 -1855 695 2662 1204 -1577 -1573 746 1901 -227 -1820 -1246 1377 1850 -175 -1744 -1033 1455
4926 1455 1982 -409 -1842 -636 1808 1494 -903 -1586 202 1989 1639 -1075 -1921 602 2168 445
4942 445 -1740 -1808 631 1708 -42 -2140 -887 1307 2061 -21 -1627 -898 1127 1847 -548 -2052
4958 -2052 -342 2338 517 115 -845 238 1274 797 -1249 -2324 541 1769 543 -1627 -1111 1207
4974 1207 2011 110 -2103 -1225 1027 1569 -179 -1982 -497 1605 1383 -1012 -2125 -205 1999 1526
4990 1526 -919 -1910 -39 1627 753 -1599 -1730 653 2110 506 -1797 -1186 1059 2215 172 -1761
5006 -1761 -1101 1144 1139 -684 -1741 -421 2262 1820 -764 -2339 -531 1537 988 -911 -1510 673 1984
5023 1984 368 -1863 -1980 690 2373 748 -1275 -1135 1106 1207 -606 -1967 -683 1789 1942 -640
5039 -640 -1919 -926 1341 1275 -848 -1717 -36 1822 1047 -1576 -1780 257 2157 1070 -1074 -1117 734
5056 734 1537 -399 -1959 -1091 1706 2174 -192 -1985 -1132 1096 1190 -488 -1482 11 1713 733 -1379
5073 -1379 -2086 -337 1648 1474 -696 -1174 404 1468 97 -1792 -1367 1204 2323 270 -1857 -1549
5089 -1549 847 1322 -305 -1456 -129 1557 1111 -1289 -2467 -742 1559 1385 -368 -1325 -140 1296
5105 1296 508 -1436 -1442 903 2226 762 -1629 -1884 272 1361 182 -1183 -405 1849 1597 -918 -2466
5122 -2466 -1180 1222 1639 -5 -1257 -205 1071 443 -1485 -1656 441 2031 1073 -1629 -1779 -333
5138 -333 1225 423 -1093 -460 1273 1538 -134 -2023 -1296 816 1790 -45 -1407 -731 1145 968 -1062
5155 -1062 -1639 484 2285 1166 -1361 -2209 -427 932 464 -1008 -490 1108 1990 -115 -2056 -1712
5171 -1712 806 1823 613 -1243 -682 793 1148 -867 -1942 -285 1855 1668 -513 -1996 -1009 875
5187 875 548 -901 -664 1169 1877 459 -1799 -1890 442 1692 550 -954 -709 592 739 -605 -1652
5204 -1652 -384 1730 2060 -224 -1841 -1110 895 876 -683 -740 647 1839 593 -1841 -1935 208 1909
5221 1909 1014 -913 -1204 132 663 -725 -1912 -743 1532 2293 423 -1749 -1098 409 825 -529
5237 -529 -1005 302 1843 1102 -1386 -1739 -357 1687 1057 -214 -1209 106 675 -415 -1558 -1545 1024
5254 1024 2608 1393 -1336 -1774 487 1062 -355 -697 177 1322 1608 -1434 -2328 -188 1239 1261 96
5271 96 -1120 79 1011 -170 -1771 -1162 826 2423 803 -1480 -1209 63 886 -135 -1102 -189 1344
5288 1344 1317 -733 -1937 -761 1337 1690 -203 -1088 -106 697 448 -1571 -1560 518 2031 1107 -1332
5305 -1332 -1772 -216 1233 258 -999 -235 1434 1336 -675 -2216 -1279 931 1877 468 -562 -145 1197
5322 1197 244 -1207 -1648 228 1763 1139 -660 -1781 -392 983 415 -886 -477 938 1735 -56
5338 -56 -2117 -1358 791 1572 496 -1105 -433 771 542 -799 -1499 -16 1736 1497 -495 -1864 -695
5355 -695 877 651 -596 -652 1103 1681 215 -1631 -1892 343 1799 873 -661 -409 800 842 -855
5372 -855 -1491 -466 1616 1624 -19 -1272 -782 734 955 -743 -896 608 1751 768 -1288 -1574 85
5389 85 1884 817 -900 -1040 396 855 -296 -1372 -458 1666 1819 1 -1479 -1357 133 793 -622
5406 -622 -737 343 1644 949 -975 -1570 -193 1323 1002 -517 -916 218 1032 132 -1353 -1005 760
5423 760 1538 298 -1204 -703 636 863 -99 -1239 -262 1170 897 -694 -1657 -189 1760 1291 -309
5440 -309 -1092 61 737 154 -1309 -758 816 2004 771 -1088 -1195 30 705 24 -1157 -203 1386
5457 1386 1200 -383 -1648 -818 1099 1145 -58 -1052 -75 1084 403 -960 -1179 485 1393 698 -999
5474 -999 -1043 48 1173 26 -1414 -580 697 1065 -175 -1568 -773 1224 1311 -96 -916 -338 716
5491 716 287 -677 -1301 11 1622 845 -613 -1033 1 1081 307 -888 -619 448 1258 0 -1087
5508 -1087 -1219 929 1368 374 -709 -698 1296 316 -441 -1196 8 1226 1158 -612 -1090 -31 1204 572
5526 572 -673 -1075 288 1154 259 -1339 -1001 420 1350 279 -1053 -840 905 777 -384 -1167 -414
5543 -414 961 1275 17 -1097 -427 491 497 -505 -935 158 1440 463 -1014 -1298 109 1159 680 -951
5561 -951 -994 563 1562 -164 -1009 -244 738 999 -585 -1204 -1557 1288 1795 -411 -2131 -868 1564 176
5579 176 -1082 -1194 -24 1403 984 -1135 -701 269 1188 226 -617 -1085 328 1518 -241 -1598 -665
5596 -665 659 808 -37 -1000 -439 931 890 -603 -1002 -253 1161 747 -889 -1291 224 1135 534 -705
5614 -705 -932 387 1056 313 -1119 -792 657 1123 91 -954 -700 676 1018 -445 -1056 -313 886
5631 886 935 -477 -1151 -273 1052 629 -659 -1231 61 1293 365 -1011 -823 312 1151 145 -1149
5648 -1149 -797 257 1069 33 -1071 -387 747 738 -566 -1184 -240 755 1093 -218 -908 69 708 513
5666 513 -662 -812 280 1437 451 -1160 -947 261 1044 202 -836 -625 684 979 -328 -1476 -517
5683 -517 911 1055 -55 -851 -80 963 235 -504 -1163 221 1316 635 -873 -1123 271 770 123 -700
5701 -700 -683 594 864 -311 -1119 -858 895 1170 75 -793 -285 544 630 -448 -905 127 1398 1005
5719 1005 -647 -1374 -325 621 669 -583 -507 736 1177 1 -1220 -935 388 1358 349 -651 -740 628
5737 628 794 -345 -981 52 1101 780 -364 -1291 -341 826 811 -269 -781 324 1154 162 -1053 -1126
5755 -1126 350 1388 876 -788 -1019 29 472 -388 -928 -111 1075 1440 39 -1059 -742 443 748
5772 748 -467 -736 278 820 472 -421 -1156 95 847 675 -791 -776 77 671 35 -989 -654 738
5790 738 1270 91 -1061 -604 463 643 53 -749 -133 955 408 -897 -1460 -177 1127 1162 -237 -655
5808 -655 -80 362 -61 -1006 -764 427 1363 553 -617 -826 56 799 87 -604 -201 689 1084 -675 -1345
5827 -1345 -418 803 823 -118 -947 103 739 207 -831 -665 321 1254 577 -1042 -1390 -58 725 353
5845 353 -319 -268 889 725 -525 -1442 -1064 779 1320 409 -583 -235 585 220 -727 -722 208 974 903 -612
5865 -612 -1123 -358 716 486 -462 -219 600 1099 -94 -1072 -966 632 1191 279 -707 -458 474 472 -575
5884 -575 -910 109 841 815 -954 -1160 82 577 865 -676 -464 1053 967 -79 -1565 -1593 425 606
5902 606 726 -447 -870 407 964 -617 -571 185 1512 1071 -533 -1376 -936 1096 556 -381 -709 252
5920 252 609 55 -1407 -1005 404 1287 338 -579 -784 155 580 -238 -747 -393 879 917 -104 -1143 -826
5939 -826 290 614 102 -650 67 1045 355 -603 -1219 37 883 461 -426 -638 -16 413 -475 -746 -469
5958 -469 709 1409 175 -718 -828 538 945 -46 -588 18 835 670 -639 -1161 23 922 887 -220
5976 -220 -703 -20 695 39 -434 -323 661 1289 245 -825 -837 -6 616 86 -698 -265 654 576 -488 -1294
5996 -1294 -499 913 847 -33 -384 100 609 350 -789 -639 353 1203 471 -621 -734 158 683 159 -926
6015 -926 -349 491 806 -569 -980 -487 363 901 197 -556 -46 313 361 -571 -573 200 989 810 -577 -940
6035 -940 -168 855 540 -412 -408 745 811 -391 -1316 -614 707 795 103 -402 -169 87 535 -739 -960 -119
6055 -119 1065 836 -337 -720 -304 444 253 -272 -548 143 704 -288 -963 -878 411 1064 409 -523 -475 126
6075 126 233 -611 -811 -274 1075 857 -263 -938 -543 670 554 -258 -423 296 702 389 -773 -873 -72
6094 -72 893 660 -822 -370 333 674 -288 -766 -323 859 1110 -191 -815 -566 697 457 -188 -608 37
6113 37 887 325 -635 -803 -168 832 407 -321 -508 45 620 199 -695 -578 587 869 81 -928 -769
6132 -769 118 541 36 -344 -77 651 842 -190 -787 -327 635 586 -335 -409 -22 571 253 -606 -669 341
6152 341 1149 193 -712 -787 264 487 202 -552 -188 1029 611 -300 -681 -205 798 415 -173 -880 -115
6171 -115 579 362 -405 -488 65 895 310 -802 -850 210 719 -14 -439 -243 558 668 -93 -623 -415 601
6191 601 1012 122 -456 -224 467 544 -578 -586 212 1051 406 -372 -558 -52 674 121 -623 -566 412 705 149
6212 149 -568 -521 518 870 -206 -675 -520 515 690 -196 -605 222 699 462 -479 -698 45 1008 299
6231 299 -643 -989 -66 584 63 -925 -561 295 679 231 -639 -422 492 1002 -189 -814 -523 655 652 -229
6251 -229 -540 -74 763 678 -421 -680 -76 708 233 -467 -606 187 951 -172 -678 -777 165 615 -174 -753
6271 -753 -599 386 556 -97 -931 -382 451 749 -346 -682 -52 668 528 -613 -848 -85 649 255 -625
6290 -625 -717 330 959 297 -600 -894 71 583 -131 -589 -187 509 789 119 -806 -577 431 588 -555
6309 -555 -651 43 686 526 -581 -813 240 710 254 -376 -749 235 576 344 -753 -539 623 640 124
6328 124 -666 -192 577 698 -162 -1054 -421 375 624 -440 -771 86 954 386 -299 -781 -20 555 -70 -802
6348 -802 -542 380 936 532 -601 -534 142 640 -112 -450 -416 537 601 -399 -714 -295 807 783 -219 -698
6368 -698 -268 462 114 -633 -680 280 852 329 -700 -725 157 726 286 -339 -248 387 606 -148 -945 -353 698
6389 698 868 113 -675 -102 450 487 -511 -820 0 662 334 -798 -749 -60 876 337 -469 85 462 473 -384
6410 -384 -868 -371 534 1030 74 -649 -459 202 460 -284 -391 132 560 353 -377 -743 -175 552 787 -77
6430 -77 -253 326 407 -154 -737 -543 407 931 485 -592 -289 281 623 -181 -777 -259 806 744 -214 -767
6450 -767 -399 549 614 -171 -300 74 980 339 -577 -725 114 984 391 -616 -558 14 530 -32 -694 -243
6470 -243 520 1001 -339 -858 -437 429 482 -80 -421 132 646 500 -463 -907 -55 1060 664 -411 -607
6489 -607 103 293 -9 -466 -352 485 1086 255 -720 -525 186 514 39 -368 -186 644 432 -770 -936 -160
6509 -160 796 708 -364 -706 -25 542 -79 -641 -431 610 878 117 -893 -834 26 642 182 -398 -92 494
6529 494 705 60 -811 -318 820 799 88 -477 47 184 -23 -554 -387 360 1178 261 -534 -768 -201 479
6549 479 -85 -147 -280 338 303 -473 -866 -689 487 994 276 -579 -27 280 41 -183 -438 223 1468 1385
6569 1385 -562 -1103 -97 113 -623 -488 -868 -96 1801 -263 -821 -1214 425 1142 30 -397 -470 156
6587 156 -50 -541 -621 77 866 460 -380 -954 -249 585 313 -296 -283 281 638 -141 -879 -629 329 556 593
6608 593 -448 -714 84 560 -313 -628 122 699 502 -97 -802 -484 396 690 84 -476 171 290 319 -545
6628 -545 -894 164 726 262 -166 -595 281 474 19 -479 -331 657 885 -46 -763 -386 167 716 -116 -561
6648 -561 37 225 472 -337 -733 -7 678 468 -266 -598 -145 334 229 -775 -403 654 897 14 -701
6667 -701 -567 336 557 152 -398 11 813 240 -402 -1082 -153 819 713 -28 -998 -368 162 276 -470 -526
6687 -526 559 1092 162 -826 -526 63 595 4 -223 -207 584 458 -321 -668 -144 570 687 -53 -413 -181
6707 -181 580 541 -300 -753 -27 678 125 -488 -706 157 521 178 -212 -313 267 504 -170 -902 -184 656
6727 656 806 92 -489 -360 303 357 -506 -371 198 1139 766 -289 -690 125 415 176 -206 -474 249 488
6747 488 191 -600 -692 537 371 -61 -764 -433 249 349 -98 -671 46 685 645 -213 -1206 -186 345 401
6767 401 -269 -353 -56 479 144 -803 -671 312 1020 324 -396 -485 205 565 -164 -878 -243 426 400 -63 -460
6788 -460 -227 103 550 -295 -455 -127 455 206 -312 -735 -53 517 421 -461 -339 164 762 -73 -722 -363
6808 -363 551 760 -81 -623 -420 323 448 -108 -426 128 617 554 -476 -624 -11 906 507 -279 -657 143
6828 143 472 -54 -606 -666 177 760 248 -714 -307 229 542 56 -470 -313 606 504 -310 -767 -248 531
6848 531 359 -22 -657 -129 417 264 -393 -716 219 565 171 -691 -613 330 528 138 -699 -525 582 666
6868 666 -278 -957 -299 540 423 -366 -589 -77 580 488 -340 -463 37 651 213 -566 -571 -11 650 344 -441
6889 -441 -550 260 735 77 -499 -219 295 592 135 -747 -369 309 468 -43 -557 -67 380 68 -319 -568
6909 -568 -94 543 171 -435 -440 77 489 141 -423 -553 171 620 2 -463 -420 526 465 -222 -700 -399 422
6930 422 362 -158 -450 98 613 354 -627 -553 -132 632 296 -299 -454 65 271 175 -610 -343 377 736 61
6951 61 -660 -629 483 536 55 -507 -33 611 292 -240 -802 -152 527 277 -204 -529 84 457 234 -524 -678
6972 -678 426 690 102 -405 -480 266 395 -285 -567 -269 524 553 -377 -765 -290 317 594 -390 -441 -28 616
6993 616 239 -364 -656 91 433 117 -454 -780 -36 271 157 -537 -230 519 641 -296 -710 -491 316 560
$$ [...]
8191C17
##END NTUPLES=NMR FID
##END=
