##TITLE=1H_SA_sl.BCutBu
 CDCl3, 8 sc, 
 18.12.2020
##JCAMPDX= 6.0         $$ Bruker NMR JCAMP-DX V2.0
##DATA TYPE= NMR FID
##DATA CLASS= NTUPLES
##ORIGIN= UXNMR, Bruker Analytische Messtechnik GmbH
##OWNER= root
$$ XWIN-NMR		Version 3.5
$$ Fri Dec 18 11:49:58 2020 Russian Standard Time (UT+4h)  she@DPX200
##.OBSERVE FREQUENCY= 200.1315066352
##.OBSERVE NUCLEUS= ^1H
##.DELAY= (6, 6)
##.ACQUISITION MODE= SIMULTANEOUS
##.ACQUISITION SCHEME= undefined
##.AVERAGES= 8
##.DIGITISER RES= 18
##SPECTROMETER/DATA SYSTEM= spect
##.PULSE SEQUENCE= zg30
##.SOLVENT NAME= CDCl3
##.SHIFT REFERENCE= (INTERNAL, CDCl3, 0, 15.7039)
##AUDIT TRAIL= $$ (NUMBER, WHEN, WHO, WHERE, WHAT)
$$ ##TITLE= Audit trail, XWIN-NMR		Version 3.5
$$ ##JCAMPDX= 5.01
$$ ##ORIGIN= Bruker BioSpin GmbH
$$ ##OWNER= she
$$ F:/spectra/data/she/nmr/H-F/1/audita.txt
$$ ##AUDIT TRAIL=  $$ (NUMBER, WHEN, WHO, WHERE, WHAT)
(   1,<2020-12-18 11:46:25.90 +0400>,<she>,<DPX200>,
      <created by zg, POWCHK disabled, PULCHK disabled
       configuration hash MD5:
       00 E9 B6 7A A2 85 ED C7 34 08 36 98 17 FE 4E 26
       data hash MD5: 16K
       95 C9 0D F4 93 AC E7 53 BD 5B 96 AE B3 77 8B E8>)
$$ ##END=
$$ 
$$ hash MD5
$$ B6 45 33 F1 A3 50 3C B0 E6 5D 63 EF E3 7C 14 4E
##$RELAX= 
##$RELAX= 
##$RELAX= 
##$RELAX= 
##$RELAX= 
##$RELAX= 
$$ Bruker specific parameters
$$ --------------------------
##$DU= <F:/spectra>
##$EXPNO= 1
##$NAME= <H-F>
##$PROCNO= 1
##$TYPE= <nmr>
##$USER= <she>
##$AMP= (0..31)
100 100 100 100 100 100 100 100 100 100 100 100 100 100 100 100 100 100 
100 100 100 100 100 100 100 100 100 100 100 100 100 100 
##$AQSEQ= 0
##$AQ_mod= 1
##$AUNM= <au_zg>
##$AUTOPOS= <>
##$BF1= 200.13
##$BF2= 200.13
##$BF3= 200.13
##$BF4= 200.13
##$BF5= 200.13
##$BF6= 200.13
##$BF7= 200.13
##$BF8= 200.13
##$BYTORDA= 1
##$CFDGTYP= 0
##$CFRGTYP= 5
##$CHEMSTR= <none>
##$CNST= (0..31)
1 1 145 1 1 1 1 1 1 1 1 1 1 1 1 1 1 1 1 1 1 1 1 1 1 1 1 1 1 1 1 1 
##$CPDPRG= <>
##$CPDPRG1= <>
##$CPDPRG2= <>
##$CPDPRG3= <>
##$CPDPRG4= <mlev>
##$CPDPRG5= <mlev>
##$CPDPRG6= <mlev>
##$CPDPRG7= <mlev>
##$CPDPRG8= <mlev>
##$CPDPRGB= <>
##$CPDPRGT= <>
##$D= (0..31)
0 1.2 0 0 0 0 0 0 0 0.06 0 0.03 0 0 0 0 0.0002 0 0 0 0 0 0 0 0 0 0 0 0 
0 0 0 
##$DATE= 1608277585
##$DBL= (0..7)
120 120 120 120 120 120 120 120 
##$DBP= (0..7)
150 150 150 150 150 150 150 150 
##$DBP07= 0
##$DBPNAM0= <>
##$DBPNAM1= <>
##$DBPNAM2= <>
##$DBPNAM3= <>
##$DBPNAM4= <>
##$DBPNAM5= <>
##$DBPNAM6= <>
##$DBPNAM7= <>
##$DBPOAL= (0..7)
0.5 0.5 0.5 0.5 0.5 0.5 0.5 0.5 
##$DBPOFFS= (0..7)
0 0 0 0 0 0 0 0 
##$DE= 6
##$DECBNUC= <off>
##$DECIM= 32
##$DECNUC= <off>
##$DECSTAT= 4
##$DIGMOD= 1
##$DIGTYP= 9
##$DL= (0..7)
0 120 120 120 120 120 120 120 
##$DP= (0..7)
150 150 150 150 150 150 150 150 
##$DP07= 0
##$DPNAME0= <>
##$DPNAME1= <>
##$DPNAME2= <>
##$DPNAME3= <>
##$DPNAME4= <>
##$DPNAME5= <>
##$DPNAME6= <>
##$DPNAME7= <>
##$DPOAL= (0..7)
0.5 0.5 0.5 0.5 0.5 0.5 0.5 0.5 
##$DPOFFS= (0..7)
0 0 0 0 0 0 0 0 
##$DQDMODE= 0
##$DR= 18
##$DS= 0
$$ [...]
##$SUBNAM2= <"">
##$SUBNAM3= <"">
##$SUBNAM4= <"">
##$SUBNAM5= <"">
##$SUBNAM6= <"">
##$SUBNAM7= <"">
##$SUBNAM8= <"">
##$SUBNAM9= <"">
##$SW= 16.9725356469052
##$SWIBOX= (0..15)
0 0 2 0 0 0 0 0 0 0 0 0 0 0 0 0 
##$SW_h= 3396.73913043478
##$TD= 16384
##$TD0= 1
##$TE= 0
##$TE2= 300
##$TE3= 300
##$TEG= 300
##$TL= (0..7)
0 120 120 120 120 120 120 120 
##$TP= (0..7)
150 150 150 150 150 150 150 150 
##$TP07= 0
##$TPNAME0= <>
##$TPNAME1= <>
##$TPNAME2= <>
##$TPNAME3= <>
##$TPNAME4= <>
##$TPNAME5= <>
##$TPNAME6= <>
##$TPNAME7= <>
##$TPOAL= (0..7)
0.5 0.5 0.5 0.5 0.5 0.5 0.5 0.5 
##$TPOFFS= (0..7)
0 0 0 0 0 0 0 0 
##$TUNHIN= 0
##$TUNHOUT= 0
##$TUNXOUT= 0
##$USERA1= <user>
##$USERA2= <user>
##$USERA3= <user>
##$USERA4= <user>
##$USERA5= <user>
##$V9= 5
##$VALIST= <valist>
##$VCLIST= <CCCCCCCCCCCCCCC>
##$VD= 0
##$VDLIST= <DDDDDDDDDDDDDDD>
##$VPLIST= <PPPPPPPPPPPPPPP>
##$VTLIST= <TTTTTTTTTTTTTTT>
##$WBST= 1024
##$WBSW= 4
##$XGAIN= (0..3)
0 0 0 0 
##$XL= 0
##$YL= 0
##$YMAX_a= 275912
##$YMIN_a= -276869
##$ZGOPTNS= <>
##$ZL1= 120
##$ZL2= 120
##$ZL3= 120
##$ZL4= 120
##$ABSF1= 10
##$ABSF2= 0
##$ABSG= 5
##$ABSL= 3
##$ALPHA= 0
##$AQORDER= 0
##$ASSFAC= 0
##$ASSFACI= 0
##$ASSFACX= 0
##$ASSWID= 0
##$AUNMP= <proc_1d>
##$AZFE= 0.1
##$AZFW= 0.1
##$BCFW= 1
##$BC_mod= 2
##$BYTORDP= 1
##$COROFFS= 0
##$CY= 11.3945322036743
##$DATMOD= 1
##$DC= 2
##$DFILT= <>
##$DTYPP= 0
##$F1P= 15.9154993809931
##$F2P= -4.1035820241983
##$FCOR= 0.5
##$FTSIZE= 0
##$FT_mod= 4
##$GAMMA= 1
##$GB= 0.15
##$INTBC= 1
##$INTSCL= 1
##$ISEN= 128
##$LB= 0.24
##$LEV0= 0
##$LPBIN= 0
##$MAXI= 10000
##$MC2= 0
##$MEAN= 0
##$ME_mod= 0
##$MI= 1.114404
##$NCOEF= 0
##$NC_proc= 0
##$NLEV= 6
##$NOISF1= 3.799351
##$NOISF2= 2.8
##$NSP= 1
##$NTH_PI= 0
##$NZP= 0
##$OFFSET= 15.70392
##$PC= 1
##$PHC0= -10760.16
##$PHC1= 9.800947
##$PH_mod= 1
##$PKNL= yes
##$PPARMOD= 0
##$PSCAL= 0
##$PSIGN= 0
##$REVERSE= no
##$SF= 200.130013532006
##$SI= 16384
##$SIGF1= 3
##$SIGF2= 2
##$SINO= 400
##$SIOLD= 16384
##$SREGLST= <1H.CDCl3>
##$SSB= 0
##$STSI= 0
##$STSR= 0
##$SW_p= 3612.71676300578
##$SYMM= 0
##$S_DEV= 0
##$TDeff= 0
##$TDoff= 0
##$TI= <>
##$TILT= no
##$TM1= 0
##$TM2= 0
##$TOPLEV= 0
##$USERP1= <user>
##$USERP2= <user>
##$USERP3= <user>
##$USERP4= <user>
##$USERP5= <user>
##$WDW= 1
##$XDIM= 8192
##$YMAX_p= 0
##$YMIN_p= 0
$$ End of Bruker specific parameters
$$ ---------------------------------
##NTUPLES= NMR FID
##VAR_NAME=  TIME,          FID/REAL,        FID/IMAG
##SYMBOL=    X,             R,               I
##VAR_TYPE=  INDEPENDENT,   DEPENDENT,       DEPENDENT
##VAR_FORM=  AFFN,          ASDF,            ASDF
##VAR_DIM=   8192,          8192,            8192
##UNITS=     SECONDS,       ARBITRARY UNITS, ARBITRARY UNITS
##FACTOR=    0.0002944,     1,               1
##FIRST=     0,             0,               0
##LAST=      2.4114304,     0,               0
##MIN=       0,             -276869,         0
##MAX=       2.4114304,     275912,          0
$$ Real data points
##PAGE= N=1
##DATA TABLE= (X++(R..R)), XYDATA
$$ plain form
0 0 0 0 0 0 0 0 0 0 0 0 0 8 -8 8 -8 8 -16 16 -16 24 -24 32 -40 48 -56 64 -72 86 -96 112 -128 145 -166 189
34 189 -213 238 -269 301 -335 375 -416 464 -513 569 -628 693 -766 845 -931 1027 -1131 1245
52 1245 -1373 1516 -1674 1854 -2059 2296 -2569 2892 -3284 3764 -4372 5170 -6266 7878 -10493
67 -10493 15454 -28266 136565 247323 -21929 -178323 -276869 -269051 -156018 80828 246427
78 246427 275912 179807 44153 -125269 -220058 -185231 -71078 34484 124228 137538 75409
89 75409 -13145 -71734 -82429 -44965 10461 68534 76404 25293 -31270 -68003 -90687 -59398
101 -59398 17201 82056 98947 79961 37543 -31376 -96619 -97870 -61491 -33111 17608 77952
113 77952 87664 67146 46673 3589 -58566 -96531 -87933 -52048 -2951 63588 105597 81923
$$ packed form
0@%%%%%%%%%%%Qj6J6j6J6k4L2l2M0m8N6p2Q8j04J20j36J58j82K08k40K73l11L55
34A89m02M51n07N70o36P10p91Q80r77J082j197J321j459J611j776J958k158K376
52A245k618K889l190L528l913M355m865N461o176P048q136R542j1436J4144j8371
67a0493K5947m3720J64831J10758k69252j56394r8546P818J13033K36846J65599
78B46427K9485r6105j35654j69422r4789L4827J14153J05562Q9744J3310o2129
89G5409q8554n8589j0695L7464N5426N8073P870n1111n6563l6733k2684L1289
101e9398P6599O4855J6891j8986m2418o8919o5243j251L6379K8380N0719O0344
113G7952R712k0518k0473m3084o2155l7965Q598L5885M9097O6539M2009k3674
$$ plain form
125 81923 30087 -19888 -67628 -77116 -34572 14964 38465 28765 -1438 -33600 -47678 -13168
137 -13168 55502 94191 79634 24386 -63878 -139340 -140921 -59411 56371 141361 162520 106170
149 106170 -20202 -134392 -157987 -105734 -11227 93952 142410 98771 5479 -71802 -99879
160 -99879 -75932 -5825 69315 85670 44043 -8814 -56598 -76625 -42782 15428 53697 59655
172 59655 36997 717 -35237 -47782 -26334 -2375 8095 17425 16509 2907 -1151 6815 12737
185 12737 6883 -5873 -15935 -27687 -31871 -8398 21455 33446 39044 30837 -627 -30638 -39394
198 -39394 -31314 -16516 2762 24419 27634 11675 6444 5828 -4828 -6423 -1906 -11338 -21595 -17948
212 -17948 -2187 14868 27158 34600 22288 -15194 -41166 -41703 -28838 4027 45308 59912 37762
$$ packed form
125H1923n1836m9975m7740r488M2544M9536K3501r700l0203l2162j4078L4510
137a3168O8670L8689j4557n5248q8264p5462j581Q1510J15782Q4990K1159n6350
149A06170j26372j14190k3595N2253R4507J05179M8458m3639r3292p7281k8077
160i9879K3947P0107P5140J6355m1627n2857m7784k0027L3843N8210L8269N958
172E9655k2658l6280l5954j2545K1448K3959J0470R330r16j3602m058P966N922
185A2737n854j2756j0062j1752m184K3473K9853J1991N598q207l1464l0011q756
198c9394Q080J4798J9278K1657L215j5959n231o16j0656j595M517r432j0257L647
212a7948J5761J7055J2290P442j2312l7482k5972n37J2865L2865M1281J4604k2150
$$ plain form
225 37762 -6329 -47926 -65965 -52726 -2774 57622 79089 57800 11033 -52687 -91799 -73703
237 -73703 -14727 51129 89260 80223 27064 -47207 -91802 -76488 -25747 36340 84856 78226
249 78226 23656 -36693 -72925 -67985 -24390 31721 67895 57437 13365 -28262 -55708 -52399
261 -52399 -10073 34044 50818 42666 12382 -24413 -46893 -42785 -14196 13105 26590 32913 22664
274 22664 -465 -10606 -11725 -15425 -13389 -7085 -999 4113 11178 21550 19569 236 -15002 -23830
288 -23830 -29015 -11472 19543 37116 34106 12160 -19502 -45631 -49381 -17929 27440 54428 56976
301 56976 31658 -21377 -64216 -67039 -37470 12027 56131 71085 46009 -7159 -51330 -62217
313 -62217 -43699 57 47453 60116 36737 -3461 -41991 -55471 -35982 6129 44398 51914
$$ packed form
225C7762m4091m1597j8039J3239M9952O0396K1467k1289m6767o3720l9112J8096
237g3703N8976O5856L8131r037n3159p4271m4595J5314N0741O2087M8516o630
249G8226n4570o0349l6232M940M3595N6111L6174j0458m4072m1627k7446L309
261e2399M2326M4117J6774q152l0284l6795k2480M108K8589K7301J3485O323j0249
274B2664k3129j0141j119l700K036O304O086N112P065J0372j981j9333j5238q828
288b3830n185J7543L1015J7573l010k1946l1662k6129l750L1452M5369K6988K548
301E6976k5318n3035m2839k823K9569M9497M4104J4954k5076n3168m4171j0887
313f2217J8518M3756M7396J2663k3379m0198l8530j3480J9489M2111L8269P516
$$ plain form
325 51914 30253 -5413 -43557 -55201 -29055 10131 41570 52553 33315 -5374 -40037 -50495
337 -50495 -30947 -803 26890 43319 30245 251 -18481 -26330 -22166 -2688 15535 20313 10630
350 10630 -2663 -9006 -12309 -8291 6467 12336 6241 2410 -1445 -6642 -5656 -1325 2164 128 -5340
365 -5340 -1265 1881 4037 11909 13666 2092 -10532 -15867 -17142 -9939 4814 19631 21127 8969
379 8969 -3785 -14066 -19888 -9240 9815 17728 14492 2136 -15253 -25277 -18250 5037 27456
392 27456 32490 21232 -5181 -37079 -48394 -29186 4215 40919 59235 44942 4253 -40917
404 -40917 -63934 -52646 -16274 31223 64115 55020 18400 -23233 -54036 -53053 -19099 24472 50996
417 50996 45386 14444 -23336 -50908 -46818 -10936 26001 47799 46921 17889 -21603 -45314 -43638
$$ packed form
325E1914k1661l5666l8144j1644K6146L9186L1439J0983j9238l8689l4663j0458
337e0495J9548L0144K7693J6429j3074k9994j8732p849M164J9478J8223M778r683
350A0630j3293o343l303M018J4758N869o095l831l855n197R86M331L489k036n468
365e340M075L146K156P872J757j1574j2624n335j275P203J4753J4817J496j2158
379H969j2754j0281n822J0648J9055P913l236j2356j7389j0024P027K3287K2419
392B7456N034j1258k6413l1898j1315J9208L3401L6704J8316j4293m0689m5170
404d0917k3017J1288L6372M7497L2892r095l6620m1633l0803R83L3954M3571K6524
417E0996n610l0942l7780k7572M090L5882L6937K1798q78k9032l9492k3711J676
$$ plain form
430 -43638 -19763 8272 29383 36118 20357 -1913 -11328 -14151 -12103 -3218 1116 -1509 -4116 -1762
444 -1762 5557 10370 9605 7246 -2605 -13367 -11023 -2501 4176 9589 6954 -3576 -12352 -12108 936
459 936 16890 22821 18643 -887 -29138 -41190 -30780 -3752 31665 54619 49124 17415 -26319
472 -26319 -56244 -58589 -33496 12077 51086 57931 38130 1090 -37605 -52222 -36120 -2686
484 -2686 29145 41240 30301 1421 -30264 -39944 -23934 1783 28922 43860 30581 -130
496 -130 -28621 -43137 -36440 -13121 17391 38531 35942 18571 -1316 -20427 -26931 -16260 -2503
509 -2503 5442 7076 3153 -509 -1984 4410 14923 14087 3203 -8599 -22084 -27580 -14900 6478
523 6478 23948 29929 21958 4129 -16476 -27076 -19777 -7078 4427 13054 11584 2933 -677 571
$$ packed form
430d3638K3875K8035K1111O735j5761k2270r415k823K048Q885M334k625k607K354
444a762P319M813p65k359r851j0762K344Q522O677N413k635j0530q776K44J3044
459I36J5954N931m178j9530k8251j2052J0410K7028L5417K2954n495l1709m3734
472b6319k9925k345K5093M5573L9009O845j9801l7040l8695j4617J6102L3434
484b686L1831J2095j0939k8880l1685r680J6010K5717K7139J4938j3279l0711
496a30k8491j4516O697K3319L0512K1140k589j7371j9887j9111o504J0671J3757
509b503P945J634l923l662j475O394J0513q36j0884j1802j3485n496J2680K1378
523F478J7470N981p971j7829k0605j0600P299J2699J1505Q627j470q651l610J248
$$ plain form
537 571 3848 5452 1956 -5666 -14801 -17388 -6436 8192 17899 20701 10719 -8007 -19825 -18654
551 -18654 -5397 11289 21255 17125 -1076 -22533 -28610 -16543 5666 31785 41967 25605 -6910
564 -6910 -37431 -49841 -35827 -2151 35447 53010 39352 7978 -25329 -46661 -38954 -8733
576 -8733 21781 38260 31954 7745 -20202 -35973 -27177 -2338 20059 32726 26954 2336 -22469
589 -22469 -33047 -26156 -4648 19464 33423 30713 9519 -14523 -29094 -32379 -18518 5325 22878
602 22878 28205 21649 5149 -11513 -21644 -20321 -9408 938 9040 14968 11666 4974 918 -5130
616 -5130 -10544 -10280 -7388 -1079 6711 12743 14154 5252 -7796 -15744 -18357 -10855 8283 23260 26000
631 26000 15726 -5379 -26066 -34656 -24772 1370 26725 36980 30500 5319 -24794 -38431 -30328
$$ packed form
537E71L277J604l496p622r135k587J0952J4628R707K802r982j8726j1818J171
551a8654J3257J6686R966m130j8201k1457o077J2067K2209K6119J0182j6362l2515
564f910l0521j2410J4014L3676L7598J7563j3658l1374l3307k1332P707L0221
576h733L0514J6479o306k4209k7947j5771Q796K4839K2397J2667n772k4618k4805
589b2469j0578O891K1508K4112J3959k710k1194k4042j4571l285J3861K3843J7553
602B2878N327o556j6500j6662j0131J323J0913J0346Q102N928l302o692m056o048
616e130n414K64K892O309P790O032J411q902j3048p948k613P502J9138J4977K740
631B6000j0274k1105k0687q590R884K6142K5355J0255o480k5181l0113j3637Q103
$$ plain form
644 -30328 -7169 21230 37229 31487 7279 -22093 -35047 -27964 -7570 19911 34501 24780 2485
657 2485 -19411 -30371 -20498 1701 22912 29841 15675 -6286 -23941 -30316 -15411 9435 26170
670 26170 28243 15229 -7817 -24516 -26925 -13709 6356 18834 21006 12649 -4598 -15121 -14048
683 -14048 -6589 3966 11776 10440 2314 -6727 -11322 -6951 -714 5621 10489 5964 -672 -3416 -4746
698 -4746 -3051 1391 3286 1118 -2859 -3986 -1750 2791 6267 8198 1839 -7371 -9601 -8979 -1942
713 -1942 8949 15106 12684 1345 -12041 -17012 -14482 -3180 13133 21152 15390 2148 -13697
726 -13697 -23160 -18026 -1626 17022 25691 19140 2552 -17614 -29989 -23099 -3064 18237 31331
739 31331 27132 6780 -17558 -33472 -29618 -9903 13897 31943 31395 11947 -11823 -27917 -29424
$$ packed form
644c0328K3159K8399J5999n742k4208k9372j2954P083K0394K7481J4590r721k2295
657B485k1896j0960R873K2199K1211O929j4166k1961j7655o375J4905K4846J6735
670B6170K073j3014k3046j6699k409J3216K0065J2478K172q357j7247j0523J073
683a4048P459J0555P810j336q126r041m595M371O237O335M868m525o636k744j330
698d746J695M442J895k168l977j127K236M541L476J931o359r210k230O22P037
713a942J0891O157k422j1339j3386m971K530J1302J6313Q019n762j3242j5845
726a3697r463N134J6400J8648Q669o551j6588k0166j2375O890K0035K1301J3094
739C1331m199k0352k4338j5914L854J9715K3800J8046n48j9448k3770j6094j507
$$ plain form
752 -29424 -13085 10187 25985 26388 11593 -8400 -23087 -25188 -11657 7602 19589 21361 11899
765 11899 -4144 -15468 -16783 -9184 2279 10510 12619 7439 -2398 -8093 -7925 -5500 144 5364
779 5364 5329 2904 1496 32 -9 -1180 -2234 -2785 -5107 -3410 3021 6822 8412 6824 -1406 -10349
795 -10349 -13765 -9062 2067 12095 16540 12982 -1699 -16236 -19803 -13662 1129 17933 23883
808 23883 16173 -1045 -19192 -25504 -18084 -714 19227 26495 17911 765 -17678 -26550 -18148
821 -18148 709 18629 26253 17878 287 -18554 -27834 -19296 -1100 16263 25891 20107 2176
834 2176 -14117 -21576 -16372 -1555 12791 19103 12557 -2478 -13484 -16639 -11012 3551 15688
847 15688 16983 9864 -2714 -13586 -16125 -10206 893 10474 11688 8597 2310 -5747 -7830 -4822
$$ packed form
752b9424J6339K3272J5798M03j4795j9993j4687k101J3531J9259J1987J772r462
765A1899j6043j1324j315P599J1463Q231K109n180r837n695J68K425N644N220
779E364l5k425j408j464m1j171j054n51k322J697O431L801J590j588q230q943
795a0349l416M703J1129J0028M445l558j4681j4537l567O141J4791J6804N950
808B3883p710j7218j8147o312P420J7370J9941P268q584j7146j8443q872Q402
821a8148J8857J7920P624q375j7591j8841r280Q538J8196J7363R628n784j7931
834B176j6293p459N204J4817J4346O312o546j5035j1006l155N627J4563J2137
847A5688J295p119j2578j0872k539N919J1099R581J214l091o287q057k083L008
$$ plain form
861 -4822 -2382 694 1903 1261 1130 923 2259 4114 619 -2609 -4195 -5469 -2945 3501 7100 7349
877 7349 3065 -4186 -8980 -9834 -3853 6385 11710 10046 3765 -7612 -15158 -12644 -2286 10774
891 10774 18629 15528 3957 -11554 -22218 -18769 -6142 9586 21767 20373 7239 -7941 -18926
904 -18926 -18312 -6574 7996 17809 15867 3403 -10154 -18483 -15596 -1920 12936 20349 17054 3333
918 3333 -13089 -22469 -19643 -5590 11153 21121 21071 9392 -7787 -18348 -18802 -10170 3397 13598
932 13598 15821 8829 -2506 -9663 -11072 -7293 1311 8135 8146 4616 -169 -5295 -6303 -4411 -144
947 -144 3007 3461 3711 2973 -321 -1846 -3048 -5042 -5022 -1859 2245 7049 9416 7646 2480 -7005 -13168
964 -13168 -12812 -7162 3215 13656 15816 10364 -731 -12075 -16382 -11857 -97 12431 16543 11208
$$ packed form
861d822K440L076J209o42j31k07J336J855l495l228j586j274K524O446L599K49
877G349m284p251m794q54N981J0238N325j664o281j1377p546K514J0358J3060
891A0774P855l101j1571j5511j0664L449J2627J5728J2181j394j3134j5180j0985
904a8926O14J1738J4570R813j942j2464j3557q329K887J3676J4856P413l295j3721
918C333j6422r380K826J4053J6743R968n0j1679j7179j0561m54Q632J3567J0201
932A3598K223o992j1335p157j409L779Q604O824J1l530m785n126j008J892M267
947a44L151M54K50p38l294j525j202j994K0L163M104M804K367j770n166r485o163
964a3168L56N650J0377J0441K160n452j1095j1344m307M525J1760J2528M112n335
$$ plain form
978 11208 -451 -13757 -18860 -11997 1552 15556 21309 14203 -1249 -16544 -23043 -15761 -813
991 -813 15142 23819 17354 1932 -12556 -20872 -16651 -2958 11022 17830 14401 2602 -8945 -15463
1005 -15463 -12848 -2029 9083 12319 10099 838 -7418 -10818 -6971 1920 7397 7758 4028 -2299
1019 -2299 -8735 -7166 -2688 2299 6893 6217 2151 -2308 -4811 -3197 -155 1727 1981 779 -2790
1034 -2790 -2808 -370 1761 4480 4024 33 -3231 -4996 -3229 1130 3912 4687 2244 -3648 -6004 -4136
1050 -4136 -109 6088 9104 5699 -1296 -9276 -12317 -7848 649 10355 15707 11203 207 -10338
1064 -10338 -16898 -13435 -1521 10892 17973 14841 2812 -10145 -18915 -16415 -3920 9497 17843
1077 17843 17080 5633 -8616 -16935 -15782 -5044 8231 16267 15844 4630 -9363 -16423 -15800 -5965
$$ packed form
978A1208j1659j3306n103O863J3549J4004N753p106j5452j5295o499P282J4948
991h13J5955Q677o465j5422j4488q316M221J3693J3980O808l429j1799j1547o518
1005a5463K615J0819J1112L236k220r261q256l400L847Q891N477L61l730o327
1019b299o436J569M478M987M594o76m066m459k503J614L042J882K54j202l569
1034b790j8K438K131K719m56l991l264j765J767M359K782P75k443n892k356J868
1050d136M027O197L016l405o995p980l041M469Q497R706N352m504j0996j0545
1064a0338o560L463J1914J2413P081l132j2029j2957q770K500J2495J3417Q346
1077A7843p63j1447j4249q319J153J0738J3275Q036m23j1214j3993p060O23R835
$$ plain form
1091 -5965 7934 16859 16130 7198 -5788 -14373 -15312 -8634 2969 11622 12367 8017 -234 -7750 -9189
1106 -9189 -5843 -364 4656 5498 3683 336 -2512 -2678 -1277 -826 283 391 72 1228 2421 2445 743
1123 743 -2864 -5722 -6069 -2610 3986 9650 9269 4769 -4047 -12179 -13378 -6915 3680 13698 16137
1138 16137 9839 -1998 -14272 -17976 -11621 -140 11913 17899 12411 1178 -10228 -15627 -10996
1151 -10996 -914 9639 14319 9016 -792 -9828 -14584 -9510 1724 11347 14660 9894 -760 -10273
1165 -10273 -14975 -10342 79 9315 13092 10016 903 -8153 -11298 -8713 -780 7120 9562 7753
1179 7753 333 -6799 -8657 -6040 -174 6346 8163 5117 -223 -5685 -6970 -4197 531 5048 5788
1194 5788 2713 -988 -4374 -5037 -1942 1251 2933 3345 1457 -537 -950 -472 1269 1080 -1400 -2962
$$ packed form
1091e965J3899Q925p29q932j2986q585r39O678J1603Q653P45m350q251p516j439
1106i189L346N479N020Q42j815l347k848j66J401M51J109J08l19J156J193K4j702
1123G43l607k858l47L459O596N664l81m500q816q132j199O463J0595J0018K439
1138A6137o298j1837j2274l704O355J1481J2053N986n488j1233j1406n399M631
1151a0996J0082J0553M680n303r808r036m756N074J1234R623L313m766j0654r513
1165a0273m702M633J0421R236L777l076r113r056l145K585P933P900K442j809
1179G753p420p132j858K617N866O520J817l046n340n462j285K773M728M517P40
1194E788l075l701l386o63L095L193J682M12j888j994m13M78J741j89k480j562
$$ plain form
1210 -2962 -3922 -3270 2007 6291 6827 4482 -1422 -7143 -8281 -4453 2765 8907 8325 3589 -4103 -10782
1226 -10782 -9906 -2630 6238 12782 11199 2538 -7884 -14920 -12754 -2359 8695 15781 14515 3241
1240 3241 -9321 -16289 -14635 -3840 8888 16540 15030 4268 -8847 -16044 -15047 -5242 7715 14790
1254 14790 14077 5584 -6154 -12827 -11888 -4851 5256 10268 9612 3219 -5482 -9994 -8680 -2637 4034
1269 4034 9101 8402 3172 -2011 -6747 -7371 -3588 -143 3859 5481 2563 1083 -869 -2087 -2282 -1932
1285 -1932 -1763 -620 885 2375 2936 2425 1741 -1777 -5909 -4948 -2324 1335 5210 6058 3712 -1576
1301 -1576 -6741 -8224 -4109 1360 8105 9763 5508 -1540 -9494 -11972 -7421 2362 10849 13514 8225
1316 8225 -1327 -10330 -15465 -10809 -1028 9815 15140 12558 2371 -7414 -13495 -11595 -2894 6667
$$ packed form
1210b962r60O52N277M284N36k345n904n721j138L828P218O142n82m736p692o679
1226a0782Q76P276Q868O544j583q661j0422p036K166J0395J1054P086j266j1274
1240C241j2562o968J654J0795J2728P652j510j0762j3115p197R97R805J2957P075
1254A4790p13q493j1738o673R39P037J0107N012o56o393q701m512J314O043O671
1269D034N067o99n230n183m736o24L783L445M002J622k918j480j952j218j95L50
1285a932J69J143J505J490N61n11o84l518m132R61K624L659L875Q48k346n288
1301a576n165j483M115N469O745J658m255p048p954k478M551R783Q487K665n289
1316H225r552r003n135M656R781J0843N325k582j0187r785o081J900Q701R561
$$ plain form
1330 6667 12144 10162 2063 -6751 -11323 -9243 -1196 7106 11367 8814 983 -7347 -11236 -8825 -1712
1345 -1712 7098 10138 7578 1837 -5763 -9186 -7330 -2021 3870 6980 5527 2054 -2347 -4417 -3136
1360 -3136 -988 1567 2525 1329 -537 -1309 -1012 279 1558 1236 423 -1318 -2539 -890 728 1749
1376 1749 2430 314 -1882 -3287 -2055 1551 5049 5590 3189 -2111 -6425 -8490 -5164 1542 7740
1391 7740 9848 6234 -410 -7674 -9513 -5789 832 7084 8909 3760 -2991 -8063 -8381 -2442 5719
1406 5719 10032 9231 2524 -6731 -11343 -10456 -1796 6985 12130 10790 2564 -7692 -12580 -10539 -2419
1421 -2419 6720 12403 10748 2396 -6674 -12688 -9605 -3552 5208 11165 9500 3674 -4316 -9396 -8954
1436 -8954 -3756 3014 7925 7552 4150 -1057 -5815 -6337 -4381 -1216 2935 5445 4844 3699 836 -1675
$$ packed form
1330F667N477j982q099q814m572K080Q047Q302M261k553p831q330l889K411P113
1345a712Q810L040k560n741p600l423J856N309N891L110j453l473m401k070J281
1360c136K148K555R58j196j866p72K97J291J279l22q13j741j221J649J618J021
1376A749O81k116k196j405J232L606L498N41k401n300m314k065L326O706O198
1391G740K108l614o644p264j839L724O621O252J825n149o751n072l18N939Q161
1406E719M313q01o707r255m612Q87Q660Q781N145j340q226j0256m888K041Q120
1421b419R139N683j655q352r070o014L083O053Q760N957j665n826p990n080M42
1436h954N198O770M911l73l402n207m758n22J956L165M151K510o01j145k863k511
$$ plain form
1452 -1675 -2849 -4127 -4446 -1449 1280 4320 5922 4301 462 -3083 -6247 -5059 -2422 2103 5930
1467 5930 6199 2171 -1466 -6288 -7335 -3943 1353 6967 9471 5547 -714 -7121 -10700 -7588 -380
1482 -380 7056 11478 9505 1630 -6719 -11678 -10342 -2852 6028 11259 10643 3264 -5661 -10905 -10307 -2922
1498 -2922 5605 10169 9436 3103 -5224 -9524 -8939 -2211 5265 8910 7633 1980 -5296 -8606 -6803
1513 -6803 -1242 4962 8176 6228 1374 -3929 -6005 -4195 -969 2610 3852 1723 -849 -2329 -2005
1528 -2005 159 2269 2449 1566 -1607 -3021 -2156 -411 1879 2875 1503 -662 -2227 -2318 -626 1427
1544 1427 2477 1548 -828 -2987 -2442 -486 2155 4115 2965 -4 -3559 -5519 -3634 260 4583
1559 4583 6731 4962 -141 -4421 -7217 -5949 -691 4397 7121 6087 1368 -4007 -7118 -6168 -1179
$$ packed form
1452a675j174j278l19K997K729L040J602j621l839l545l164J188K637M525L827
1467E930K69m028l637m822j047L392N296N614K504l924o261o407l579L112P208
1482c80P436M422j973p875q349m959J336P490Q880N231o16p379q925n244N98P385
1498b922Q527M564p33o333q327m300N85O728P476L645j277n653p276l310J803
1513f803N561O204L214j948m854n303k076J810L226L579J242k129k572j480L24
1528b005K164K110J80q83l173j414Q65J745K290R96j372k165j565r1J692K053
1544A427J050r29k376k159N45J956K641J960j150k969l555j960J885L894M323
1559D583K148j769n103m280k796J268N258N088K724j034m719n375l111R50M989
$$ plain form
1574 -1179 4378 7503 6321 1072 -5590 -9050 -7636 -2021 5748 10462 10145 4200 -4262 -10081 -11021
1589 -11021 -6046 2447 9468 10854 6931 -1095 -8268 -10192 -6864 416 7682 9314 6765 524 -6439
1604 -6439 -8839 -5910 -550 5207 7315 4913 979 -3442 -5650 -3714 -636 1847 3567 2141 768
1619 768 -287 -675 -757 -783 -1831 -2217 -1092 1134 4218 5040 3278 -792 -5898 -8091 -5773 -263 6387
1636 6387 9982 7793 1394 -5976 -10232 -8071 -1650 5407 9698 7530 415 -6093 -9486 -6829 417
1651 417 6759 9430 6279 -568 -7108 -9447 -6368 801 6994 8580 5702 -780 -6584 -7854 -5314
1666 -5314 682 5795 6988 4968 -46 -4980 -6237 -4067 -4 3887 5268 3228 5 -3409 -4374
1681 -4374 -2960 -314 2330 3810 2577 334 -1896 -3372 -2567 -921 1522 2759 2651 1313 -560
$$ packed form
1574a179N557L125j182n249o662l460J414N615P769M714l17n945q462n819r40
1589a1021M975Q493P021J386l923q026p173j924L328P280P266J632k549o241o963
1604f439k400K929N360N757K108k402l934m421k208J936L078K483J720j426j373
1619G68j055l88q2k6j048l86J125K226L084Q22j762m070n106k193K318N510O650
1636F387L595k189o399p370m256K161O421P057M291k168p115o508l393K657P246
1651D17O342K671l151o847o540k339L079P169O193J586k878o482n804j270K540
1666e314N996N113J193k020n014m934j257K170M063L891J381k040l223l414r65
1681d374J414K646K644J480j233k243k230j476Q05J646K443J237j08j338j873
$$ plain form
1696 -560 -2154 -2474 -1236 28 898 1315 510 202 -307 -401 206 781 354 -299 -844 -632 143 559 791
1715 791 264 -1053 -1365 -1291 117 1778 2345 1462 -421 -2825 -3133 -873 1765 3996 3897 838 -3603
1732 -3603 -6077 -5035 -488 4801 8007 7031 1267 -6148 -9583 -8896 -2662 5644 10831 10357 3587 -4898
1748 -4898 -10498 -10482 -4931 4319 10248 9949 4736 -3331 -9403 -9104 -4559 2699 8050 8321 4654 -2092
1764 -2092 -6994 -7146 -3688 1275 5082 5587 2871 -724 -3623 -4216 -1975 591 2363 2688 1640 85
1780 85 -867 -1527 -791 -751 -829 -527 -617 183 1750 2086 1867 756 -1633 -2275 -2209 -836 1303 2723 1593
1799 1593 -206 -2099 -2634 -1271 1384 3806 4595 1730 -2479 -5676 -6598 -3404 2511 7154 8687 5482
1815 5482 -725 -6688 -9226 -6850 -396 5879 8980 7486 944 -5532 -8567 -6982 -1196 4934 8167
$$ packed form
1696e60j594l20J238J264Q70M17q05l08n09r4O07N75m27o53n45K12P75M16K32
1715G91n27j317l12P4J408J661N67q83j883k404l08K260K638K231r9l059m441
1732c603k474J042M547N289L206r76n764p415l435O87O234Q306N187m74o770q485
1748d898n600J6N551R250N929k99n213q067o072K99M545P258N351K71l667o746
1764b092m902j52L458M963L807N05k716l595k899n93K241K566J772L25j048j555
1780H5r52o60P36M0p8L02r0Q00J567L36k19j111k389o42O6J373K139J420j130
1799A593j799j893n35J363K655K422P89k865m209l197r22L194N915M643J533l205
1815E482o207n963k538K376O454O275L101j494o542o476l035J585N786O130L233
$$ plain form
1830 8167 6921 1651 -4939 -7738 -6473 -1900 4193 6684 5725 2002 -3373 -6124 -5394 -1678 2895
1845 2895 5171 4421 1767 -1886 -4019 -3158 -827 1189 2328 1477 -494 -1490 -1675 286 1791 2235
1861 2235 1547 -387 -2466 -3026 -2186 -193 2044 3111 2382 722 -1246 -1757 -1467 -875 199 500 -174
1878 -174 -363 -18 589 1384 1820 858 -769 -2350 -2562 -1208 852 2664 3379 1363 -1339 -3343 -3467
1895 -3467 -1097 2013 4282 4607 1291 -2636 -4903 -4874 -1205 3377 6275 5750 1435 -4208 -7120 -6714
1911 -6714 -2521 4188 8214 7746 3086 -3506 -7774 -7385 -3652 2375 6994 6620 2792 -2649 -6528 -5988
1927 -5988 -2450 3291 7425 5923 1738 -3399 -7317 -6893 -2914 2451 6559 7027 4009 -668 -4736
1942 -4736 -5948 -3827 -1050 2002 3943 3055 1878 209 -1307 -1669 -1573 -1337 -371 611 956 1768 1933
$$ packed form
1830H167j246n270o590k799J265M573O093K491r59l723n375k751P30L716M573
1845B895K276p50k654l653k133Q61K331K016J139q51j971r96j85J961J505M44
1861B235o88j934k079n60Q40J993K237J067p29j660j968n11K90N92J074L01o74
1878a74j89L45O07P95M36r62j627j581k12J354K060J812P15k016k702k004j24
1895c467K370L110K269L25l316l927k267K9L669M582K898n25m315n643k912M06
1911f714M193O709M026m68m660o592m268L89L733O027M619l74l828n441l879N40
1927e988L538N741M134j502m185n137l918M24L979N365M108M68l018m677m068
1942d736j212K121K777L052J941q88j177j669j516l62R6K36R66R82L45Q12J65
$$ plain form
1959 1933 297 -1012 -2394 -2454 -687 1419 2939 3786 1408 -1029 -3947 -4531 -2469 1224 3972 5219
1975 5219 3439 -613 -4286 -6606 -5098 -483 4007 6892 6236 1979 -3082 -6261 -6536 -2961 2039
1990 2039 4968 5800 2340 -1920 -5259 -4850 -2076 2186 4876 4503 1179 -3394 -5839 -5026 -739 3909
2006 3909 6488 5295 1594 -3371 -6422 -5215 -2001 1960 5114 4156 1392 -1688 -3368 -2585 -81
2021 -81 2320 3301 1615 -1322 -3013 -3324 -1223 1830 3587 2943 930 -1832 -3153 -2610 -550 1417
2037 1417 2256 1681 229 -1154 -1476 -199 500 1068 432 -908 -1496 -874 397 1961 2131 873 -673
2054 -673 -2411 -2323 -408 1726 2562 2229 -257 -2896 -3453 -2452 1011 4076 4871 3277 -715 -5067 -6194
2071 -6194 -4153 -189 4733 7174 6002 1549 -3740 -6958 -6117 -2842 2080 6372 5998 3100 -1405
$$ packed form
1959A933j636j309j382o0J767K106J520Q47k378k437k918n84K062L693K748J247
1975E219j780m052l673k320J508M615M490K885o56m257n061l179k75L575N000
1990B039K929Q32l460m260l339M09K774M262K690l73l324m573k445Q13M287M648
2006C909K579j193l701m965l051J207L214L961L154r58k764l080j680P83K504
2021h1K401R81j686k937j691l11K101L053J757o44k013k762j321N43K060J967
2037A417Q39n75j452j383l22J277O99N68o36j340n88O22J271J564J70j258j546
2054f73j738Q8J915K134Q36l33k486k639n57J001L463L065P95j594l992m352j127
2071f194K041L964M922K441j172m453n289l218Q41L275M922M292l74k898m505
$$ plain form
2086 -1405 -4928 -5555 -3763 724 4781 5489 3732 -380 -4247 -5679 -4085 -257 3293 5466 4357
2101 4357 1219 -2835 -4752 -3712 -1374 2014 4128 3917 1518 -1250 -3251 -3207 -1573 375 2054 2008
2117 2008 694 -401 -1212 -1319 -136 596 488 203 -395 -146 486 425 189 -443 -938 -675 -72 1386 2526
2136 2526 1551 -277 -2561 -4136 -3498 -319 3380 5625 5051 962 -2778 -5927 -5537 -2144 2410 5421
2152 5421 5185 2053 -2287 -5068 -4664 -1467 2743 4801 4452 1269 -2789 -4872 -4104 -1133 2817 4628
2168 4628 3701 936 -2856 -4118 -2632 103 2546 3782 1929 -620 -2798 -3179 -1254 1171 3074
2183 3074 2933 1145 -1768 -3195 -3151 -1371 1433 3232 3225 1559 -982 -2706 -3242 -2403 369 2413 3086
2200 3086 2508 872 -1277 -2127 -2751 -1800 -230 617 1805 1973 1530 768 -595 -1217 -1629 -1405 -1091 666
$$ packed form
2086a405l523o27J792M487M057P08j757m112l867j432J594L828L550K173j109
2101D357l138m054j917J040K338L388K114k11k399k768k001M4J634J948J679m6
2117B008j314j095q11j07J183P32j08k85n98K49O32o1k36o32m95K63O03J458J140
2136B526r75j828k284j575O38L179L699K245n74m089l740l149L90L393M554L011
2152E421k36l132m340k781M04L197M210K058l49l183m058k083P68K971L950J811
2168D628r27k765l792j262J486K735K443J236j853k549k178l81J925K425J903
2183C074j41j788k913j427M4J780K804J799pj666k541j724n36Q39K772K044O73
2200C086n78j636k149q50o24R51J570Q47J188J68m43p62j363o22m12K24L14J757
$$ plain form
2218 666 1551 1906 1545 -638 -1983 -2766 -2129 -67 2327 3660 3140 607 -2832 -4544 -4069 -1479 2315
2235 2315 4840 4928 2531 -1803 -4620 -4859 -2728 1527 4192 4569 2519 -1055 -3782 -4460 -2108 1562
2251 1562 4480 4486 2030 -1460 -4955 -5055 -1976 1609 4608 4984 2459 -1115 -4449 -5227 -2748 966
2267 966 3189 4422 2691 269 -2459 -3441 -2098 -55 1486 2524 1732 429 -684 -1533 -1119 256
2283 256 492 1102 742 39 -362 -550 -826 -649 -664 -344 925 995 2217 2106 307 -1285 -2423 -3229 -1651
2302 -1651 -393 2494 3573 3772 2043 -1100 -3730 -3340 -653 550 2696 2910 1319 -839 -2793 -1943
2318 -1943 220 1648 3658 2530 302 -2883 -3455 -2407 -369 3761 4549 2962 213 -2608 -4823
2333 -4823 -3997 -2260 2398 4703 3445 815 -1878 -3912 -3220 -643 1913 3845 2413 455 -1666
$$ packed form
2218F66Q85L55l61k183j345p83O37K062K394J333n20k533l439j712M75K590L794
2235B315K525Q8k397m334k817k39K131M255K665L77k050l574k727o78K352L670
2251A562K918Ok456l490l495j00L079L585K999L76k525l574l334p78K479L714
2267I66K223J233j731k422k728r82J343K043J541J038p92j303j113q49M14J375
2283B56K36O10l60p03m01j88k76J77j5L20J269P0J222j11j799j592j138q06J578
2302a651J258K887J079J99j729l143k630L90K687J203K146K14j591k158j954Q50
2318a943K163J428K010j128k228l185n72J048K038M130P88j587k749k821k215
2333d823Q26J737M658K305j258k630k693k034O92K577K556J932j432j958k121
$$ plain form
2348 -1666 -3427 -2159 513 1794 3612 1705 -326 -2504 -3322 -2531 -180 1830 2542 1863 767 -850
2364 -850 -1052 -1099 -621 970 260 32 -266 -232 179 524 1316 1051 -215 -825 -1192 -1055 133 637 792 991
2384 991 -83 -705 -304 347 948 1163 82 -1328 -2077 -1651 -61 2027 2804 2305 225 -2371 -3839
2401 -3839 -3418 -854 2524 4389 4056 1534 -1949 -4719 -4499 -2190 1606 4112 4168 2285 -1488 -3922
2417 -3922 -4185 -1765 1613 4426 4158 1630 -1515 -4195 -4707 -1975 1017 4039 4496 2421 -681 -3303
2433 -3303 -4075 -2648 363 2306 3402 2205 -46 -1649 -2398 -1427 239 1461 1829 1016 -381 -1286
2449 -1286 -1289 -732 146 844 1024 1261 291 -5 -308 -638 -603 -585 -417 86 947 1165 1304 629 -811 -2062
2469 -2062 -2238 -1630 718 2542 3176 2249 157 -2435 -3562 -2953 -681 1991 3476 3077 889 -1720
$$ packed form
2348a666j761J268K672J281J818j907k031k178q18P91K351K010P12o79j096j617
2364h50k02m7M78J591p10k28k98L4M11L45P92k65j266o10l67J37J188N04J55J99
2384I91j074o22M01O51O01K15j081j410p49M26J590K088P77m99k080k596j468
2401c839M21K564L378J865l33k522l483k770K20K309L796K506N6j883l773k434
2417c922k63K420L378K813k68k528l145k680n12K732K992L022M57k075l102k622
2433c303p72J427L011J943J096j197k251j603p49R71J666J222L68q13j397r05
2449a286lN57Q78O98J80K37r70k96l03l30L5J8J68N03Q61K18J39o75j440j251
2469b062j76O08K348J824O34r27k092k592j127O09K272K672J485l99k188k609
$$ plain form
2485 -1720 -3461 -3284 -981 1960 3531 3146 1324 -2049 -3515 -3764 -1134 1891 3539 3455 1400 -1485
2501 -1485 -2959 -2656 -852 1488 2905 2365 452 -1946 -2897 -1960 245 2250 3263 2094 -431 -2487
2517 -2487 -3264 -2500 322 2208 3239 2486 143 -1756 -2810 -2134 -319 1496 2464 1764 328 -1420
2533 -1420 -2021 -1765 -212 904 1363 1134 591 -208 -500 -356 -181 42 -498 -542 -77 314 186 1046 706
2552 706 -392 -1359 -1504 -638 716 1620 1948 1017 -1012 -2097 -2462 -1109 1183 2625 2736 1373 -1314
2569 -1314 -3121 -2897 -1880 983 2911 3308 1177 -1115 -3193 -2911 -1230 1661 3811 3294 1262 -1637
2585 -1637 -4269 -4261 -1650 1250 3664 4360 1776 -1112 -3699 -4236 -1937 842 3184 3906 2180 -544
2601 -544 -2789 -3755 -2463 -72 1978 2835 1996 518 -1159 -1657 -1888 -460 412 982 1006 106 -71 -41
$$ packed form
2485a720j741J77K303K941J571l85j822l373j466k49K630L025J648q4k055k885
2501a485j474L03J804K340J417n40j913k398r51R37K205K005J013j169k525k056
2517b487p77P64K822J886J031p53k343j899j054O76J815J815R68p00j436j748
2533a420o01K56J553J116M59k29n43p99k92J44J75K23n40m4M65L91j28Q60l40
2552G06j098r67j45Q66J354R04L28r31k029j085l65J353K292J442J11j363k687
2569a314j807K24J017K863J928L97k131k292k078K82J681K891K150n17k032k899
2585a637k632QK611K900K414O96k584k888k587n37K299K779K342P22j726k724
2601e44k245r66J292K391K050Q57q39j478j677m98k31J428Q72N70K4r00j77L0
$$ plain form
2619 -41 -171 46 136 -222 -362 -52 168 655 674 48 -328 -811 -709 -62 720 1247 1104 281 -849 -1611 -1921
2640 -1921 -323 1090 1616 1507 125 -813 -1360 -1766 -566 1343 1620 1000 26 -1523 -1745 -898 444
2657 444 1809 2405 1338 -224 -2391 -2689 -1082 181 3251 3480 2019 -302 -2406 -3654 -2774 -236
2673 -236 2102 3578 2723 650 -1545 -3114 -2730 -431 1351 2781 2437 669 -1108 -2623 -2316 -410
2689 -410 1197 2358 2200 479 -1326 -2119 -1863 -522 1181 1754 1646 617 -570 -1445 -1305 -910 513
2706 513 902 966 715 -26 -576 -445 -610 -486 97 16 74 573 1283 1116 54 -1098 -881 -1760 -1227 144
2726 144 2284 2919 975 61 -1777 -1882 -557 587 2131 2276 1045 -1294 -2490 -2900 -1650 2017
2742 2017 2848 2570 1312 -270 -2465 -3292 -1935 -88 2726 2846 1216 -537 -2771 -2468 -1447 588
$$ packed form
2619d1j30K17R0l58j40L10K20M87J9o26l76m83J02O47P82N27j43q23j130p62l10
2640a921J598J413N26j09j382r38n47m06J200J909K77o20r74j549k22Q47J342
2657D44J365N96j067j562k167k98J607J263L070K29j461k321k104j248Q80K538
2673b36K338J476q55k073k195j569L84K299J782J430l44j768j777j515L07J906
2689d10J607J161j58j721j805p93K56J341J703N73j08j029j187q75J40L95J423
2706E13L89O4k51p41n50J31j65J24N83q1N8M99P10j67j062j152K17q79N33J371
2726A44K140O35j944r14j838j05J325J144J544J45j231k339j196m10J250L667
2742B017Q31k78j258j582k195q27J357J847K814J20j630j753k234L03J021K035
$$ plain form
2758 588 1601 2093 856 -987 -1609 -2489 -862 851 2007 1980 1084 -577 -1781 -1904 -944 1003 1842
2775 1842 1427 1085 -194 -1907 -2348 -937 -145 685 1002 1212 206 -324 26 -103 -722 -677 -229 63 126
2794 126 301 256 320 410 -704 -777 -273 380 -392 680 573 -70 -882 -814 -395 300 1744 1759 671 760 -1447
2815 -1447 -2572 -1964 -451 2768 2295 1470 122 -855 -1922 -2080 343 1570 2115 1810 105 -1800 -2394
2832 -2394 -1522 -53 2046 2583 1910 -359 -1953 -2448 -1636 582 1858 2698 2254 -226 -2032 -2582 -2236
2849 -2236 -443 1897 2333 2325 577 -1165 -1902 -1917 -555 747 1113 1438 318 -541 -1373 -921 -381 376
2867 376 820 801 539 -118 -313 -196 -151 -225 -61 -195 186 59 406 446 400 -8 -594 -983 -726 -100 633 774
2889 774 678 -212 -536 -1085 -674 327 730 1057 525 -233 -1679 -1244 -566 721 1809 1566 492 -1156
$$ packed form
2758E88J013M92j237j843o22q80J627J713J156k7q96j661j204j23R60J947Q39
2775A842m15l42j279j713m41J411P92Q30L17K10j006n30L50j29o19M5M48K92O3
2794A26J75m5O4R0j114p3N04O53p72J072j07o43q12O8M19O95J444J5j088Q9k207
2815a447j125O08J513L219m73q25j348r77j067j58K423J227N45l05j705j905n94
2832b394Q72J469K099N37o73k269j594m95Q12K218J276Q40m44k480j806n50L46
2849b236J793K340M36qj748j742p37j5J362J302L66L25j120q59q32M52N40P57
2867C76M44j9k62o57j95J17M5p4J64j34L81j27L47M0m6m08n86l89K57O26P33J41
2889G74r6q90l24n49M11J001M03L27n32p58j446M35O78J287J088k43j074j648
$$ plain form
2907 -1156 -2387 -1712 -322 1716 2866 2328 319 -1566 -2950 -2977 -1118 1320 2973 2915 844 -1008
2923 -1008 -2587 -2552 -1122 939 2238 2335 1263 -1246 -1945 -2331 -1117 733 2150 2442 1630 -387 -1439
2940 -1439 -1896 -1463 17 860 1541 1086 188 -511 -568 -451 38 456 228 -158 -306 -606 -206 -4 386 547
2960 547 392 55 -11 114 -157 -46 -373 -515 -588 -95 193 734 990 723 -300 -981 -1354 -982 101 1557
2980 1557 1535 1321 -9 -1614 -2341 -1858 -201 1601 2410 1852 425 -1699 -2774 -1843 -273 1625 2858
2997 2858 2483 383 -1529 -2969 -2389 -368 1367 2862 2558 466 -1413 -2266 -2128 -389 1015 1833
3013 1833 1533 100 -958 -1732 -1044 333 1140 1371 588 -555 -1482 -1365 -744 526 1376 1161 327 -189
3031 -189 -898 -929 -207 364 826 515 12 -261 -843 -293 6 173 388 242 67 61 132 35 108 -159 -828 -580
$$ packed form
2907a156j231O75J390K038J150n38k009j885j384k7J859K438J653n8k071j852
2923a008j579L5J430K061J299R7j072k509o99l86J214J850J417K92q12k017j052
2940a439m57M33J480Q43O81m55q98o99n7J17M89M18k28l86j48l00M00K02L90J61
2960E47j55l37o6J25k71J11l27j42p3M93K88N41K56k67j023o81l73L72J083J456
2980A557k2k14j330j605p27M83J657J802Q09n58j427k124j075R31J570J898J233
2997B858l75k100j912j440N80K021J735J495l04k092j879q53J38J739J404Q18
3013A833l00j433j058p74O88J377Q07K31p83j143r27J17O21J270Q50k15q34n16
3031a89p09l1P22N71M62l11n03k73n82N50K99J67K15j46j75oP1r7P3k67o69K48
$$ plain form
3053 -580 -257 224 755 719 660 -275 -907 -1207 -731 264 1500 1520 1199 -19 -1086 -1657 -1367 -498 499 1628
3073 1628 1709 994 -215 -1645 -1934 -1289 260 1526 1833 893 -292 -1635 -2137 -1031 602 2052 1811
3090 1811 862 -943 -2190 -2605 -1304 295 2107 2754 1657 -381 -1612 -2189 -1281 260 1826 1986
3106 1986 1182 -842 -1558 -1461 -1141 667 1479 1607 905 -356 -1244 -1592 -945 44 913 961 513 -43 -390
3125 -390 -216 -216 -66 205 -365 -701 153 444 812 650 211 -642 -798 -1016 -382 993 1397 1168 408 -930
3145 -930 -1658 -1334 -383 943 1574 938 23 -1045 -1443 -587 66 1389 1493 716 -487 -1683 -2261 -1013
3163 -1013 555 1531 2083 1172 -74 -1370 -1997 -1376 478 1308 1847 1444 -228 -1097 -1704 -1480 14 1269
3181 1269 1592 1494 172 -949 -1541 -1695 -434 730 1702 1709 803 -321 -1284 -1317 -647 191 848 1307 609
$$ packed form
3053e80L23M81N31l6n9r35o32l00M76R95J236K0l21j218j067n71K90Q69R97J129
3073A628Q1p15j209j430k89O45J549J266L07r40j185j343n02J106J633J450k41
3090A811r49j805j247m15J301J599J812O47j097k038j231n77R08J541J566J60
3106A986q04k024p16R7L20J808Q12J28p02j261q88l48O47R89Q69M8m48n56l47
3125c90J74%J50K71n70l36Q54K91L68j62m39q53j56k18O34J375M04k29p60j338
3145i30p28L24R51J326O31o36r15j068l98Q56O53J323J04p77j203j196n78J248
3163a013J568R76N52r11j246j296o27O21J854Q30N39m03j672q69o07K24J494J255
3181A269L23r8j322j121n92j54J261J164R72Pr06j124r63l3O70Q38O57M59o98
$$ plain form
3200 609 94 -401 -983 -655 43 536 437 226 237 -109 98 335 248 223 -472 -229 -473 -142 556 537 278 -399
3222 -399 -450 -580 -178 533 720 465 -57 -932 -1131 -575 389 1029 1252 541 -292 -1286 -1445 -702 725 1290
3242 1290 1493 619 -824 -1647 -1659 -623 661 1479 1870 665 -889 -1629 -1689 -749 957 1691 1751 784 -664
3261 -664 -1688 -1665 -999 421 1899 1468 854 -337 -1396 -1239 -914 309 869 1204 777 -105 -774 -489
3279 -489 -621 188 695 847 127 -435 -775 -815 -290 251 583 669 381 8 -316 -973 -449 -208 108 288 34
3300 34 330 275 -290 124 -345 -294 -235 53 217 303 653 113 -123 -825 -897 -527 95 881 1223 706 -93 -732
3322 -732 -1556 -980 -47 850 1816 1364 85 -1194 -1893 -1328 -181 1108 2039 1834 449 -982 -1942 -1839
3340 -1839 -626 1045 1694 1750 517 -604 -1327 -1371 -230 819 915 792 39 -1143 -1136 -820 49 914 1163
$$ packed form
3200F09n15m95n82L28O98M93r9k11J1l46K07K37q7k5o95K43k44L31O98j9k59o77
3222c99n1j30M02P11J87k55n22q75j99N56R64O40K23p11q33r94j59P43J427N65
3242A290K03q74j443q23j2J036J284Q18L91j205j554p40o0R40J706P34O0r67j448
3261f64j024K3O66J420J478m31o14j191j059J57L25J223N60L35m27q82o69K85
3279d89j32Q09N07J52p20n62l40m0N25N41L32Q6k88l73l24o57N24K41L16J80k54
3300C4K96n5n65M14m69N1N9K88J64Q6L50n40k36p02p2L70O22P86L42n17p99o39
3322g32q24N76R33Q97R66m52j279j279o99N65J147J289R31k05j385j431r60J03
3340a839J213J671O49N6j233j121p23m4J141J049R6j23p53j182PL16Q69Q65K49
$$ plain form
3359 1163 730 301 -879 -1012 -745 -17 411 833 691 -76 -502 -457 -280 194 351 418 72 -173 -297 -288 -58
3380 -58 143 149 10 25 -294 110 188 4 -75 -173 -632 -333 112 325 934 496 -73 -315 -1033 -624 -231 527
3402 527 1138 1198 415 -750 -1376 -1119 -532 377 1346 1372 390 -507 -1219 -1173 -340 793 1282 1318 272 -893
3422 -893 -2011 -1413 -464 767 1609 1284 661 -828 -1623 -1516 -516 517 1302 1350 812 -413 -1153 -1337
3440 -1337 -562 456 932 992 924 -81 -827 -1147 -731 77 629 985 795 389 -172 -508 -570 -667 -485 131
3460 131 438 419 470 224 -135 -251 -580 -352 -129 322 478 532 196 23 -779 -709 -320 -53 519 869 410
3481 410 144 -360 -1063 -725 -103 564 1074 1060 82 -469 -1468 -1222 -201 565 1377 1066 512 -532 -1412 -1203
3501 -1203 -628 417 1058 1228 229 -637 -975 -1202 135 888 1514 867 -143 -822 -1371 -1061 -157 1118
$$ packed form
3359A163m33m29j180j33K67P28M28M22j42p67m26M5J77M74J57O7l46k45j24RK30
3380e8K01Oj39J5l19M04P8j84p9r8m59K99M45K13O09m38n69k42p18M09L93P58
3402E27O11O0p83j165o26K57N87R09R69K6r82q97p12M6Q33J133M89L6j046j165
3422h93j118N98R49J231Q42l25o23j489p95J07J000J033P85M8n38j225p40j84
3440a337P75J018M76O0o8j005p46l20M16Q08N52L56j90m06n61l36o2r7J82O16
3460A31L07j9N1k46l59j16l29K28K23M51J56N4l36j73q02P0L89K67N72L50m59
3481D10k66n04p03L38O22O67N10j4r78n51r99K46J021P66Q12l11n54j044q80K09
3501a203N75J045O41J70r99q66l38k27J337P53O26o47j010o79n49L10R04J275
$$ plain form
3519 1118 1407 956 -24 -977 -906 -786 8 694 952 272 -241 -778 -1101 -93 361 727 1052 -124 -1003
3538 -1003 -817 -597 -95 888 510 433 81 -353 -229 -157 -185 429 220 -111 -90 -82 112 391 204 19 -400 -593
3560 -593 -416 -90 518 689 636 -114 -524 -900 -597 -5 778 1023 684 140 -858 -1019 -1216 -288 881 1108
3580 1108 979 195 -924 -1273 -1312 -1122 1062 945 1425 614 -615 -1357 -1387 -922 -619 291 1584 1644 -333
3599 -333 -59 -1043 -1160 692 1125 916 1775 42 -1234 -1362 -585 -5 1069 935 324 -150 -461 -872 -572
3618 -572 231 449 836 100 -51 -353 -870 -341 128 431 195 134 -288 16 69 230 303 -12 -147 -430 -193
3639 -193 334 194 260 172 -261 -333 -524 71 633 799 451 39 -825 -723 -975 368 1157 1202 996 -1 -1096
3660 -1096 -1539 -936 40 880 1216 900 -237 -1046 -1094 -1036 -144 1024 1041 895 -68 -720 -878 -738 -38 838
$$ packed form
3519A118K89m51r80r53P1J20P94O86K58o80n13n37l23J008M54L66L25j176q79
3538a003J86K20N02R83l78p7l52m34J24P2k8O14k09l31K1QJ94K79j87j85m19j93
3560e93J77L26O08J71n3p50m10l76L03N92P83K45l39n44r98j61j97R28J169K27
3580A108j29p84j119l49l9J90K184j17M80q11j229p42l0M65L03R10J293O0j977
3599c33K74r84j17J852M33k09Q59j733j276j28P77N80J074j34o11m74l11m11L00
3618e72Q03K18L87p36j51l02n17N29M69L03k36o1m22L04N3J61P3l15j35k83K37
3639a93N27j40O6q8m33p2j91N95N62J66l48m12q64J02k52J343P89M5k06r97j095
3660a096m43O03R76Q40L36l16j137q09m8N8Q92J168J7j46r63o52j58J40P00Q76
$$ plain form
3680 838 880 591 146 -679 -1130 -628 -31 629 1014 645 136 -659 -694 -607 -233 448 613 743 239 -197 -636
3701 -636 -441 -52 316 540 404 55 -390 -689 -224 97 303 655 463 123 -1 -468 -326 -334 30 -283 -173
3722 -173 -35 190 601 291 318 129 -534 -471 -217 363 635 957 520 -121 -801 -729 -431 225 1045 1243 757
3743 757 -188 -715 -1439 -873 479 1329 1265 200 -569 -1256 -1298 -560 963 1414 937 254 -135 -1696 -1082
3762 -1082 -855 164 862 985 510 -380 -878 -796 -112 176 957 891 72 -484 -773 -918 -253 453 931 624
3782 624 151 -89 -739 -769 -438 91 419 364 370 -315 -479 -232 -278 264 -76 208 192 31 241 140 -61 -367
3804 -367 -496 -322 -254 110 501 657 438 -157 -470 -521 -387 -100 237 677 678 -132 -102 -701 -816 -102 345 810
3826 810 777 28 -276 -593 -975 -371 184 811 713 70 -273 -657 -835 -315 706 676 881 371 -764 -906
$$ packed form
3680H38M2k89m45q25m51N02N97O60L85l69n09p95l5Q7L74O81J65J30n04m36m39
3701f36J95L89L68K24j36l49m45k99M65L21K06L52j92l40j24m67J42qL64l13J10
3722a73J38K25M11l10K7j89o63O3K54N80K72L22m37o41o80P2K98O56Q20J98m86
3743G57r45n27p24N66J352Q50o4j065p69o87m2P38J523M51m77o83l89j561O14
3762a082K27J019O98J23m75q90m98Q2O84K88P81o6q19n56k89j45O65P06M78l07
3782F24m73k40o50l0L31N29L28n5Oo85j64K47m6N42l40K84j6j61K10j01k01l06
3804c67j29J74O8L64L91J56k19n95l13n1J34K87L37M40Jq10L0n99j15P14M47M65
3826H10l3p49l04l17l82O04N55O27r8o43l43l84j78N20J021l0K05n10j135j42
$$ plain form
3846 -906 -1007 -111 716 909 617 629 -471 -667 -748 -26 392 653 601 151 -394 -894 -404 76 594 1032 689
3867 689 126 -400 -676 -609 -367 215 266 738 283 -149 -64 -231 -180 168 -106 -24 -180 -172 -84 206 33 -77 -333
3890 -333 -115 -126 30 313 43 114 -152 -536 -484 -56 32 522 559 106 -492 -781 -705 -192 295 700 899 419
3912 419 -372 -829 -969 -359 223 1011 626 240 -283 -626 -950 -474 219 636 620 258 -478 -476 -838 -257 396
3933 396 1219 878 388 -227 -1037 -1142 -1066 112 876 813 613 222 -351 -636 -626 -15 223 505 222 108 -82
3954 -82 -195 -8 23 10 473 36 3 26 25 14 -74 -78 -129 -23 65 335 153 95 -185 -560 -258 -304 9 324 710
3979 710 503 120 -169 -711 -559 -167 288 370 480 243 2 -355 -269 10 206 487 359 -68 -262 -530 -680
4000 -680 -145 408 760 584 221 -479 -678 -318 -3 940 419 783 -214 -325 -615 -534 -44 423 673 507
$$ packed form
3846i06j01Q96Q27J93k92J2j100j96q1P22M18K61n2m50n45n00M90M80N18M38l43
3867F89n63n26k76O7K42N82N1M72m55m32Q5j67N1L48k74Q2j56QQ8K90j73j10k56
3890c33K18j1J56K83k70P1k66l84N2M28Q8M90L7m53n98k89P6N13M87M05J99m80
3912D19p91m57j40O10N82P88l85l86n23l43l24M76O93M17j6l62p36Kl62N81O53
3933C96Q23l41m90o15q10j05P6J178P64o3k00l91n73k85J0O11K38K82k83j14j90
3954h2j13J87L1j3M63m37l3K3jj1q8mn1J06Q8K70j82n8k80l75L02m6L13L15L86
3979G10k07l83k89n42J52L92M55Q2J10k37k41l57Q6K79J96K81j28m27j94k68j50
4000f80N35N53L52j76l63p00j99L60L15R43n21L64r97j11k90Q1M90M67K50j66
$$ plain form
4020 507 181 -654 -717 -577 -110 637 995 582 193 -69 -917 -582 -245 54 575 558 -32 -173 -242 -418 58
4041 58 289 343 483 32 -92 -157 -303 -116 45 -39 -100 121 -68 70 -54 -76 -117 -417 -413 63 230 480 443
4064 443 167 -300 -727 -839 -371 299 968 871 59 -240 -638 -968 -505 79 440 503 998 -212 -614 -622 -427
4085 -427 246 420 741 506 -101 -591 -742 -234 290 701 774 626 -204 -619 -503 -494 -76 429 613 259 66
4106 66 -414 -590 -321 -4 569 518 61 -19 -442 -481 -341 60 394 429 405 -270 -190 -24 10 226 380 280 218
4129 218 -95 74 24 41 -141 4 -80 -209 27 -28 122 268 120 -275 -289 -336 74 46 468 431 234 -220 -470
4152 -470 -308 -123 21 405 216 -84 -76 -330 -207 -66 425 572 580 83 -624 -650 -460 -95 394 788 445 73
4174 73 -519 -459 -419 -1 752 547 499 75 -636 -919 -551 -61 368 621 571 33 -236 -719 -613 -235 371 637
$$ packed form
4020E07l26q35o3J40M67P47L58m13l89k62q48L35L37K99N21j7n90j41o9j76M76
4041E8K31N4J40m51j24o5j46J87J61q4o1K21j89J38j24k2m1l00MM76J67K50l7
4064D43k76m67m27j12M68O70O69r7q12k99l98l30M63N84L61O3M95j210m02qJ95
4085d27O73J74L21k35o07m90j51N08N24M11P3j48q30m15J16RM18N05J84l54j93
4106F6m80j76K69L17N73n1m57q0m23l9J40M01L34L5k4o75Q0J66L4K16J54j00o2
4129B18l13J69n0J7j82J45q4j29K36n5J50J46j48l95j4m7M10k8M22l7j97m54k50
4152d70J62J85J44L84j89l00Qk54J23J41M91J47Qm97p07k6J90L65M89L94l43l72
4174G3n92O0M0M18P53k05m8m24p11k83L68M90M29K53n0n38k69m83J06L78O06K66
$$ plain form
4196 637 539 399 -275 -637 -515 -46 -82 120 310 104 -26 -40 -304 -71 17 15 -98 70 103 -185 53 -27 -127
4219 -127 -133 -142 -295 -228 65 420 16 45 -175 -533 -217 -91 463 542 335 -123 -230 -512 -320 -115 96 344
4241 344 167 -9 -323 -221 -50 23 257 468 87 -377 -446 -545 -438 305 536 711 358 -84 -647 -481 -200
4262 -200 334 457 617 328 -331 -558 -782 -319 -119 486 613 436 24 -300 -494 -364 33 171 411 378
4282 378 -96 -200 -472 -174 98 404 262 308 40 -331 -540 -219 131 105 343 83 54 263 56 282 243
4303 243 304 -138 -57 45 42 -28 153 334 174 -18 -13 15 -88 273 308 -22 -235 -244 -283 75 296 497 80 -167
4327 -167 -596 -349 -354 100 465 507 426 39 -445 -932 -209 -205 468 836 648 191 -358 -780 -662 -154 380 781
4349 781 621 208 -196 -688 -401 -139 254 706 599 111 -338 -521 -355 -376 8 562 398 102 -244 -293 -90
$$ packed form
4196F37r8j40o74l62J22M69l6K02J90k06j30j4k64K33Q8kj13J68L3k88K38q0j00
4219a27orj53O7K93L55m04K9k20l58L16J26N54P9k07m58j07k82J92K05K11K48
4241C44j77j76l14J02J71P3K34K11l81m64o9r9J07P43K31J75l53m42n63J66K81
4262b00N34J23J60k89o59k27k24M63K00O05J27j77m12l24j94J30L97J38K40l3
4282C78m74j04k72K98K72L06j42M6k68l71k09L21L50k6K38k60k9K09k07K26l9
4303B43O1m42Q1J02lp0J81J81j60j92NK8j03L61L5l30k13rl9L58K21K01m17k47
4327a67m29K47nM54L65M2q1l87m84m87P23MO73L68j88m57n49m22J18N08N34M01
4349G81j60m13m04m92K87K62L93M52j07m88m49j83J66k1L84N54j64k96l46m9K03
$$ plain form
4370 -90 98 -120 84 1 102 -97 -340 -94 72 62 270 -74 -132 -135 -1 -196 33 -319 -18 -86 92 -215
4392 -215 -132 187 157 -118 -116 -157 -143 285 195 314 196 -71 -346 -298 -170 10 197 609 343 -47 -356 -302 -164
4415 -164 237 374 432 107 -71 -235 -472 -390 -126 341 607 312 -51 -424 -307 -508 -210 447 682 407 202
4436 202 -198 -259 -96 -66 437 676 184 -56 -373 -600 -330 98 284 342 163 -125 -300 -404 -371 -85 48
4457 48 306 58 266 -297 -321 -233 91 429 41 99 -329 -13 -78 -206 -110 52 419 -51 -16 -14 -2 164 -28
4480 -28 -105 -221 -126 140 -103 129 223 169 -81 -280 -238 -242 335 234 388 181 14 -446 -518 -64 132 437 336
4503 336 -111 -29 -729 -316 -175 274 639 508 50 -315 -279 -355 -42 192 628 625 -23 -227 -568 -421 -52 123
4525 123 395 454 134 -121 -420 -318 -50 14 388 304 158 131 -253 -447 -130 30 54 144 402 -45 -178 -203
$$ packed form
4370i0J88k18K04q3J01j99k43K46J66j0K08l44n8lJ34j95K29l52L01o8J78l07
4392b15Q3L19l0k75Km1J4M28r0J19j18k67k75M8J28J80J87M12k66l90l09N4J38
4415a64M01J37N8l25j78j64k37Q2K64M67K66k95l63l73J17k01K98O57K35k75k05
4436B02m00o1J63L0N03K39m92k40l17k27K70M28J86N8j79k88j75j04L3K86J33
4457D8K58k48K08n63k4Q8L24L38l88N8m28L16o5j28R6J62L67m70L5KJ2J66j92
4480b8p7j16R5K66k43K32R4n4k50j99M2mN77j01J54k07j67m60p2M54J96L05j01
4503C36m47Q2p00M13J41M49L65j31m58l65L6p6L13K34M36lo48k04l41J47L69J75
4525A23K72N9l20k55k99J02K68O4L74q4j46k7l84j94L17J60K4R0K58m47j33k5
$$ plain form
4547 -203 -52 -309 -200 -92 96 39 137 -24 -81 -71 -49 -59 49 276 -31 45 268 138 -193 -497 137 -231
4569 -231 81 246 136 13 -216 -200 -201 250 384 179 42 1 -200 -474 -570 -137 367 681 289 103 -260 -327
4591 -327 -371 -36 234 538 180 -8 -129 -371 -342 -130 302 640 507 -39 -243 -433 -507 209 239 258 52 -211
4613 -211 -287 -240 -18 39 344 119 142 83 -225 -230 -107 222 40 -69 -14 -196 -280 -111 426 362 282 43 230 -201
4637 -201 -152 -46 -113 -50 104 237 -36 363 17 -92 144 -123 10 -299 -55 184 343 292 138 79 -574 -483
4659 -483 -302 -1 231 819 345 -53 -175 -362 -235 67 361 427 260 -79 -384 -381 -699 -148 244 545 618
4680 618 228 -109 -184 -513 6 347 243 538 28 -302 -255 -349 -14 47 52 571 45 -265 -114 -100 21 79 238
4703 238 134 -70 -82 -450 65 -72 276 137 167 265 39 -104 117 -107 148 283 -210 111 -32 -36 74 48
$$ packed form
4547b03J51k57J09J08J88n7R8j61n7J0K2j0J08K27l07P6K23j30l31l04O34l68
4569b31L12J65j10j23k29J6jM51J34k05j37m1k01k74r6M33N04L14l92j86l63o7
4591c27m4L35K70L04l58j88j21k42K9K12M32L38j33n46k04j90p4P16L0J9k06k63
4613b11p6M7K22N7L05k25K3n9l08nJ23L29j82j09N5j82q4J69N37o4q0k39J87m31
4637b01M9J06o7O3J54J33k73L99l46j09K36k67J33l09K44K39J59n1j54n9o53R1
4659d83J81L01K32N88m74l98j22j87J27L02K94O6j67l39l05Ll18N51L92L01P3
4680F18l90l37p5l29N19L41j04K95n10l30M7r4L35O1NN19n26l10J51J4J21N8J59
4703B38j04k04j2l68N15j37L48j39L0R8k26j43K21k24K55J35m93L21j43mJ10k6
$$ plain form
4725 48 -54 -242 -36 -176 -19 222 68 249 2 -123 -134 -314 -81 517 198 181 127 -109 -189 -315 -37 204
4747 204 268 214 251 -332 -276 -168 68 332 214 100 9 -319 -70 4 261 162 191 -103 -154 -278 -5 62 11 210
4771 210 374 -153 -175 -278 -448 -271 181 292 587 -71 -7 -290 -146 -267 75 134 525 324 -79 -191 -294
4792 -294 -281 -17 85 407 36 46 -13 -241 -36 -24 145 330 410 106 182 -98 9 -225 41 -123 117 73
4814 73 151 -170 139 -34 4 -273 -370 -144 347 372 431 244 -112 -263 -136 -186 243 516 231 300 -421 -107 -366
4837 -366 -158 -29 464 236 301 -234 -471 -310 -25 309 671 534 102 -187 -621 -468 -352 75 526 545 258
4858 258 19 -227 -211 -352 92 240 273 167 -157 -234 -83 -246 72 325 112 242 54 -225 14 233 196
4879 196 -126 330 -137 -108 -239 120 -27 -106 47 -7 -80 -232 -98 -13 73 91 163 103 -19 105 35 34 170 156
$$ packed form
4725D8j02j88K06j40J57K41j54J81k47j25j1j80K33N98l19j7n4k36q0j26K78K41
4747B04O4n4L7n83N6J08K36K64j18j14r1l28K49P4K57r9K9k94n1j24K73O7n1J99
4771B10J64n27k2j03j70J77M52J11K95o58O4k83J44j21L42N9L91k01m03j12j03
4792b94J3K64J02L22l71J0n9k28K05J2J69J85Q0l04P6k80J07k34K66j64K40m4
4814G3P8l21L09j73L8k77r7K26M91K5N9j87l56j51J27n0M29K73k85O9p21L14k59
4837c66K08J29M93k28O5n35k37J61K85L34L62j37m32k89m34J53J16M27M51J9k87
4858B58k39k46J6j41M44J48L3j06l24p7J51j63L18K53k13J30j88k79K39K19l7
4879A96l22M56m67K9j31L59j47p9J53n4p3j52J34Q5Q6J8P2o0j22J24p0jJ36j4
$$ plain form
4903 156 -88 -79 -90 -140 46 76 430 161 -38 -285 -404 162 181 256 169 -60 -174 -434 -126 -3 138 294 446
4926 446 -211 -171 -436 -251 -43 290 270 211 -100 -214 -353 -388 -11 362 315 358 -58 -130 -219 -112 221 -152 178
4949 178 270 226 -62 -340 -209 -25 282 211 143 -233 -238 -64 -149 -277 -37 -93 93 202 -252 -298 -237 77 97 -9
4973 -9 65 -215 45 128 -77 187 -168 -121 -34 143 -31 -108 -77 -49 -174 -108 -234 -82 175 302 254 203 -97 3
4997 3 -241 -277 93 461 227 613 -452 -486 -241 -367 -125 435 247 13 52 -208 -274 -293 -24 81 167 198 -145
5020 -145 -299 -465 -392 -131 508 439 2 -121 -298 -370 -36 104 119 337 298 -84 -389 -272 -3 -106 134 92
5042 92 59 7 -268 -235 -23 -75 269 161 -60 64 -164 -161 -74 -219 -51 -25 107 -44 -233 51 264 204 341
5065 341 174 -131 -239 146 160 66 -6 -18 -163 -264 -114 148 261 53 -38 -141 -90 -254 -147 -199 67 193
$$ packed form
4903A56k44Rj1n0J86L0L54k69j99k47j19N66J9P5q7k29j14k60L08J23J41J56J52
4926D46o57M0k65J85K08L33k0n9l11j14j39l5L77L73m7M3m16p2q9J07L33l73L30
4949A78R2m4k88k78J31J84L07p1o8l76nJ74q5j28K40n6J86J09m54m6O1L14K0j06
4973iP4k80K60Q3k05K64l55M7Q7J77j74p7L1K8j25O6j26J52K57J27m8n1l00J00
4997Ck44l6L70L68k34L86j065l4K45j26K42N60j88k34L9k60o6j9K69J05Q6L1l43
5020a45j54j66P3K61O39o9m37j23j77p2L34J40J5K18l9l82l05J17K69j03K40m2
5042I2l3n2k75L3K12n2L44j08k21J24k28LQ7j45J68K6J32j51j89K84K13o0J37
5065C41j67l05j08L85J4r4p2j2j45j01J50K62J13k08r1j03N1j64J07n2K66J26
$$ plain form
5087 193 -43 53 -41 -347 -172 207 347 157 -9 -148 -328 -41 -174 -150 117 237 224 -342 -220 -207 36 2
5109 2 281 230 116 -217 -428 -173 210 271 445 313 -44 -402 -126 84 119 309 25 217 -200 -46 -426 -212
5131 -212 -114 75 -358 -224 -63 -465 184 602 -115 -189 -17 -70 56 -25 102 9 132 -210 -147 -29 201 91
5153 91 310 100 49 161 -65 14 96 -21 492 162 -90 -70 -77 -417 -216 261 61 84 74 -126 -145 -285 -181
5176 -181 198 342 266 -6 -25 -373 -249 -4 96 368 345 436 16 -330 28 -149 -270 261 295 202 -39 -427
5198 -427 -433 -77 18 140 280 130 122 -236 -146 -350 -36 42 173 146 -142 -26 -45 -46 83 -24 199 58 171 98
5222 98 -626 74 -84 3 374 17 -249 -464 -304 104 -137 339 241 153 -133 183 398 258 -325 583 14
5243 14 -69 167 1 360 169 327 361 -910 -920 -278 -353 112 602 -40 198 -328 -201 380 97 150 86 -6
$$ packed form
5087A93k36R6r4l06J75L79J40j90j66j39j80K87j33K4K67J20j3n66J22J3K43l4
5109BK79n1j14l33k11K55L83O1J74j32l57l58K76K10L5J90k84J92m17J54l80K14
5131b12R8J89m33J34J61m02O49M18p17p4J72n3J26q1J27r3J23l42O3J18K30j10
5153I1K19k10n1J12k26P9Q2j17N13l30k52K0pl40K01M77k00K3j0k00j9j40J04
5176a81L79J44p6k72j9l48J24K45J00K72k3R1m20l46L58j77j21N31L4r3k41l88
5198d27oL56R5J22J40j50ql58R0k04L14P8J31k7k88J16j9jJ29j07K23j41J13p3
5222I8p24P00j58Q7L71l57k66k15J60M08k41M76r8q8k86L16K15j40n83R08n69
5243A4q3K36j66L59j91J58L4j271j0O42p5M65M90o42K38n26J27N81k83N3o4r2
$$ plain form
5265 -6 -183 -6 -287 -167 243 444 133 -53 -43 -272 -261 156 177 165 102 -201 -425 -49 -2 -127 -114 99 276
5288 276 -198 -179 -214 3 -313 144 147 81 -187 -43 -150 -383 -8 -304 18 49 164 -17 -169 -178 -132 -43 -6 77
5312 77 -265 138 -24 -48 13 175 -102 -347 -33 238 115 49 13 -28 -274 -149 -90 365 259 236 121 112 -10
5335 -10 -395 -191 -149 450 673 201 183 -271 -942 -503 117 555 -105 227 550 -762 -461 998 -37 57
5355 57 451 728 -356 242 -74 232 78 -104 176 -287 229 -74 149 -198 -152 -40 293 53 70 -147 -193
5376 -193 167 37 -68 347 95 -92 -88 77 -6 -75 92 -6 -7 136 80 71 35 160 1 0 122 45 96 161 59
5401 59 173 238 -15 -118 -278 -54 251 299 221 -28 -86 -265 -12 92 106 310 46 -24 -86 -51 -155 -86 -35 397
5425 397 -117 -165 -501 -444 336 412 445 -18 44 -7 -529 -170 28 260 353 333 60 -138 -39 -96 -87 174 259 356 14
$$ packed form
5265fj77J77k81J20M10K01l11j86J0k29J1M17K1j2o3l03k24L76M7j25J3K13J77
5288B76m74J9l5K17l16M57Lo6k68J44j07k33L75k96L22L1J15j81j52rM6Q9L7Q3
5312G7l42M03j62k4O1J62k77k45L14K71j23o6l6m1k46J25N9M55j06k3j15rj22
5335a0l85K04M2N99K23m72j8m54o71M39O20M38o60L32L23j312L01J459j035R4
5355E7L94K77j084N98l16L06j54j82K80m63N16l03K23l47M6J12L33k40J7k17m6
5376a93L60j30j05M15k52j87MJ65q3o9J67r8jJ43n6rl6J25j59jJ22p7N1O5j02
5401E9J14O5k53j03j60K24L05M8p8k49n8j79K53J04J4K04k64p0o2L5j04O9N1M32
5425C97n14m8l36N7P80P6L3m63O2n1n22L59J98K32R3k0k73j98R9n7RK61Q5R7l42
$$ plain form
5450 14 -141 -310 -233 40 371 350 194 40 -332 -131 -122 -11 93 426 -18 -68 136 -267 197 204 105 -100 -33
5473 -33 -14 -47 -63 71 73 -12 33 -118 -72 109 -101 131 178 -43 -332 -101 99 58 142 121 73 -38 -252 -167 -61
5498 -61 -142 116 324 129 -275 -21 -302 101 17 25 250 318 -106 -316 -65 -45 71 167 214 217 -46 46 -22 -231
5522 -231 18 186 216 263 25 -277 -357 -155 -102 178 308 147 141 77 -78 8 260 -256 197 143 -49 -183 -117
5545 -117 83 -144 119 31 -96 36 -506 113 -13 -12 137 192 91 -12 -76 -483 -97 13 -206 -44 175 -67
5567 -67 26 -2 48 56 -107 -120 -67 -104 27 131 -166 300 -97 -143 -352 -127 150 185 274 -35 -172 -219 -150 -71 82
5592 82 237 107 185 -47 -206 -58 319 -320 73 0 -114 -218 -251 39 -256 69 216 339 233 92 -80
5613 -80 -311 -27 -51 -6 162 5 -153 -157 -290 -77 52 72 116 56 -114 46 16 58 127 95 170 -39 -116 -57 -7
$$ packed form
5450A4j55j69P7K73L31k1j56j54l72K01RJ11J04L33m44n0K04m03M64Pr9k05O7
5473c3J9l3j6J34Kq5M5j51M6J81k10K32M7k21k89K31K00m1Q4k1m8j11k14Q5J06
5498f1q1K58K08j95m04K54k81M03q4QK25O8m24k10K51K0J16R6M7Lk63R2o8k09
5522b31K49J68L0M7k38l02q0K02N3K80J30j61oo4j55Q6K52n16M53n4j92j34O6
5545a17K00k27K63q8j27J32n42O19j26JJ49N5j01j03o4m07L86J10k19J62K19k42
5567f7R3k8N0Qj63j3N3l7J31J04k97M66l97m6k09K25K77L5Q9l09j37m7O9P9J53
5592H2J55j30P8k32j59J48L77o39L93p3j14j04l3K90k95L25J47J23j06j41j72
5613h0k31K84k4M5J68j57j58mj33K13J29K0M4o0j70J60l0M2O9l2P5k09p7N9N0
$$ plain form
5638 -7 45 19 -34 -29 216 73 -108 38 127 -40 25 265 -153 126 108 22 1 214 -245 53 18 -25 178 78 75
5663 75 -77 -198 -105 -229 -22 225 -2 -72 177 -286 -250 -14 -7 232 400 49 -153 -176 -128 -320 -70 80 192
5686 192 255 28 6 -224 -187 -249 52 405 346 -265 -46 -177 -174 -61 93 285 306 85 46 36 -277 32 -141
5709 -141 3 92 244 39 -358 139 -157 -6 93 36 47 116 43 55 194 -413 387 -272 349 -231 95 0 171
5732 171 219 -67 92 139 410 92 368 583 483 -188 -535 207 -618 141 -237 -378 -529 -67 422 -375 83
5753 83 90 24 -246 -239 125 -205 -255 17 0 100 145 -615 213 -479 448 220 263 -179 -148 -2 156 -85 -452 -135
5777 -135 502 213 -142 202 22 -36 -222 281 246 446 420 -22 -404 18 -478 -37 602 -131 448 -192 301
5798 301 292 -593 30 -3 -332 -96 -170 257 -629 157 -332 520 214 245 -476 -208 132 177 450 -410 -304 312
$$ packed form
5638gN2k6n3NK45j43j81J46Q9j67O5K40m18K79j8q6k1K13m59K98l5m3K03j00l
5663G5j52j21R3j24K07K47k27p0K49m63L6K36PK39J68l51k02k3M8j92K50J50J12
5686A92O3k27k2k30L7o2L01L53n9o11K19j31LJ13J54J92K1k21l9j0l13L09j73
5709a41J44Q9J52k05l97M97k96J51R9n7J1O9p3J2J39o07Q00o59O21n80L26r5J71
5732A71M8k86J59M7K71l18K76K15j00o71l47P42q25P59l78j41j51M62M89p97M58
5753H3Po6k70PL64l30n0K72j7J00M5p60Q28o92R27k28M3m42L1J46J58k41l67L17
5777a35O37k89l55L44j80n8j86N03l5K00k6m42l82M22m96M41O39p33N79o40M93
5798C01rq85O23l3l29K36p4M27q86P86m89Q52l06L1p21K68L40M5K73q60J06O16
$$ plain form
5820 312 11 -177 2 -201 97 9 109 -35 360 -51 493 47 326 166 -316 -251 -139 340 -43 24 -226
5841 -226 6 -11 -160 -199 415 80 121 105 -197 -75 -20 -81 47 215 221 118 -123 -326 -75 -18 101 104 191 90
5865 90 -13 -314 2 -109 139 -93 106 -78 139 -113 97 18 -26 -75 49 114 -146 11 -94 144 -59 -3
5887 -3 46 -131 -202 82 106 83 -58 170 74 28 139 40 -120 -1 79 -9 -118 -229 -32 -60 91 -87 105 -51
5911 -51 6 -141 -117 70 148 27 301 -441 24 15 -137 31 98 -78 244 67 -96 -231 -1 146 -17 379
5933 379 -128 -112 -78 -93 -2 176 211 126 69 -244 -59 -65 5 140 204 167 -79 -159 130 21 220 203 102 9 -123
5958 -123 -254 37 -32 82 275 95 133 -226 -181 -208 12 10 152 -23 108 102 -6 48 -48 146 92 29 -152 1
5982 1 -118 -106 -54 -71 -44 -60 31 25 -19 -175 184 1 139 -100 -164 -61 -113 -84 199 84 29 10 349 -67 120
$$ packed form
5820C12l01j88J79k03K98q8J00j44L95m11N44m46K79j60m82O5J12M79l83O7k50
5841b26K32j7j49l9O14l35M1j6l02J22N5o1J28J68Oj03k41k03K51N7J19LQ7j01
5865I0j03l01L16j11K48k32J99j84K17k52K10p9m4m9J24O5k60J57j05K38k03N6
5887cM9j77p1K84K4k3j41K28r6m6J11r9j60J19Q0q8j09j11J97k8J51j78J92j56
5911e1N7j47K4J87P8j21K74p42M65rj52J68O7j76L22j77j63j35K30J47j63L96
5933C79n07J6L4j5R1J78L5q5n7l13J85oP0J35O4l7k46q0K89j09J99j7j01r3j32
5958a23j31K91o9J14J93j80L8l59M5k7K20kJ42j75J31oj08N4r6J94n4o3j81J53
5982Aj19J2N2j7K7j6R1om4j56L59j83J38k39o4J03n2K9K83j15n5j9L39m16J87
$$ plain form
6007 120 83 205 40 -66 -430 -275 214 -38 74 316 270 -138 -81 -282 167 26 168 135 179 -84 -297 -239
6029 -239 129 -11 311 163 -20 -418 -388 -253 72 164 144 334 187 -57 168 -224 -359 -326 -1 410 277
6050 277 -43 -238 208 231 275 301 -70 -712 185 -40 305 -33 -306 -130 278 134 -28 131 -35 155 155 -51
6072 -51 -356 -49 -250 137 -72 -24 60 -118 -21 -219 -63 57 264 66 182 122 -55 -187 -80 137 192 495
6094 495 -249 33 100 -48 -50 94 522 184 268 30 -139 -90 45 58 89 171 -13 -96 69 114 -24 116 -56
6117 -56 432 -47 -20 -45 -505 388 52 12 -296 -21 -23 41 -621 -698 240 624 302 23 174 27 -57 -24 44 75
6141 75 116 114 7 127 -123 -214 26 -33 106 -214 -65 -235 -17 136 80 -34 43 -40 165 -134 67 154 -77
6164 -77 87 -20 -266 119 0 43 215 -125 11 -395 -30 30 111 337 -220 349 474 45 -128 -153 277 -571
$$ packed form
6007A20l7J22j65j06l64J55M89k52J12K42m6m08N7k01M49j41J42l3M4k63k13N8
6029b39L68j40L22j48j83l98L0J35L25R2k0J90j47k44K25l92j35L3L25M11j33
6050B77l20j95M46K3M4K6l71o42Q97k25L45l38k73J76M08j44j62J59j66J90%k06
6072e1l05L07k01L87k09M8Q4j78R7j98J56J20K07j98J16o0j77j32J07K17N5L03
6094D95p44K82O7j48kJ44M28l38Q4k38j69M9J35J3L1Q2j84q3J65M5j38J40j72
6117e6M88m79K7k5m60Q93l36m0l08K75kO4o62p7R38L84l22k79J51j47q4L3O8L1
6141G5M1kj07J20k50r1K40n9J39l20J49j70K18J53n6j14P7q3K05k99K01Q7k31
6164g7J64j07k46L85j19M3J72l40J36m06L65O0Q1K26n57N69J25m29j73k5M30q48
$$ plain form
6186 -571 -87 -1068 -71 -379 -89 395 18 413 823 -784 503 -651 -336 -224 54 -298 524 406 -480
6205 -480 444 -280 857 1022 1093 -597 8 -167 -819 -254 -627 584 604 -161 169 -222 -313 -190 421 -381
6225 -381 -245 -19 25 -67 -305 -379 -629 335 -12 -69 -646 110 87 -196 244 -538 -100 -276 177 641 656 271
6247 271 120 437 300 377 -302 487 409 -52 386 -276 71 36 -934 -35 646 763 26 129 -651 231 -236
6268 -236 -187 205 307 221 443 -303 -776 165 211 406 63 -425 647 -294 -84 -140 137 -34 359 -34 235
6289 235 362 193 391 -353 99 -478 249 394 -638 474 107 -545 -17 -753 -261 704 -31 84 1224
6308 1224 354 -296 195 382 446 0 -164 202 152 -82 123 139 -107 97 86 -107 -110 -296 -71 -38 95 53
6330 53 14 -25 109 50 -256 106 142 432 -20 161 165 -53 -264 93 75 347 48 61 -242 -56 48 -307 207
$$ packed form
6186e71M84r81R97l08K90M84l77L95M10j607J287j154L15J12K78l52Q22j18q86
6205d80R24p24J137J65P1j690O05j75o52N65l73J211K0p65L30l91r1J23O11q02
6225c81J36K26M4r2k38p4k50R64l47n7n77P56k3k83M40p82M38j76M53M64J5l85
6247B71j51L17j37P7o79P89p8m61M38o62L47l5r70Q99O81J17p37J03p80Q82m67
6268b36M9L92J02q6K22p46m73R41M6J95l43m88J072r41K10n6K77j71L93l93K69
6289B35J27j69J98p44M52n77P27J45j032J112l67o52N28p36M92R65p35J15J140
6308A224q70o50M91J87O4m46j64L66n0k34K05J6k46K04j1j93lj86K25L3J33m2
6330E3l9l9J34n9l06L62L6K90m52J81Mk18k11L57j8K72k99J3l03J86J04l55N14
$$ plain form
6353 207 117 260 248 -144 -99 28 -268 92 -17 292 179 113 -74 -129 -155 172 449 174 164 -213 -97 -49 -191
6376 -191 -162 111 36 -84 -90 -243 -44 36 80 -80 368 -104 -148 -77 -74 105 48 36 195 -22 321 172 49 -209
6400 -209 90 -69 -138 12 186 -157 5 11 -81 159 -2 256 -23 221 10 49 207 72 -70 88 -47 9
6422 9 179 -18 159 2 -286 28 -286 77 -49 132 215 59 -153 -3 -107 -44 243 105 131 -115 -102 -100 -99
6445 -99 88 7 19 -106 -81 6 -302 -133 129 286 94 -169 -82 68 -35 -80 33 -44 -116 167 99 -5 111
6468 111 84 162 -111 134 144 -70 -237 -140 196 17 -23 97 125 49 -92 53 -219 81 -87 61 -64 -112 -20
6491 -20 121 95 60 95 -247 -35 34 126 126 68 35 -186 127 76 -29 35 199 -41 -177 -109 118 174 -309 181 -85
6516 -85 171 -168 -104 21 -92 107 361 76 179 51 -151 -209 -266 161 276 107 164 77 -219 174 -49 -137
$$ packed form
6353B07r0J43j2l92M5J27k96L60j09L09j13o6j87n5k6L27K77k75j0l77J16M8j42
6376a91K9K73p5j20oj53J99Q0M4j60M48m72m4P1LJ79n7j2J59k17L43j49j23k58
6400b09K99j59o9J50J74l43J62Or2K40j61K58k79K44k11L9J58j35j42J58j35N6
6422IJ70j97J77j57k88L14l14L63j26J81Q3j56k12J50j04O3K87j38K6k46J3KJ
6445i9J87q1J2j25K5Q7l08J69K62J57j92k63Q7J50j03m5J13p7p2K83o8j04J16
6468A11k7P8k73K45J0k14j67R7L36j79m0J20K8p6j41J45k72L00j68J48j25m8R2
6491b0J41k6l5L5l42K12O9R2%n8l3k21L13n1j05O4J64k40j36O8K27N6m83M90k66
6516h5K56l39O4J25j13J99K54k85J03j28k02n8n7M27J15j69N7q7k96L93k23q8
$$ plain form
6538 -137 90 208 75 -10 -45 33 -188 -242 334 306 226 -47 171 97 -205 199 18 63 -14 34 -259 80 125 -183
6562 -183 13 -21 94 -192 1 -62 80 31 -225 -283 -365 -150 -318 169 805 413 -133 72 -44 176 129 -91
6584 -91 -5 -31 -59 -457 220 -370 -112 96 469 111 -154 2 -261 205 441 274 165 331 159 -757 -405
6605 -405 195 249 204 257 410 164 -964 -299 755 -423 288 41 -95 -279 -294 -202 -669 -35 243 -210 312
6626 312 226 -78 -98 -317 -305 208 -314 526 -280 -223 -181 -478 227 -547 -258 -87 -182 159 -247 40 -402 131
6648 131 -137 352 -115 277 -26 152 98 -552 61 -192 -176 -284 219 -332 -333 88 292 -1 -301 119 -183
6669 -183 60 -48 -201 -133 95 -78 -146 342 138 294 166 -353 -317 403 -169 92 42 -56 -278 -14 -103 -292
6691 -292 79 433 51 137 -38 -420 -298 -321 0 82 153 -11 -34 -237 34 -378 88 345 640 -193 396 -221
$$ packed form
6538a37K27J18j33q5l5P8k21n4N76k8q0k73K18p4l02M04j81M5p7M8k93L39M5l08
6562a83J96l4J15k86J93o3J42m9k56n8q2K15j68M87O36l92n46K05j16K20m7k20
6584i1Q6k6k8l98O77n90K58K08L73l58k65J56k63M66K36j67j09J66j72r16L52
6605d05O00N4m5N3J53k46j128O65J054j178P11k47j36j84j5R2m67O34K78m53N22
6626C12q6l04k0k19J2N13n22Q40q06N7M2k97P05p74K89J71r5L41m06K87m42N33
6648A31k68M89m67L92l03J78n4o50O13k53J6j08N03n51jM21K04k93l00M20l02
6669a83K43j08j53O8K28j73o8M88k04J56j28n19L6P20n72K61n0r8k22K64q9j89
6691b92L71L54l82Q6j75l82J22k3L21Q2P1j64k3k03K71m12M66K57K95q33N89o17
$$ plain form
6713 -221 -370 87 -186 -243 -542 109 -103 203 -581 36 29 440 -568 -255 -191 324 164 -19 -144 -57 171
6734 171 -61 -45 98 -244 -195 -19 282 186 84 419 156 -86 200 -102 30 -79 -337 77 224 356 97
6755 97 -71 -100 -386 -92 -152 -142 297 -45 92 -50 -215 -48 263 171 66 -373 -91 -245 6 -112 -77 290
6777 290 223 57 253 -277 -547 -256 29 -69 2 -227 -22 -77 -160 -139 -9 113 348 240 122 -364 -77 -252
6799 -252 183 -107 296 300 224 63 126 162 -157 400 -115 -124 87 -239 -462 -95 350 306 -241 -118 28 187 656
6822 656 -503 239 -175 244 -213 109 -14 138 -601 -12 -451 -231 -128 37 0 -4 -309 -92 -55 -50 -332 -317
6844 -317 7 -295 362 -220 -112 311 -186 898 747 469 142 -45 -89 -126 -155 -122 122 141 -17 25 -30 42
6866 42 -281 -62 55 344 24 55 -256 -235 -125 176 -210 86 213 99 488 -119 -159 -340 165 88 227 20
$$ packed form
6713b21j49M57k73n7k99O51k12L06p84O17pM11j008L13O4N15j60j83j25Q7K28
6734A71k32J6J43l42M9J76L01r6j02L35k63k42K86l02J32j09k58M14J47J32k59
6755I7j68k9k86K94o0J0M39l42J37j42j65J67L11r2j05m39K82j54K51j18L5L67
6777B90o7j66J96n30k70K91K85r8P1k29K05n5q3K1J30J22K35j08j18m86K87j75
6799b52M35k90M03Mp6j61O3L6l19N57n15rK11l26k23L67M45m4n47J23J46J59M69
6822F56j159P42m14M19m57L22j23J52p39N89m39K20J03J65l7ml05K17L7Nk82J5
6844c17L24l02O57n82J08M23m97J084j51k78l27j87m4l7k9L3K44J9j58M2n5P2
6866D2l23K19J17K89l20L1l11K1J10L01l86K96J27j14L89o07m0j81N05p7J39k07
$$ plain form
6888 20 -122 95 -65 -146 45 177 -25 -71 11 -178 24 -2 68 28 -29 -22 -82 -45 -145 -36 80 -69 118 87
6912 87 -61 -306 83 129 28 57 -182 -52 -63 94 187 77 -120 -21 -228 -26 16 -125 -9 100 -208 -26
6934 -26 107 -38 -85 86 263 89 169 -92 -83 88 0 34 326 182 45 -237 -166 -228 146 76 218 61 -35 84
6958 84 -375 -244 -157 346 -157 -146 -245 -339 102 244 127 49 96 78 2 -145 -269 -208 218 -71 94 139 -210 290
6982 290 -52 -64 43 -32 104 -21 -86 -21 -13 245 11 134 -7 -132 -45 116 290 72 48 -104 -92 -104 91
7005 91 112 27 -44 -165 168 -237 -113 128 209 -33 12 -145 -288 -246 -31 -163 146 92 31 202 43 -10 90
7028 90 -6 -152 153 51 -9 -186 29 8 11 246 327 237 87 -8 -81 -282 52 257 380 -181 -141 -255 -129 -2
7052 -2 -96 52 327 196 -31 -94 -299 -86 -74 -36 21 -37 58 81 42 5 92 -87 30 53 5 143 186 9 2 -22
$$ packed form
6888B0j42K17j60q1J91J32k02m6Q2j89K02k6P0m0n7Po0L7j00J09J16j49J87l1
6912H7j48k45L89M6j01K9k39J30j1J57R3j10j97R9k07K02M2j41J16J09l08J82
6934b6J33j45m7J71J77j74Q0k61RJ71q8L4K92j44j37k82P1o2L74p0J42j57r6J19
6958H4m59J31Q7N03n03J1r9r4M41J42j17p8M7j8p6j47j24O1M26k89J65M5l49N00
6982B90l42j2J07p5J36j25o5O5QK58k34J23j41j25Q7J61J74k18k4j52J2j2J95
7005I1K1q5p1j21L33m05J24K41Q1k42M5j57j43M2K15j32L09n4o1J71j59n3J00
7028I0r6j46L05j02o0j77K15k1LK35Q1r0j50r5p3k01L34K05J23n61M0j14J26J27
7052br4J48K75j31k27o3k05K13J2L8N7n8R5K3l9l7Q7j79J17K3m8J38M3j77pk4
$$ plain form
7078 -22 50 -203 -69 -40 -200 -62 224 42 -45 -289 264 137 394 102 274 -2 -95 -16 -141 40 -195 -247
7100 -247 290 45 -136 -160 31 114 134 -12 172 -36 -153 57 -190 55 127 103 206 235 -159 -188 62 -103
7122 -103 239 81 -81 186 -263 -106 39 -143 106 209 -10 71 6 -249 -155 -1 264 -38 135 177 153 -343
7144 -343 137 119 -49 65 -54 235 -306 121 82 -114 164 59 -11 -211 -20 -163 35 174 292 7 -118
7165 -118 -91 -116 140 276 209 113 -33 -253 263 185 252 250 -182 66 43 43 -25 -27 243 126 209 41 -173 -378 -105
7190 -105 97 119 98 -131 -104 -85 -242 41 15 412 305 -56 224 -38 34 136 52 8 263 -44 -250 -16 -289
7213 -289 -109 45 152 26 87 -73 -104 -150 1 -53 -11 -128 5 -180 -4 139 -388 -121 -93 -7 69 -123 178
7236 178 -86 -86 -182 55 26 274 7 204 145 153 -27 -103 66 -175 160 -123 107 17 -212 -24 -213 -184 171
$$ packed form
7078b2P2k53J34K9j60J38K86j82q7k44N53j27K57k92J72k76r3P9j25J81k35n2
7100b47N37k45j81k4J91Q3K0j46J84k08j17K10k47K45P2k4J03K9l94k9K50j65
7122a03L42j58j62K67m49J57J45j82K49J03k19Q1o5k55R4J54K65l02J73M2k4m96
7144c43M80j8j68J14j19K89n41M27l9j96K78j05p0k00J91j43J98J39J18k85j25
7165a18K7k5K56J36o7r6j46k20N16p8O7km32K48k3%o8kK70j17Q3j68k14k05K73
7190a05K02K2k1k29K7J9j57K83k6L97j07l61K80k62P2J02q4m4K55l07k06K34k73
7213b89J80J54J07j26O1j60l1m6J51n4M2j17J33j85J76J43n27K67K8Q6P6j92L01
7236A78k64%r6K37k9K48k67J97n9Qj80p6J69k41L35k83K30r0k29J88j89K9L55
$$ plain form
7259 171 -102 -255 68 39 21 -84 -57 313 27 141 267 9 -144 -24 -202 75 71 130 221 155 3 -148 84
7282 84 54 76 102 106 122 -52 -147 -324 169 103 146 30 46 -165 -32 -112 346 140 112 -57 27 -217 -111 1 -27
7307 -27 123 110 76 -11 -93 -26 -15 138 43 229 148 30 -315 -65 257 -352 323 135 199 339 -18 -43 403 70
7331 70 -86 -346 -26 55 81 36 151 92 31 -287 191 -79 -94 -50 31 -30 4 -103 -218 -43 45 142 -95 -139 34
7356 34 -75 74 -320 -189 134 20 103 24 -162 -272 -147 15 16 57 -72 -221 -61 -67 -92 196 185 69 7 127
7380 127 -271 -83 195 135 -39 -8 14 -37 -106 -174 210 90 -214 113 -24 70 24 0 -25 124 233 -80 160
7403 160 161 -181 -14 117 -35 113 -77 100 113 94 -79 177 -15 218 123 -172 50 195 -157 1 -171 -33
7425 -33 -94 -256 228 44 199 -4 71 -40 -173 -160 141 145 -112 189 74 -78 -252 -128 -242 164 243 96
$$ packed form
7259A71k73j53L23k9j8j05K7L70k86J14J26k58j53J20j78K77mN9R1o6j52j51K32
7282H4l0K2K6MJ6j74r5j77M93o6M3j16J6k11J33q0M58k06k8j69Q4k44J06J12k8
7307b7J50j3l4q7q2O7J1J53r5J86q1j18l45K50L22o09O75j88O4J40l57k5M46l33
7331G0j56k60L20Q1K6m5J15n9o1l18M78k70j5M4Q1o1L4j07j15J75Q8R7k37m4J73
7356C4j09J49l94J31L23j14Q3p9j86j10J25J62JM1j29j49J60ok5K88j1j16o2J20
7380A27l98J88K78o0j74L1K2n1o9o8L84j20l04L27j37R4m6k4k5J49J09l13K40
7403A60Jl42J67J31j52J48j90J77J3j9j73K56j92K33r5k95K22J45l52J58j72J38
7425c3o1j62M84j84J55k03P5j11j33J3L01Mk57L01j15j52j74J24j14M06P9j47
$$ plain form
7447 96 -85 -10 -113 -136 -6 35 186 67 198 250 50 -36 -18 -19 330 110 32 -177 -268 51 153 -63 -61 100
7471 100 125 -75 -51 -5 -66 38 304 58 -84 -19 43 -88 77 -90 70 -6 62 -216 63 67 40 81 115 136 6
7496 6 -186 -41 51 -57 258 -208 44 -54 36 124 -7 96 -151 -156 84 308 230 58 -74 82 -28 -115 85
7519 85 11 -50 91 66 309 -90 178 -114 -104 138 197 209 -2 111 -6 -137 -153 202 183 276 36 17 -68 -113
7543 -113 112 -76 189 325 5 -97 -227 122 -54 -296 -59 268 -276 -144 -164 -96 149 -11 188 -31 189
7564 189 -22 -26 -62 -6 -46 -12 -215 113 61 289 102 -34 -15 -232 -241 186 199 215 34 -447 101 -197 -494 151
7588 151 375 98 -232 -97 -234 -3 -57 102 227 -494 -120 -65 70 -173 -203 -374 51 179 297 232 31
7609 31 -176 -111 92 -110 265 82 -53 66 182 -58 143 31 144 274 -31 -96 124 -454 -11 187 -71
$$ packed form
7447I6j81P5j03k3J30M1J51j19J31N2k00q6J8jL49k20p8k09r1L19J02k16KJ61
7471A00K5k00K4M6o1J04K66k46j42O5O2j31J65j67J60p6O8k78K79Mk7M1L4K1j30
7496Fj92J45R2j08L15m66K52r8R0Q8j31J03k47nK40K24p8j72j32J56j10q7K00
7519H5p4o1J41k5K43l99K68k92J0K42N9J2k11J13j17j31j6L55j9R3k40j9q5m5
7543a13K25j88K65J36l20j02j30L49j76k42K37L27n44J32k0O8K45j60J99k19K20
7564A89k11ml6N6m0L4k03L28n2K28j87j36J9k17rM27J3J6j81m81N48k98k97O45
7588A51K24k77l30J35j37K31n4J59J25p21L74N5J35k43l0j71M25J28J18o5k01
7609C1k07O5K03k02L75j83j35J19J16k40K01j12J13J30l05o5K20n78M43J98k58
$$ plain form
7630 -71 -73 114 -54 -119 6 -97 48 92 -182 3 69 7 22 -154 167 169 213 -42 16 -179 316 55 95 268
7654 268 829 275 -539 -453 -382 -65 -90 75 -108 266 -56 37 -171 -188 110 -65 -55 -286 65 -184 -212 25
7676 25 -97 240 161 -157 222 377 281 251 26 32 -247 18 -72 56 49 211 15 -260 -25 71 84 -94 66 239
7700 239 104 63 -254 80 65 59 -17 209 -154 -178 -123 -513 -332 424 -284 -96 268 367 120 -554 157 78 -150
7723 -150 279 274 -200 95 -207 60 -114 -7 -49 169 -96 -62 30 148 -152 69 -104 -108 45 36 -117 -39 85
7746 85 -38 -25 261 -15 125 301 25 -84 -61 -80 -101 159 13 102 123 119 -75 -256 11 149 34 164 -98
7769 -98 196 -24 47 -176 -94 -94 36 134 -35 2 -47 -251 -44 207 -127 -14 -61 -50 -87 42 -81 259 94 16
7793 16 42 -36 -16 -205 -110 44 125 62 143 -87 -210 -21 132 8 229 153 -74 257 97 -302 -31 127 -225
$$ packed form
7630g1kJ87j68o5J25j03J45M4k74J85O6o2J5j76L21KM4k55N8j95M95k61M0J73
7654B68N61n54q14Q6P1L17k5J65j83L74l22R3k08j7K98j75J0k31L51k49k8K37
7676B5j22L37p9l18L79J55r6l0k25Ok79K65r0J28pJ62j96k75K35R6J3j78J60J73
7700B39j35m1l17L34j5op6K26l63k4N5l90J81P56p08J88L64R9k47o74P11p9k28
7723a50M29nm74K95l02K67j74J07m2K18k65L4R2J18l00K21j73mJ53rj53P8J24
7746H5j23J3K86k76J40J76k76j09K3j9k1K60j46Q9K1mj94j81K67J38j15J30k62
7769i8K94k20P1k23Q2%J30R8j69L7m9k04K07K51l34J13m7J1l7J29j23L40j65p8
7793A6K6p8K0j89R5J54Q1o3Q1k30j23J89J53j24K21p6k27L31j60l99K71J58l52
$$ plain form
7816 -225 -186 -10 66 -40 -28 -71 290 -227 -192 312 206 31 132 58 58 -33 321 -42 -25 148 29 270 107
7839 107 -80 -158 301 2 176 -125 -138 -44 69 -52 40 128 74 40 -7 189 -462 -26 -28 -77 443 178 107 -296
7863 -296 -235 -175 -163 49 154 258 6 -234 4 -394 -66 67 116 6 110 -290 -162 -260 -89 110 278 -287
7885 -287 163 59 -136 -3 -53 -85 54 60 135 -377 -206 -57 -55 174 -34 305 118 82 149 -170 -49 12 -196
7908 -196 59 -21 -43 -212 -189 -33 -10 11 40 -29 160 189 146 23 242 50 -195 -118 78 -46 -44 110 -20 23
7932 23 -2 -23 95 169 137 1 111 -3 -283 -123 195 174 288 49 18 -397 -64 -121 -160 21 139 138 -405 281
7956 281 -304 120 93 113 86 47 280 5 -81 -67 202 15 327 205 18 -104 97 219 -53 -3 244 -47
7978 -47 -72 -131 42 -52 40 125 125 45 -86 24 148 31 25 -107 156 -336 -88 145 -107 -301 76 -114 100 -276
$$ packed form
7816b25L9J76P6j06J2m3L61n17L5N04j06j75J01p4%r1L54l63J7J73j19K41j63
7839A07j87p8M59k99J74l01j3R4J13j21R2Q8n4l4m7J96o51M36km9N20k65p1m03
7863b96O1O0J2K12J05J04k52k40K38l98L28J33M9j10J04m00J28r8J71J99J68n65
7885b87M50j04j95J33n0l2J39OP5n12J71J49KK29k08L39j87l6O7l19J21O1k08
7908a96K55q0k2j69K3J56K3K1K9o9J89K9m3j23K19j92k45P7J96j24KJ54j30M3
7932B3k5k1J18P4l2j36J10j14k80J60L18k1J14k39l1m15L33n7l9J81J18jn43O86
7956B81n85M24k7K0k7l9K33k75q6J4K69j87L12j22j87j22K01J22k72N0K47k91
7978d7k5n9J73r4R2Q5%q0j31J10J24j17oj32K63m92K48K33k52j94L77j90K14l76
$$ plain form
8002 -276 163 -62 8 32 -51 -4 -184 -18 -100 155 -87 -127 -9 111 -226 -46 -8 -69 171 319 242 -332 -178
8025 -178 -141 107 -39 7 73 -115 220 -353 38 -65 145 100 104 156 33 -163 -335 35 -1 -45 11 144 -29
8048 -29 164 -40 143 -23 3 153 153 166 151 -241 -114 -66 132 451 41 27 -61 -67 -135 84 123 6 -102 188
8072 188 88 -263 -94 -170 121 119 2 71 27 -32 -8 17 89 -1 132 -80 -11 135 -63 -6 -22 77 141 67 185
8097 185 129 335 122 193 15 101 -113 160 117 130 -189 40 -114 -96 -316 -83 149 -20 44 -144 243 -176
8119 -176 -9 -8 56 25 57 60 -67 60 97 82 192 -21 23 -256 76 37 88 -4 296 182 -27 -35 -86 -75 114 -247
8145 -247 -290 93 -191 -144 -248 -146 31 164 144 22 121 46 62 208 164 -90 35 -235 -184 -42 -81 -250 -273
8168 -273 23 -22 13 8 50 -34 -415 77 -193 -269 -64 65 98 179 54 -15 -236 -158 -82 57 156 69 43
$$ packed form
8002b76M39k25P0K4q3M7j80J66q2K55k42m0J18J20l37J80L8o1K40J48p7n74J54
8025a78L7K48j46M6O6j88L35n73L91j03K10m5MN2j23j96j72L70l6m4N6J33j73
8048b9J93k04J83j66K6J50%J3j5l92J27M8J98L19m10j4q8oo8K19L9j17j08K90
8072A88j00l51J69p6K91kj17O9m4n9K4K5P2r0J33k12O9J46j98N7j6R9O4p4J18
8097A85n6K06k13P1j78Q6k14K73m3J3l19K29j54J8k20K33K32j69O4j88L87m19
8119a76J67JO4l1L2Lj27J27L7j5J10k13M4k79L32l9N1r2L00j14k09qn1J1J89l61
8145b47m3L83k84M7j04J02J77J33k0j22R9p5J6J46m4k54J25k70N1J42l9j69k3
8168b73K96m5L5nM2q4l81M92k70p6K05J29L3Q1j25o9k21P8P6J39R9q7k6
8191D3
$$ Imaginary data points
##PAGE= N=2
##DATA TABLE= (X++(I..I)), XYDATA
$$ plain form
0 0 0 0 0 0 0 0 0 0 0 0 0 8 -8 8 -8 8 -16 16 -24 24 -32 38 -41 49 -58 72 -80 95 -108 124 -142 162 -184 209
34 209 -235 265 -298 333 -373 416 -462 514 -570 631 -700 772 -851 940 -1035 1140 -1255 1383
52 1383 -1525 1684 -1859 2059 -2284 2546 -2849 3209 -3638 4163 -4829 5700 -6893 8634 -11436
67 -11436 16699 -30123 146012 236983 37529 -48776 -179541 -177082 -77560 44925 57480 38178
79 38178 4211 -22557 -34488 32887 90073 82527 26076 -42417 -117990 -126390 -64744 31251 100898
92 100898 113363 70892 1690 -69542 -76657 -27647 13837 29738 28519 -10642 -55410 -55293 66
105 66 57416 78531 73360 34323 -50205 -101288 -78018 -38567 1337 51650 67355 37704 10198
118 10198 7947 9370 -3749 -16452 -34059 -69162 -74622 -22488 41490 93452 121910 89034 1182
$$ packed form
0@%%%%%%%%%%%Qj6J6j6J6k4L2m0M8n6P0p9R0j07J30j52J75k03K32k66L04l46L93
34B09m44N00n63O31p06P89q78R76j084J201j331J472j623J791j975K175k395K638
52A383k908L209l543L918m343M830n395O058o847P801q992J0529j2593J5527k0070
67a1436K8135m6822J76135R0971j99454q6305j30765K459R9522J22485J2555j9302
79C8178l3967k6768j1931O7375N7186p546n6451o8493p5573q400O1646R5995O9647
92A00898J2465m2471o9202p1232p115M9010M1484J5901j219l9161m4768J17N5359
105F6N7350K1115n171l9037q4528n1083K3270L9451L9904N0313J5705k9651k7506
118A0198k251J423j3119j2703j7607l5103n460N2134O3978N1962K8458l2876q7852
$$ plain form
131 1182 -88293 -132366 -114278 -51330 33938 106677 113572 59823 -1551 -51870 -75366 -51413
143 -51413 1808 39532 37732 11738 -16278 -43546 -44559 4895 55723 66835 51741 9308
155 9308 -58424 -101271 -82295 -19152 48067 96418 105965 51745 -36809 -92470 -98419 -63172 11770
168 11770 82978 97250 55822 -11212 -69858 -90697 -59356 14467 77669 87546 55385 -4967
180 -4967 -72833 -98121 -64029 105 59233 87184 74918 24420 -39927 -71322 -65019 -42954
192 -42954 -2771 38827 50731 42469 32133 14572 -12619 -36901 -46844 -44700 -33161 6287 53050
205 53050 66998 50492 16133 -37525 -77365 -68035 -19865 37450 72696 71619 29085 -39869
217 -39869 -83115 -69954 -24311 34091 82450 79571 25762 -39777 -79954 -73828 -29915 32338
$$ packed form
131A182q9475m4073J8088O2948Q5268P2739O895n3749o1374n0319k3496K3953
143e1413N3221L7724j800k5994k8016k7268j013M9454N0828J1112j5094m2433
155I308o7732m2847J8976O3143O7219M8351R547n4220q8554n5661n949L5247P4942
168A1770P1208J4272m1428o7034n8646k0839L1341P3823O3202R877l2161o0352
180d967o7866k5288L4092O4134N9128K7951j2266n0498o4347l1395O303K2065
192d2954M0183M1598J1904q262j0336j7561k7191k4282r943K144J1539L9448M6763
205E3050J3948j6506l4359n3658l9840R330M8170N7315L5246j077m2534o8954
217c9869m3246J3161M5643N8402M8359k879n3809o5539m0177O126M3913O2253
$$ plain form
229 32338 80447 74095 22392 -30188 -67880 -69733 -23156 35255 66401 57356 16460 -32846 -65916
242 -65916 -59175 -10197 39557 60166 54694 15586 -38875 -63476 -50214 -12739 31434 57402
254 57402 52023 15396 -29243 -48987 -43311 -22088 15144 41355 34823 15157 -4906 -20680 -22041
267 -22041 -10035 6897 13568 4258 -2664 -6777 -12771 -3766 12132 13374 7392 1743 -6816 -11219
281 -11219 -7377 3911 10147 1155 -6088 -6638 -10159 -2009 17063 22569 12308 -4069 -20731 -28573
295 -28573 -20676 3498 29663 32012 16408 -4171 -29455 -37758 -14215 17543 37589 37328 13283
308 13283 -23262 -51973 -49486 -12826 29208 56572 59765 24496 -28934 -62421 -62581 -30792 19806
321 19806 61251 68172 35265 -17003 -53700 -65018 -41706 9527 51005 58147 36823 -3213
$$ packed form
229C2338M8109o352n1703n2580l7692j853M6577N8411L1146r045m0896m9306l3070
242f5916O741M8978M9754K0609n472l9108n4461k4601J3262L7475M4173K5968
254E7402n379l6627m4639j9744N676K1223L7232K6211o532j9666k0063j5774j361
267b2041J2006J6932O671r310o922m113n994R005J5898J242n982n649q559m403
281a1219L842J1288O236q992p243n50l521Q150J9072N506j0261j6377j6662p842
295b8573P897K4174K6165K349j5604k0579k5284q303K3543L1758K0046k61k4045
308A3283l6545k8711K487L6660M2034K7364L193l5269n3430l3487j60L1789N0598
321A9806M1445O921l2907n2268l6697j1318K3312N1233M1478P142k1324m0036
$$ plain form
333 -3213 -42175 -54942 -32971 7987 40068 46376 30501 -5663 -42273 -48504 -26514 3291 34225
346 34225 46534 31898 134 -26758 -35330 -28265 -9861 15141 28440 20851 9165 -1469 -13016
359 -13016 -15666 -7986 -1150 1852 3216 7401 7896 2657 849 -3634 -13200 -14502 -3998 9300 19791
374 19791 23328 14632 -8493 -33989 -40065 -23853 3804 35827 55424 41317 2890 -36498 -60208
387 -60208 -52314 -15924 32432 63363 57127 22154 -21718 -57562 -59988 -24528 17233 46219 50205
400 50205 24303 -14051 -41235 -40347 -14833 15683 36521 37018 9338 -24314 -38830 -34107 -10904
413 -10904 22112 42103 37481 12079 -17762 -34582 -35019 -17785 12143 28631 24689 12950 -5465
426 -5465 -20487 -18310 -3727 11488 16856 10369 -355 -15254 -24759 -13525 3993 15399 23567
$$ packed form
333c213l8962j2767K1971M0958L2081O308j5875l6164l6610o231K1990K9805L0934
346C4225J2309j4636l1764k6892q572P065J8404K5002J3299p589j1686j0634j1547
359a3016k650P680O836L002J364M185M95n239j808m483r566j302J0504J3298J0491
374A9791L537q696k3125k5496o076J6212K7657L2023J9597j4107l8427l9388k3710
387f0208P894L6390M8356L0931o236l4973m3872l5844k426L5460M1761K8986L986
400E0205k5902l8354k7184Q88K5514L0516K0838M97k7680l3652j4516M723K3203
413a0904L3016J9991m622k5402k9841j6820m37J7234K9928J6488l942j1739j8415
426e465j5022K177J4583J5215N368o487j0724j4899r505J1234J7518J1406Q168
$$ plain form
439 23567 20861 5509 -10019 -18198 -17252 -10481 -4118 5331 9627 6972 9138 11582 5779 -436 -8045
454 -8045 -18329 -21354 -13876 3048 21434 28389 24732 9097 -16695 -32111 -28651 -14285 8210
467 8210 26266 26464 11207 -8826 -20196 -15462 -689 17348 24841 8483 -16480 -31926 -33207
480 -33207 -12405 23477 47919 46041 18016 -21621 -50560 -54425 -26485 18263 47611 49070 26908
493 26908 -12789 -44257 -43699 -16747 19075 42288 39410 12239 -27325 -51880 -43159 -12272 24699
506 24699 54258 54130 23704 -15445 -45667 -52754 -36743 -4509 29119 43641 36144 19494 -3649
519 -3649 -25321 -30845 -23711 -12959 819 14279 22977 22195 13763 3010 -10395 -23289 -22446 -11277
533 -11277 1486 15955 22367 14318 -958 -14316 -18483 -11846 1817 17923 23354 11757 -5818
$$ packed form
439B3567k706j5352j5528q179R46O771O363R449M296k655K166K444n803o215p609
454h045j0284l025P478J6924J8386O955l657j5635k5792j5416L460J4366K2495
467H210J8056J98j5257k0033j1370M734J4773J8037P493j6358k4963j5446j281
480c3207K0802L5882K4442j878k8025l9637k8939l865K7940M4748K9348J459k2162
493B6908l9697l1468N58K6952L5822K3213k878k7171l9564k4555Q721L0887L6971
506B4699K9559j28l0426l9149l0222p087J6011L2234L3628J4522p497j6650k3143
519c649k1672n524P134J0752J3778J3460Q698p82q432j0753j3405j2894Q43J1169
533a1277J2763J4469O412q049j5276j3358m167O637J3663J6106N431j1597j7575
$$ plain form
546 -5818 -22009 -30115 -20522 2874 25629 36689 29308 7466 -20336 -40683 -38278 -15901 10997
559 10997 34637 41268 23444 -5647 -28154 -34472 -21302 2896 25866 31229 13937 -10515 -27639
572 -27639 -30852 -13230 17161 36313 34441 13428 -16363 -38393 -39841 -17681 14932 36028 37177
585 37177 20958 -8682 -31887 -33235 -17909 4782 22152 25072 13845 -4441 -16156 -13229 -3747
598 -3747 6350 12788 6887 -6480 -13882 -12248 -2289 10832 17883 15489 1734 -13455 -17694 -13029
612 -13029 -3069 10804 15227 8432 -813 -7959 -8791 -2324 5998 9601 4025 -6372 -10966 -9686 -3144
627 -3144 9519 16296 9809 -1207 -11773 -15383 -8144 5280 17255 17851 3857 -12371 -22511
640 -22511 -22984 -5887 17360 29806 26716 8804 -16428 -34090 -33623 -12077 17748 35985 36644
$$ packed form
546e818j6191q106R593K3396K2755J1060p381k1842k7802k0347K405K2377K6898
559A0997K3640O631j7824k9091k2507o318J3170K4198K2970N363j7292k4452j7124
572b7639l213J7622L0391J9152j872k1013k9791k2030j448K2160L2613K1096J149
585C7177j6219k9640k3205j348J5326K2691J7370K920j1227j8286j1715K927R482
598c747J0097O438n901j3367p402J634R959J3121P051k394j3755j5189m239M665
612a3029R960J3873M423o795r245p146q32O467Q322L603n576j0397m594J280O542
627c144J2663O777o487j1016j0566l610P239J3424J1975N96j3994j6228j0140
640b2511m73J7097K3247J2446l090j7912k5232j7662M67K1546K9825J8237O59
$$ plain form
653 36644 18469 -14449 -39210 -40552 -21555 9502 35495 43247 26222 -5155 -31707 -39060 -27383
666 -27383 -927 27304 35406 23722 2065 -21368 -31027 -21539 -1582 18378 26202 18010 1360
679 1360 -16131 -24039 -15625 -1994 12073 20855 16419 4298 -7765 -14275 -12856 -5934 1373 8071
693 8071 7277 3326 2580 613 -1267 -1643 -3119 -4469 -4997 190 5914 9566 7643 2956 -7415 -15799
709 -15799 -13194 -2444 8963 19054 18287 5570 -11854 -23187 -19847 -5419 11644 25221 24587
722 24587 6205 -14133 -27591 -27551 -10506 13396 29667 29040 11669 -10843 -27166 -29958 -13750
735 -13750 10060 25458 27095 13651 -8065 -24091 -25341 -11010 9190 22293 22848 9609 -11141
748 -11141 -23776 -21394 -7854 11082 24237 21940 7239 -10451 -21745 -19803 -7859 8853 19748
$$ packed form
653C6644j8175l2918k4761j342J8997L1057K5993P752j7025l1377k6552p353J1677
666b7383K6456K8231Q102j1684k1657k3433r659R488J9957J9960P824q192j6650
679A360j7491p908Q414J3631J4067Q782m436j2121j2063o510J419O922P307O698
693H071p94l951p46j967j880l76j476j350n28N187N724L652j923m687j0371q384
709a5799K605J0750J1407J0091p67j2717j7424j1333L340J4428J7063J3577o34
722B4587j8382k0338j3458M0J7045K3902J6271o27j7371k2512j6323k792J6208
735a3750K3810J5398J637j3444k1716j6026j250J4331K0200J3103N55j3239k0750
748a1141j2635K382J3540J8936J3155k297j4701j7690j1294J942J1944J6712J0895
$$ plain form
761 19748 16828 4941 -7706 -17293 -15459 -4131 7849 14559 13160 4546 -4972 -11224 -10736 -2999
775 -2999 3189 6166 6446 1857 -3079 -3721 -2261 386 1837 1184 191 -2354 -1957 2253 4237 2666
791 2666 601 -4311 -8434 -5839 991 8670 11737 7129 -759 -10942 -16660 -9493 2811 13668
805 13668 18505 12032 -3082 -16585 -21130 -12443 4175 18021 23587 14779 -5318 -21102 -25488
818 -25488 -16911 3083 21577 27290 18131 -2024 -20043 -26076 -18363 1534 20211 25440 16770
831 16770 -1839 -21171 -26781 -16894 2025 20727 27816 19341 867 -18779 -25933 -18524 -3798
844 -3798 12510 21797 15954 3305 -8704 -15286 -11695 -2327 6644 10419 6516 -306 -4570 -7353
858 -7353 -4513 2388 4838 4185 2399 -882 -2629 -2766 -1206 486 -854 -2456 -447 897 3236 6506
$$ packed form
761A9748k920j1887j2647r587J834J1328J1980O710j399q614r518o252M88P737
775b999O188K977K80m589m936o42J460K647J451o53r93k545L97M210J984j571
791B666k065m912m123K595O830P679L067m608p888j0183n718P167J2304J0857
805A3668M837o473j5114j3503m545Q687J6618J3846N566q808k0097j5784m386
818b5488Q577J9994J8494N713r159k0155j8019o033P713J9897J8677N229q670
831A6770j8609j9332n610R887J8919J8702P089q475j8474j9646p154P409J4726
844c798J6308R287n843j2649j2009o582L591R368Q971L775l903o822m264k783
858g353K840O901K450o53j786l281j747j37J560J692j340j602K009J344K339L270
$$ plain form
874 6506 5240 -747 -6570 -10495 -7979 -851 8070 14912 12391 1219 -9409 -16759 -16020 -4308 9669
889 9669 18455 17479 5494 -9109 -18242 -17372 -4551 11135 19259 17408 3777 -13776 -22911 -19089
903 -19089 -4385 14184 24984 22868 8054 -11912 -24311 -24165 -11871 7215 21392 22405 12686
916 12686 -2800 -16590 -19319 -11418 1882 12875 14431 8147 -2200 -11963 -12134 -4812 4369 10864
930 10864 11378 4097 -5012 -11341 -10422 -3571 3032 8527 9680 3698 -2549 -4985 -5640 -3262 722 2739
946 2739 2405 148 -234 1159 1295 1486 1511 -2065 -5160 -4628 -1938 2224 5543 5553 2838 -2271 -5865
963 -5865 -4151 -478 3847 7101 3735 -3190 -8263 -9740 -4851 4441 12499 14501 7999 -4313 -13751
978 -13751 -17191 -11082 3021 14725 17684 11956 -1763 -14284 -17987 -10897 2900 14847 17228
$$ packed form
874F506j266n987n823l925K516P128Q921O842k521j1172j0628p350P39J1712J3977
889I669Q786r76j1985j4603r133Q70J2821J5686Q124j851j3631j7553r135L822
903a9089J4704J8569J0800k116j4814j9966j2399J46J2294J9086J4177J013r719
916A2686j5486j3790k729P901J3300J0993J556o284j0347r763j71P322R181O495
930A0864N14p281r109o329R19O851O603N495J153n982o247k436o55K378L984K017
946B739l34k257l82J393J36J91K5l576l095N32K690M162L319J0k715n109l594
963e865J714L673M325L254l366o925n073j477M889R292Q058K002o502j2312r438
978a3751l440O109J4103J1704K959n728j3719j2521l703P090J3797J1947K381
$$ plain form
991 17228 10704 -4073 -16912 -18189 -9585 4392 17690 20479 11428 -4097 -17030 -19835 -12491
1004 -12491 1760 15560 20199 12337 -1132 -13280 -19182 -14122 -1384 10560 17496 13143 3391
1017 3391 -6705 -14440 -12650 -3559 3045 8809 9543 3439 -2320 -4972 -5514 -2061 501 2658 3578
1032 3578 1785 923 708 -1506 -2965 -3456 -4460 -2258 2143 6453 9474 6732 -561 -8030 -13205 -11535
1048 -11535 -1986 7955 15071 14749 5261 -7179 -15722 -16141 -6647 6132 15214 16902 7214 -7117
1062 -7117 -15608 -16394 -7148 7420 16746 16614 6506 -7494 -16810 -16262 -6401 8549 17317 14912 5039
1077 5039 -8447 -17752 -15707 -4807 8488 16879 15059 6155 -6078 -14874 -13373 -5143 3960 10476
1091 10476 10486 3893 -3629 -8019 -7225 -1753 3783 7298 6414 260 -4646 -5955 -5328 -840 3611 5556
$$ packed form
991A7228o524j4777j2839j277Q604J3977J3298K789r051j5525j2933k805P344
1004a2491J4251J3800M639p862j3469j2148n902N060J2738J1944O936m353r752
1017C391j0096p735J790R091O604N764P34o104n759k652n42L453K562K157R20
1032C578j793q62k15k214j459m91j004K202M401M310L021k742p293p469n175J670
1048a1535R549R941P116l22r488j2440q543m19R494J2779R082J688r688j4331
1062g117q491p86R246J4568R326j32j0108j4000r316N48R861J4950Q768k405r873
1077E039j3486r305K045J0900J3295Q391j820q904j2233q796J501Q230R103O516
1091A0476J0o593p522m390P94N472N536L515q84o154m906j309O27M488M451J945
$$ plain form
1107 5556 4768 897 -2422 -3547 -3662 -1515 973 1140 1281 1200 231 506 1546 662 -421 -1823 -3031
1124 -3031 -2057 -93 2572 4611 2603 -398 -2834 -5378 -3419 1148 4233 5777 3203 -1801 -5638
1139 -5638 -6976 -3238 3838 8567 8887 4320 -4801 -12550 -13140 -6444 4845 14435 16745 10728 -2800
1154 -2800 -15105 -18316 -12720 313 13939 18878 12987 -221 -13369 -18389 -12556 444 13778
1167 13778 18635 11767 -851 -13690 -18588 -11690 1240 12814 17334 11319 -211 -11071 -15810
1180 -15810 -10297 90 8630 12596 9240 561 -6281 -9310 -7178 -974 4138 6189 4978 876
1194 876 -1473 -2248 -2476 -837 -209 -1534 -1145 -72 1588 3587 3601 1457 -1830 -5393 -4771 -866 2943
1211 2943 6624 5865 138 -6054 -9198 -7450 -328 7663 11886 10422 1336 -8313 -13217 -12451 -3913
$$ packed form
1107E556p88l871l319j125j15K147K488J67J41q1r69K75J040q84j083j402j208
1124c031R74J964K665K039k008l001k436k544J959M567L085J544k574n004l837
1139e638j338L738P076M729L20m567r121p749n90O696J1289R590K310o017j3528
1154b800j2305l211N596J3033J3626M939n891j3208j3148n020N833J3000J3334
1167A3778M857o868j2618j2839m898O898J2930J1574M520o015j1530j0860m739
1180a5810N513J0387Q540L966l356q679o842l029K132O204N112K051j211m102
1194H76k349p75k28J639O28j325L89J073J660J999J4k144l287l563O22L905L809
1211B943L681p59n727o192l144J748P122P991M223j464r086r649m904P66Q538
$$ plain form
1226 -3913 7775 14065 13198 4627 -6400 -13588 -13602 -5757 5837 13154 13174 6593 -4693 -13396 -13014
1241 -13014 -6293 4259 12464 13074 6394 -3965 -12376 -12427 -5846 3605 12023 12274 4929 -4438 -11547
1256 -11547 -11752 -4603 4761 11572 12020 4776 -4726 -10326 -10600 -4952 2357 7175 8309 4087 -1762
1271 -1762 -4542 -4997 -1666 1434 3133 3481 746 -2936 -3145 -1106 246 3231 2432 554 -2340 -2298
1287 -2298 -740 1153 2497 1306 -515 -3265 -2687 102 2943 4659 3906 -579 -4895 -7485 -5024
1302 -5024 794 6372 9218 6856 -638 -7294 -10082 -7459 74 6935 10561 7551 -527 -7869 -9801
1317 -9801 -6779 854 8528 10315 5890 -2174 -9906 -11454 -6487 2524 11818 13707 8368 -1694 -11734
1332 -11734 -15686 -10056 -79 9861 14577 10030 903 -8144 -12762 -9651 -1165 7683 10994 8384 264
$$ packed form
1226c913J1688O290q67q571j1027p188j4P845J1594P317K0o581j1286q703L82
1241a3014O721J0552Q205O10o680j0359q411n1O581R451Q418K51p345r367p109
1256a1547k05P149R364O811M48p244r502n600k74N648P309M818J134m222n849
1271a762k780m55L331L100J699L48k735l682k09K039J352K985p99j878k894M2
1287b298J558J893J344j191j821k750N78K789K841J716p53m485m316k590K461
1302e024N818N578K846k362p494o656k788K623P533O861L626l010q078p342j932
1317i801L022P633P674J787m425q064p732j548M967R011R294J889n339j0062j0040
1332a1734l952N630R977R940M716m547r127r047m618L111Q486Q848L311k610q120
$$ plain form
1347 264 -6870 -10063 -7527 120 6376 8655 6022 -442 -5566 -7698 -5841 490 4941 5780 5313 773
1363 773 -3316 -4393 -3672 -1408 900 1579 2080 1464 781 1179 501 -1159 -2759 -3096 -3047 -129 2642 4663
1381 4663 4220 1202 -3102 -5308 -5545 -1169 3858 6608 5855 -119 -6986 -9984 -8227 -1525 8175 12796
1397 12796 11122 3428 -7916 -13804 -13336 -6094 5425 13926 14214 7217 -3562 -12313 -13307 -8395 1434
1412 1434 11790 13118 7935 -1401 -10419 -12101 -7816 530 8231 11354 7685 -204 -7580 -10040 -6791
1427 -6791 -240 5105 8224 5677 -902 -4650 -6076 -4220 474 4431 4773 2415 -1676 -2968 -2336
1442 -2336 -650 2271 2466 969 -1479 -3527 -2957 210 3145 4397 3356 -548 -2808 -4069 -2678
1457 -2678 485 2469 1941 406 -1882 -2634 -398 1043 4654 3414 -219 -3935 -6306 -4804 -519
$$ packed form
1347B64p134l193K536P647O256K279k633o464n124k132J857O331M451Q39m67m540
1363G73m089j077P21K264K308O79N01o16o83L98o78j660j600l37M9K918K771K021
1381D663m43l018m304k206k37M376N027K750p53n974o867k998J757O702R700M621
1397A2796j674p694j1344n888M68P242J1519Q501K88o997j0779q751r94M912R829
1412A434J0356J328n183r336r018j682M285Q346P701L123l669p889p376k460L249
1427f791O551N345L119k547o579l748j426J856M694L957L42k358m091j292O32
1442b336J686K921J95j497k448k048N70L167K935J252j041l904k260j261J391
1457b678L163J984n28j535k288p52K236J441L611j240l633l716k371J502M285
$$ plain form
1472 -519 4911 6982 4755 -197 -5948 -7526 -4578 1254 7116 8164 4858 -1903 -8495 -8740 -4129
1487 -4129 3102 9348 9811 4286 -3774 -10006 -10661 -5016 3137 9910 11013 5720 -2601 -9417 -10916
1502 -10916 -6121 1217 8173 10666 6697 -92 -6087 -9385 -7425 -1194 4781 8016 7040 2174 -3431
1517 -3431 -7110 -6641 -1884 3451 6828 7220 3259 -2416 -6289 -7354 -4198 697 4937 6928 5052
1532 5052 914 -2551 -4627 -4654 -2214 401 2237 3243 2839 1520 195 -1961 -2974 -3608 -2837 105
1548 105 3131 5013 5265 2107 -2604 -5870 -7087 -3835 1968 6977 8378 4906 -2266 -7665 -9192
1563 -9192 -5792 2494 8850 10124 5883 -2635 -10424 -12162 -6508 3105 11327 12977 7603 -2030 -10791
1578 -10791 -12530 -7213 1175 8905 10927 6058 -1499 -7680 -8255 -3666 2582 6836 6991 2092 -3699
$$ packed form
1472e19N430K071k227m952n751j578K948N832N862J048l306o761o592k45M611
1487d129P231O246M63n525q060o232o55N645Q153O773J103n293q321o816j499
1502a0916M795P338O956K493l969o789n995l298J960O231N975L235r76m866n605
1517c431l679M69M757N335L377L92l961n675l873j065L156M895M240J991j876
1532E052m138l465k076k7K440K615J836J006m04j319j325k156j013o34P71K942
1548A05L026J882K52l158m711l266j217L252N803N009J401l472p172n399j527
1563i192L400Q286O356J274m241q518p789j738N654R613Q222J650n374r633q761
1578a0791j739N317Q388P730K022m869p557o181n75M589O248M254J55m899n791
$$ plain form
1593 -3699 -6585 -5617 -1307 3562 5879 4577 624 -3374 -4426 -3512 -266 2912 3524 2097 -55 -2486
1609 -2486 -2432 -1199 397 1861 1501 20 -520 -1223 -723 658 850 812 71 -1127 -1266 -261 474 905
1627 905 799 -306 -959 -1024 -286 1690 1644 684 -599 -2826 -3621 -1939 626 3805 5559 4089 1034
1644 1034 -3414 -6688 -6280 -2909 1794 6737 7718 4555 -1004 -6262 -8196 -5600 160 6676 9607
1659 9607 6231 330 -6361 -9938 -7605 -858 6526 10508 7974 647 -6674 -10602 -8478 -945 6331
1674 6331 10450 8240 1032 -6194 -9873 -7762 -1206 5082 8688 7108 1463 -4408 -7108 -5926 -1214
1689 -1214 3495 5594 4310 1099 -2404 -3370 -2679 -665 1472 1981 1274 640 -429 -516 -380 -1268 -1524
1706 -1524 -1746 -900 973 3059 4075 2932 -376 -4044 -5765 -4676 -475 4447 7148 5867 851
$$ packed form
1593c699k886R68M310M869K317j302l953l998j052R14L246L178O12j427k152k431
1609b486N4J233J596J464l60j481n40p03N00J381J92l8p41j198j39J005P35M31
1627I05j06j105o53o5P38J976m6r60j283k227p95J682K565L179J754j470l055
1644A034m448l274M08L371M703M943R81l163n559n258j934K596N760O516K931
1659I607l376n901o691l577K333O747P384L982k534p327p321l928K124P533P276
1674F331M119k210p208p226l679K111O556O288L606j580n645n871k700J182M712
1689a214M709K099j284l211l503r66O91K014K137N09p07o34j069q7J36q88k56
1706a524k22Q46J873K086J016j143l308l668j721J089M201M922K701j281n016
$$ plain form
1721 851 -4902 -8178 -6857 -1851 4883 9015 8101 3155 -3914 -8672 -8660 -4471 2375 7455 8159 4957
1737 4957 -1344 -6396 -6951 -4213 430 5150 6270 3614 -505 -4781 -5466 -2945 1076 4978 5572 2970
1753 2970 -1462 -5317 -5729 -2848 1757 5043 5717 2523 -2058 -5145 -5588 -1937 2529 5183 5473 1960
1769 1960 -2384 -5016 -5014 -2155 2275 4536 4173 1624 -1749 -3617 -3266 -976 1817 3643 2419 586
1785 586 -1366 -2551 -1783 -860 21 839 158 -136 1025 1386 2028 1823 -772 -3251 -4248 -3493 -336 3343
1803 3343 5748 5227 1223 -3078 -5509 -5223 -1861 3071 5334 4522 1047 -3592 -5314 -3256 719 4883
1819 4883 5873 3131 -1718 -6013 -7157 -3699 2028 6478 7991 4127 -1724 -6769 -8278 -4433 1887
1834 1887 6825 8293 4814 -1610 -6373 -8457 -5112 907 6354 7954 5075 -855 -5912 -7739 -5397
$$ packed form
1721H51n753l276J321N006O734M132r14m946p069m758J2M189O846N080P04l202
1737D957o301n052n55K738M643M720J120k656m119m276o85K521M021L902N94k602
1753B970m432l855m12K881M605L286O74l194m581l087m43L651M466K654K90l513
1769A960m344k632KK859M430K261l63k549l373j868L51K290K793J826j224j833
1785E86j952j185P68R23Q81Q18o81k94J161L61O42k05k595k479r97P55L157L679
1803C343K405n21m004m301k431K86L362M932K263q12l475m639j722K058L975M164
1819D883R90k742m849m295j144L458N727M450J513l864n851n045j509L845O320
1834A887M938J468l479o424m763k084L345O019N447J600k879n930n057j827K342
$$ plain form
1849 -5397 514 5851 7588 5730 852 -4340 -6891 -6050 -2142 2686 5146 5453 3346 -324 -2599
1864 -2599 -3351 -2990 -1170 37 1173 2202 2090 1804 1148 -689 -2314 -2514 -2299 -916 2017 3289 2908
1881 2908 937 -1745 -3729 -3363 -846 2761 4809 4280 1279 -3335 -6045 -5626 -2067 2943 6658 6593
1897 6593 3153 -2835 -6887 -6878 -3712 1756 6500 7253 4025 -1448 -5955 -7085 -3950 784 5311 6144
1913 6144 3143 -1196 -5367 -6083 -2864 1590 5307 6384 3493 -1324 -4964 -6468 -4166 230 4092
1928 4092 6334 4750 578 -2861 -4741 -3923 -748 2047 2995 2074 -297 -1616 -1707 -319 1718 2567
1944 2567 1288 -487 -2534 -3640 -2148 458 2692 3510 2234 -124 -1802 -2575 -1466 853 1491 1272
1960 1272 216 -1440 -1460 -558 802 2032 1462 -428 -1778 -2352 -1010 1292 2870 2846 665 -2076 -3394
$$ packed form
1849e397N911N337J737j858m878n192k551Q41L908M828K460L07k107l670k275
1864b599p52L61J820J207J136J029j12k86o56j837j625k00K15J383K933J272l81
1881B908j971k682j984L66K517L607K048n29l001m614k710M19L559N010L715o5
1897F593l440n988m052RL166N468M744P53l228n473m507j130L135M734M527Q33
1913F144l001m339m171p16L219M454L717J077k891m817l640j504K302M396L862
1928D092K242j584m172l439j880Q18L175K795R48r21k371j319r1J388K037Q49
1944B567j279j775k047j106J492K606K234Q18j276k358j678p73J109K319O38k19
1960A272j056j656k0R02J360J230n70j890j350n74J342K302J578k4k181k741j318
$$ plain form
1977 -3394 -2734 -497 2709 4053 2297 -842 -4228 -5578 -2574 1867 6121 7081 3505 -2337 -7490
$$ packed form
1977c394O60K237L206J344j756l139l386j350L004M441M254R60l576n842n153
$$ [...]
8191a91
##END NTUPLES=NMR FID
##END=
