##TITLE=1H_SA_sl_BA/tBu-5
 CDCl3, 108 sc, 
 27.11.2020
##JCAMPDX= 6.0         $$ Bruker NMR JCAMP-DX V2.0
##DATA TYPE= NMR FID
##DATA CLASS= NTUPLES
##ORIGIN= UXNMR, Bruker Analytische Messtechnik GmbH
##OWNER= root
$$ XWIN-NMR		Version 3.5
$$ Fri Nov 27 12:52:28 2020 Russian Standard Time (UT+4h)  she@DPX200
##.OBSERVE FREQUENCY= 200.1315066352
##.OBSERVE NUCLEUS= ^1H
##.DELAY= (6, 6)
##.ACQUISITION MODE= SIMULTANEOUS
##.ACQUISITION SCHEME= undefined
##.AVERAGES= 108
##.DIGITISER RES= 18
##SPECTROMETER/DATA SYSTEM= spect
##.PULSE SEQUENCE= zg30
##.SOLVENT NAME= CDCl3
##.SHIFT REFERENCE= (INTERNAL, CDCl3, 0, 15.7039)
##AUDIT TRAIL= $$ (NUMBER, WHEN, WHO, WHERE, WHAT)
$$ ##TITLE= Audit trail, XWIN-NMR		Version 3.5
$$ ##JCAMPDX= 5.01
$$ ##ORIGIN= Bruker BioSpin GmbH
$$ ##OWNER= she
$$ F:/spectra/data/she/nmr/H-F/1/audita.txt
$$ ##AUDIT TRAIL=  $$ (NUMBER, WHEN, WHO, WHERE, WHAT)
(   1,<2020-11-27 12:44:08.50 +0400>,<she>,<DPX200>,
      <continue with go, POWCHK disabled, PULCHK disabled
       configuration hash MD5:
       00 E9 B6 7A A2 85 ED C7 34 08 36 98 17 FE 4E 26
       data hash MD5: 16K
       31 80 0F 91 B3 A0 89 41 03 C7 5F EB 32 E0 2D FC>)
$$ ##END=
$$ 
$$ hash MD5
$$ 22 79 CC 1C 11 E9 C1 E5 9E E8 BE CA 09 ED 3B 56
##$RELAX= 
##$RELAX= 
##$RELAX= 
##$RELAX= 
##$RELAX= 
##$RELAX= 
$$ Bruker specific parameters
$$ --------------------------
##$DU= <F:/spectra>
##$EXPNO= 1
##$NAME= <H-F>
##$PROCNO= 1
##$TYPE= <nmr>
##$USER= <she>
##$AMP= (0..31)
100 100 100 100 100 100 100 100 100 100 100 100 100 100 100 100 100 100 
100 100 100 100 100 100 100 100 100 100 100 100 100 100 
##$AQSEQ= 0
##$AQ_mod= 1
##$AUNM= <au_zg>
##$AUTOPOS= <>
##$BF1= 200.13
##$BF2= 200.13
##$BF3= 200.13
##$BF4= 200.13
##$BF5= 200.13
##$BF6= 200.13
##$BF7= 200.13
##$BF8= 200.13
##$BYTORDA= 1
##$CFDGTYP= 0
##$CFRGTYP= 5
##$CHEMSTR= <none>
##$CNST= (0..31)
1 1 145 1 1 1 1 1 1 1 1 1 1 1 1 1 1 1 1 1 1 1 1 1 1 1 1 1 1 1 1 1 
##$CPDPRG= <>
##$CPDPRG1= <>
##$CPDPRG2= <>
##$CPDPRG3= <>
##$CPDPRG4= <mlev>
##$CPDPRG5= <mlev>
##$CPDPRG6= <mlev>
##$CPDPRG7= <mlev>
##$CPDPRG8= <mlev>
##$CPDPRGB= <>
##$CPDPRGT= <>
##$D= (0..31)
0 1.2 0 0 0 0 0 0 0 0.06 0 0.03 0 0 0 0 0.0002 0 0 0 0 0 0 0 0 0 0 0 0 
0 0 0 
##$DATE= 1606466264
##$DBL= (0..7)
120 120 120 120 120 120 120 120 
##$DBP= (0..7)
150 150 150 150 150 150 150 150 
##$DBP07= 0
##$DBPNAM0= <>
##$DBPNAM1= <>
##$DBPNAM2= <>
##$DBPNAM3= <>
##$DBPNAM4= <>
##$DBPNAM5= <>
##$DBPNAM6= <>
##$DBPNAM7= <>
##$DBPOAL= (0..7)
0.5 0.5 0.5 0.5 0.5 0.5 0.5 0.5 
##$DBPOFFS= (0..7)
0 0 0 0 0 0 0 0 
##$DE= 6
##$DECBNUC= <off>
##$DECIM= 32
##$DECNUC= <off>
##$DECSTAT= 4
##$DIGMOD= 1
##$DIGTYP= 9
##$DL= (0..7)
0 120 120 120 120 120 120 120 
##$DP= (0..7)
150 150 150 150 150 150 150 150 
##$DP07= 0
##$DPNAME0= <>
##$DPNAME1= <>
##$DPNAME2= <>
##$DPNAME3= <>
##$DPNAME4= <>
##$DPNAME5= <>
##$DPNAME6= <>
##$DPNAME7= <>
##$DPOAL= (0..7)
0.5 0.5 0.5 0.5 0.5 0.5 0.5 0.5 
##$DPOFFS= (0..7)
0 0 0 0 0 0 0 0 
##$DQDMODE= 0
##$DR= 18
##$DS= 0
$$ [...]
##$SUBNAM2= <"">
##$SUBNAM3= <"">
##$SUBNAM4= <"">
##$SUBNAM5= <"">
##$SUBNAM6= <"">
##$SUBNAM7= <"">
##$SUBNAM8= <"">
##$SUBNAM9= <"">
##$SW= 16.9725356469052
##$SWIBOX= (0..15)
0 0 2 0 0 0 0 0 0 0 0 0 0 0 0 0 
##$SW_h= 3396.73913043478
##$TD= 16384
##$TD0= 1
##$TE= 0
##$TE2= 300
##$TE3= 300
##$TEG= 300
##$TL= (0..7)
0 120 120 120 120 120 120 120 
##$TP= (0..7)
150 150 150 150 150 150 150 150 
##$TP07= 0
##$TPNAME0= <>
##$TPNAME1= <>
##$TPNAME2= <>
##$TPNAME3= <>
##$TPNAME4= <>
##$TPNAME5= <>
##$TPNAME6= <>
##$TPNAME7= <>
##$TPOAL= (0..7)
0.5 0.5 0.5 0.5 0.5 0.5 0.5 0.5 
##$TPOFFS= (0..7)
0 0 0 0 0 0 0 0 
##$TUNHIN= 0
##$TUNHOUT= 0
##$TUNXOUT= 0
##$USERA1= <user>
##$USERA2= <user>
##$USERA3= <user>
##$USERA4= <user>
##$USERA5= <user>
##$V9= 5
##$VALIST= <valist>
##$VCLIST= <CCCCCCCCCCCCCCC>
##$VD= 0
##$VDLIST= <DDDDDDDDDDDDDDD>
##$VPLIST= <PPPPPPPPPPPPPPP>
##$VTLIST= <TTTTTTTTTTTTTTT>
##$WBST= 1024
##$WBSW= 4
##$XGAIN= (0..3)
0 0 0 0 
##$XL= 0
##$YL= 0
##$YMAX_a= 1018428
##$YMIN_a= -591902
##$ZGOPTNS= <>
##$ZL1= 120
##$ZL2= 120
##$ZL3= 120
##$ZL4= 120
##$ABSF1= 10
##$ABSF2= 0
##$ABSG= 5
##$ABSL= 3
##$ALPHA= 0
##$AQORDER= 0
##$ASSFAC= 0
##$ASSFACI= 0
##$ASSFACX= 0
##$ASSWID= 0
##$AUNMP= <proc_1d>
##$AZFE= 0.1
##$AZFW= 0.1
##$BCFW= 1
##$BC_mod= 2
##$BYTORDP= 1
##$COROFFS= 0
##$CY= 11.3945322036743
##$DATMOD= 1
##$DC= 2
##$DFILT= <>
##$DTYPP= 0
##$F1P= 15.9154993809931
##$F2P= -4.1035820241983
##$FCOR= 0.5
##$FTSIZE= 0
##$FT_mod= 4
##$GAMMA= 1
##$GB= 0.15
##$INTBC= 1
##$INTSCL= 1
##$ISEN= 128
##$LB= 0.24
##$LEV0= 0
##$LPBIN= 0
##$MAXI= 10000
##$MC2= 0
##$MEAN= 0
##$ME_mod= 0
##$MI= 1.114404
##$NCOEF= 0
##$NC_proc= 0
##$NLEV= 6
##$NOISF1= 3.799351
##$NOISF2= 2.8
##$NSP= 1
##$NTH_PI= 0
##$NZP= 0
##$OFFSET= 15.70392
##$PC= 1
##$PHC0= -10683.28
##$PHC1= 2.200881
##$PH_mod= 1
##$PKNL= yes
##$PPARMOD= 0
##$PSCAL= 0
##$PSIGN= 0
##$REVERSE= no
##$SF= 200.130013532006
##$SI= 16384
##$SIGF1= 3
##$SIGF2= 2
##$SINO= 400
##$SIOLD= 16384
##$SREGLST= <1H.CDCl3>
##$SSB= 0
##$STSI= 0
##$STSR= 0
##$SW_p= 3612.71676300578
##$SYMM= 0
##$S_DEV= 0
##$TDeff= 0
##$TDoff= 0
##$TI= <>
##$TILT= no
##$TM1= 0
##$TM2= 0
##$TOPLEV= 0
##$USERP1= <user>
##$USERP2= <user>
##$USERP3= <user>
##$USERP4= <user>
##$USERP5= <user>
##$WDW= 1
##$XDIM= 8192
##$YMAX_p= 0
##$YMIN_p= 0
$$ End of Bruker specific parameters
$$ ---------------------------------
##NTUPLES= NMR FID
##VAR_NAME=  TIME,          FID/REAL,        FID/IMAG
##SYMBOL=    X,             R,               I
##VAR_TYPE=  INDEPENDENT,   DEPENDENT,       DEPENDENT
##VAR_FORM=  AFFN,          ASDF,            ASDF
##VAR_DIM=   8192,          8192,            8192
##UNITS=     SECONDS,       ARBITRARY UNITS, ARBITRARY UNITS
##FACTOR=    0.0002944,     1,               1
##FIRST=     0,             0,               0
##LAST=      2.4114304,     0,               0
##MIN=       0,             -591902,         0
##MAX=       2.4114304,     1018428,         0
$$ Real data points
##PAGE= N=1
##DATA TABLE= (X++(R..R)), XYDATA
$$ [...]
2835a126Q91p03J442k800L214q66k585K658q76O57q66J429j390K787m195J966
2851c63K053l494K230j223O86o42K272k285N69K361k733L580l696J611J110q20
2867A216l25N57J106j671K344m159N187j623k808K276j368J929j229j085j93M645
2883D799l882j855L528k069K760k812j495K664n52l14k44r63p89N867m851j113
2899a321J706n11J883m071J896J234N87n198K957O84M55J761n593L191J09k69
2915e00M52j370R36Q99P23m417L915j577R94J626l921L137O64j753j108K311k71
2932G40J597j795n10K742k153m28J467m10k87Q92j517R83K032k288N00p96P55
2949A524R70j685r00Q59K683k807J643l348M611l57m448J190K314q23k188P12
$$ y = [-1126, -235, -938, 504, -2296, 918, 52, -2533, 125, -751, -94, -960, 469, -921, 1866, -2329, -363, 1690, -1804, 426, -797, -111, -753, 1519, -766, -197, 2164, -569, 3011, -685, 926, 2036, 1216, 891, 1448, 2554, 883, 3227, -932, 4255, 2632, -176, 2100, 732, 2661, 1432, 347, 154, 4799, 917, -938, 2590, 521, 3281, 469, -1026, 1638, 1086, 772, 528, -435, -1224, 4643, -208, -1321, 385, -126, 1757, -2314, -418, 816, 1403, -3795, -838, -154, 301, 2062, -3531, -340, -231, -500, -48, -1418, -482, 417, 1140, -3277, 638, -939, 55, 1681, -2240, 897, 1561, -192, -1300, 1011, 740, 2337, 542, 32, 2774, 621, 193, 1660, 1250, 963, 1855, 338, 1321, 3353, 1065, 1565, 769, 1524, 2494, 809, -91, 768, 3451, 644, 2287, -1061, 3550, 3193, -1255, -65, 2249, 1426, -762, -50]
2965e0n94L423k438j416K176q16O07r31m98Q27O10j584M78K195l392K422j988
2982i69j227K650j618l48P55l43R36M27l118L053P68j826p78J116Q9J345k604
2999a692p16M013j998l15l93j61J652k63k511K805J96k61l07m41m72L647k388
3016C95J49M92J022O59l090j21J063K404m309K605p21Q53J076l268L48K689l07
3033A939k680J718k337L040k48k092N71R22j07j219m2o21L056j900j569J960m58
3050f7J293l280J63K492R65k814N54K88p53K491k913J168J589l130J145p15OJ795
3068B77R10l679J700O70j162J933l077K321N70o41m93J016r7p14J016k081K905
3085A374j963K8K056j185R8p98J109k29K016l524K068N94j871K579l342J929k23
$$ y = [-50, -644, 2779, 341, -1075, 1101, 285, 892, -39, -537, 290, 900, -684, -206, 1989, -1403, 1019, -969, -2196, 454, -1164, -1512, -757, -1100, -164, 263, -2855, 198, 966, -860, -1638, -522, -433, 912, -1692, -2408, 1605, -393, -708, -1101, -1262, 390, 127, -2384, 421, 617, 356, 49, -392, -864, 2783, 395, 544, 1036, 2058, 2717, -373, -494, 569, 2973, -1336, 1269, 548, 1401, 2477, -791, -443, 2246, 1939, -741, 977, -1360, 1680, 1432, -660, -89, 833, 726, -493, -535, -1156, 1900, 0, -1569, 391, -67, 1226, -2054, -1891, 601, 1566, -1248, -694, -406, -1159, 1332, -1581, -413, 1176, -1954, -809, -1524, -1518, 277, 1187, -2492, -792, -122, -1284, 649, -2428, -107, 463, -178, -671, 345, 248, -466, 550, -1531, 1374, -589, -561, 1495, 310, 408, -390, 719, 490, 2506, -1018, 1050, 1644, -227, 2352, -990, 939, 716]
3102G16J822k833Q22m40M18J884m678K498K323j820n71l44R07J11p53k686M272
3119A648j656j248J547k216K285q31p21k28K285k306J268r96k526N028k693j100
3135b460J398M65n1O61k492O7L871l810J674j367J277K269l540l79J302R09j745
3152a951K808k627K226O59l423K663k06l22K17j002M60K079j168k550L689j520
3168C2J356l88j673J778J061k559k43K061j427J726k156Q43J995k637P3L76o9
3185A49j184L025k997J208J254k499K053k512J645P47r32j751J268O36m5K28k447
3202b154L253k83k872L21J047Q29q69J096k127K006p02L8K76q65J851j244n9l99
3220h57J825j207l10k92k79J751m03j929J996O20j358j05j400J778J312k403K498
$$ y = [716, 2538, -295, 527, 87, 505, 2389, -2289, 209, 2532, 712, 141, -203, 704, 815, 62, -2624, 1648, -8, -1256, 291, -1925, 360, -471, -1192, -1420, 865, -1441, -173, -1169, -3695, 1333, -1360, -2460, -1062, -597, -648, 13, -2479, -2412, 1459, -2351, -677, -2044, -767, 1502, -2038, -2417, -1115, -206, -1951, 857, -1770, 456, 1115, -2308, 355, 149, -173, 44, -958, -498, 1581, 413, -2137, 1552, 32, 1388, 1000, -673, 1105, 2166, -393, -636, 1425, -2, 1724, -432, 411, 2406, -231, -158, 218, 149, -1035, 1990, -1007, 201, 1455, -1044, 1009, -1503, 142, 889, -43, -1794, -526, 110, 65, 293, -2154, 1099, 816, -2056, -1735, -688, 141, -728, 368, -1759, 247, -455, -417, -141, -1006, 845, -399, -458, -857, 968, -239, -549, -841, -1120, 631, 228, -1701, 295, 915, -443, -548, -1948, -170, 1142, -1261, 1237]
3237A237P0j967P16Q71q40Q76K67k139J547l46J497j003j074J873q55r72P54J3
3255E25N37P54j992q2L703k847m16N00Q3L84j237j364K134J401k367j58L73J417
3273A348o48r24m24M75M78m20n18j163K961j375j392J917j081J346j600n52m05
3290a977K513j281j347Q95K05J271j638J566j29K4j211J237n88m77K867l302O10
3307g62J167j007J575o16j33j56J985k829J122m57R40K09j213J213j98j016l3
3324b09J075j733J880J227j538J571k191K20L43k01O47R0m22j381J852m79j07
3341F44j53o70K125j254j573M17J802k552J436j223J486o30k005J854j50o71k62
3358a379l07P76O6N51q15K225k936J959j374p3q5J847Q98k654K680k437K348j595
$$ y = [1237, 1307, -660, 56, 927, 87, 963, 1230, -909, 638, 292, 1789, 786, -288, 1585, 730, -242, 512, 525, 1062, 1816, -176, -258, 3445, 598, 182, 682, 765, 1149, -88, -1452, 682, 2083, -284, -442, -69, 1348, 700, -224, -648, -173, 305, -115, -633, -1796, 1165, -210, -1602, 315, -766, 580, -1020, -1572, -1977, 536, -745, -2092, -1197, -992, 279, -1359, 207, 78, 102, -1109, 128, -460, -937, 1930, -1372, -762, 405, -602, 973, 357, 224, 68, 2053, -776, 346, -111, 829, 1038, -175, 1038, 840, -176, -209, 866, -867, 1013, 2240, 702, 2273, 82, 302, 645, 444, 1091, 1181, 759, -622, 1230, 751, 644, 491, -179, 1946, 692, -881, -464, 1338, -1214, 222, -1001, 485, -145, -2150, -296, -446, -1117, -1379, -1686, -910, -844, -293, -1108, 1117, -1819, 140, -1234, -1307, -1392, 455, 1353, -1301, 1379, -1058, 1290, -305]
3376c05r82K150l68j063N38J181k06R29k566J40J650j288P13q46J005Q5P86j374
3394A79M83Q92k060K549k276J553k3j388J45o11K003p96J48j840L362j729l02
3411B89Q33j139K229k240K35j76J033q20j490J768o17J571j703R7N92m56J15o10
3429d89L44M53J305l419J805j68l32M78j758J450M14M52k271J563J9J2Pk433K862
3448B94L50q96P08j308J091N96o65L90J54L69j607R02j723K144o15O09N82L69
3466A744j968J283J75r77J369k248P6J061J77j076M26K47R27J84j955K062q94
3483F13m88Q51q01o77J377l30k233L007j776K411p46j996J575k65L05j663R56
3500A20J74R57k734R48J200j505K55j36n9J938q99j260J417j028N28P90j851J196
$$ y = [-305, -1287, 863, 495, -568, -30, 1151, 945, 1874, -692, -552, 1098, -190, 523, -323, 682, 767, 1553, 179, 662, 1554, -506, 2043, -233, 1320, 1297, -91, 54, -557, 1446, 650, 798, -1042, 2320, 591, 289, 1122, -17, 2212, -28, 207, 31, 1064, 244, -1246, 522, -95, 1476, -227, -130, 462, 6, 121, -489, -145, 308, 1613, -1806, -1, -169, -501, -23, -1781, -331, 83, 535, -1736, -173, -154, -142, -135, -2568, 294, 644, -252, 456, -852, 239, 835, 170, 560, 714, 1083, -524, 378, -1345, 799, 184, 793, 1375, 1744, -224, 1059, 1234, 257, 1626, -622, -546, 515, 692, -384, 42, 289, 1216, 1400, -555, 1507, 613, 125, 976, 175, -502, 875, 545, -1688, 1319, -457, 1954, 1208, -788, 787, 522, 827, -836, 120, 294, 1251, -1483, -535, 665, -840, -585, -721, -780, 1158, 259, -1001, 416, -612, -84, 706, -1145, 51]
3518E1L59r55m25Q16j18Q26r43k185L583n94j791J603q35K129j192j159Q75J024
3536A069j642k93J581j551J434p6r36J40J295j641J608o83j80J219j442R93M07
3553A302j251J649k248K94Q7Q31j777K080j239J98N49j575J879m20N35r19J170
3570A145q97J22j74k71J405j159L32j46j157M1J460j880K94J086r15N10p33p3
3588a010J535p40Q1r53Q23r33M13p45J572N00k203P13L66Q63j020R34j950K013
3606B59j27j642K724k336K825j107k122J001J169j33l2K57o97J084j211o51J831
3623A092j068j98NR50M9j39j567Q95J498j663P30j12p33M91p1o13N28J351r59
3642D66R3k188K333J599k500M29j462J305Q78j948j775L012j121J548j819M68
$$ y = [51, 410, -545, -970, -154, -272, 554, -389, -2574, 1009, 415, -1376, 227, -608, 1521, 329, -830, 45, 1069, -573, -866, 715, -836, 598, 522, -414, -274, 1021, -620, 988, 305, 125, 1344, -98, 895, 1302, 51, 1700, -548, -254, -167, 664, -1113, 967, -272, -74, 475, -1100, 779, 359, 894, -25, 1145, 248, 370, 196, -75, 1330, 171, 503, 357, -800, -759, 701, -1179, -885, 201, -714, -204, -937, -1010, 525, -215, -134, -1087, -264, -1197, -784, -1529, 43, 543, -1660, -947, -581, 282, -738, 196, -1754, 259, 132, -1510, 1214, -1122, 1703, 596, -1526, -525, 644, 511, 479, 736, 39, 1123, -88, -739, 1092, 24, -174, -169, 781, 830, 691, -876, 19, 1517, -146, 584, 472, -261, 230, 159, -454, 74, 1425, 466, 559, -1629, 704, 2303, -197, 232, -1230, 75, 953, -995, -2770, 242, -879, 669, -1150, -682]
3658f82M03o91K29j47J208j152J354m63k114K274n59r22M16j355K094j53j138
3675a398P43K019j538k48J90r72K535j113l83j82L26p75J615j666O90J932j589
3692A86L28p57r9N57P1p46L393l309O5R66o93o51J578k73l36P22k58j24K16k257
3712a421J361o81P94J40j698K204p92J88O0K29j569M20J275p06M7k3P0M02L03
3731F03l363L626q50k084K299j780J221K94j158j87R77n3N05j115J169J122k995
3748a769N22N85Q58N94j706j237J789J443k708N30J141j74O94j309l31J317j46
3765I3m58M67n62N74L79j217J037o21J074k81j8k05R0l5k52M46j526K194o34q16
3785b71J312n29L14m11o46J29P62j026p71K457k013J028p11Q06j020J075p95P09
$$ y = [-682, -279, -970, -741, -888, 320, -832, 522, 59, -2055, 219, -340, -1262, -846, -2201, -107, -260, -1398, -655, 1364, -174, -422, -232, -1204, 1331, 218, -165, -347, -21, -796, 819, -847, -157, 1775, 186, 514, -243, -342, 215, 286, -460, 2933, -376, -311, 655, -38, -689, 889, 616, 280, 1002, 744, 620, 836, -1421, -60, -741, 53, 193, -1505, 699, -93, 95, 155, 384, -1185, -765, 510, -196, -149, -172, -102, 300, 603, -2760, 866, 16, -2068, 231, -1549, -328, -34, -1192, -1379, -402, -455, 50, -1065, 104, 1226, -1769, -1247, -662, 196, 790, -916, -2153, -364, 1079, -1629, -1099, 42, -132, 562, -747, -1078, 239, 93, -365, 102, -460, 114, 493, -724, 313, -308, 766, 485, 467, 262, 352, 317, 65, 511, -1015, 1179, 545, -271, 1041, 512, 826, 415, -231, -102, 660, -366, -1137, 1320, -693, 335, -376, 430, -590, 485, -310, 399]
3803C99M28j413J318j468P05n12l72O93M88q71J27Q77j604J663j216L11N95n28
3821c80J63n18L36R01L30j555r00K448k587K594p42m88L37L61l86P87m31j552
3839a282J421j434K313K16j563L22K79R43p87J5r19J587p13o77Q16j102J586j153
3857a32n79J73J771q25o35L66j028J865p0q94j83Q2J413j064O74j230K63o07l14
3876i54J75n5J482J56o12n44J241j340q02J48J658r52p34J132o99K21R27j083
3894f35R0M10Q6j731J331J3N56o3j432N15P18r7J88K05j106R73p52K5R86j69n44
3915d33R19j31l18K28j253P40N92N08r64k26j10L09J47J10J315q25j18K17j004
3934b97p6J649j162R26K8j643J305j188J8J112j241q1L55L70p71J060r01N40J032
$$ y = [399, 827, -586, 732, -736, -31, -543, -915, -222, 266, -605, -478, 399, -1205, 458, -758, -447, 148, -380, -217, -735, -399, 502, 832, -723, -1623, 825, -1762, 832, 90, -398, -61, 300, -86, 701, 270, -1282, 139, -1295, 1018, 1234, -329, -7, 272, 1215, 428, 443, -476, 1111, 398, -279, 537, -565, 1021, -132, -711, -538, 1233, 408, -227, 139, -889, 976, 906, 12, -171, -89, 1324, 260, 934, -296, -33, -640, -954, -779, -834, 648, 804, 192, -352, 889, -451, -1253, -1105, 553, -399, -1133, -1, -700, -479, 448, -635, -545, -135, -49, -1780, -449, -436, 120, 57, -1375, -860, -142, -239, -51, 154, -952, 21, -731, -706, 280, 111, -433, 486, 355, 37, 265, -988, -248, 344, 852, -112, -338, -448, -139, 8, 118, 1433, 608, 490, 707, -297, -373, 1276, 114, 1040, 1068, -575, 730, -458, -440, 672, -569, -650, -295, 75, -696, 364, -537, 3, 1035]
3953A035j386K0R95j270O33r57N24Q71j156K97O23n47P10j8j421J872l18r10j253
3972a656M76J628n2p74n54J307p74K13l71J63J210q09o56K48M76M71m68l48n41
3991h11P69O72N36j413l52J562k52j108O97J180k567J052j77P7P63j171O15P11
4009G83j29n05j5P4O52N83k136J592j252P86L88M29j842R58Jj050J191j004L40
4028a56M5o63J022N01j068k19O29K11O02j807J114O79k050J858q99L19q80O85
4046g7j394R48o45M16R66m11J255j197p12Q69k52Q23j010L34j346J101K97j00
4064a35J091j376J619j710r81J644M50j034k84J193o74J225n49k01K71Q7K95p31
4082B00k37o4J098j276M55P09l53L6j221k02M45O80r00K080j859M58J415k988
$$ y = [1035, -351, -331, 664, -606, 27, -930, -406, 465, -691, -394, 229, -318, 392, 374, -1047, 825, 507, -403, -1656, -1180, 448, 396, -378, -932, 375, -399, -186, -557, -394, 816, 7, -649, -401, 75, 546, 78, -270, -811, -42, 630, 1166, -247, -599, 963, 711, -397, 300, 1480, -1087, -35, -212, -135, 628, -543, 72, 783, 654, 149, 134, 208, 860, 1443, -693, 899, -353, 433, 821, 1250, -592, 366, 367, -683, 508, -496, -156, -111, -774, 248, 749, -319, -538, 91, 302, 904, -903, 211, 890, -1160, 698, -201, 118, -762, -77, -1471, -523, -1168, -752, 214, -197, 1058, -139, -851, 18, -234, 589, -421, -87, -1433, -332, -35, -135, 956, -420, 1199, -511, -1492, 152, 602, -432, -716, 477, -197, 1028, 479, 278, 549, 636, 931, 200, -37, -101, 997, -279, 176, 885, 532, 568, -653, -855, -410, 270, -630, 1450, -409, 49, 1464, -1524]
4100a524K456K21j036lP25p73L11m62j315K301j346O12n93J99P24j282L86p76
4118a175J665j341M01J93k03Q77j267j4N41O79n46k61p10J425j83j120J074k34
4136a99k80k03O31j255J235R38j067L21r60N60J069q09k59J061j191L40M79K68
4154F79J41j358Q13J90j111P12r5p35J268Q41p81k38N60j311K007j673k91o4O6
4173c80J222p45O10j131P0j253J498o0l76J267p22M26q55j54k20K001j93k518
4191a513J571j5L91p95M03l3P00r38J60l31m45J030m62q23R15Q1k56J27K7R47
4211G41p79q39J06R06j03RK02O04n7p13m79J290r64P46m47j334J241j19J49P2
4231B32m45l84J155L62j006L77O2L27k051Q82O71P82q67m40J290l71l82m47M27
$$ y = [-1524, 932, 1153, 117, 114, 839, 66, 377, -85, -1400, 901, -445, 167, -426, -227, 497, -785, -399, -1175, 490, -851, -450, -257, -460, 417, -850, -864, -323, 356, -190, -451, -1161, 264, 81, -1039, 35, -199, -479, -682, -51, -1306, -71, 867, -200, 121, -839, -279, 790, -19, -278, 783, -408, -68, 411, 679, 820, -538, 275, 465, -646, 66, -29, -764, 504, 1345, 564, 326, 886, -425, 1582, -91, -382, -446, -380, 842, 97, 707, -424, -354, -1607, -109, -169, -545, 722, 0, 426, -429, -583, -803, 1198, 1005, -1513, 58, 43, 434, -361, 42, 9, 709, -229, -69, -400, -845, 185, -277, -1100, -185, -104, -360, -233, -206, 741, -38, -877, -771, 135, 32, 41, 243, 847, 790, 77, -402, 888, -76, 670, 223, -1111, 130, 11, 160, 232, -213, -597, 558, 920, -86, 291, 353, 680, -1371, -489, 182, 964, 97, -343, 947, 576, 194, -253, 174]
4250A74k28PM65p02l48J616o53l83N14J49J54M49k127K87J309j405o3o3K04Q83
4270B39q13L24J575j160j778Q77rO7R93r60N75J139j289k03jK11P26j294J206
4289D25j059J057r46K97J601k154P69p81J368l77O0k10N51n35k08N38r89K029
4307A436j517p3M3L38M71p18j67r6l29K576j326p09r28Q34O76L10K8j109J202
4326I42j070k9p62J939j428K8Q02o28J66P9R70o80J3q49M34K01j020R16j325J525
4346B24k7p81J015j756J317M11o96q08J223m46K52m9r14O96J020j417k43J660
4364F81n63j08j318M86O32k93l13J227o59q35J393J33J110n14j337R25j658N56
4382d55J54J105q74R32j519M73P20r53J232r10m82P39k96Q56j028L79O43j045
$$ y = [174, -54, -47, 418, -284, -632, 984, 331, -52, 462, 611, 765, 1214, -913, -626, 683, -722, -785, -848, -644, 239, -574, -250, 1325, 165, -1613, -736, -745, -678, 315, -645, -70, 1069, -220, -423, -424, -213, 513, -781, 425, -634, 423, -523, -226, 1375, -779, -10, -791, 577, 200, 260, 50, 601, 66, -142, 396, -593, 1436, -81, -154, -111, 227, 698, -20, -187, -283, -612, 1964, 638, -71, -999, -165, 511, 821, 849, -260, 942, -128, -157, -919, 1020, -408, -380, 422, -206, -40, 39, 1009, 329, 342, -507, -73, 128, -892, 24, -1301, 224, 197, -584, 431, -1325, -8, 403, -293, -1101, 122, -324, -72, -121, -1035, -339, 681, -736, -979, 681, 118, 10, -1308, -822, -190, -483, -796, 431, -228, -1063, 330, 463, 1573, 1059, -278, 647, -1011, -455, -301, 804, -70, 862, -657, -184, 536, -417, 815, -95, -577, 162, -134, 722, -306, 73, 716, -329]
4400c29k91m1Q31j164J130K90l01m33rp32O51N82p47R13n49O35o41k05K01l19
4420e28l81J234j156r36K145n93M82j013N11j61k76m54O91o5L64L73J87r75j26
4439f77J131k73p77J556j477J572j463N15k37j56J018j195N62L51o76K82J51k92
4457h5m02L78N76q10J586j829K68L80j83N39K2j246P57P24j466J500o28J327m03
4476A005j323m16J507l05m09J53m42J95r81K06P27J20Q9j040Q50o86J179n81L70
4495B18j538L2J210j05l47O02P38j48k87q98k24J206j835O57Q70q63K89N02k81
4514b02JO45j263J436j252O74k31l66L74j28j8N10o6p49J167j05p07J289r09Q15
4534I15j899J914j978J703o9r08Q67n07J191j874j32J273o27J078l08k27O29j48
$$ y = [-329, -620, -661, 170, -994, 136, 426, 125, -308, -317, -1049, -398, 184, -563, 350, -199, 436, -205, -410, -209, -528, -909, 325, -831, -1767, 378, -215, 267, -746, -235, -396, -672, -1126, -435, -500, -136, 237, 424, -551, -677, 454, 181, -596, 960, -517, 1055, -408, 107, -130, -286, 732, -463, 99, 450, -226, 56, 207, -85, -487, -109, 467, -343, 1243, -586, -318, 62, -121, 418, 440, -806, -49, 675, -791, 709, 81, 1408, 1005, -318, -734, 773, 468, 59, 212, -230, -35, -1016, -810, -83, 37, 126, -914, -64, -750, 429, -152, 218, -1320, -1288, -78, -183, -530, 72, 810, 662, 375, -523, -747, 459, -1376, -719, 151, -712, -423, 79, -202, -201, 444, -819, 617, -635, 39, -192, -558, -184, -312, -330, 180, 114, -635, 532, 427, -280, 1009, 100, 915, -984, 930, -1048, 655, 586, -322, 545, 38, 1229, -645, -777, 496, -131, 947, 639, 412, 1041, 893]
4552H93j616J306k90o02M28K26j50j102K213j503O05l17l52N33O4M0J07p91P73
4571D65P63k407L15J205j860K059l23r67J011l24J48J274j307N82J159l080J072
4588b15n26L71Q89j055J65R3L02n24P13o4m18K90O49P58q86j029Q19l50O63j009
4608c64N67l06R62j445L26R81L60m0n89j93p5R55r13j88m82o85J877j113R51J87
4628G73Oq31l46J064N71q81l26O74R9j158j2J052j160N71j43J70j12L24r27N95
4648Co08k23N89M18j006J732q25k7o25N79K71n84J139k658K150j765J112K32p21
4667h17J99M19L92m91J32o46J180j204J699j99j322O99J1m35L94j94Q29L72q64
4686A54o67J002j23N16j249O73P87k105R20K23j96l28J98l13N22N93j155l3N63
$$ y = [893, -723, 583, 293, -309, 119, 345, 195, -907, 1306, -197, 408, 91, -261, 272, 336, 376, 483, -308, 465, 1228, -1179, -864, 341, -1519, 540, 217, -750, 261, -63, 85, 1359, 52, 634, 1793, -1287, -215, -741, -370, 519, -536, -371, -278, 24, -500, 213, 149, -269, 21, 670, 1428, 542, -487, 332, -18, 645, -364, 203, -103, 859, -586, -260, 721, 1081, 1041, 452, 259, 184, 1139, 226, 38, -444, -1129, 748, -365, 586, 773, 779, -52, -398, 666, 1237, 356, 30, 704, 803, -355, -367, 685, -475, 96, -47, 123, 11, 335, -592, 3, -605, -828, -239, 179, -827, 905, 80, 53, -572, 7, 278, -306, 833, -1825, 325, -1440, -328, -96, -817, -618, -199, 193, -298, -166, -812, 368, -836, 863, 664, -658, 41, 52, -383, 11, -183, 646, 1018, 154, -513, 489, 366, 882, -367, 306, 1093, -1012, -92, 131, -65, -393, -195, -508, 14, 607, -548, -581, -18]
4705a8Q81J82j320k24O47j44R8J3j371J697l0m59p20J15k8P3J345r15P61J93j282
4726e06O71r61J559o78m94l70J255m56P09p01p25R03m24Q59m96l28n67L73k8K75
4746a30J175j597J137n30m2O33l67M26j815m05J870N59j515J047P71p85L11r95
4764b52R63q35Q55l46J476j736n81J899j720O14K6j26J64n2j062nJ551r06J21
4783D8J92N52o37q1p68P49ql14n6m19Q61o83M36M25q38L68P76j549J297p1n09
4804b29L08n58K96M65M41j342O07m29K64l76N55o70M83o90K57K96J89J93J6m97
4824d21J040o18j26q89J467r34K31q4J127J37j111J8k02N92p80J290j363J211
4842E85j12L59j86k17L90n58j88J088q09l83P59p95L11n49M89k58l94M78l97N91
$$ y = [-18, 863, 1045, -275, -499, 148, 4, 102, 115, -1256, 441, 411, -48, -768, -653, -681, -608, 737, -178, 583, 776, -506, 165, -796, 763, 85, -409, -779, 476, 20, 729, 28, -697, 206, -218, 641, 145, -183, -750, -377, -405, -130, 1045, -552, 585, 55, 13, 646, 279, 705, -1110, -1515, 355, 914, -601, 446, 1217, 432, 743, -252, 711, -124, 731, 385, 1861, 125, -456, 1443, -277, 337, 363, 237, 401, 349, -713, -718, 833, -73, 48, 240, 792, 155, 74, -694, 55, 47, -267, -323, -742, 119, -564, -128, 297, -541, -173, 603, -946, 351, 280, -229, 79, -479, -183, 282, 723, -619, -12, -441, -177, -553, 2, -668, -185, -875, -618, -322, -133, 60, 76, -421, 619, 1, -125, -1014, 453, -481, -250, -334, 793, 930, -181, -163, -365, 227, -553, 737, -626, 585, 473, 832, 646, 429, 819, 261, 73, 1161, 352, -31, 728, -67, 244, -305, 184, -74, -468, 10, -387, 204]
4862B04j6m77Q55r50q51J404o9J96n82M56N6l23l91M61J24K16k94n48J18L67k35
4883b79j52O0Q84m72o97j05J218p62L38o70P87l34l20k5l26J481J5p99K06q72
4903h24J943j434n58J192L09q90M91m04J468l60j301J956j326m6P9J81r35J100
4921F41lr31R20q46J172p3q27l70J498q33n00m98Q75M43j267J147K90k40p81P11
4941E28l43j24R5n93m03L29M65M13j237R85lM76p60k2l56M04J59m58O23L74q66
4962c14M62j193J47N20P33j374J312j450J461j118k0L25J089j667R34O07j219
4979g65J796n90o21J61L0L99N7k88m97J334K48r93L91q33J118j015J27m10l5R88
4999F02m1j58o49J236q37P45j21k051K536j415N21m56O10j611J318j289Q95P34
$$ y = [204, 188, -289, 566, -384, -1235, 169, 100, 296, -286, 170, 226, -97, -488, -27, 97, 313, 19, -529, -411, -44, -279, -431, -371, 513, 41, -656, -761, 457, -305, 33, -637, 150, -184, -504, -529, -855, 626, 641, -158, 48, -824, 1119, -315, -873, 319, 628, -262, 229, -175, 1293, 933, -368, 1588, 262, 216, 295, 476, -459, 641, 638, -293, 627, -219, 953, 880, 53, -317, 1181, 348, -152, -650, 225, 668, -599, 548, 838, 598, -183, 528, 185, 61, 156, -437, -840, -511, -46, 367, -870, 115, 112, 588, -172, -194, -550, -146, 13, -445, 178, 552, -314, 148, -1045, -898, -378, 355, -1019, 293, -1157, 304, -814, -834, -509, 580, -1087, -153, 454, -765, 1031, 441, -180, -19, 11, 410, 467, 179, -318, 1016, 1264, 271, 662, -171, 947, -68, 59, -351, -386, 602, 561, 403, -246, 990, 153, 898, 777, -1274, 1262, -153, 368, -88, 522, -1089, 229, -1060, -165, 569]
5017E69n33q0n65R06K80k92p65J148j017j049J383j077R62L54j363J355oM9p75
5036e16J355j235J09O63q97O4R19r57J38Q07j204R35k41R3L96L6o86j60J04M00
5056A23J291r30r0j302R10Q76j244J73J012j012N9o42J96L58N87l50K51q1M2O97
5076I24r58k16K45j99m23J287j306J79M90j34J549j677N77L30j098m06J580j195
5094d51M59m39q78J739m07j143R29p33Q14o05n4J259o51j691O64R03p55j09J153
5113Dm00P27M03j612J076o65j82J173j060P46N38j361J204l26o83K3K64j30J293
5132A032r36P50q44k14k36P95p72o75K268j147j086J695r42r3O82L97Q99j397
5150A76k24m16J684j554J373r85PR6l50K32j189J102j97J049j250Q08n29J19L41
$$ y = [569, 36, -44, -609, 297, 577, 285, -480, 668, -349, -1398, -15, -1092, -130, 224, -1139, 216, 210, 259, -516, 839, -396, -287, 376, -521, -457, 462, -495, -357, 450, -754, 181, -60, 33, 429, 465, -221, -381, -277, 123, 1414, 484, 394, -908, 2, 878, -366, -193, 819, -193, -134, -776, -580, -222, 365, 15, 266, 185, 227, 924, -34, -250, -5, -204, -627, 660, -646, -467, 23, -111, 1438, -239, 338, 668, -430, -836, 744, -451, 8, -431, -1309, 430, 23, -1120, -191, -924, -110, -715, -769, 490, -161, -1852, -1188, -285, -1040, -1149, 4, -396, 331, 734, -878, 198, -467, -649, 524, -536, 210, 748, -613, 591, 265, -418, -395, -131, -261, 1032, 96, 846, 2, -212, -448, 347, -425, -1100, 1168, 21, -1065, 630, -312, -405, 277, 674, 1573, 176, -48, -464, 1220, -334, 1039, 54, 61, 157, -193, 39, -1150, -48, -245, 804, -446, 362, -167, -48, 293]
5169B93p38J642r35j085J336l54k00N8j82p30J288r69K76k51P35J92k77n49M48
5188bO08j130N34J30l18J139p81K17K83r12p76J035j057R91O24j081O87q1o43
5207e33K86j01r1K065k008J055j174M77r30P63J62l76N19N4j55J424k412R61k35
5226b49p9J349j022O80k75m26P75l61n43J8N53k31j60l66L83L51o14J35Q36j386
5246f32K93J307j609P81l19k48J090r8j122O34r52J26N51O65j445J048p23l15
5264i68M5J059O3l59r97M39J803k062J464j337L38N01N08l35l15L2K15N09q80
5283b77M32j97J328n05k71m51p4q32J112R72p46R68j734l56J471j36j422P02k05
5302b21M19Q50o06m24J89o47J145J52j510J090j12o9J0k8N23r09l34N83k9p09
$$ y = [293, -445, 1197, 262, -823, 513, 159, -41, 17, -165, -895, 393, -576, -300, -551, 184, 376, 99, -450, -2, 606, -524, 10, 140, -178, 961, 180, 397, 680, -232, -1008, 27, -1030, -39, 585, -496, 191, 110, -533, -247, -348, -439, 1626, -382, 673, -501, -24, -954, -191, -29, -405, 114, 168, 13, 1437, -975, -14, -249, -328, 1021, -1, 679, 404, -22, 753, 392, -151, -133, 420, 189, 29, -337, 46, 397, -217, -82, 754, -632, -339, 968, -641, 140, -179, -427, 663, 565, -557, 77, -875, -749, -198, 467, -978, 70, -653, -968, -923, 136, 199, -160, -1157, -718, 1085, -977, 487, -850, -512, -11, 497, 162, -153, -121, 94, 603, -277, 155, -42, 1286, 781, 510, 59, -15, -847, 265, 1237, 491, 1459, -275, -631, 840, 704, -718, -16, -221, 198, 1048, 442, 18, 207, -440, 705, 857, -653, 437, 325, 256, 266, 238, 761, -148, -482, 101, 72, -637]
5322f37Q14N19j278p2M78mP86p06q39J460j476K064j073j792K262q96O55j11l40
5341a86l77R36m98J12p8M73J98K8q57L37P76j050j2J150k000J009O03n55K43M13
5361F65j271L11J77p9L61p71J225j67j342J543Rk88J76J69q12k9o50M43Q39m15
5381I4j91n6J04k80J208q5k65K79k89k02j922J488N0o46J223j26j019K5R52j779
5401a437J241L85j40j394J104M26J23r17m50J716j499N06P87l27p51m02k71P17
5419e83J450n45M28p53j79R08j383J28l09l98N05J504q16k54R45p94N54j105J381
5438F84N76j086q28J380j76n00M48j179L90J332j784R28K25k81m1J016r86O25
5456G43j79m97N81j101J108n27k14K2K44n09k8J142j154O19q94P53L00r06K19
$$ y = [-637, 177, 696, -582, -654, -176, -180, 606, -100, -939, 521, -955, 1109, 36, -1756, 506, -390, 265, 154, -186, -563, 373, -125, -13, -91, 382, 580, 608, -249, 88, 864, -186, -198, 952, -1048, -39, 564, 9, 252, 665, -606, -295, -118, -197, 164, -607, 618, 451, -891, 652, 661, 373, 549, 718, -94, -123, -773, -330, 509, 94, -97, -153, -49, -329, 879, 794, 529, 808, 519, 317, -1605, -117, -67, -713, 510, 384, -635, -610, 342, -1437, -196, 189, 49, -1345, -241, 185, 308, -609, -1059, 657, -842, -336, 451, 124, -627, -1029, -1300, -583, 867, 322, 750, -3, -182, 726, -657, -529, -838, -1236, -731, 773, -43, -297, 648, -146, 408, -697, 684, 1260, 174, -654, 726, 550, 50, 498, -681, -291, 1041, -743, 185, 410, 129, 88, 1104, 118, 743, 564, 67, 648, -453, 655, 128, -86, -64, 180, -329, -357, 785, -369, 250, -644, 109, 409, -497, -278]
5475b78R71r3o92N80j097M18r5n51P53o28J378k79l49QR6J46l69l71M7R30M96
5496A021j086r4o3k01K66q12J74M71m79Q31j64k12k03L24L1l91J126m11K50q40
5516d62k23J928r92L8o15M53Q78j043J251L75p16j48l22L36p51K63L81j15q4p1
5536C61K97P7q75J13L71m6j41k69q3o43Q74k3O99j112n86K141j270J92n87K83
5556b27j73P28n17Q84j056l66J234n88k86Q16J53j001l5N55p34J436j114m44O88
5575d7M37j7j285J050O94j314k05M79J10l20M36m06J488j709q2P19M22j151J713
5594A012j110p50J421j344J015L02r59P21n37O70J05k64n05N08l48O26j92p24
5612c53J117j257P81K66m91p79R07l37N26R0j359K49O11Lo16R32k06J91o5j790
$$ y = [-278, 693, 600, -92, 488, -609, -191, -286, -837, -84, -712, 666, 387, 38, 46, 142, 288, -81, -452, -405, 525, 1021, -65, -159, -222, -423, -157, -969, -795, -324, -803, 28, -136, -348, -551, -227, -196, -587, 539, 128, 378, -462, -685, 1243, 251, 289, -326, 127, 1005, -38, 1213, 1588, 872, 724, 402, 738, -13, 250, 631, 516, 432, 361, 658, 735, -140, -27, 344, 298, 157, -112, -195, -838, 36, 13, 712, -400, -986, 1155, -115, 77, -510, -227, -400, 328, -189, 695, -361, -727, 507, -81, -367, 449, 602, -399, -434, 121, -613, 823, -291, -735, -47, 390, 373, -912, 138, 832, -482, -687, -208, -98, -418, 18, -388, 1100, -609, -691, 28, 450, -701, 1012, -98, -848, 573, -771, 244, 546, -413, 308, -229, 441, 546, 282, -223, 285, -63, 563, 371, -353, 764, -493, 288, 554, 63, -716, 191, -146, 380, 470, -889, -640, -29, -26, -642, 290, 84, 275, 210, -1580]
5632a580K063r19j83J662j738l22P09Q46j093N56O37r65J317n45k78O34j440Q90
5650B51l81p53P85N49o97M48p47J413r18P5J16k04K34r16J223p2k11p59m18J566
5670E84J83K75K11n61j146J183o50O51m04K81l63N72j72l78J63j532J707k184
5688a580J196O31o33J308l5j350J222j439P51r63K163j121M47k04j80Q47j728
5705f68J044r41mM23L73j359Q68p9o23J070p37K49Q48j350J228Q91n73o42k36
5724b18n49N39l45J25Q92m64L20N3o77j92J629j094P16r25p44J166q28J297j73
5743E28j22K12o58q8O26M58o7J77j080J33M3r5N76m40M53j80l1o80P60o21q5j84
5765c65J081m24N85j315J094j86L52j345R20k86k37r16M0N53j022J400m91Q42
$$ y = [-1580, 483, -436, -619, 1043, -695, -1017, -308, 538, -555, 1, 638, -327, 990, 445, 167, 801, -639, 251, -130, -883, -98, 451, -246, 202, -545, 868, -50, 25, 141, -63, 171, -745, 478, 406, 195, -564, -982, 584, 767, 1042, 1253, 692, -454, 729, 79, 730, 326, 607, 244, 816, 644, 266, 429, -1103, 604, -1580, -384, 247, -386, 922, 887, -463, 759, -680, 71, -892, 1271, 150, 597, 393, 213, 1060, -668, 376, -565, -569, -146, 227, -1132, -264, -343, -966, 104, -633, -384, 464, -886, 342, 1233, 660, 18, -218, -767, -228, -573, -448, 444, -20, 300, 353, -324, -516, 1113, 19, 735, -190, -934, 232, -596, 701, 528, 406, 618, -40, -128, 498, 956, 889, 1066, -14, 119, 162, 67, 643, 203, 656, 476, 445, -235, 525, -96, -181, -365, 716, 292, 877, -438, 656, 470, 822, -523, 397, 111, -126, -1042, -1002, -449, -1471, -71, -562, 280]
5783B80l81l60qr6M74J16q48R04m07j75L65O33j63K93j412R37M20j618Q90k08
5803c64m77J639k52j063J302m13j25j071N64K70L62r25O27L66m69j99R99j176
5821d05Q07r30J258N40o45J15j456M73P09K70j222Q68j165Q08K21L57k57P7j013
5840e90M76Q53j020R54j225L69J34k77l00J402j218J79L00m94J095k4j264O10
5858d0J00j479J180K01J95l11o77J130k94q3o64L81l49N35K85j113M68P63l54
5877a26M50r94J061p4p19R02J23l38j251J081n55K005k93j674J45R21r46P98q92
5896c76k9l61Q03l7N05q4O84n91M52j175J665j081r53J174j187K011j084j17m8
5915A71r4O43q5l57l69K6n19J555j242n67R19k03N47m01n4p34J835j258k81R59
$$ y = [280, -101, -461, -469, -565, -91, 25, -823, 81, -326, -501, -136, 497, 334, 627, -785, 152, 572, -1046, -156, -364, -841, 798, 546, -517, 785, 372, 247, -824, -260, 10, 372, -553, 74, 440, -29, -228, 771, -405, 402, -528, 730, 1270, 625, 740, -716, -243, 466, 736, -486, 382, -783, 25, 246, 603, 346, 423, -590, -114, 739, -281, 673, -552, -183, -49, -326, -626, 776, -442, -263, 37, -457, 638, 614, -650, -40, 60, -1419, -239, -38, 157, -154, -831, 299, 5, -78, -742, -361, -710, -175, 110, -1003, -535, 228, -126, 324, -670, 391, 317, -402, 500, 623, 285, -966, 115, -440, 1565, 1272, -402, -257, 664, -282, 516, -376, -405, -766, 37, 0, 505, 421, 1105, 514, 966, -209, 1456, 375, -578, 596, -591, 1420, 336, 219, 171, 77, 720, 635, 278, -91, -65, -584, 971, -271, -838, 81, -122, 425, 24, -30, -764, 1071, -187, -468, 491]
5935D91j3q97M82o1R3l35m76Q83r43j4R19J27r05N22n60O60K3P5n54N83o03N25
5957B2m6j19J62l32L28L9q46l76J712j076N88J13k70P32r10k66K000j445N93L49
5977I52o29j36J289k432J383q9m23N94n52r11L22N96K74m6p39J161j292O17N76
5996E15o02k41J200j664N89L21j85j59J70k84K52Q28k344J787m04K90Q9j98p76
6015h16n96J150k23J41j22J644n99j174J93Q64M05r15j95J1R23j114l50R03n17
6034c87O66m27j160Q62K090j360O48o9k067J174r47J353j307J579j013K334k134
6051a65O91L9q51L73k53Q49P79q83k85o2O47j985J704j94j25O37n49m22J85j08
6071B2l30K44m30P45k11j823K393j794J105n44J071j075k8P0O93l24k072K460
$$ y = [491, 478, -419, 63, 2, 95, -240, -716, 167, -776, -790, 129, 256, -649, -127, -687, -27, -4, 71, -483, 100, -503, 22, -24, -143, 19, -313, 15, 54, -792, -1168, 544, -532, 56, 169, -101, 631, -279, -545, 1455, 10, 603, 952, 323, 187, 1476, -956, 427, 338, -85, 509, -43, -954, -632, -36, 238, 192, -547, 614, -678, -61, 515, -87, -328, 872, -792, -203, 118, -67, -226, -56, -340, -88, 740, -1604, 183, -221, 69, 158, -40, -816, -1412, -262, -485, -344, -466, 1178, 579, -595, -402, 462, 867, -48, -243, -232, 691, -423, -773, 130, -387, 279, -148, -1308, -446, 1644, 284, 932, 863, -1204, -30, -977, 376, -931, 648, -365, 1969, -165, 526, 565, -286, 87, -166, 683, 1462, 579, 294, 232, 879, -1106, 598, 404, 279, 916, 367, -55, 130, 22, -308, -64, -494, 251, 40, -1783, 610, -1184, -79, -623, 448, -627, -655, -585, 108, -216, -2288, 172]
6089A72r67k63J066Q2l69P36j248j350K299l60J87m67j02J992j362l80P89L61
6107H16j066N31p96J96j21l8L52Q5j19m05O10j019R94M04K9j71n91J286k3q32
6127A22l73j94J280p64N80l94j8J55R3ml22j46j064J348J54m7q56O89M00o83M40
6148C96j028J299q48m9M61r55M72m59K41l05J241j46O03j189L92l13k33K91O05
6167D76n60J49p75K87J37M0k76m95J325r61N06L53L29q78N27p29J791k059%M16
6187c97N55q49j7O16o63j35J924p69n73M80K53O1j78q92O16Q08j370J834k629
6206a325N92O26N80r87J106j168k3J105j235J43m35J994j426j77R42m61k42J63
6224b28J174q09L46M94j709J260l17j021L53N67n97O74j160J064Q1q04J129k008
$$ y = [172, -795, -1058, 8, 90, -279, 457, -791, -2141, 158, -202, -15, -482, -584, 1408, 46, -334, 455, 816, -250, 281, -515, -319, -440, -478, -126, -41, -160, -565, 45, -974, 20, 424, 453, 282, -309, 977, 954, 122, -251, -445, 835, 71, 651, 257, 239, 394, 487, 483, 161, 15, -1049, 299, 453, 406, -450, 239, 639, -44, 396, -632, 667, -181, -230, 231, -724, -252, -711, -470, -775, 466, 320, 923, -266, 126, -187, -420, -129, 476, -84, 65, -710, -423, -286, -246, -522, -1017, 308, -653, -147, 206, 535, -343, 184, -545, 1246, -813, -813, -397, 158, -691, -708, -92, -755, -890, 1034, 265, -308, 172, 425, 486, 308, -584, 32, 840, -530, 1304, -1325, -733, -107, 473, -514, 592, -576, -599, 506, -729, -586, -1021, 973, -453, -630, 312, -149, -391, -228, 946, 137, 483, 977, -732, 528, 211, -810, -457, 110, -487, 187, -973, 91, 172, -632, 497, -1511]
6242a511Q45K00L65j738J101P06J58L66j020J021o59l89K87Q38j797J819L94J9
6260A005j519K52N23L01j197Q73k3N90m78j54J7k24J186j277M16n49P20r35J15
6279c58J31K009k133K48J07l63J189k03j126J119O61j721Q82j309N85M69K72m4
6297D15Q56j894J869j219p8O06q14L79K9o85K08Q45o00K49n4k49r8q55R50N31
6317C91j145J024J280k395R33r26J420j781J162M85k056K510k388J886k25qJ31
6334B98o08J3J34P68r18R97o59K77L90q32M34o56k16M12m94Q71L72m35n15J984
6354A617k798P94L68j563J587M81K56p75J885j347j075J04K6P48Q92j766q80J502
6372E6J45q43n62J436P4r74n68J116q71O37p2O99q70Q37o40N54j352l50J774k385
$$ y = [-1511, -666, -466, -101, -1839, -738, -32, 126, 492, -528, 493, -166, -555, -268, 570, -1227, 592, 986, 1005, -514, -262, 261, 562, -635, 238, 215, 805, 327, 173, 190, -34, 1152, -125, 291, -258, 462, -473, -358, -227, 1782, -351, -103, 4, -359, 830, 627, -499, 620, 1281, -440, 442, -867, -282, 187, 459, 415, 1271, -623, 1246, 27, -51, 555, -259, 120, 149, -536, -328, 517, -83, 166, 112, -137, -235, -1090, -140, 391, -754, 270, 1550, -845, 88, -838, 582, -1199, -37, 448, -1608, 902, -1486, 400, 175, 167, 298, -310, -297, -163, 605, -313, 684, 25, 302, 692, -140, 294, -362, -578, -166, -660, 211, 583, 148, -367, 1617, -1181, -387, -19, -1582, 5, 486, 742, -33, 1852, 505, -570, -466, -440, 308, 1200, -566, -1446, 56, 201, -642, -1204, 232, 306, -668, -1236, -120, -991, -354, -426, 273, -597, 240, -400, 154, -1198, -1548, 226, -2159]
6392b159K025j00k76o72J162k85J3K91q08L15l52J219j426J097l08r54J015K82
6410G9q53J599J4q88K19K43r3r03R10q65M85R91j534J968j419l87J678j044m86
6429b86L07n2O08n22J42j29n5m11J65O99j434J070o50k3M89k34M91l36j815J477
6449d99J265k23l23l95k62Q20p90m32J555m11m49M30j188J280j003Q04p35L3R65
6468D42j488J681j508K029j330n64P18N6N37r97Q87m56M8j067O07M16m11Q15m91
6487g6j75J86m27J07L60R6L57J03O6n03P27j39K42n10o43J430j067k32J150r75
6507G7Q2N31j002L83j4n26P69j26r89J337n39O0j68p20J078k25L15p78O01j62
6527a6O02j40j448J133p28l80RL74n38K629r67l24l33lK5j413J603L66O8M25q9
$$ y = [-2159, -134, -234, -510, -1182, -20, -305, -292, -1, -809, -494, -846, 373, -1053, 44, -264, -1218, -203, 79, -774, 825, 839, -49, 170, 413, 320, -583, 327, -538, -53, 938, -596, 1372, -47, -434, 1244, 200, -286, 21, -31, 577, 55, 197, 68, 13, -398, -233, 466, -968, 102, -548, -571, -82, -316, 175, -161, -1976, -499, 766, 543, 220, -175, -437, 383, -407, -839, 716, 305, -144, 286, -902, 378, -625, 179, -556, -523, 442, -1046, 635, -873, 1156, -174, -738, -20, 36, 573, -424, 463, 7, 55, -1012, -405, 11, -400, 415, -76, -251, -65, -492, -385, -25, 71, 428, 531, 597, 94, 821, 682, 924, 414, -229, 1201, 134, -98, 1052, 77, 159, 690, -312, 71, 57, -469, 300, 174, -815, 522, -17, 43, -125, -845, 233, 8, 323, -455, 146, -16, 586, 446, -1002, 131, -597, -977, -968, -594, -1132, 1497, 530, 206, -127, -130, -105, -1518, 85, 451, 519, 944, 855]
6548H55r80l75J152r58p12J388j119J163l87K55q21R74l33L24l37k02m27p03P37
6567e06j143K258n81j45p05P72N08J31o3m00m5K75m55K2m0J42P93j045k95M98
6587b4K33j576R38J322k4q8n39Q94n24j167M63J033p7j153J1J21P05l82n62K25
6607a71l4k11N69j561Q74N35o19J578j536R21n54L77l69m59P14q45J186r38L89
6626a54P7j77L16n49J038p99k32m48M31j61O25M04n26J110l49j166N92k28P68
6645E72m52J1J8K00r19K45N14j72Q32l00N73j437O80N34J36j070J89j51K70O6
6665C39o08N9K88N58j657M73qJ10J257r47o32j02J436j558M02J025K18m09r27
6684f83J121O2n26K25q99Q74m24N48q66M33K26j81O91j093R63r29L28p46J402
$$ y = [855, -125, -500, 652, -306, -1018, 370, -749, 414, 27, 282, -539, 435, 102, 426, 89, -113, -540, -1243, -506, -1649, 609, 28, -117, -822, -50, 458, 589, 526, 126, 81, 356, -99, -77, -117, 25, 818, -227, -522, -24, 209, -1367, -429, 893, 869, 781, 242, 1136, 612, -555, -92, 941, 864, -289, -278, -157, 548, 166, -396, -171, -205, -416, 153, -1408, -534, 1, -618, 960, -576, 345, -209, 168, -201, -660, 54, -791, 395, -543, -154, -77, -254, 62, -487, 551, -248, -480, -928, -497, -658, -33, 371, -155, 955, 606, -560, 32, -196, 572, 120, 131, 149, 349, -570, -325, 189, 17, 849, 549, 1122, -315, 365, 899, 1035, -35, 154, 3, 273, 339, -269, -210, 78, 636, -1021, -548, -556, -446, 811, -136, -768, -870, 566, -992, -590, 435, 653, 244, -683, 438, 500, -26, 199, -700, 174, -250, 298, -568, -135, 91, -90, 601, -492, 471, -458, -130, -876, 526]
6703E26j140J490n72M83m62j74o32J411j209j10J767j946N90R97j759P51M48r52
6721d93O41k33Q45m8r17L56Q27j208J729j360r63J755p49P3j95R8J24o35L43j279
6741a289J880o65N30P1Q8n25K92n41m25J004p21O34J62j147N01J367k180Q76o11
6760f99R97O52j443O48R10k431K500j071j134K2N85q80rJ211q0J92n08P34k75
6779g9j62j017R51k88P96k77p7N82q42K63P06m60L20L30j519Q37K121j690j42
6798C53j89j286R72R11M93k107J757K80o52j517O56J592r12q96L40J134j195M00
6816A34q54P0O46n97J847j338N11r0J83L49M33j748J018n10k37N92J001k027j27
6835g44O96R6m90N07lj53l32j13K80N40J129k105Q47m40R67p24r8q03j1K314k235
$$ y = [526, -614, 876, 304, 787, 325, 151, -481, 930, -279, -389, 1378, -568, 22, 1019, -740, 11, 459, -493, 148, -85, 760, 712, -205, 151, 978, -230, 1499, 139, -824, 931, 182, 255, 60, 158, 282, -353, -10, -1289, 591, -74, 456, 527, 615, 90, 382, -159, -584, 420, -301, 333, 495, -652, -151, 1216, -964, -88, -699, 298, 950, -493, 155, 1065, -1366, 1134, 63, -1071, -1049, -464, -1344, -1353, -142, -222, -30, -538, 196, -79, -241, -1258, -307, -595, 201, -76, -153, 429, -413, -150, 556, 96, 416, 746, -773, 64, 2185, 495, 353, 164, -1122, -150, 761, 1254, -853, 904, 1184, 532, -985, -329, 1263, 351, -545, -205, 929, -266, 134, -720, -650, -4, -601, 1246, -92, 419, 329, 512, 861, 1294, -454, 564, 54, -183, 409, 1410, -617, -744, -48, 48, -442, 65, 62, -91, -423, -536, -256, 284, 1413, -692, 155, -285, 682, -42, -140, -943, -954, 1360, -875]
6856h75K005j132j018K118o52L06j338R94j590J676j128J075Q13r73l50q64R65
6873C2o16O84M12M48r39L42n76N52J05L67o58J397K94k529K48R86j858J087o4
6892b86O13O29r63o24m42J754j913J065P50k89J40j050R40l56j198J193J97r18
6910g58J359l90k249J917n18J365j239N24j56j161k9J541l45m33n43K104j520
6927e31K052j075o1m19L97p93J26k82L59J459j584J122p47N42n22k89p49O89p36
6946a042N55K092j876N96j215J831n02J135K57k570O5J441j250J489o84p26o03
6963a007J175m46K16j00Q4q1Q04l13o25J82p33J558j904J543J67p89n77Q08P99
6982G61m66O29j464N90j064J240P4r16N35q3J171l05j31k99n41O90j48l79o98
$$ y = [-875, 1130, -2, -1020, 1098, 446, 752, -586, 408, -1182, 494, -634, 441, 1254, 281, -69, -933, 32, -584, 100, 512, 960, 21, 363, -213, 339, 444, 811, 153, 1550, 1844, -685, -437, 549, -1309, -222, -286, 327, 956, -7, -631, -1073, 681, -1232, -167, 583, 294, 434, -616, 324, -32, -1230, -37, 160, -758, 601, 211, -2038, -121, -639, 726, -513, 11, -145, -1306, -1335, 206, -139, -572, -1115, 989, -531, 1521, 446, 385, -34, 363, -430, -304, -586, -227, 1232, -352, 770, 23, 565, 43, -246, -995, -306, -1042, -487, 1605, -271, 325, -890, 941, 439, 1574, 1831, -739, -674, 767, -483, 1006, 322, -404, -1007, 168, -278, -62, -162, -78, -159, 645, 332, -293, -111, -844, 714, -1190, 353, 520, -269, -846, -38, 761, 295, 924, -540, 50, -1014, 226, 300, -616, -81, -164, 1007, 702, 571, 272, -269, 421, 273, -106, -804]
7001h04J49Q39P70p48k81O14j338N71j31K71p52M22l46Q15N74p51Q01p76j85j20
7021d06Q72p71P36R57j953J577j233K86m81R03N38o46j53p30L77N68L31k90n56
7040g4n13R43j90j73N85q34N5O37q23K13j52P27j220OJ270n6m94r2N96k04j10
7061I7o8R24k070J198m90k15J021k334L381k802J089o50L46J279r83L38n24J106
7079F43l66m91R03j35j136m71K170j816L48O30n53L31q1p84N30J269j029J077
7097A039K06j435J470j489j52K47K07j54m63K237q02J6j460J609p39o06M58J132
7115A321j540o58P39l4K044k036J82k5k71M58M42n36k32M3m03R88l72K41j250
7134h99L80l62Q84O57p75O98r64j34k53l45J351j276O24k28J44P30m23L5q53J469
$$ y = [-804, -655, 184, 954, 206, -75, 539, -799, -228, -359, -88, -840, -418, -764, 51, 625, -126, 675, -101, -286, -406, 466, -305, 431, 1388, -565, 1012, -221, 65, -416, 487, 1025, 379, 226, -504, -127, 441, 772, 482, -74, -587, 356, 166, -7, 578, -256, -201, 436, -387, -174, -326, 401, -819, -813, 457, 401, -93, -185, 411, 207, 97, 29, 953, -1117, 81, -409, -624, 397, -1937, 1444, -1358, -269, -919, -573, 706, -277, 61, -463, 643, 277, -214, 689, 554, -582, -1053, 1117, -699, -351, 279, -274, 57, -24, -808, -278, 991, -38, 1039, 1245, -190, 1280, -209, -361, -114, 93, -61, -524, 1713, 911, 927, -533, 1076, 337, -269, 189, 1321, -219, -877, -138, -172, 1872, -164, 18, -7, -278, 180, 622, 86, -146, -103, -506, 482, 110, 351, -899, -519, -881, 3, 660, -115, 583, -381, -515, -768, -1113, 238, -1038, -414, -642, -498, 232, -191, -156, -1009, 460]
7154D60m49m14K89k95J304j533O79n22L25Q32J90j002m08R36k98l71n26J381k56
7173C22k77r07P10j67J01L88o91J079m22O52o41O12J79j423M98k13Q83o54J087
7192A116j056j502K048l05n69J24j21o35l28R11k05J561k70j041Q06M5n62p07
7210f90R74j45n61M04N38n48o52R23o60M07k63l94R76n80O02o56l55L54K79L71
7230C24l19l84QM68K43p89j27n7l8J475j402L83O8o68K20m04J216J24J092j246
7250A87N8L78j039K58J77L83n60R6M80l68p7M26l70o23K79J526j328K58J411k471
7270i19J94N81r34K168j656Q12O06m45l25m0k46K88J135q92l28J96j94J37j190
7289a052P22q06Q46J29k69J06L38J76p20N58l61j6N30k89RP3l48J96O71o65n36
$$ y = [460, 11, -403, -114, -409, 895, -638, 41, -481, -156, 676, 866, -136, -544, 392, 94, -277, -803, 578, 322, 45, -862, -152, -319, -218, 170, -521, 558, 136, 788, 147, 759, 938, -485, 13, -200, 683, 29, 1116, 60, -1442, 606, 301, -268, -144, -265, -900, -1228, -317, -522, 1039, 769, -272, 534, 579, 17, -690, 284, 139, -422, -18, 520, -28, -680, 243, -417, -10, -273, -667, 309, -271, 331, -325, -680, -326, -47, 324, 5, -379, -371, 97, 340, -449, -576, -633, -671, 804, -598, -215, -147, -815, -595, -999, 217, 341, 1433, 187, 245, 623, -416, -158, 19, 402, -158, -62, 418, 50, -27, 399, 29, -594, -315, 1211, -117, 141, 1552, -919, -725, -144, -1078, 1090, -566, 246, 852, 407, 82, 42, -204, 84, 1219, 327, -1, 195, 1, 138, -1052, -330, -1136, -290, -161, -430, -324, 14, 190, -530, 28, -333, -349, 181, -108, -99, -26, -374, -178, 493, -172, -708]
7310g08Q92n11J001n62j59l45J60M39k61j84m5L65k44M37K81r11K80M54o9K60
7330E70j84p6M57j86q22N90N16r42j61J050j108M22o59J065m63j61P13m25J28
7349C24j531J306m15j44n6K34O11m07m67J282k61l77K68j174R29n99M9J732k027
7368g23n4J079k02p18J169j81o3M29j222P43K66j064J012q00l18L62l53Q42j35
7387F9j058O55M0M58k77N04m8j301J515m03n57L18q9Q67m47r21O58k77J237p54
7407A89N27n25o5m51J195o89L67p83L25p8K41j246J37Q74Jk76M16K57j347Q50
7427h1L87r09n83J034M47p60r6M60J8m03J181r18O47r24J88J075j96j170J393
7446G90k58q71k01L76M21p93M17J61P99j109K35L1n50O99K05j261O05N61j13p06
$$ y = [-708, 184, -327, 674, 112, -47, -392, -232, 207, -54, -238, -283, 82, -162, 275, 556, -355, -75, 379, 310, 570, 386, 310, 767, 581, -241, 349, 865, -77, -238, 812, -296, 126, -533, 532, 69, -92, 621, 196, 324, -1207, 99, -316, -460, -516, -282, 329, -78, -545, 737, 476, 99, 367, -807, 122, -477, -428, 1304, -723, -777, 302, 100, -618, 551, 370, 307, 736, -486, 257, 523, -541, 471, -329, -647, -285, -638, 204, 69, -989, -334, -294, 164, -113, 391, 343, -958, 557, 154, -403, -85, -174, 693, 246, -675, -17, -294, 943, 189, 716, 191, 126, -325, 870, 181, 548, -235, 90, 12, 253, -993, -856, 18, 19, -257, 159, 416, -931, -81, 306, -603, -1186, -152, 295, -465, -561, -101, -83, -486, 695, -223, 424, -500, -312, 763, 567, -603, 790, 532, -339, -540, -164, 257, -536, -119, 42, 841, -268, -33, -2, -552, 147, 352, -909, -304, 257, 144, -562]
7466e62N75J18l85o6L36J166q54R0r61K2o51N36O33O85Q25j219O24j345N26m80
7486c87k06R20j095J558j735R64j141J526o43J525r20q99L41k07K064k046l11
7503f92j02L90j72p8P42N47j62k40l1j064J372n32m24M96j324O08P18L54N95j107
7523a06k00P0P85j23M59j410N85k62P07j029j96J058j323J145M31j023r7N0O09
7542A30l89k21j02J333n59L03q76J104j54p29M17j109Q34K63M8kk75Q64l12m66
7562A02N78l47nj16O4j31r49J460k49j012J065o81L6Q05j093P79q13M81L30q30
7582e26J294r41j09O0L32q02K97m38o2P2M84P86Q39n71j969J894j452P23K77l92
7602b04n63J407j233M00J20k17L64M75q75j07N80l77J293n18o34r3P9O25m39p60
$$ y = [-562, 13, 131, -254, -320, 16, 1182, 328, 418, -543, -521, -1172, -636, -3, 682, 1507, 288, 912, -433, 93, -387, -593, 327, -768, 790, -945, 19, -1122, 404, -239, 1286, 366, -533, -192, -399, 1665, -381, -692, -794, -404, -576, -654, 88, 635, 473, 233, 202, -862, 510, -22, -446, 50, -1274, -666, 52, 406, 1001, -106, -306, -236, 549, 426, 885, -525, 60, -202, 505, -524, -720, 338, -985, 160, 591, -432, -529, -479, 130, -259, -480, -582, 751, 192, 495, -381, 723, 569, -160, 257, -852, -18, 245, 293, 291, 16, 880, 568, 102, 680, 333, 328, 212, 276, 145, -804, 656, 407, -605, 460, -221, -185, 620, -473, 306, -507, -26, 304, -526, 768, -173, -282, -222, 110, -692, -395, -833, -895, -823, -339, 447, 1286, 715, -1254, 640, -812, -89, 188, -204, -767, 640, -593, -193, -73, -290, 74, 549, -326, -433, 147, -230, 1063, 545, -89, -182, -103, 522, 83, -677]
7622f77J101n31Q09J77p51k51p3M05k91j54m4r0k0L68P55L51L81j323k77j88J43
7643a80L87J38K66n99K56q03R94n2p08N02K53k09k58l68O13L67k15r56j63K31
7663e04J023j258J261q69M59J80j356M34n84J605j098Q02m02K51R18j302M02j091
7681a129K103j061M28q40K52L57q9L7o52J385j025j57J157j340J087p65L16p19
7699f55O09Q3l91k42Q43L89k34j298M52J003l41j018J017j32L71J39O46j5p22
7718E04n45m07R59N72m91r33R97j204m8J620Mj165j25P30k33l68K13M42j278o5
7738h21M36n18O4L70m48J043J04M82r82l81K55N04L77M53j575j62P81M42j324
7757i00j53K075j252J32K80m70L94k75M80O01p04p99Q12K47l76P42j857J353m77
$$ y = [-677, 424, -107, 702, 879, 128, -123, -196, 209, -82, -236, -280, -370, -390, -22, 733, 1084, 1465, 142, -135, -323, -180, 207, 345, 611, 12, 268, -535, 459, 407, -301, 201, 454, 245, -13, -381, 232, 599, 384, -572, -735, -504, 519, -739, 522, -347, 112, 292, -1064, -630, -1214, 391, -707, 95, -307, -56, 862, -440, -38, -1129, 974, -87, 341, -499, -247, 110, 21, 58, -594, 791, -234, -391, 766, -574, 513, -252, 64, -655, -46, 37, -354, -596, 247, 636, 402, -896, -444, 559, 218, -800, 217, 85, 456, 595, 1241, 1226, 504, -41, -448, 511, 1083, 592, -341, 656, -548, -596, 1024, 1028, -137, -262, 468, 235, -133, 80, 522, -756, -821, -385, -903, -839, -469, -917, 126, 230, 712, -270, -651, -396, 108, 485, 938, -637, -799, -18, 424, -900, -1053, 1022, -230, -98, 182, -288, 106, -169, 311, 912, 208, -591, 221, 468, 92, 834, -1023, 330, -147]
7776a47o21Q30n72K68J591L21k136J534j527J065n22k16Q86m12N77o78n71o04
7794i34l42J740j826J876q83K06J79p8r07J022P10l57l87l17k84L28J1M65o84
7813d62O80L1j428J323K74j270L01J257k356L118j608Q49p24m39J85m58m04R91
7831a40N96j67j321J458l37j115L39J296o08m6m62K020k431J073P48q05K64m07
7849d5L37j75J69J070j084M65j105R06r86J212q79Q65j085N09M43l55m26p49P31
7868a82K53m12O99l86K86K04j36q24K03r65J033O24o27L85k06m00K40M13R12j187
7888g3l75L24j031Q12k54R25L26m03J30J40l2o24r8J093j705K97J665j052k74
7907b09O17o88m0N04j071N05M48J23m7m90Q02j433O42l93R98j5m44M73p57P13
$$ y = [-147, -768, 62, -510, -242, 1349, 1670, -466, 1068, -459, 606, 84, -132, 754, 342, 919, 241, -330, -934, -1276, 464, -1362, 514, -369, -163, 16, -62, -969, 53, 763, 406, 19, -298, -582, -254, -243, 222, -462, 218, 249, -1179, 144, 418, -852, -551, 706, -1650, 1468, -140, 709, -15, -454, -269, -727, -1131, -140, 456, 289, -1032, 426, 89, -1026, -687, 609, 1, -45, -507, 1513, -918, 155, 903, 98, 362, -45, 292, 117, 286, 1356, 272, 737, -368, 538, -448, 764, -115, 750, -335, 174, 617, 262, -164, -913, -182, 71, -341, 358, -28, 258, 462, 326, -498, -295, -1260, -227, 397, -230, 155, -51, -451, -211, 202, 1114, -73, -448, -124, -1155, -343, -597, 328, 654, 251, 381, 521, 489, -135, -233, 860, -845, -548, 1117, 65, -209, 408, -280, -320, 184, -887, -382, 66, 189, 142, -348, 454, -979, -337, -730, 268, 253, -191, 282, -475, 238]
7927B38K75N85j140L81p56O03K67k94k21L34j003R44q98L7R75K75j150j25J003
7946C30l38M00K96p83j65P69j094R36j70r46O64J23O52j139R67j371l12N71L91
7965b19Q97j021L03p59M93L17k19k90J113j296o1N56j1q89R44J81q63Q72o58K5
7985e85P28k24p89J162n34M06L52l96r43R02p25J167k39n20M7l69J14J011r06
8004c41Q67m45L97j94L31r96J333m39q51L65k51N75n82P29n79P52r46J107k12
8023F20r1o04O09J08j952K037J25q98k44J74K79j074J202j09j047j17J323N85
8041I26k718J249L73k8N3j01J048m99Q9L11qn92q15O09M49k88l89k36J78L19r39
8062a009L51P40N47r33k91R90M88j538J031J81PP14j836N13M1L47P95j581Q48
$$ y = [238, 513, 1098, -42, 339, -417, 186, 453, 159, -62, 272, -731, 213, -685, -648, 327, 602, -548, -673, 330, -8, 392, 688, -95, -260, 509, -585, 351, 181, -765, -101, 22, 674, -465, 502, -869, -1181, -610, -219, 678, -343, -40, -799, -306, 11, -208, -498, 615, -681, -742, -186, -197, -1086, -142, 39, -824, 48, -610, -585, 143, -81, -870, 292, -242, 164, 516, 120, -823, 79, -646, 521, 282, -238, -191, -560, -446, 565, -341, 526, 81, 478, 284, 615, -381, 952, 513, -338, 27, -224, 351, -231, 498, -81, 671, -275, 832, 620, 529, -75, 534, 642, -1310, 727, 852, -46, -290, -116, 163, -911, 291, 182, -865, -982, 341, 926, -1792, -543, -170, -198, -145, -246, 802, 303, 392, 703, 695, 103, -712, -103, 346, 58, -331, -567, -389, -70, -1009, -658, 82, 629, -304, -595, 395, 883, -655, 376, 557, 564, 1278, -558, -45, -4, 343, 1138, -443, 405]
8081D05q17J169p81L63O09p96N67j034J95l54r49J663m97J271j941J364j224J99
8099e88J296m54o48J93K93J07k42n75O91j053P99L98j221J253J38p69O02K87L4
8118E41r51M36j10R6O23k57r26J250p82K03k69M0k11K82M68j194P23L90m03l0
8138h1o87P32l45N06m24L58l10Q69o93K11j216Q07K65m33P93J2m25N45m70J095
8158A109j490N66K14m89Q74j053L84N91J25q9ml71q88P54o34J065n81l98J01J068
8178H54O08k282J581p66n70R06l64Q4M43q12m34n01J508
$$ y = [405, -412, 757, -24, 339, 948, 152, 719, -315, -120, -474, -1423, 240, -257, 1014, -927, 437, -787, -588, 708, 254, -394, -201, 92, 199, -43, -618, 73, -980, -181, 217, -1004, 249, 387, -382, 220, 507, 541, -410, 26, -84, 12, 635, 378, -548, 702, -80, 123, -146, -106, -317, -35, 433, -761, -38, 352, -51, -81, -768, -36, -381, 125, -299, 59, -251, 618, -75, 136, -1080, -273, -8, -441, 352, 364, -61, 484, 14, 1109, -381, 185, 399, -90, 784, -269, 115, 706, 831, 742, 738, 367, -521, 233, -401, 664, 83, -315, -214, 854, 1462, -820, 761, -5, -575, 331, -33, 51, 494, -318, -752, -1253, 255]
8191B55
$$ Imaginary data points
##PAGE= N=2
##DATA TABLE= (X++(I..I)), XYDATA
0@%%%%%%%%%%%%%%j08K16k16K16k16L24m32M32n40O48p56Q66r74J188j396J587
30H39j805K046k272K576k910L259l683M126m623N163n740O379p090P858q686R603
46E040j0599J1684j2877J4183j5616J7209j8969K0911k3084K5536k8317L1499
58A6600l5177L9503m4665N0922n8734O8795q2278J01401j30824J82292k98253
69a90418J040494J68352j111595P59645l11961L44406q5520o07275L00327M25214
79G31669m78399J35667k39540O957M20237m62843o9823J85666m3795J33805j33503
90A86098k18329K74783J78393m32819J51804j6051N1770O9444l18504J25925J58370
101B10884j21385n0793O2757n4087J25876j44064j06629J68731j91651J05995
$$ y = [0, 0, 0, 0, 0, 0, 0, 0, 0, 0, 0, 0, 0, 0, 0, -108, 108, -108, 108, -108, 216, -216, 216, -324, 324, -432, 434, -540, 648, -748, 839, -966, 1080, -1192, 1384, -1526, 1733, -1950, 2176, -2447, 2716, -3024, 3355, -3735, 4123, -4563, 5040, -5559, 6125, -6752, 7431, -8185, 9024, -9945, 10966, -12118, 13418, -14899, 16600, -18577, 20926, -23739, 27183, -31551, 37244, -45034, 56367, -74457, 107835, -190418, 850076, 1018428, -93167, 666478, 354517, 698923, 613403, 6128, 306455, 731669, 253270, 388937, 149397, 156354, 576591, 113748, 43925, 229591, 185796, 319601, 186098, -32231, 242552, 420945, -11874, 139930, 123879, 175649, 245093, -73411, 52514, 210884, 89499, 38706, 101463, 47376, 173252, 29188, -77441, 91290, -100361, 5634]
111E634l2947l4416P5538j7654N3789l1877J9017l3741L5251m0648K0838M1919
123F0703M3635o2640m8521K30732j17830m5137O227M8358Q5794j72419q895R3375
135A13382n940o9626O5069n8151M5441N0500j41985R7662m9031p8551O4166k0814
147A2122m0911J20826l2355n8638J14815q1800R7735o6591j43092K26586j6573
158A32124j48717M1957J3136O5173M2383k36752Q5055J46502j29228j0505p4839
169g3711O6000J07154j44897n2134J22719J2582R099m4195r7310J37850K2594
180F5751j03405m1093J2982J27781K7089j73551k807J74875L529r2674j05161
191a06684Q6975J24971r6451p0787L3021P9712J1499q3853k4768Q7050j7140o537
$$ y = [5634, -27313, -61729, 13809, -3845, 49944, 18067, 37084, 3343, 38594, -2054, 18784, 60703, 104338, 41698, -6823, 223909, 106079, 60942, 67169, 115527, 201321, 28902, 20007, 113382, 107442, 37816, 102885, 44734, 90175, 140675, -1310, 96352, 47321, -31230, 32936, 12122, -28789, 92037, 59682, 1044, 115859, 34059, 131794, 65203, -77889, 148697, 132124, -16593, 25364, 38500, 103673, 146056, -90696, -5641, 140861, 11633, 1128, -73711, -7711, 99443, -45454, -97588, 25131, 37713, 46812, 2617, -94693, 43157, 65751, -37654, -78747, -65765, 62016, 89105, -84446, -87253, 87622, 91151, -1523, -106684, -19709, 105262, 8811, -61976, -28955, 50757, 62256, -21597, -46365, 40685, 23545, 17008]
203A7008j9855m8698R2224j8527k1399j679Q067Q5451k5477j04720P4512Q2036
215A18943r7382n881l4376R0099N9117j56092M3120Q7368j2417m4513l3537m840
227I609J13792p2209p9962J08458o5961N4995l185q1293N4436M1906l5011k7040
239A8535j6014J5059J13858j56443j4981J16570l3151J995p5851L0920P0255k8979
251D1773j16184P7003M0259o5629K6178m8855Q0348m1194m0686M2325J5004k4942
263a4600l0218M0961l5510P7272n1455l3648L8900J4913L4339p4023p523J9578
275b1014J19403r2908r2599Q6812M6795K8693j33076M94J01168N0173j40991j1865
287e8915R1432j6556M7492j41676M5983Q7540l9211j4486k7377k805P4036M0443
$$ y = [17008, -2847, -51545, 40679, 22152, 753, -926, 7141, 92592, 67115, -37605, 36907, 118943, 21561, 15680, -18696, 71403, 130520, -25572, 17548, 104916, 92499, 47986, 14449, 9609, 123401, 51192, -28770, 79688, 13727, 68722, 65537, -15756, 38680, 80586, 45575, 18535, 2521, 17580, 131438, -25005, -39986, 76584, 43433, 45428, -30423, 497, 70752, 41773, -74411, 2592, 42851, -22778, 3400, -45455, 34893, -6301, -46987, -4662, 10342, -14600, -44818, -3857, -39367, 37905, -13550, -47198, -8298, 6615, 40954, -33069, -40592, -21014, 98389, 5481, -87118, -306, 46489, 75182, -57894, -57400, 43768, 93941, -47050, -58915, 32517, 15961, 63453, -78223, -32240, 55300, 16089, 1603, -25774, -28579, 45457, 85900]
299H5900j80082R0273N3418j4411R291j42154J13984Q6202r1852p0165P5580M462
311B0446M1292o1422j00941J89111q1076m6626L9675n0912N2100K8413p9251M29
323d8762Q0892q2435O7823o8568k4848J36878j07981j1335L2587J3260K7222k2548
335g815r0172J17010N1408j57407O9378q942M1180P5r8183N2217O2931l9616l8505
348d6441M1599l9691O5162m1557n0206P0514l5527K6719j6270k0849L1450N7384
360D2287o7562k3947O8519k2454J6041n6160K6822O3494k2719n5310J8696P0034
372E7741m4533k1153k1808N6228L699o9936J5662L3027M735k7309O169k8261O2161
385B6422J136p6311L2270K173J5199R415n3438j03J00749k5520o0796P361J2301
$$ y = [85900, -94182, -3909, 49509, 35098, 44389, -97765, 16219, 102421, 10569, -59596, 15984, 20446, 61738, 316, -100625, 88486, 7410, -39216, 459, -50453, 1647, 30060, -49191, -48762, 32130, -50305, 17518, -51050, -75898, 60980, -47001, -58336, -25749, -12489, 14733, -7815, -97987, 19023, 70431, -86976, -17598, -26540, 14640, 14715, -83468, -31251, 31680, -7936, -46441, -4842, -44533, 20629, -20928, -71134, -620, -36147, -9428, -25698, -46547, -15097, 42287, -25275, -49222, 19297, -3157, 12884, -43276, -16454, 47040, 24321, -30989, -12293, 57741, 13208, -7945, -29753, 26475, 30174, -39762, -24100, 8927, 13662, -13647, -7478, -35739, 26422, 27558, -48753, -16483, -14310, 889, 10304, -43134, -43237, 57512, 31992, -28804, -21443, -9142]
398i142P7451p9064p3200R2025K6184m6334j0853j3110M5108L8899j05183J5724
410d1495L8626k7240K1804l8369k7450O6334j152m6540K1362j0261N2640M04r5349
423h6686M9359N7303l1817k5758j785N3140N6403q9030j2977Q5739j6512k8727
435H652k9108J8288L9358p500l6242Q638K6704L826m863m1230J9174K9627L440
448C8764n1922j4250O0406J1421k3802n5349N2483O0947n0834o3751L9439M4796
460D8348l6856j6167l4045P0178J6597n7511J5455M309K151J94j8898l2467O3184
473B4472k8394j1238K9033n0013P1451k1266n4722L2717K3121l1288l935j8015
485c8077K1454O3973j13502L6420O2951l3578Q096l1576J6994L2394k8729n3781
$$ y = [-9142, 68309, -10755, -83955, 8070, 34254, -12080, -22933, -36043, 9065, 47964, -57219, -41495, -2869, -30109, -8305, -46674, -74124, -7790, -8942, -55482, -34120, -44381, 8259, 8663, -86686, -37327, 19976, -11841, -37599, -39384, 13756, 70159, -18871, -31848, 53891, 37379, 8652, -20456, -2168, 37190, 29690, -6552, 2086, 28790, 32616, 27753, -13477, 5697, 35324, 38764, -13158, -27408, 32998, 44419, 20617, -34732, 17751, 78698, 27864, -35887, 3552, 48348, 11492, -4675, -38720, 31458, 48055, -9456, 5999, 10308, 12459, 12653, -6245, -38712, 24472, -3922, -15160, 13873, -36140, 35311, 14045, -40677, -7960, 15161, -16127, -20062, -38077, -16623, 47350, -66152, -29732, 33219, -359, 7737, -23839, -6845, 25549, -3180, -56961]
497e6961P1047j4675m508K5341n5960O5188p851k9568M85M182R63L1176k7876
510I83m3337J00275k2178k1268k5192J3656O7252m5946n0605J2660P2384m7322
522A1362j9906j0984K6221N2573o5162p317J3623L4948l8147r54r279Q305N9279
535E4562o5576J8470J3980J5041q33m3870j7524O0216J8847j03732N2520R041
547A1142K6242r101q4687O1257M2129m0819m1123K7376j3772N3639l8684n6578
559f2979R0658l6418J5320N938m4368K9672L7696n8996r187L9776k6587O3100
571D3625o9879L155Q4082o0904j4322J3935L326R708n219n6884P1380R406o6078
584c4669M7981k7024K0643N766l6984J4054K7706k9636N052K4942m5611O1998
$$ y = [-56961, 14086, -589, -5097, 20244, -35716, 29472, 21621, -7947, -7462, -3280, -2317, 28859, 983, -42354, 57921, 35743, 14475, -10717, 2939, 70191, 24245, -26360, -13700, 58684, 11362, -8544, -19528, 6693, 59266, -5896, -13213, 410, 35358, -2789, -3743, -13022, -4717, 54562, -11014, 7456, 21436, 36477, 35644, -8226, -25750, 34466, 53313, -50419, 2101, 11142, 37384, 28283, -56404, 4853, 46982, 6163, -34960, -7584, -21356, 32283, -6401, -62979, 27679, -8739, 6581, 12519, -31849, -2177, 35519, -23477, -32664, 7112, -19475, 43625, -26254, -23099, 60983, 79, -14243, -308, 3018, 12726, 7507, -49377, 22003, 31409, -34669, 13312, -13712, 6931, 12697, -24287, -10233, 17473, -12163, -7111, 17831, -27780, 34218]
596C4218r005k6278L4314m672Q859j8241j6404K7193L4606o2060P02M2664l924
609D1972m21n0697J8488L6294j7473m7506J7996K9223j5154K945k7881J6772J6782
622B1340j2456j0050k136L012J6564n860m4312M5021K0618k9312o305j224L1898
635B6798O061m8075j1697O0529j5397k9950m246J5297M4156l4841l9457L8460
647G638J2512k5675P091j8897J4040L4116m2279M646J1139O246K4005l3684k5934
660b5036O2342N105m1872j971P705M7564j9943n7112L2252M6936k0895l5016k267
673b208K1424L0765l8971j7724K4227O806P402j7227j8030J2826L9880l2432k0975
686d237J0374K4512Q095l9946L751K3380J6354l7199j1407K3150J5790q919m5377
$$ y = [34218, 25213, -1065, 33249, 28577, 37436, 19195, 2791, 29984, 64590, 2530, 3232, 45896, 41972, 41551, -9146, 9342, 45636, 28163, -19343, -1347, 27876, 12722, 15667, -12214, 4558, 21340, 8884, -1166, -3302, -290, 16274, 10414, -33898, 11123, 31741, 2429, -3876, -5100, 26798, 32859, -15216, -26913, 33616, 18219, -11731, -15977, -680, 43476, 8635, -30822, 7638, 20150, -5525, 1566, -17331, -3291, 30825, -11454, -6808, 4331, 10577, 34582, 898, -25036, 37306, 42411, 539, -1432, 6273, 53837, 33894, -23218, 9034, 55970, 35075, 59, -2208, 19216, 49981, 11010, -6714, 17513, 24319, 31721, 14494, -3536, 9290, 49170, 16738, -4237, 6137, 30649, 38744, -1202, 2549, 25929, 42283, 5084, -6323, 16827, 32617, 23698, -21679]
699b1679K7202K3564j4254k8366J9931M345m780Q609l7416L2397k909q785P575
712E434j2555O572J3601p452k0747L3337j5944O453j1274j3341N4047l0994k3832
725a6695J7157K8009k2165o460p762J9922K9365o7102K7675J3625p252J904j3132
738b911J761J4713M707l0583L0036j5190K2609k953m2547M7401J833q210k2348
751a682R111J2329K6150m0112l1913O8116q044j4379l6370K2037L6325j8013l3869
764a0314l597M5823k1964L991l1978J6818L5398l3465r012n948K5887m684K946
777I901m0635K0444M5961l6602q292j5324M5751L07m0044j7975M6822J3544m5909
790b2051J3742j5402L9099o795l6728J6848R008J641p041J574k4485M8692j7088
$$ y = [-21679, 5523, 29087, 14833, -13533, 6398, 10743, 5963, 14572, -22844, 9553, 6644, -2141, 5434, -7121, -549, 13052, 5600, -15147, 18190, 2246, 8699, -2575, -15916, 38131, 7137, -16695, 462, 28471, 6306, -154, -7916, 12006, 41371, -25731, 1944, 15569, 8317, 10221, -2911, -1150, 13563, 18270, -12313, 17723, 2533, 25142, 22189, -20358, 27043, 28876, 20666, -1682, 7429, 19758, 45908, 5796, -26117, 41999, 33955, 19576, -16794, 5243, 41568, 23555, -10314, -13911, 31912, 9948, 13939, -18039, -1221, 34177, 712, -8300, -14248, 11639, 6955, 9901, -30734, -10290, 35671, -931, -9223, -24547, 21204, 21511, -18533, -36508, 10314, 23858, -22051, -8309, -23711, 15388, 8593, -28135, -11287, -2279, -638, -7679, -6105, -30590, 18102, 1014]
803A014k2545K5288j7964L3048j8544k1903K2255K6602l4521j385J7818j977L3239
816D0425n8196J8523L5364l0259n710M438L13P146N077l8395L9358m583j7447
829c946K3506l0042J6686O538j4972k545J1563q861J4259j0483k6785N5344j9951
842A0311k3589J0211N954P525j4772j6564J6947K3796l5270O467P090m85R437
855G058k7083K898J2568o457j3655J3903p907O522J1101k6944J0999J1843j057
868f211q553p411R622K6675j9185k9367L7065J1151r935j4186n320K6687P245
881A8277l5761m713L0599o594k57j4086M41K8766j2430k2276R807J086O702Q988
895H549l7526J5223L4537j6916j1731n275J8358K1817k8893k7674M1585M898j7805
$$ y = [1014, -21531, 3757, -14207, 18841, 297, -21606, 649, 27251, -7270, -8655, 9163, 7186, 40425, -17771, 752, 36116, 5857, 147, 4585, 4898, 12044, 17121, -21274, 18084, 13501, -3946, 19560, -10482, 6204, 12742, -2230, -4775, 6788, -2073, 12186, 1703, -25082, 30262, 10311, -13278, -3067, 2887, 10412, -4360, -20924, -3977, 19819, -15451, -8984, -1894, -2379, 7058, -20025, -17127, -4559, -11016, -24671, -10768, -18675, -12153, -1052, -27996, -16997, -5154, -6211, -14764, -22175, -12553, 14122, -5063, -34430, 2635, 13786, 3851, -10335, -15655, 11032, 18277, -17484, -22197, 8402, 1808, 1551, -12535, -12094, 16672, 4242, -18034, -8227, -7141, -439, 8549, -28977, -13754, 20783, 3867, -7864, -13139, 5219, 27036, -1857, -29531, 12054, 16952, -853]
908h53m300j0273L3321m30l1438L616K3052j3471j732j2325n353K9730k0121m292
922a4869L499K551J3725r070k4867J4396K9981l3284l989K786K0909J0264l1491
935a9459j71K4332J2742l1353K501M324J5896m382l0275K1093K362j465o152L009
949f998j1599J4169K153k6824K0010o922J1027m995r185J5002J3935j6304j2847
962a9378K8604j4643J1753j5635k327L5326k2673p543J1653J0165j5093J1953
974A2162j9321J4470J3559l8297K7732r829j28P923j0395p542K0284j179k2559
987a3120J6467k5147L5700p250l7163K9118J0496p87j7301Q7L71L8093l6504j9523
1001b6463L8045j3450J2051j9651k203J5963M627j7625j949M359n111K7855m4140
$$ y = [-853, -5153, -15426, 17895, 17465, -13973, -10357, 12695, -776, -2508, -14833, -20186, 9544, -10577, -14869, -11370, -8819, 4906, -4164, -29031, -14635, 15346, -17938, -21927, -19141, 1768, 12032, -19459, -19630, 4702, 17444, -13909, -11408, -7084, 8812, 4430, -25845, -4752, -2390, -3855, -10007, -6998, -18597, -4428, -2275, -29099, -9089, -16011, -4984, -9979, -19164, -4162, 9773, -6531, -19378, 9226, -5417, 6336, -9299, -11626, 23700, 1027, -6516, 5137, 15302, 209, 12162, -7159, 7311, 20870, -17427, 10305, 476, 348, 8271, -2124, -9666, 10618, 9439, -13120, 3347, -21800, 13900, 6650, -30513, -1395, 9101, 8314, -8987, -8900, -8529, 29564, -6940, -26463, 11582, -1868, 10183, -9468, -11671, 4292, 8919, -8706, -10655, -6296, -11407, 16448, -27692]
1014b7692O969K5107j0465k320j3376J4028J1895M078m3651K5756K2151j9483
1026g003m117j3026L3337K08j7693j1907K6794N24j1419N082k1542L7390q475
1039H153j5623O395L523Q895r44j2371j1497M2056k0543j2793O773R92K1555k4034
1053E37j0813J7673J9242k9734K357L504K388J5333l7510J4903J4703r321J070
1066D332q59j0157J4140O988k9286J9206p629M989Q134k4638J0680J3036q321
1079F15j0114J0664m896J2823j3265j3403L2356j5995j1161J0118M577k271L27
1092C75j2263R336J3017k2570R187j139J11J1302j1922m122J0689L552l813J538
1106C278j4066J8882Q188k2343K677J3126N102j0503q178M220K2351j3706j7837
$$ y = [-27692, -20723, 4384, -6081, -8401, -21777, -7749, 4146, 8224, -35427, -9671, 12480, -7003, -11120, -24146, 9191, 9399, -8294, -20201, 6593, 7117, -4302, 780, -20762, 16628, 8153, -7470, -1075, 2448, 11343, 10399, -1972, -13469, 28587, 8044, -4749, 2024, 3016, 24571, 537, -10276, 7397, 26639, -3095, -738, 2766, 5154, 20487, -17023, -2120, 12583, 3262, 4332, 3473, -6684, 7456, 14444, -14842, 4364, -3265, 1724, 9858, -14780, -4100, 8936, 615, -9499, 1165, -3731, 9092, -4173, -17576, 14780, -1215, -12376, -2258, 2319, 48, 375, -11888, -2552, 10465, -12105, -2918, -4057, -3946, 7356, -4566, -8688, 2001, 5553, 1740, 3278, -10788, 8094, 16282, -6061, -3384, 9742, 14844, 4341, -3837, 383, 22734, 9028, -8809]
1119h809J6914O949k729r136l105J1888Q214j6838r25N763j25R527j6936k767
1133b115J4939L110j2091k234J006J4246L375l0666J1244J7991k215j8371l914
1146e695J5055J0313j8220j6129K4730M96k462j0692o873J8353J397j2170p506
1159i403J0323N68Q614j8429p119K3552j634o591j5580J1493J2245j846k0958
1172a4765M710K2313j3093j588p324J3681L734p862n152L996J0175j0569Q730
1185F986j2895R100P223q746L987m131Q671j713N4j4242J9282J452j7779J2324
1199I573k966R769j1248l673R050J0082j6721o540K0749j1029R712j9671N235
1212B322J7590j3172n309K103N921m543R605k4109J3367R306j4994J1097j7728
$$ y = [-8809, 8105, 15054, 12325, 3189, 84, 11972, 20186, 3348, 2423, 8186, 8061, 17588, 652, -2115, 12824, 15934, 3843, 1609, 2615, 16861, 20236, -10430, 814, 18805, 16590, -1781, -5695, 9360, 19673, 1453, -14676, 10054, 10550, 8088, -2604, -9477, 8876, 10273, -1897, -9403, 920, 1488, 10102, -8327, -15446, 8106, 6472, -119, -15699, -4206, 8039, 6193, -14765, -10055, 12258, -835, -2423, -9747, 3934, 7668, -194, -5346, -1350, 8825, -1744, 6986, -5909, 3191, 10414, 1668, 5655, 1524, 10195, 8482, 8536, -5706, 13576, 15028, -2751, 9573, 6607, 16376, 5128, 1455, 10505, 20587, 3866, -2674, 18075, 7046, 16758, -2913, 2322, 19912, 6740, 1431, 3534, 9455, 4912, 14517, -9592, 3775, 13081, -1913, 9184, -8544]
1225h544J1362Q865j0188j6302K0162L551j1807K240j6827L3486j3056j7504J1606
1238b956N931J378p753l587r28K5340k6297l9J0998q147J5482j3646j047M987
1252b84R682j2790J579k967M385J9804l3713R099J4494l59o794o721O114J2310
1266A3839K46k8901K2358L650k127q55j4924J6213N583m360j1261R342n258J1398
1280A4943l363k3866K3303J294l033q888k764J1008Q536j8705q703K6333j3768
1293B327R54o459o62J8940j1969j0766R504O905j1213P734j1390M471J3859k0328
1307h093J0127j961j038Q439n840j3710J9332Q73j9546J3537o935J0498k339j7961
1321a4617J5529J0641j5125n112J0838j872J1437k0819m02K4804j3156o657P178
$$ y = [-8544, 2818, 11683, 1495, -14807, 5355, 8906, -2901, -661, -17488, 15998, 2942, -14562, -2956, 2975, 4353, -3400, -6987, -7915, 17425, -8872, -8911, 2087, -6060, 9422, -4224, -5271, -284, 9398, -3392, -1813, -4780, -395, 19409, -14304, -5205, 9289, 8930, 2136, -4585, 1529, 13839, 14085, -14816, 7542, 11192, 9065, 8210, -6714, 9499, 15082, 10722, -539, 8803, 3545, 14943, 11580, -12286, 11017, 12311, 9278, 390, -2374, 8634, 17170, -1535, -10238, 16095, 2327, 3281, -3178, -3840, 15100, 3131, -7635, 1869, 8774, -2439, 5295, -6095, -1624, 12235, -8093, 2034, 73, -965, 7474, 1634, -12076, 7256, 8129, -11417, 2120, -4815, 5683, 3344, -14617, 912, 11553, -3572, -8684, 2154, 282, 11719, -9100, -9502, 15302, 2146, -4511, 2667]
1334B667j039N945K447j8240J2754P039r724O555j0170O402J4245j3491q495J3757
1348A0652Q02k621l195j1201K2758n54k1090L477J1610J150k816j2343J473K2967
1362B1069j5829o650O555k826Q289j691j4055O501J0514p216J471j1014Q111J4536
1376A7765j7992o911R381P662m912n453j1077K0379M260k5755P515O615K260k316
1390A421r213K22J4107o084n905M952j0796J9242n582j3419R019P860k898l540
1404f14j617L42J7627j6007m680J3075j795J795j0763L605R164J415j6913R523
1418D157N219o789O419j0975O221J432j541l664J328R27o0N887j4076J1571n31
1433E525n669K513k724M880o20l330q339K0336j0245r468R770k238P774j2974
$$ y = [2667, 1628, 7573, 10020, -8220, 4534, 11573, 1849, 8404, -1766, 4636, 18881, 5390, -3105, 10652, 11454, 8833, 5638, -5563, 17195, 16641, -4449, -972, 10638, 11788, 8972, -3371, -1898, 21069, 5240, -1410, 5145, 2319, 10608, 8917, -5138, 1363, 11877, 4661, 6132, -4882, 3229, 17765, -227, -7138, 2243, 9905, 4993, -460, -11537, 8842, 13102, -12653, -5138, 1477, 3737, 1421, -7792, -7570, 6537, 453, -5452, -500, -11296, 7946, 2364, -11055, -2036, 5824, 2926, -614, -2231, -1889, 15738, -269, -4949, 8126, 6331, 8126, -2637, 968, 10132, 11547, -5366, 4157, 9376, 2587, 9006, -1969, 4252, 5684, 4143, 479, 1807, 2734, 2674, 8561, -5515, 6056, 5525, -144, 2369, -355, 4525, 3905, 575, -7764, 12572, 2327, -7141, 2629, 391, 8165, -4809]
1447d809p10O583M597j3432L949N032q752J3150j7735M672P632n829j034n96J093
1462f189K999N694k1126J5837J825k396K297j5394J5273R856j2076j2570J8785
1475B815L93q03m725j3960K7742n746r400k948M292P219J339j1189o674K2461
1489A0816j0958K538o671l938K0486o667j1803J419J6539o680l227r610J0388
1502B632J6583k4339L556N873N286m059n461m385J1393O981k0849J0604k794N464
1516F485K664j3840K393P184n6p307J962o353J5950n680j5376J5670N03j950p138
1531d889N41M651Q500j6238P19J3608j1026O965o996j089J0098n982m689O392
1545E65j688l488J2079j3535N098O144p188M699m727L421M654l546q162J6058
$$ y = [-4809, -5519, 1064, 5661, -7771, -3822, 1210, -7542, 5608, -12127, -7455, 177, -5652, -6686, -7282, -6189, -3190, 2504, -18622, -2785, -960, -3356, -1059, -16453, -1180, 8676, -3400, -15970, 2815, 3208, 2405, -2320, -16280, 11462, 5716, -3684, -6632, -2340, 4879, 6218, -4971, -11645, 10816, -142, 2396, -4275, -8213, 12273, 5606, -6197, -4778, 11761, 5081, 1854, -7756, 2632, 19215, -5124, -1568, 4305, 9591, 5532, 71, -4314, 7079, 14060, -6789, 3815, 1021, 6485, 9149, -4691, -2298, 4886, 4830, -2477, -515, -6868, 9082, 3402, -11974, 3696, 4199, 2249, -4889, -4348, 303, 8803, -7435, -6716, 6892, -4134, 2831, -4165, -5254, 4844, -1138, -5827, 565, -1123, -4611, 7468, -6067, -969, 5175, -2013, 2686, -2041, 1380, 6034, 2488, -5674, 10384]
1559A0384n243p644R465m973O955m631n469P869O093j0303m36N267p54M735j0439
1574H76L25R850m557k306J267m160M481P258j3889Q68O526K898L88j2797L240
1589B68J3954n442j3498P005L034M151o762j1311J3130O005j1356q89L050J639
1603B978L507r436k942R046l206J558l897l885R896L479j5318K220J0577m100
1617D77J327j0412P370J1387j0547o599Q216M245j910k942q603J6235j128j1296
1631d180N574m9M737k11m980m929J2202k019k987j765n108J6818o955r173K490
1646e35P731Q44m591o161L140J5780j5496k23L831J341L036o255l77J769M082
1661G916q453O217m230j861Q666r106K549n29L539m010K063j882J914J548j0853
$$ y = [10384, 5141, -2503, 6962, 1989, 8944, 4313, -1156, 6713, 12806, 2503, 2067, 7334, 6580, 11315, 876, 1201, 11051, 6494, 4188, 5455, 1295, 5776, 13034, -855, 13, 6539, 9437, 9825, -2972, 268, 14222, 8780, -4718, 2287, 5321, 9472, 2710, -8601, 4529, 10534, -822, -1711, 1339, 2978, 6485, -2951, -5893, 3153, -53, 1505, -2392, -6277, 3619, 7098, -8220, -6000, 4577, 477, 1804, -8608, -1238, 10149, -398, -6997, 1219, 5464, 3554, 612, -7991, 8244, 7116, -4180, 1394, 1345, 6082, 5871, 891, -4038, 8164, 6145, 3158, 1393, -3715, 13103, 6148, -3025, -535, 7196, 8040, 3449, -2712, 428, 16208, 712, 489, 4320, 5661, 8697, 2442, 2065, 3834, 7916, -537, 5680, 1450, -411, 8255, -851, 1698, 1169, 4708, 698, 2761, 879, 2793, 4341, -6512]
1676f512J3315l295m004j159J225N442l197n244k787J6551r995l158Q66K653N792
1691F493r071j3J875N496o407K596n302J012J4567j6282K550K03P049n94n725
1706a553m895R862R042j9288Q209j132P562r75j3196J0454N832m369p138Q666
1720G081n506P615m882q668J5393o953J667j961r85K515P772j2612k970J4483
1734A1989q955M775r795Q53J6813r592r374N297P389m141R24j3457J3041Q261
1748A4028j5881M261k742M181L039n100q852J0409K131n802K152j0018J2752K508
1762G066j2778k73N703K429j512m525n775J8411q335o254P658k639M136l123k096
1777a907K141M764q506O870m4o431R302o032K52M262k854j410L869m358K301N992
$$ y = [-6512, 6803, 3508, -496, -1655, -430, 5012, 1815, -3429, -6216, 10335, 340, -2818, -1952, 701, 6493, -2578, -2591, -716, 4780, -1627, 969, -4333, -3321, 11246, -5036, -2486, -2283, 4766, 4172, -1553, -6448, 3414, 12456, -6832, 1377, 245, 7807, 6832, -6364, 4090, 9922, 5553, -1585, 7081, 1575, 9190, 4308, -4360, 11033, 4080, 5747, 3786, 2801, 5316, 13088, 476, -2494, 11989, 3034, 7809, -1986, -1133, 15680, 6088, -3286, 2011, 9400, 5259, 6183, -7274, 5767, 14028, -1853, 2408, -334, 3847, 6886, 1786, -7066, 3343, 5474, -328, 1824, -8194, 4558, 7066, -5712, -5985, -282, 2147, 635, -3890, -9665, 8746, 411, -5843, 1815, -824, 3312, 189, -1907, 234, 4998, -3508, 3362, 3318, -3113, 6189, 157, 409, 4671, 1817, 407, 4276, -82, 2219, 8211]
1793H211j3553R470L993p283J087m87M692L069r544m345J5781p301m441K690l198
1808a159R755l222q793O018M018o335N784p086q85R995r053K33J556j650L527
1823B703j780q751Q427M011r573J546q36M569n51q678L127R292o020n257O847
1838i24l450N408m161n087P790J244l532L99k322R87Q589r034k997P763j289K250
1854A634p065k678J0753M137j5027J867P343J77K086j3381P195P908m454n661
1868e166K748N83O956m28j4319J2841J38j689J265p867O117O569m060q378R560
1883D870l252L588n461o366J4559n138n077k3N063l212J626o246J941Q666j3210
1898g672O858j383l0K686l532j240K951K399q169P928p802N097M517r520L784
$$ y = [8211, -5342, 4128, 8121, 838, 1925, 1438, 6130, 9199, -345, -4690, 11091, 3790, -651, 2039, -1159, 8596, 5374, -3419, 2599, 6617, 282, 6066, -1020, -1905, 8090, -963, -730, 826, -824, 2703, 923, -7828, 599, 4610, -4963, -3417, -4253, 316, -235, -8913, -5786, 3506, -2514, -7771, -924, -4374, 1034, -3127, -8214, -424, 820, -2712, -2313, -4635, -3648, 4941, -4093, -7090, 673, -616, 1634, -5431, -8109, 2644, 6781, -8246, -6379, 964, 1141, 3227, -10154, -2959, 4949, 495, -5166, -2418, -1835, 5121, 4693, -9626, 3215, 3353, 1664, 2929, -4938, 1179, 7748, 3688, -4690, 4870, 1618, 5206, -255, -6621, 7938, 2800, -2277, -2300, 2763, -449, 1177, -5069, -3128, 5538, -7672, -814, -2197, -2227, 459, -3073, -4313, -1362, 1037, -7132, 796, -7006, -1909, 2608, -6912, -3128]
1913c128Q02M059q383K572K56N393l878p865J1085l751J267l748K747L10K235
1928b7l557l283R817r116O294k455m37K473n75m40j061M905o005Q284q939J534
1944b588J2239j2288K252M88O415m753j691m847J0465P49j3127P987k281P075
1958F095m025r039N594P496l913n243N283p732J4328o465r023P289j95M533o486
1973a503n957L921J1058j1534l094P415l146R292j4685J946Q472j834n170q29
1987e648K789J159N054j2957O212K342j411J904m621M06N383J487r960O040J365
2002d56P4O11p393Q694m85l385q5M454k120J16q48l072J0915p683k184N820q94
2019B079j612J040j279M28M729o603K390j097n88P286p828q33M861P80k820P18
$$ y = [-3128, -2326, 1733, -6650, -4078, -3822, 1571, -2307, -10172, 913, -2838, -1571, -5319, -2572, -2262, -27, -3584, -6867, 2950, -6166, 128, -2327, -2764, -291, -866, -1306, -2367, 2538, -3467, 4817, -4122, -2588, 9651, -2637, -385, 103, 6518, 1765, 74, -4773, 5692, 6441, -6686, 1301, -980, 6095, 2070, -6969, -1375, 6121, 2208, -3035, 2248, -5484, 8844, 2379, -6644, 645, 450, 4983, -1503, -7460, -3539, 7519, -4015, -7109, 306, -2840, 6452, -8233, -6287, 2185, 351, -4819, -5648, -2859, -1700, 3354, -9603, -3391, -1049, -2460, -556, -5177, -4771, 612, 2099, -7861, -1821, -456, -382, 229, -7164, 1530, 1045, -2340, -2425, 2029, -91, 25, -823, -3895, 7020, -663, -2847, 2973, 2079, 467, 1507, 228, 656, 5385, -1218, 1172, 75, -513, 6773, -1055, -1888, 2973, 3753, 933, 1651]
2035A651m602N324K777j0654O662J784l934p02P0R93M191n949j136P781p877K539
2051a082Q91n009N342j226l264J796R09j160M183p220L49Q389o138j178m00L158
2067a660L247n000o868J0582J931p197K12p79P233j426o416Q76O219k437j188
2082b671j461k422Q902J52p008j5N058K151j361n029R59J1332o773m619J210L958
2098B363M032o924k813N802M914r337K929Q51J384K610p676J131J884J206j319
2113A037R42o702Q915N27r724N641j222L875j636n634K735N695l465o187P202
2128A999k202L544o902k633R809m004l185R32J802k335N278o225R74M416o015
2143d747O130n626O24L461P46l896J464L620l073L876q776R295O31o897L309K400
$$ y = [1651, -2951, 2373, 5150, -5504, 1158, 2942, -992, -1694, -1624, -631, 3560, -2389, -3525, 4256, -3621, -1082, -191, -5200, 142, -1084, -4348, -2552, -1643, -2803, 1380, -5840, -5491, 2898, -3240, -4418, -4818, -1660, 1587, -3413, -10281, 301, 2232, -4965, -4753, -5532, 1701, 275, -6141, -5265, 954, -1483, -2671, -4132, -6554, 2348, 2500, -4508, -4523, 535, 2686, 1325, -3704, -2745, 8587, 1814, -2805, -1595, 2363, 6395, -529, -3342, 2460, 7374, -1963, 966, 1817, 3201, 5811, -1865, -734, 1150, 2356, 1037, 1979, -4723, 4192, 4719, -5005, 636, -586, 3289, 1653, -3981, -1246, 4449, 984, -5203, 1999, -203, 3341, -3561, -6194, 3615, -389, -3574, -2642, -840, -3175, 2103, -4122, -3148, 1268, -4747, 1383, -4243, -3619, -158, 588, -3308, -1844, 1776, -1297, 2579, -6197, 3098, 3729, -3168, 141, 2541]
2159B541O77l700K495k276P074p188l156R888n423K722l405J620J009L033o036
2174a25%N340m493O251q761K709N725l99m323k279N818M41J921j3592R086O794
2190A0113q955l49k696N963O98j626q843R616j406m117K048p496J0173j585l327
2205a789p07K927r79J067j920n878J2357m742l259n2N05N818m742l024L011O842
2221E435q739K312j02j912P780q418J03L054j81j454L173m334K613M127q410N301
2237C48p70j50L755m389k66O867j258p046P388l845M399j973o300Q359j345k520
2253A254J63J470j943M674m473k472O541n701L189l03k646K622J229n096J744
2268B52K368l480M047o995L559N230p410j115M965r92k413K243l712O398j329
$$ y = [2541, 3218, -482, 2013, -263, 6811, -377, -3533, 6355, 932, 3654, 249, 1869, 2878, 5911, -125, -125, 5215, 722, 6973, -1788, 921, 6646, 6247, 1924, -355, 5463, 5904, 7825, -5767, 3319, 10113, 1158, 809, -1887, 4076, 4774, 3148, -5695, 3921, 2515, -1602, 446, -7050, 3123, 1538, -1789, -2496, 431, -548, 519, -1401, -7279, 5078, 336, -2923, -2975, -2470, 3348, -1394, -4418, -1407, 5435, -3304, -992, -1094, -3006, 4774, -3644, -3541, -487, -668, -2122, 1051, -3283, -670, 3457, -4953, 348, -422, -572, 3183, -1206, -1472, 5395, 4137, -2909, 4479, 634, 5033, 3060, -3240, 5119, 3774, 1254, 1417, 2887, 944, 5618, 1145, -1327, 5214, -487, 2702, 2399, -247, 2375, 3604, -1492, 252, 2620, -860, 3187, -3808, -249, 4981, -2429, -3544, 1421, 429, -1984, 259, -3453, 2945, 1616]
2283A616p350N092J227k597M55j845P68O202p223J41L232l946N492k071n781N858
2299g30L461o890K329j374L972L919j0466L024N709k793k200j11P74N209k375
2314A458o474Q177l62j879M87l368M442J263k978j938M227j850L737m085l824
2329b967Q305j335k588k412L140J147J598p203J545O805n173L67k320L489J981
2344D379l287n207M094N135n200J642m778M596K380m598j274l2L776j102k187
2359a663n165Q679p87n263K520j280L388j546k348o98O874n142k415N450m044
2374c440M311k933j037M238k563J49J676r04l557Q157n940J888K277l835M257
2389B744m206K110Q27k14l658M996n2k030J945n625Q566m071l632K817K801j041
$$ y = [1616, -5734, -642, 585, -2012, -1557, -3402, -2634, 3568, -3655, -3514, -282, -4228, 1264, -807, -6588, -730, 2731, -4159, -1830, -3204, 768, 4687, -5779, -2755, 2954, 161, -2039, -2150, -1376, 3833, 1458, -5016, 3161, 2799, 920, 1407, -1961, 2481, 3744, 766, -1172, 3055, 1205, 4942, 857, -2967, 5338, 4003, 1415, -997, 2143, 3290, 4888, -2315, -770, 6035, 862, 1229, -1091, 2398, 4379, 1092, -4115, -21, 5114, -86, 1556, -3222, 1374, 3754, -844, -2118, -2150, 1626, 524, -1663, -6828, 1851, 1064, -4199, -1679, -2959, 429, -1117, -3465, -4163, 2711, -2431, -4846, 604, -3440, 871, -2062, -3099, 1139, -1424, -1275, 401, -503, -4060, 4097, -1843, 45, 2322, -1513, 2744, -1462, 648, 1475, 1261, -2397, 2599, 2547, 517, 2462, -3163, 5403, 1332, -2300, 517, 3318, 2277]
2405B277l985K989k235N697o335M06L196j793L147k516k450J33N224n176p71P50
2421a442L66M975p116o88L613J985l539k137K439P64L105r531L880L556j185j863
2437b818k618K015J168K918p356M344o42L308j140q553O876L680k361l705J642
2452c242J759L927n341m635J0137l686p74k319J282M289r00l373K52N690n284
2467b218M015l601o98N540j452l582N42K925j203J891o085N512L032n870L130
2482A878k546K652M58l022q18M117j324l030L987k712R18j380j430L992k141j033
2498a434J442L42l238M657k525j942L361k174K98j010k16L46J721m726K709J374
2514a015k020J718n122M157L092l843j297M047j128j304J160j866L733j312k649
$$ y = [2277, -1708, 1281, -954, 4743, -1592, -1186, 2010, 217, 3364, 848, -1602, -1469, 3755, -1421, -2192, -1442, -1076, 3899, -3217, -3905, -292, 1693, -1846, -3983, -1544, -780, 2325, -7206, -3326, 230, -955, -2818, -5436, -3421, -2253, 665, -6691, -2347, -2989, 319, -821, -9374, -2498, 1182, -1179, -4884, -3242, -1483, 2444, -2897, -7532, 2605, -1081, -1855, -4174, -2892, 1397, 497, -2876, -2624, 3066, -2218, 1797, -1804, -2502, 3038, 1586, -1996, -1454, 1471, 268, 2159, -3926, 1586, 4618, -1252, 1878, -668, 1984, 2442, -580, -1398, 2719, 1395, -1635, 2352, -360, 558, -822, -2252, 1740, -401, -1434, 8, 350, -2888, 1769, -756, -2698, 663, -1511, -1213, -2223, -2439, -2093, -372, -5098, -2389, -1015, -3035, -1317, -6439, -2282, 810, -3033, -4330, -283, -1411, -2715, -1555, -3421, 312, -1000, -3649]
2529c649K283Q21j647J818o21j125M970m213J271j100q08N924k854m044M514K436
2545C976m806J254k494M684J737o876L476K528j419m4p99j033M337k767n378M704
2561A080j299L472k051l169J441L705j045l971J404l02O243p767k416N540L89
2576A254j846k911J569J461K433n601P34M085l049K347m639J015K883N03k896
2591b658O68O46P0L727p028K174L198l63j689k019K892Q94R59n330O589l067j467
2608a804L543l670K505j050l84J076K147m173K452M15l595O201m169R66J924k053
2624C31J264J110l378K344M265p911L972Q37j540P63l077K006J935j956k563M823
2640C225j383n02j49m027P466l327j256j25o5j421M079k839l231O773m614K836
$$ y = [-3649, -1366, -545, -2192, -374, -995, -2120, 2850, -1363, -92, -1192, -2000, 3924, 1070, -2974, 1540, 3976, -830, 424, -2070, 2614, 4351, -2525, 951, 3479, 2060, 2016, 1217, 184, 4521, 1754, -3624, 1080, -219, 3253, 1202, -1967, -526, 3179, 2134, -1837, -433, -735, 5508, -2259, -4675, 865, 1254, -592, -3503, -1934, -473, 1960, -3641, -2907, 1178, -1871, 476, -4163, -3148, -265, 238, -2658, -1990, -1344, -1274, 2453, -4575, -2401, 797, 434, -1255, -3274, -382, 512, 1471, -3859, 2730, -337, -1804, 1739, -1931, 574, -476, -860, 216, 2363, -1810, 642, 1057, -2538, 3663, -506, 460, 2384, 331, 1595, 2705, -673, 1671, 5936, -1975, 1997, 2834, 1294, 2057, -1020, 986, 2921, 965, -1598, 3225, 1842, 1340, 1191, -2836, 4630, 1303, 47, -78, -143, -1564, 2515, -324, -3555, 3218, -1396, 1440]
2656A440m218j95N280k379k886O0O032l520J26l201L082M024o453m20J991J297
2672F0o12j42l571L964L238n607L352k730K990M36k385j537L036L864m347j20
2688a11j463O033j197o260N077K84q28o66n67r15M997n223k69M776l911L330k017
2705A070L27l78J489l075K515k01k516M673n022R15L385l060M72N84l4N79N67
2722B290m574M497K20l429J498j470K258j110j593N07L033l035j083K095j899
2737a795K658j123k435J680P71q69N53j284N69L288m274J003J163o66K658k544
2753f47l07L186j946k876L392R9m82J455l664K901J237l991K61K545k189K793
2769A767p65l263M898l51o57M39q64R48J980m648M66M387k428R17l016P00M380
$$ y = [1440, -2778, -2973, 2307, -72, -2958, -2898, 3134, -386, -260, -3461, -379, 3645, -2808, -3228, -1237, 60, -552, -694, -4265, -301, 2937, -2670, 682, -2048, 942, 1378, -1007, -2544, 492, 4356, 9, -111, -1574, 4459, 3262, -2998, 2079, 2363, 1535, 869, 302, -613, 4384, -839, -1108, 3668, -243, 3087, 1070, 1397, 1019, 2508, -567, 1948, 1747, -769, 3904, -1118, -203, 3182, 122, 594, 1178, 1144, 1723, 2290, -2284, 2213, 2433, -996, 502, -968, 1290, 180, -1413, -906, 2127, -908, -1991, 104, -1795, 863, -260, -2695, -1015, -244, -1113, -560, -1844, -1275, 2013, -2261, -1258, -95, -761, 1897, -647, -954, 2232, 286, -2590, 802, 901, 419, 1874, -1790, 1111, 2348, -1643, -1382, 1163, -1026, 1767, 1002, -2261, 2637, 2286, 1629, 2068, 1204, 2152, 4132, -516, -50, 4337, 1909, 2826, -190, 510, 4890]
2786D890j967m772L118K478j863l11l030K931K825m819l39M82M39J187O54o245
2802d342N470J7j965K033m141M697J033l935j93K496q02p49j300r50N544l761
2818h48j090K880r74j233J683j170q53M335n146K707m60j124K829j478j738J547
2834a33J368k297J170l08J161J451m435K341J440o73j481J027K32K47j42j980
2850a012M528l104O3J167j957K408m43o99j306L456k730K309j363j463L375k696
2866E33L12j067K80j35J854k931K096K326o380L495R20n68p77j264J514K085j315
2883I78l719K550l92R34m99l998L801J655k673q3J547l582N259k205l501N783
2899A855k359J780m643O23L383O66k756q3L279k479K387m103N47N194k787l01
$$ y = [4890, 2923, -1849, 1269, 3747, 1884, 1573, -1457, 1474, 4299, -520, -859, -377, 62, 1249, 1903, -4342, 1128, 1145, -820, 1213, -2928, 1769, 2802, -1133, -1326, 1170, 368, -381, -1681, -2631, 2913, -848, -1938, 942, -32, -1265, 418, -752, -1605, 2730, -2416, 291, -169, -1293, 1536, 58, -1680, -133, 1235, -1062, 108, -200, 961, 2412, -2023, 318, 1758, 1085, -396, 631, 863, 1110, 968, -1012, 3516, 412, 475, 1642, -315, 2093, 1650, 951, -355, 3101, 371, 2680, 1317, -146, 3229, 533, 845, -222, 58, -77, 1777, -1154, 942, 3268, -3112, 383, 1303, 735, -42, -1306, 208, 2293, 978, -2741, -191, -583, 351, -148, -4146, -345, 1310, -1363, -1446, 101, -3481, 1778, -427, -3928, 1855, -504, 1276, -3367, -2744, 639, 1305, -1451, -1534, 1745, -734, 1653, -2450, -1903, 3291, 504, 203]
2915B03j324J050K20J503k785K306L87m28P16l190K472J857j697j835J914N91
2931A960k68r3j546L774k639j557K761j868J354j213Q17k087L965m058N8J305
2947F65k142L170j923m26M31K272k296j491P38J401J896n936K045K250o74r81
2963a001P17q62M65J322m313L816l55j208R55j420J081J163k147p45L098k206
2979a640J354J043l765L184J65j579K98Q06j145K646l078R40K662l535O85J271
2995C12J71L71j501R0K300m83k211L333j179p88Q7j240R86J917p54o60j46k606
3013b001M079j527j466K844j096K58j192r97J791J329k694N46J055j340J584j302
3029a29n26M09R88k537O53Q13o95K285l335J012J321k090R30j009P85R34Jk623
$$ y = [203, -1121, -71, 149, 1652, -1133, 1173, 1560, 1132, 1848, -1342, 1130, 2987, 1290, -545, 1369, 1960, 1692, 1599, 53, 3827, 1188, -369, 2392, 524, 1878, 665, 1482, -605, 3360, -698, -640, 665, -1477, 1693, -230, -656, -225, 2047, -249, -1740, -1002, 399, 2295, -3641, -1596, 654, -20, -1001, -284, -1146, -681, 641, -3672, 144, -211, -1419, -464, -1884, -803, 360, -1787, -2532, 566, -1640, -286, 757, -3008, 176, 341, -1238, -940, -134, -1279, 1367, -1711, -771, 1891, -1644, -959, 312, 483, 854, -647, -557, 1743, 1260, -951, 2382, 1203, 415, 502, -738, 248, 2165, 1411, 751, 605, -2001, 2078, 551, -915, 1929, 833, 1091, -101, -1098, 693, 2022, -672, -126, 929, -411, 1173, -129, -655, -246, 742, -1795, -1142, -329, -1024, 1261, -2074, -1062, 259, -1831, -901, -1910, -1125, -191, -190, -2813]
3047b813K479l50J022k70l796M217R6j504l84K084n60n91p2o38L187k088l08Q2
3065b07L56p99K300l169M99L127l252K430k620J540J896k728K22J886j30j802
3081d51J687j516N47J422j852J213M86o79n02J673r42l35n84k071M460m059K033
3098E30R92k507J876o54n71j218K863k402K475l284k4L120k383L71j082K043o7
3115G8jk720J530L552m478J773r81R61O14j859j58J994p42r59J760l381M270l16
3133I37k685K023n0R92j330p09j153M251k734j673L459j557K672k944m42K591
3149A648n29j262J291j34j122K627l113J404J227j659J42l65L96L81J246m876
3165b698K994P66r55J29j655J861Q27j246j034J665q55O05q25j414L167j658o62
$$ y = [-2813, -334, -684, 338, 68, -3728, 489, 585, -919, -1303, 781, 221, -370, -442, -1080, 2107, 19, -289, -207, 149, -650, 1650, -1519, -1020, 2107, -1145, 1285, -1335, 205, 2101, -627, -405, 1481, 1351, -451, 1236, -280, 267, 1689, -163, 1050, 1536, 857, 355, 2028, 1086, 751, 167, -1904, 2556, -1503, 530, 1522, -985, 891, 237, -334, -1552, 1311, -1091, 1384, -1900, -1924, 1196, -1187, -816, -1898, 145, 78, 77, -2643, -1113, 2439, -2039, -266, -1247, -286, 328, -1531, -1689, 305, -437, -1396, 364, -3017, 1253, 937, -1748, 275, 225, 1217, -113, -822, -1975, 2276, -458, -2131, 1328, -229, 2443, -501, -943, 1648, 1119, -143, 1148, 1014, -108, 2519, -594, 810, 2037, 378, 520, 155, 551, 932, 2178, -2698, 296, 1062, 107, 236, -1419, 442, 1269, 23, -1011, 654, -201, 404, -421, -1835, 1332, -326, -988]
3182i88J83J6Q70P31j693p79K850k697J833j304j032K851j044k031J085J807j708
3199a050J415k094Q50J534k639J202O35P12j161L1j265K131M65k486K293j717
3215a144K186j55k758K261r2R3j149J583p19J356k82j094K208k59j301n08l6J68
3233C58R46k240K443R89l300K442l85Q2L32J056l667K737l87k231J429j56j56
3250B92J253k953O25K348j849n34k41j85L457k044j837K127r91M14p12m50L25
3267i55J396k665J210j23m77K073r49r90J323L00j60j046m40J497L84k680J543
3284g59M25Q68k9j244L10M48J244l678L313j400P61M28r25J437j50m65p47J775
3302A612r80K300k305p70J185m13J382k766R70R94P93l464L03L266j802J82j310
$$ y = [-988, -805, -789, 81, 812, -881, -1660, 1190, -1507, 326, -978, -2010, 841, -203, -2234, -1149, 658, -1050, 365, -1729, -879, 655, -1984, -782, -147, 565, -596, -565, -1830, 301, 766, -1720, 573, -1144, 1042, 887, -1871, 390, 298, 391, -758, 825, 106, 1462, 1180, 86, 2294, 2035, 734, 226, 190, 358, 1304, -936, 1507, 2496, -804, 1638, 1253, 1335, 1667, 2723, -944, 1793, 1406, -825, 604, 448, 292, 1545, -1408, -783, 1565, -284, -818, -1059, -1244, 2213, 169, -1668, 459, -532, -118, -830, -1280, -955, 441, -2224, -1014, -1137, -1614, 459, -490, -1480, -157, 143, -17, -1063, -1503, -6, 378, -2302, -759, -334, 534, 505, -739, -429, 19, 1263, -2415, 898, -502, 259, 687, -238, 1199, 1049, 584, -163, 1612, 632, 2932, 627, -143, 1042, 629, 2011, -755, 215, 1209, 2002, -1462, -1159, 2107, 305, 487, -823]
3319h23J997P53j468o50L32N45k124K798l137K851P78l619K463j638Q94k9J31
3336E4j939K957p88k687K688j768J750K46j770K20J532o28j370J05N39J297k356
3353a918J148Q14r55Q65j365J676J00k38j978K607r31n92N83R9K37O22k41o46
3371a13J527r65L13P49l562L160N21j248L26R59P74j340L05k273L498j595j396
3388c60k64Q40J373p23r87j5J342j047K008k855m38J852p51q26Q57J000o22j495
3406a111p84K105m1j785J015O85j69m41j595J506L78K04j020M50o31L71K65k590
3424c188K672n08L0o21K81N17J053j128j979L593q41K99j622Q16J088j48j654
3441a340j98J908j137P49m17J17J594j530L73L39N0j034J545k77n8j560K54J664
$$ y = [-823, 1174, 1927, 459, -191, 141, 686, -1438, 1360, -1777, 1074, 1852, -1767, 696, -942, -48, -77, 54, -1885, 1072, 284, -2403, 285, -1483, 267, 513, -1257, -1037, 495, -133, -1503, -1398, -859, 438, -1918, -770, 44, -911, -46, -1411, 265, 365, 127, -1851, 756, -175, -767, -184, -85, 152, 774, 533, -113, 1414, 449, 762, 1511, -2051, 1109, 1630, 382, 708, 1667, 2441, 1101, 1406, -867, 2631, 1036, -360, -624, 216, 1589, 866, -121, -136, 1206, 159, 2167, -688, -1126, 726, -25, -851, 6, 1006, 384, -1111, -1895, 210, 169, -1616, -601, 84, -85, -526, -2121, -615, -237, -33, -1053, -603, -1234, -863, -598, -3188, -516, -1024, -994, -1615, -1334, -817, 236, -892, -2871, 722, -119, 180, -1442, -626, 462, 314, -1340, -1538, 370, -767, -18, -435, -318, 1276, -254, 119, 458, 508, -526, 1019, 742, 684, -876, -622, 1042]
3459A042j576K266p59o09k91J366j672k05R43o43O48j255j56J420m55j160J390
3476B94N26n81k0j224R20J57j435J441j379J306O10j96l307K088J864k549P71
3493g14q95J132J033j496L14O37j52J453k861K0J708j634N81j56k48R97K93j559
3511a547J028R05q16R84j108J227M86j459o2Q47K81m27O51j830J691J74j553L86
3529a42k84J234M39k307K79K500j723j584K142k79J331j734p55Q46O13l17L85
3546F44j506r93K575j185q57P71M25mj482J253Q08k89k015L29J640j053Q25j245
3564a359J852o50j107R00m5L0j472J573j426J124l14j87J508q74M79q40J278r73
3582e03K958l534J300k24j542K090j118m42J099J78j123l13J933j617K857l822
$$ y = [1042, -534, 1732, 973, 364, 73, 1439, -233, -438, 505, -138, 510, -745, -901, 519, 64, -1096, 294, 820, 239, 219, -1005, -85, 72, -1363, 78, -1301, 5, 615, 419, -2888, -800, 1064, -1485, -714, -1609, -477, 556, -940, -626, 11, -141, 1312, -1549, -1529, 179, -1455, -874, -1030, -1278, -281, 12, -1547, -519, 386, -430, 554, -554, 673, 1159, -300, -362, 485, 766, 339, 990, -840, 851, 1025, -528, -142, -426, 808, 1247, -1060, -781, 1719, -4, -1588, 554, 275, 1606, -128, -883, -37, 576, 259, 644, -862, -1855, 720, -465, -1322, -551, -126, -130, -1612, -359, 449, 160, -1855, -1526, 114, -939, -114, -1359, 493, -157, -1264, -364, -409, -379, -1851, -278, -1704, -580, -894, -1081, 427, -447, 32, -808, 470, -503, 2455, -1079, 221, -3, -1545, 545, -573, -1015, 84, 262, -861, -1174, 759, -858, 1999, -1823]
3598a823K287M80j565Q89Q7K02m32J145j425J650j673L16J351j974j27N35R22
3615H45k350K102j55J547k655j588L565j823J42j376J949P67rl02j332J531j825
3632i67R94qo09R59j179j47K13J238j479J166k339J527Q51j451J122K55M30P00
3650A276j202j233J608p61k189K455k267K688L14j821l29J081M65m75N37k161
3666b014K488j10j497J106L48r0P06j254L86J271j239j711K283j392J813j39j588
3683f33J995m35j692J823j183N87R76j266Q40p07p6P35P48q85n09m93l95R85L73
3702G88j118J223j563K50N83l9j226J611j598R71l52O95K20j497j463J803J65
3719e47p23J106k61M98J61q26O90l56Q1P70r07j154K444l72k519K247j113P92
$$ y = [-1823, 464, 944, -621, 268, 355, 557, 125, 1270, -155, 1495, -178, 138, 1489, -485, -612, -77, 845, -1505, 597, 442, 1989, -666, -2254, 1311, -512, -370, -1746, 203, 970, 961, 659, -673, 858, -967, 27, 19, -590, 369, -810, -957, -744, 494, -985, 181, -2158, -631, 220, -1231, -109, 146, 576, 1276, 74, -1159, 449, -312, -2501, -46, -2313, 375, 689, -1132, -1461, -380, 85, -390, 147, -2014, 474, 364, -1133, -27, 321, 231, 937, -317, 69, 1340, 101, -1610, 673, -719, 1094, 955, -633, 1362, 927, -765, 1058, -125, 462, 1438, 172, 1012, 305, 229, 964, 1712, 827, 318, -175, -570, 415, 788, -330, 893, -670, -420, 163, 124, -1102, 509, -1089, -118, -470, 225, 445, -1052, -2515, -712, -547, -1270, -164, -425, 73, 234, -592, 98, -258, -177, 593, -314, -1468, 976, 604, -1915, 332, -781, 11]
3737A1M82j515J627K7l48j218J136p93J269j155L0K240k044n68J417r61Q84R85
3755A506k165j39P36R38J436l424P48K395j077j707O62J706j049J064k709L91
3771f88K80J010j50q13J12l7J081k298K395r91j023K041j707k04K025j465p4P12
3789B06j287M97P75j288J632p65n27Q27r33N73o23J229m83n55q21J573r20Q80
3807a0n24m1J024j042J241j687J626l80r02P32q32P61N55p8k39m46J216q36L52
3826D90j218J362l07q78J407j327J872j381K4K86J62m57R18k82n61J029j835J328
3844F32p46N46l50m4l91O57J232j685O20k23o10J589k310M32Q82k81N0j48J46
3863bM66j494K54J095j8k43J16j389L47N53P80r89N24k8R06j609j83l67Q58j82
$$ y = [11, 493, -1022, 605, 632, 284, -934, 202, -591, 678, -477, -447, 1793, -251, -819, 598, -363, 521, 1506, -659, -798, -62, 876, 2312, -1112, -364, 2031, 954, -753, -91, 1615, 566, 1630, -1079, -688, -408, 602, 452, -361, -249, -286, 795, -1503, 892, -99, -1122, 919, -788, -992, 1033, -432, -506, 206, -1081, -584, 191, -1097, 535, -230, -757, 70, -863, -290, -913, 316, -167, -722, -1543, 30, -890, -10, -534, -575, 449, -593, 648, -1039, 587, 207, -695, 37, -795, -34, 521, 443, 204, -242, 974, 138, 490, -728, 634, 327, -551, 856, -471, 1401, 20, 44, 330, 492, 35, 953, 671, 110, 1139, -696, 632, -114, 432, 82, 38, -353, 304, 1536, -149, 471, 248, -362, 1227, -1083, -651, 231, -50, 0, -148, -2, 464, -1030, -776, 319, 301, 58, 174, -1215, -868, -315, 465, -524, 0, -28, 878, -731, -914, -1281, -423, -605]
3883f05q14J412r35K535k498l9J169Q14j644o1K21J422r56n93O95K47p58J336
3901I48p15j527J195N64K37q35L79l4m36j461K615j215K02n6n74k3J341j123j48
3920f66J633j519O15J281j999J247k3k36L06J50j238J385l09j355J241p77J83
3937h1P45j187R79j4j805K126j527n75K065j363q7R97r34Q44k34j16L94O1m34
3956a46j345O60j91J138P0o54L08J68m08N34J19j313J838j729m20R32M31M25l97
3975B0j7N45P78j914M02k67J920l97j857L39L28R32j26n29m45K102j739p11KR03
3995B69K80P11j788J9L22K37k37K253j667P00j262j24J062j066J41k91k87Q16
4013H8J333k343k61Q26j3J30L10j16J81N92j499J230j883L0J827j880J744o18
$$ y = [-605, -1419, -7, -942, 1593, -905, -944, 225, 1039, -605, -666, -445, 977, 21, -572, 123, 370, -388, 948, 233, -1294, -99, 465, 702, -133, 246, 212, -224, -1685, 930, -285, -83, -139, -713, -736, 605, -518, -666, 967, -552, 63, 1344, -655, 592, 569, 333, 639, 789, -449, 936, 627, -728, 513, -264, -81, 664, -523, 456, 442, -1363, 763, -764, -1339, 726, -637, -724, 273, -661, 183, -51, -167, 227, 288, -146, -1491, -831, -1022, 116, 186, -468, -160, 8, -400, 134, 253, -1060, 778, -951, -1371, -439, -8, 417, 20, 3, 548, 1326, -588, -186, -453, 1467, 1070, -787, -448, -120, 812, 686, 157, -288, 1814, 75, -636, -634, 269, 549, 1260, -528, -509, -187, 50, -187, 2066, 399, 1099, -163, -287, 775, -291, -150, -441, -728, 88, 1421, -922, -1183, -357, -370, -240, 70, -46, 135, 727, -772, 458, -1425, -1395, 432, -1448, 296, -322]
4031c22K11m1K50n00l72K11k87J439j413M18Q94p75j62J0o56L26P18j272K025
4050G02j451J073k52m11K74N33K85j335J693j537J347k74j880J345k72L34J61
4067C35m04L33j17o80J12J281o30K7L87j719J698n99p49J054k05j44K11n83k14
4086f06J340j495J443q26j040Q08l69M68o66J898j316L62p8q71J405j874JJ298
4104a18p45K82k2q95J165N09r97R97k34n56P34L46j404N24O82m26n88j053K402
4123F03q64l63J780j83r39P4J41q98J059k46P2L54p10J5P33j785Q75J339q86q4
4143H7k63k43J956j499j44J310o46q06R48j069N23K84O6n93j2nJ455k037P08o2
4163d2o90P88%r18J559j087l33L89L03J46j322R98j000J032k58M98k08j170K68
$$ y = [-322, -111, -152, 98, -402, -774, -563, -850, 589, -824, -406, 488, -287, -449, -439, -1095, -769, -51, -1323, 702, -749, 324, 72, -339, -65, 468, 753, -582, 1111, -426, 921, 647, -1233, 112, -160, 174, 335, -69, 264, 147, -533, -421, 860, 230, 257, 644, -1075, 623, 24, -725, 329, 124, -20, 191, -392, -606, 734, -761, 682, -144, -1184, -376, -745, -277, -943, 955, -361, 1, -77, -948, 457, -1417, -1416, -118, -863, -581, -603, -1498, -333, 176, -821, 176, -58, -614, 120, 466, -938, -414, 268, -158, -746, -1799, 603, -261, -624, 1156, 973, 34, 108, 249, -649, 410, 164, 236, 590, -120, -105, 628, -1157, -282, 1057, 171, 87, -176, -419, 1537, 38, -106, 1204, 558, -248, 700, -369, 154, 438, 504, -89, -101, -106, 1349, -688, 20, -42, -732, 56, 56, -862, 697, -390, -723, -334, -31, 115, -1207, -209, -1209, -177, -435, 63, -145, -1315, -1047]
4182a047Q08l23J032j503M29L73j6p33J995j785J132K41m69Q3Q59j570N6N67J22
4201B51N15m77q34K46M74j45m08L64j12J218j420j13K603k632J049j173Q66L83
4219F55n02m35J219k81k79L74p60J126j038j032J064K81r68J060n21r90J378O14
4237I65j645R03n46L66l32J170j306O58o59J91O28j931K257q51m11j65M30l96
4255f74L27p4J27J964k319J58k28j0J080j132R48p62J324j041R51j244m44J455
4273D06j448K543j087p3L33L54j609P57K37p73R27j061J140n42O58j125J424n54
4291E07o40O71r52J890j182J06M42j290J208j42K15n32l7m80J840q11o94p84M80
4310a85l92k01J226r26O69J26n91R1n72Q08m40p9P82m14K1N69q30P62J38r40J6
$$ y = [-1047, -239, -562, 470, -1033, -604, -231, -247, -980, 1015, -770, 362, 603, 134, 217, 1076, -494, -438, 129, 251, 766, 289, -545, -299, 175, 30, -378, -14, -126, 1092, -328, -441, 2162, -470, 579, -594, 272, 655, 153, -282, 937, 656, 377, 751, -9, 1117, 79, -953, 111, 392, -576, 484, -37, -1027, 351, 965, -680, 223, -323, 43, -289, 881, -425, 233, -426, -235, 393, -1538, 719, -132, -543, -708, -278, -674, -347, -421, -294, 1670, -649, -491, -719, -729, 351, -781, 167, -595, 729, -312, 639, -605, -1049, 406, -1042, 1501, 414, 341, 674, 1028, -581, 176, 413, -360, 567, -494, 646, 104, 762, -363, 1061, 507, -133, 538, -414, 1476, 294, 400, 842, -448, 760, 618, 833, 301, 264, -216, 1624, 813, 119, -665, -185, -577, -778, 448, -478, 191, 317, -274, -183, -755, 53, -387, -466, 316, -98, -77, 492, -338, 424, 562, -378, -362]
4331c62J97q63J812j846K27K553k288L39q3J04J37Q97j152j007J312l67l5J354
4349I29j285M7Q58q58K27J08o63Q90R5m74J68J027j598J110k28K87k95o58J061
4368G48k69M06J85o93r8q56n8N70J006r50K32m59R72p37j11Q74j401J056o40J129
4388I06p71P81o68n5L93r71j92k05N65K02K28p29J94Q23p31j21j54O75k2J13o50
4409c89n80J532r46M59l27L66n63Pk15Q13k01P96r76q01J104O65o66O0O7l45J49
4430IQ30q03R29j110o25R80k74P97p78J78j45K12K46P15n87m01L94o17K15J031
4450A196j053m19R52l04J95K08k071O40J655k371K217k224J696M04q94j22J42
4467a53J17N63l31j478J350j48p93J001n19L0N91n36j195J166k2N00l34j55O66
$$ y = [-362, -165, -1028, 784, -1062, -835, 1718, -570, -231, -314, -210, -73, 824, -328, -1335, -23, -390, -425, 929, -356, -309, 549, -309, -82, 26, -637, 253, 348, -126, 42, 1069, -529, 581, 353, 640, 345, -313, 748, 479, 885, 1070, 377, 279, -577, -635, -65, 941, -9, 223, -236, 736, -1, -112, 762, -639, 417, -223, 906, 135, 916, 248, 193, 586, -385, -577, -782, -217, -15, 213, -516, -322, 501, -230, -351, -505, 170, 148, 261, -389, -969, 563, -383, 76, -251, 115, -448, -441, -656, 157, -44, 752, -224, -1025, 79, 744, 78, 138, 205, -140, 9, 839, 36, 965, -145, -770, 210, -64, 733, -45, 133, -12, 200, 446, 1161, 574, 173, 567, -50, 165, 1196, 143, -276, 676, 372, 567, 775, -1296, -656, 999, -1372, 845, -1379, 317, 721, -173, -295, -153, -36, 527, 196, -1282, 68, -80, -873, 128, -391, -361, 230, -306, -1501, -335, -357, 143, -191, -346, 320]
4486C20r75q3J336m86K22n2k87j551J529O10o84l14N54j217J418L68j608J940
4504A040j963J078j018J512J24P98k090Q79J042j818J646j241Q12Q4l91r33P12
4521B73J01O43q39r1R5k64j600K57J582k08p93J223m38K86K18j360J680k92M22
4540H95j689J96P1J36J175o35p08P42p61Q35m47mn12l23P84j88N73l63o77O02
4560b98M27j165J846j301P3J167n09n22J185P0p09j20m03O16o82p83J559m52j238
$$ y = [320, -655, -738, 598, 112, 334, 282, -5, -1556, -27, 583, -101, -415, 139, -1078, 340, 708, -900, 1040, -923, 155, -863, 649, 773, 1571, -519, 360, 1402, -416, 1230, -11, 801, 885, 494, -439, 273, 374, 1017, 178, 87, 182, -82, -1682, -1425, 157, -51, -844, 379, -59, 227, 445, -915, 765, 473, 895, -794, -598, -527, -391, 784, 149, -559, 183, -578, 257, -190, -194, -706, -1029, -245, -433, 140, -223, -900, -298, 129, -1036, 810, -491, -418, 749, 240, -282, 903, 973, 264, 144, -259, 357, -325, -1108, 451, -1, -1239]
$$ [...]
8191B14
##END NTUPLES=NMR FID
##END=
