##TITLE=1H_SA_sl_BA/tBu-1
 CDCl3, 58 sc, 
 27.11.2020
##JCAMPDX= 6.0         $$ Bruker NMR JCAMP-DX V2.0
##DATA TYPE= NMR FID
##DATA CLASS= NTUPLES
##ORIGIN= UXNMR, Bruker Analytische Messtechnik GmbH
##OWNER= root
$$ XWIN-NMR		Version 3.5
$$ Fri Nov 27 13:05:02 2020 Russian Standard Time (UT+4h)  she@DPX200
##.OBSERVE FREQUENCY= 200.1315066352
##.OBSERVE NUCLEUS= ^1H
##.DELAY= (6, 6)
##.ACQUISITION MODE= SIMULTANEOUS
##.ACQUISITION SCHEME= undefined
##.AVERAGES= 58
##.DIGITISER RES= 18
##SPECTROMETER/DATA SYSTEM= spect
##.PULSE SEQUENCE= zg30
##.SOLVENT NAME= CDCl3
##.SHIFT REFERENCE= (INTERNAL, CDCl3, 0, 15.7039)
##AUDIT TRAIL= $$ (NUMBER, WHEN, WHO, WHERE, WHAT)
$$ ##TITLE= Audit trail, XWIN-NMR		Version 3.5
$$ ##JCAMPDX= 5.01
$$ ##ORIGIN= Bruker BioSpin GmbH
$$ ##OWNER= she
$$ F:/spectra/data/she/nmr/H-F/1/audita.txt
$$ ##AUDIT TRAIL=  $$ (NUMBER, WHEN, WHO, WHERE, WHAT)
(   1,<2020-11-27 13:02:56.10 +0400>,<she>,<DPX200>,
      <continue with go, POWCHK disabled, PULCHK disabled
       configuration hash MD5:
       00 E9 B6 7A A2 85 ED C7 34 08 36 98 17 FE 4E 26
       data hash MD5: 16K
       48 B1 AC 3C 25 D0 A2 36 F4 9F 61 7D 1D 51 F9 3C>)
$$ ##END=
$$ 
$$ hash MD5
$$ D4 2B 65 E0 A8 1F EA 4B 64 B6 2A B0 B3 68 23 4E
##$RELAX= 
##$RELAX= 
##$RELAX= 
##$RELAX= 
##$RELAX= 
##$RELAX= 
$$ Bruker specific parameters
$$ --------------------------
##$DU= <F:/spectra>
##$EXPNO= 1
##$NAME= <H-F>
##$PROCNO= 1
##$TYPE= <nmr>
##$USER= <she>
##$AMP= (0..31)
100 100 100 100 100 100 100 100 100 100 100 100 100 100 100 100 100 100 
100 100 100 100 100 100 100 100 100 100 100 100 100 100 
##$AQSEQ= 0
##$AQ_mod= 1
##$AUNM= <au_zg>
##$AUTOPOS= <>
##$BF1= 200.13
##$BF2= 200.13
##$BF3= 200.13
##$BF4= 200.13
##$BF5= 200.13
##$BF6= 200.13
##$BF7= 200.13
##$BF8= 200.13
##$BYTORDA= 1
##$CFDGTYP= 0
##$CFRGTYP= 5
##$CHEMSTR= <none>
##$CNST= (0..31)
1 1 145 1 1 1 1 1 1 1 1 1 1 1 1 1 1 1 1 1 1 1 1 1 1 1 1 1 1 1 1 1 
##$CPDPRG= <>
##$CPDPRG1= <>
##$CPDPRG2= <>
##$CPDPRG3= <>
##$CPDPRG4= <mlev>
##$CPDPRG5= <mlev>
##$CPDPRG6= <mlev>
##$CPDPRG7= <mlev>
##$CPDPRG8= <mlev>
##$CPDPRGB= <>
##$CPDPRGT= <>
##$D= (0..31)
0 1.2 0 0 0 0 0 0 0 0.06 0 0.03 0 0 0 0 0.0002 0 0 0 0 0 0 0 0 0 0 0 0 
0 0 0 
##$DATE= 1606467531
##$DBL= (0..7)
120 120 120 120 120 120 120 120 
##$DBP= (0..7)
150 150 150 150 150 150 150 150 
##$DBP07= 0
##$DBPNAM0= <>
##$DBPNAM1= <>
##$DBPNAM2= <>
##$DBPNAM3= <>
##$DBPNAM4= <>
##$DBPNAM5= <>
##$DBPNAM6= <>
##$DBPNAM7= <>
##$DBPOAL= (0..7)
0.5 0.5 0.5 0.5 0.5 0.5 0.5 0.5 
##$DBPOFFS= (0..7)
0 0 0 0 0 0 0 0 
##$DE= 6
##$DECBNUC= <off>
##$DECIM= 32
##$DECNUC= <off>
##$DECSTAT= 4
##$DIGMOD= 1
##$DIGTYP= 9
##$DL= (0..7)
0 120 120 120 120 120 120 120 
##$DP= (0..7)
150 150 150 150 150 150 150 150 
##$DP07= 0
##$DPNAME0= <>
##$DPNAME1= <>
##$DPNAME2= <>
##$DPNAME3= <>
##$DPNAME4= <>
##$DPNAME5= <>
##$DPNAME6= <>
##$DPNAME7= <>
##$DPOAL= (0..7)
0.5 0.5 0.5 0.5 0.5 0.5 0.5 0.5 
##$DPOFFS= (0..7)
0 0 0 0 0 0 0 0 
##$DQDMODE= 0
##$DR= 18
##$DS= 0
$$ [...]
##$SUBNAM2= <"">
##$SUBNAM3= <"">
##$SUBNAM4= <"">
##$SUBNAM5= <"">
##$SUBNAM6= <"">
##$SUBNAM7= <"">
##$SUBNAM8= <"">
##$SUBNAM9= <"">
##$SW= 16.9725356469052
##$SWIBOX= (0..15)
0 0 2 0 0 0 0 0 0 0 0 0 0 0 0 0 
##$SW_h= 3396.73913043478
##$TD= 16384
##$TD0= 1
##$TE= 0
##$TE2= 300
##$TE3= 300
##$TEG= 300
##$TL= (0..7)
0 120 120 120 120 120 120 120 
##$TP= (0..7)
150 150 150 150 150 150 150 150 
##$TP07= 0
##$TPNAME0= <>
##$TPNAME1= <>
##$TPNAME2= <>
##$TPNAME3= <>
##$TPNAME4= <>
##$TPNAME5= <>
##$TPNAME6= <>
##$TPNAME7= <>
##$TPOAL= (0..7)
0.5 0.5 0.5 0.5 0.5 0.5 0.5 0.5 
##$TPOFFS= (0..7)
0 0 0 0 0 0 0 0 
##$TUNHIN= 0
##$TUNHOUT= 0
##$TUNXOUT= 0
##$USERA1= <user>
##$USERA2= <user>
##$USERA3= <user>
##$USERA4= <user>
##$USERA5= <user>
##$V9= 5
##$VALIST= <valist>
##$VCLIST= <CCCCCCCCCCCCCCC>
##$VD= 0
##$VDLIST= <DDDDDDDDDDDDDDD>
##$VPLIST= <PPPPPPPPPPPPPPP>
##$VTLIST= <TTTTTTTTTTTTTTT>
##$WBST= 1024
##$WBSW= 4
##$XGAIN= (0..3)
0 0 0 0 
##$XL= 0
##$YL= 0
##$YMAX_a= 2058974
##$YMIN_a= -1786421
##$ZGOPTNS= <>
##$ZL1= 120
##$ZL2= 120
##$ZL3= 120
##$ZL4= 120
##$ABSF1= 10
##$ABSF2= 0
##$ABSG= 5
##$ABSL= 3
##$ALPHA= 0
##$AQORDER= 0
##$ASSFAC= 0
##$ASSFACI= 0
##$ASSFACX= 0
##$ASSWID= 0
##$AUNMP= <proc_1d>
##$AZFE= 0.1
##$AZFW= 0.1
##$BCFW= 1
##$BC_mod= 2
##$BYTORDP= 1
##$COROFFS= 0
##$CY= 11.3945322036743
##$DATMOD= 1
##$DC= 2
##$DFILT= <>
##$DTYPP= 0
##$F1P= 15.9154993809931
##$F2P= -4.1035820241983
##$FCOR= 0.5
##$FTSIZE= 0
##$FT_mod= 4
##$GAMMA= 1
##$GB= 0.15
##$INTBC= 1
##$INTSCL= 1
##$ISEN= 128
##$LB= 0.24
##$LEV0= 0
##$LPBIN= 0
##$MAXI= 10000
##$MC2= 0
##$MEAN= 0
##$ME_mod= 0
##$MI= 1.114404
##$NCOEF= 0
##$NC_proc= 0
##$NLEV= 6
##$NOISF1= 3.799351
##$NOISF2= 2.8
##$NSP= 1
##$NTH_PI= 0
##$NZP= 0
##$OFFSET= 15.70392
##$PC= 1
##$PHC0= -10686.95
##$PHC1= 8.40088
##$PH_mod= 1
##$PKNL= yes
##$PPARMOD= 0
##$PSCAL= 0
##$PSIGN= 0
##$REVERSE= no
##$SF= 200.130013532006
##$SI= 16384
##$SIGF1= 3
##$SIGF2= 2
##$SINO= 400
##$SIOLD= 16384
##$SREGLST= <1H.CDCl3>
##$SSB= 0
##$STSI= 0
##$STSR= 0
##$SW_p= 3612.71676300578
##$SYMM= 0
##$S_DEV= 0
##$TDeff= 0
##$TDoff= 0
##$TI= <>
##$TILT= no
##$TM1= 0
##$TM2= 0
##$TOPLEV= 0
##$USERP1= <user>
##$USERP2= <user>
##$USERP3= <user>
##$USERP4= <user>
##$USERP5= <user>
##$WDW= 1
##$XDIM= 8192
##$YMAX_p= 0
##$YMIN_p= 0
$$ End of Bruker specific parameters
$$ ---------------------------------
##NTUPLES= NMR FID
##VAR_NAME=  TIME,          FID/REAL,        FID/IMAG
##SYMBOL=    X,             R,               I
##VAR_TYPE=  INDEPENDENT,   DEPENDENT,       DEPENDENT
##VAR_FORM=  AFFN,          ASDF,            ASDF
##VAR_DIM=   8192,          8192,            8192
##UNITS=     SECONDS,       ARBITRARY UNITS, ARBITRARY UNITS
##FACTOR=    0.0002944,     1,               1
##FIRST=     0,             0,               0
##LAST=      2.4114304,     0,               0
##MIN=       0,             -1786421,        0
##MAX=       2.4114304,     2058974,         0
$$ Real data points
##PAGE= N=1
##DATA TABLE= (X++(R..R)), XYDATA
$$ plain form
0 0 0 0 0 0 0 0 0 0 0 0 0 0 0 -57 58 -58 58 -89 116 -116 174 -174 232 -263 300 -348 408 -489 576 -643
30 -643 751 -857 970 -1104 1252 -1413 1586 -1783 1998 -2231 2486 -2771 3073 -3404 3771 -4167
46 -4167 4600 -5075 5598 -6167 6792 -7484 8246 -9085 10035 -11089 12289 -13647 15222
59 15222 -17051 19226 -21845 25090 -29215 34692 -42350 53937 -73945 119052 -490426 152582
71 152582 -293908 -1187432 -1412798 -1786421 -52673 -3675 -1467634 -1403348 -887551 -170026
81 -170026 395564 -1101126 -1378733 -253688 159692 162946 -687281 -1295691 -95271 621900
91 621900 -26377 -520513 -770505 59733 1103583 236247 -411976 -143994 443386 1186489
101 1186489 536658 -542836 -34175 621671 735947 292793 -824557 -440648 533123
$$ packed form
0@%%%%%%%%%%%%%n7J15j16J16j47K05k32K90l48M06m95N63o48P56q97J065j219
30f43J394j608J827k074K356k665K999l369L781m229M717n257N844o477P175p938
46d167Q767r675J0673j1765J2959j4276J5730j7331J9120k1124K3378k5936K8869
59A5222l2273L6277m1071M6935n4305O3907p7042R6287j27882J92997o09478O43008
71A52582m46490q93524k25366l73623J733748M8998j463959O4286N15797P17525
81a70026N65590j496690k77607J125045M13380L254q50227o08410J200420P17171
91F21900o48277m94136k49992Q30238J043850q67336o48223K67982N87380P43103
101A186489o49831j079494N08661O55846J14276m43154j117350L83909R73771
$$ plain form
110 533123 293997 -254519 -881225 -646988 408838 330414 -594687 -778670 -394349 308956
120 308956 402356 -638445 -891059 -166266 250167 81999 -618275 -1011348 -196214 365500
130 365500 -178658 -617694 -745804 -114790 576775 -8533 -593835 -333495 170583 572149
140 572149 175738 -619767 -293947 338099 337657 -48232 -658803 -478201 290317 241219 -357668
151 -357668 -587528 -383612 271722 390687 -374254 -486147 -42364 330151 420629 -235701
161 -235701 -522565 138581 398747 192459 -174408 -527146 107877 534219 51337 -195556
171 -195556 -257768 124839 662435 196763 -264910 31706 265399 538133 287040 -370853
181 -370853 -64246 337045 227588 35088 -421743 -357758 263720 83923 -308046 -368708
$$ packed form
110E33123k39126n48516o26706K34237J055826p8424r25101j83983L84321P03305
120C08956R3400j040801k52614P24793M16433j68168p00274l93073Q15134N61714
130C65500n44158m39036j28110O31014O91565n85308n85302K60340N04078M01566
140E72149l96411p95505L25820O32046m42l85889o10571J80602P68518m9098n98887
151c57668k29860K03916O55334J18965p64941j11893M43783L72515R0478o56330
161b35701k86864O61146K60166k06288l66867l52738O35023M26342m82882k46893
171a95556o2212L82607N37596m65672m61673K96616K33693K72734k51093o57893
181c70853L06607M01291j09457j92500m56831O3985O21478j79797l91969o0662
$$ plain form
191 -368708 -388523 141949 175107 -420265 -370149 -150587 44590 183313 -333552 -486258
201 -486258 17955 58136 19563 -217379 -476757 36737 234720 -40284 -125625 -198271 78554
212 78554 448836 106821 -91294 100298 187727 450389 239413 -129821 109950 279659
222 279659 248275 167900 -139954 -66934 295055 125340 -6923 -86692 -124900 217745 159710
233 159710 -123085 -94670 -35542 77382 157134 -150329 -206154 25136 965 40659 -114455
244 -114455 -239204 5734 84703 -24309 -53280 -88987 7390 213658 55450 -13283 69564
255 69564 77083 212228 145704 -3134 67775 145194 113089 137976 16199 -13813 152698
266 152698 72108 66147 47525 -28412 80263 114559 10081 27646 20803 -21857 114217 14327
$$ packed form
191c68708j9815N30472L3158n95372N0116K19562J95177J38723n16865j52706
201d86258N04213M0181l8573k36942k59378N13494J97983k75004q5341p2646K76825
212G8554L70282l42015j98115J91592Q7429K62662k10976l69234K39771J69709
222B79659l1384q0375l07854P3020L61989j69715j32263p9769l8208L42645n8035
233A59710k82795K8415N9128J12924P9752l07463n5825K31290k4171L9694j55114
244a14455j24749K44938P8969j09012k8971l5707R6377K06268j58208o8733Q2847
255F9564P519J35145o6524j48838P0909P7419l2105K4887j21777l0012J66511
266A52698q0590n961j8622p5937J08675L4296j04478J7565o843m2660J36074r9890
$$ plain form
278 14327 -43074 34717 -43306 39997 66113 -53796 -14090 40272 490 110682 39868 -48382
290 -48382 119949 74734 110650 133973 -10795 85964 191849 101261 111213 61921 5254 219658
302 219658 135118 11881 65646 -2629 137533 170613 -47602 -34295 57952 50442 136495
313 136495 -37560 -150705 83141 64718 46589 -17982 -169352 31863 157307 -7647
323 -7647 -53500 -87847 -13564 220007 30812 -117143 -1671 44171 210767 119438 -129888
334 -129888 14857 189257 182558 152498 -72930 -22732 289826 196861 69295 -32731 -40608
345 -40608 252346 235664 -54214 -78614 2561 161298 232245 -101353 -164620 70137 153982
356 153982 164776 -74118 -208590 82935 223225 67598 -83977 -185003 45739 266320
$$ packed form
278A4327n7401P7791p8023Q3303K6116j19909L9706N4362l9782J10192p0814q8250
290d8382J68331m5215L5916K3323j44768R6759J05885r0588R952m9292n6667K14404
302B19658q4540j23237N3765o8275J40162L3080k18215J3307R2247p510Q6053
313A36495j74055j13145K33846j8423j8129o4571j51370K01215J25444j64954
323g647m5853l4347P4283K33571j89195j47955J15472M5842J66596r1329k49326
334a29888J44745J74400o699l0060k25428N0198L12558r2965j27566j02026p877
345d0608K92954j6682k89878k4400Q1175J58737P0947l33598o3267K34757Q3845
356A53982J0794k38894j34472K91525J40290j55627j51575j01026K30742K20581
$$ plain form
366 266320 22103 -158129 -125538 59200 256884 58539 -208697 -68520 157464 234114
376 234114 86978 -199321 -59591 243276 215143 12167 -189963 -90343 229326 193919
386 193919 -125694 -219033 -80921 184181 177982 -182392 -248986 4556 204718 149753 -147297
397 -147297 -248477 80662 270023 90428 -138310 -207653 100534 313371 64512 -180367
407 -180367 -113637 150434 334889 116685 -186412 -10707 272830 344371 146427 -144191
417 -144191 11769 352347 317082 35208 -144942 -44024 299376 249395 -143262 -222042
427 -222042 -61269 202578 175576 -225934 -313117 1449 172143 80745 -227035 -366266
437 -366266 27249 192477 -42807 -272569 -344585 -10234 211925 -93088 -343232 -223979
$$ packed form
366B66320k44217j80232L2591J84738J97684j98345k67236J40177K25984P6650
376B34114j47136k86299J39730L02867k8133k02976k02130R9620L19669l5407
386A93919l19613r3339J38112K65102o199l60374o6594K53542K00162n4965k97050
397a47297j01180L29139J89361j79595k28738o9343L08187K12837k48859k44879
407a80367O6730K64071J84455k18204l03097J75705K83537P1541j97944k90618
417a44191J55960L40578l5265k81874j80150J00918L43400m9981l92657p8780
427b22042J60773K63847k7002m01510q7183L14566J70694r1398l07780j39231
437c66266L93515J65228k35284k29762p2016L34351K22159l05013k50144J19253
$$ plain form
447 -223979 30528 246405 -12353 -321104 -65169 204929 281255 81983 -215021 -981
457 -981 366730 279422 31014 -130919 -20623 382302 267179 -98134 -125133 23242 315934
468 315934 266783 -150507 -167647 141947 269132 207243 -144099 -239518 175879 248638 42939
479 42939 -194183 -271089 88977 249816 -88498 -281441 -184501 54083 263569 -62134
489 -62134 -308513 -53331 166814 239970 5764 -266811 -25102 287003 168193 -47828
499 -47828 -217760 -71505 293820 132472 -169190 -185919 -26699 238834 166106 -203909
509 -203909 -180192 106127 208470 144035 -175985 -211533 151119 209281 14175 -189287 -207834
520 -207834 97608 234550 -69042 -221499 -99402 116555 269420 -4228 -197185 35943
$$ packed form
447b23979K54507K15877k58758l08751K55935K70098P6326j99272k97004K14040
457i81L67711q7308k48408j61933J10296M02925j15123l65313k6999J48375K92692
468C15934m9151m17290j7140L09594J27185o1889l51342r5419M15397P2759k05699
479D2939k37122p6906L60066J60839l38314j92943R6940K38584K09486l25703
489f2134k46379K55182K20145P3156k34206k72575K41709L12105j18810k16021
499d7828j69932J46255L65325j61348l01662j6729J59220K65533p2728l70015
509b03909K3717K86319J02343o4435l20020l5548L62652N8162j95106k03462j8547
520b07834L05442J36942l03592j52457J22097K15957J52865k73648j92957K33128
$$ plain form
530 35943 249536 261819 72265 -137938 66038 345063 205929 17099 -95482 31183
540 31183 320387 182072 -98171 -77130 69408 243656 192738 -136744 -100215 150590 186330
551 186330 118822 -129956 -171054 132443 159950 -50538 -160963 -190800 40277 166284 -130691
562 -130691 -211230 -85030 44574 176671 -39380 -206688 41418 175504 149252 59032
572 59032 -136122 60845 288857 119519 22339 -38024 37661 291473 161325 -65087 33778
583 33778 104656 231217 222176 -67302 15042 204385 174276 149992 -28714 -79776 179753
594 179753 144098 -25191 -49025 -119651 62477 141135 -110830 -116892 -35756 15155 129189
605 129189 -39298 -158055 56942 81956 71020 36636 -128471 41922 165721 28040
$$ packed form
530C5943K13593J2283j89554k10203K03976K79025j39134j88830j12581J26665
540C1183K89204j38315k80243K1041J46538J74248n0918l29482L6529K50805L5740
551A86330o7508k48778m1098L03497K7507k10488j10425k9837K31077J26007k96975
562a30691q0539J26200J29604J32097k16051j67308K48106J34086k6252r0220
572E9032j95154J96967K28012j69338r7180o0363P5685K53812j30148k26412R8865
583C3778P0878J26561r041k89478Q2344J89343l0109k4284j78706n1062K59529
594A79753l5655j69289k3834p0626J82128P8658k51965o062Q1136N0911J14034
605A29189j68487j18757K14997K5014j0936l4384j65107J70393J23799j37681
$$ plain form
615 28040 4571 -34472 2481 189567 74559 -50091 54425 60092 159663 150014 -30669
626 -30669 56876 154665 115630 119637 17613 -17669 153186 90157 3367 19014 -45687 65144
638 65144 95487 -49413 -25579 21269 11877 89403 2346 -63441 71549 36593 33987 39081
650 39081 -53251 27187 76076 -12436 4518 4161 -28088 77201 14369 -35791 53522 7593
662 7593 37786 69405 -13192 27687 73853 -4268 44188 31017 -34913 55039 -9859 -33444
674 -33444 34023 -37648 -23741 17610 -46362 3579 28448 -61231 24621 19656 -15403 61181
686 61181 -22251 -16179 68576 12513 9084 29332 -36605 53319 74324 -35512 31665 14619
698 14619 30481 109831 -522 -14126 78188 48394 70126 48796 -64111 62129 88253
$$ packed form
615B8040k3469l9043L6953J87086j15008j24650J04516N667R9571r649j80683
626c0669Q7545R7789l9035M007j02024l5282J70855o3029q6790J5647o4701J10831
638F5144L0343j44900K3834M6848r392P7526q7057o5787J34990l4956k606N094
650C9081r2332Q0438M8889q8512J6954l57l2249J05289o2832n0160Q9313m5929
662G593L0193L1619q2597M0879M6166p8121M8456j3171o5930Q9952o4898k3585
674c3444O7467p1671J3907M1351o3972M9941K4869q9679Q5852m965l5059P6584
686F1181q3432O072Q4755n6063l429K0248o5937Q9924K1005j09836O7177j7046
698A4619J5862P9350j10353j3604R2314k9794K1732k1330j12907J26240K6124
$$ plain form
709 88253 -5208 18567 -59812 -12050 95108 -22368 -74641 -23735 -34299 58620 16494 -131701
721 -131701 -22931 18195 16182 22508 -112120 -70952 73666 16364 -35345 -62076 -91031 75496
733 75496 65075 -84012 -51345 -32483 54661 101387 -65246 -87561 45596 66176 75247 -26099
745 -26099 -117184 57859 106530 16838 -40956 -97144 20387 134846 -5118 -101756 -52647
756 -52647 15430 119742 11134 -142999 -39550 66429 83058 11371 -130014 -59564 121543
767 121543 75276 -31671 -93383 -55747 130818 103818 -71213 -85719 825 112542 119104
778 119104 -72392 -109681 59452 118810 84057 -60568 -124070 64080 149644 24001 -84072
789 -84072 -101972 34821 161078 -8070 -144112 -74441 37074 122128 -12318 -185743 -77217
$$ packed form
709H8253r3461K3775p8379M7762J07158j17476n2273N0906j0564R2919m2126j48195
721a31701J08770M1126k013O326j34628M1168J44618n7302n1709k6731k8955J66527
733G5496j0421j49087L2667J8862Q7144M6726j66633k2315J33157K0580R071j01346
745b6099r1085J75043M8671q9692n7794n6188J17531J14459j39964r6638M9109
756e2647O8077J04312j08608j54133J03449J05979J6629p1687j41385P0450J81107
767A21543m6267j06947o1712L7636J86565k7000j75031j4506Q6544J11717O562
778A19104j91496l7289J69133N9358l4753j44625o3502J88150Q5564j25643j08073
789h4072j7900J36793J26257j69148j36042O9671J11515Q5054j34446j73425J08526
$$ plain form
800 -77217 84509 75411 -30370 -175843 -89338 129656 69565 -76572 -140790 -64481 133016
811 133016 101802 -116560 -127497 2260 118087 112841 -113800 -138655 65167 136029 74473
822 74473 -87660 -131491 84235 180408 22346 -88430 -96553 73098 195863 -5975 -133718
833 -133718 -57745 77828 155532 -7008 -181342 -45098 116714 100646 -18359 -179312
843 -179312 -49334 159353 84795 -65103 -142045 -36549 162545 100144 -122698 -121167 6175
854 6175 138051 99865 -143990 -131577 56634 134830 58842 -123180 -138642 87265 157537
865 157537 1215 -114479 -119837 82610 162822 -41252 -153036 -85583 70850 125775 -54151
876 -54151 -200838 -58932 87881 81648 -61623 -199515 -41766 126860 66719 -87437 -157898
$$ packed form
800g7217J61726r098j05781j45473Q6505K18994o0091j46137o4218P6309J97497
811A33016l1214k18362j0937J29757J15827n246k26641k4855K03822P0862o1556
822G4473j62133m3831K15726R6173j58062j10776q123J69651J22765k01838j27743
833a33718P5973J35573P7704j62540j74334J36244J61812j6068j19005j60953
843a79312J29978K08687p4558j49898p6942J05496J99094o2401k22842J531J27342
854F175J31876l8186k43855J2413J88211P8196p5988j82022j5462K25907P0272
865A57537j56322j15694n358K02447Q0212k04074j11784O7453J56433N4925j79926
876e4151j46687J41906J46813o233j43271j37892J57749J68626o0141j54156p0461
$$ plain form
887 -157898 -26563 149372 70187 -124865 -121280 7546 145584 67686 -137951 -109688 58906
898 58906 145348 47631 -118054 -103017 102122 150848 11920 -108749 -87768 105264 141318
909 141318 -32917 -141375 -69408 80200 106147 -65263 -182972 -51833 75131 64877
919 64877 -84268 -186209 -42188 96995 38455 -108011 -155189 -35244 113591 28465 -135041
930 -135041 -123826 -7499 110007 29116 -138824 -106854 50377 108684 25384 -111191 -89920
941 -89920 98823 120632 776 -92264 -64884 98082 122798 -38111 -116380 -41109 67499
952 67499 92179 -65234 -152234 -28558 57105 44896 -79231 -160432 -33697 74116 2699
963 2699 -99271 -139496 -44490 81115 -13138 -129850 -111903 -28907 67109 -437 -137061
$$ packed form
887a57898J31335J75935p9185j95052L585J28826J38038p7898k05637K8263J68594
898E8906Q6442r7717j65685J5037K05139M8726j38928j20669K0981J93032L6054
909A41318j74235j08458P1967J49608K5947j71410j17709J31139J26964j0254
919F4877j49145j01941J44021J39183n8540j46466m7178J19945J48835q5126j63506
930a35041J1215J16327J17506q0891j67940L1970J57231N8307q3300j36575K1271
941h9920J88743K1809j19856r3040K7380J62966K4716j60909p8269P5271J08608
952F7499K4680j57413q7000J23676Q5663j2209j24127q1201J26735J07813p1417
963B699j01970m0225R5006J25605r4253j16712J7947Q2996R6016o7546j36624
$$ plain form
974 -137061 -89490 27747 58496 14024 -104894 -70836 81378 74249 722 -66513 -49828
985 -49828 87969 97542 -34099 -61414 -20142 60535 91928 -51543 -89447 3836 47036 47266
997 47266 -46019 -112232 -791 59324 -6581 -53047 -104749 -26734 63311 -27399 -87696 -75910
1009 -75910 -32246 41884 -7599 -110580 -54829 3799 21517 10828 -87467 -48445 47542 30016
1021 30016 -2540 -42250 -43187 55833 55153 -31589 -24271 -21192 32912 59688 -36800 -47638 3264
1034 3264 17255 25893 -21814 -77144 -152 20919 -19285 -26333 -75201 -29444 21788 -32458
1046 -32458 -58109 -46613 -43920 5822 -11150 -77948 -29340 -20994 -11061 6870 -52018 -34650
1058 -34650 16150 -1296 -1328 -1495 -35168 25631 31118 -11519 19844 -6630 7888 47306 2865
$$ packed form
974a37061M7571J17237L0749m4472j18918L4058J52214p129p3527o7235J6685
985d9828J37797R573j31641k7315M1272Q0677L1393j43471l7904R3283M3200K30
997D7266r3285o6213J11441O0115o5905m6466n1702P8015R0045r0710o0297J1786
1009g5910M3664P4130m9483j02981N5751N8628J7718j0689r8295L9022R5987j7526
1021C0016l2556l9710r37R9020o80q6742P318L079N4104K6776r6488j0838N0902
1034C264J3991Q638m7707n5330P6992K1071m0204p048m8868M5757N1232n4246
1046c2458k5651J1496K693M9742j6972o6798M8608Q346R933J7931n8888J7368
1058c4650N0800j7446l2j67l3673O0799N487m2637L1363k6474J4518L9418m4441
$$ plain form
1071 2865 -5092 22458 -6927 21348 27774 -34611 8749 -966 -17848 20329 -28527 -38865 2106
1084 2106 -24568 -20098 -5669 -68503 -21769 -3527 -49360 -12548 -52869 -55684 4780 -28947
1096 -28947 -50852 -24946 -54937 -12101 14295 -64421 -27992 -17738 -21620 27653 -32712 -54368
1108 -54368 11353 2279 -83 677 -67764 -2308 39409 -24391 -12336 -46380 -28862 47811 -9094
1121 -9094 -58454 -23083 -24638 21923 18981 -85068 -34530 9529 -463 7773 -68877 -68228 30987
1134 30987 11625 -35184 -43664 -70616 21952 44985 -58020 -49163 -30471 9309 55574 -37129
1146 -37129 -81032 4887 25125 26319 -16622 -97350 -3215 55797 -3737 -36072 -74884 -28804
1158 -28804 67138 28 -82533 -51778 -22219 45421 14161 -107540 -64920 12988 21993 -4010
$$ packed form
1071B865p957K7550k9385K8275O426o2385M3360r715j6882L8177m8856j0338M0971
1084B106k6674M470J4429o2834M6734J8242m5833L6812m0321k815O0464l3727
1096b8947k1905K5906k9991M2836K6396p8716L6429J0254l882M9273o0365k1656
1108e4368O5721r074k362P60o8441O5456M1717o3800J2055l4044J7518P6673n6905
1121i094m9360L5371j555M6561k942j04049N0538M4059r992Q236p6650O49R9215
1134C0987j9362m6809q480k6952R2568K3033j03005Q857J8692L9780M6265r2703
1146c7129m3903Q5919K0238J194m2941q0728R4135N9012n9534l2335l8812M6080
1158b8804R5942o7110q2561L0755K9559O7640l1260j21701M2620P7908R005k6003
$$ plain form
1170 -4010 -97654 -94198 35628 26964 -47071 -81594 -89706 27851 52721 -69598 -91791 -42879
1182 -42879 19573 59586 -53885 -115968 -4150 41021 34071 -36528 -114423 -6977 79962
1193 79962 9345 -53561 -82110 -19930 96589 14849 -90976 -54750 49 77830 27760
1204 27760 -110379 -64545 44274 49302 10998 -97249 -89078 68802 52947 -38111 -86096
1215 -86096 -79159 53187 75326 -70868 -100425 -33393 35686 75437 -66195 -126287 1850
1226 1850 55165 39492 -52165 -125963 -2706 94663 5041 -66925 -92865 -13254 109706 5918
1238 5918 -103265 -64795 8572 85112 20130 -122292 -67557 53854 56250 7019 -111366
1249 -111366 -80506 77951 57752 -39106 -96556 -69603 65675 77395 -77741 -103266 -29237
$$ packed form
1170d010r3644L456J29826q664p4035l4523q112J17557K4870j22319k2193M8912
1182d2879O2452M0013j13471o2083J11818M5171o950p0599p7895J07446Q6939
1193G9962p0617o2906k8549O2180J16519q1740j05825L6226N4799P7781n0070
1204B7760j38139M5834J08819N028l8304j08247Q171J57880j5855r1058m7985
1215h6096O937J32346K2139j46194k9557O7032O9079L9751j41632o0092J28137
1226A850N3315j5673r1657p3798J23257R7369q9622p1966k5940P9611J22960j03788
1238E918j09183L8470P3367P6540o4982j42422N4735J21411K396m9231j18385
1249a11366L0860J58457k0199r6858n7450K6953J35278J1720j55136k5525P4029
$$ plain form
1260 -29237 49869 74129 -77610 -120770 4205 68144 38242 -61749 -118556 11092 102683
1271 102683 5255 -68231 -89583 9466 113798 4821 -98825 -57801 30605 90380 19599
1282 19599 -115239 -50895 68430 67207 6097 -102636 -56822 86861 69124 -37743 -87457
1293 -87457 -47625 73316 78532 -73809 -94248 -16355 59568 63113 -75006 -112576 9900
1304 9900 73846 24511 -62034 -110078 15145 97225 -3968 -76696 -81097 13074 96336 -2262
1316 -2262 -105712 -50969 34497 73782 7392 -112874 -41470 68857 58798 -6576 -91560
1327 -91560 -43783 85800 63871 -43942 -70470 -33677 73265 69351 -69407 -76224 -1878
1338 -1878 59764 53378 -62634 -93504 25066 69388 20289 -51197 -88954 27134 85306 -7169
$$ packed form
1260b9237P9106K4260j51739m3160J24975O3939k9902r9991n6807J29648R1591
1271A02683r7428p3486k1352R9049J04332j08977j03646M1024Q8406N9775p0781
1282A9599j34838O4344J19325j223o1110j08733M5814J43683j7737j06867m9714
1293h7457L9832J20941N216j52341k0439P7893P5923L545j38119l7570J22476
1304I900O3946m9335q6545m8044J25223Q2080j01193p2728m401R4171Q3262r8598
1316b262j03450N4743Q5466L9285o6390j20266P1404J10327j0059o5374q4984
1327i1560M7777J29583k1929j07813k6528L6793J06942l914j38758o817P4346
1338a878O1642o386j16012l0870J18570M4322m9099p1486l7757J16088N8172r2475
$$ plain form
1350 -7169 -65054 -62269 18520 83612 -10162 -94365 -33937 27424 61323 -2419 -100811 -25931
1362 -25931 59955 44393 -12506 -77692 -32367 77331 42281 -42414 -58371 -26450 66477 47032
1374 47032 -61275 -56794 5630 52442 42567 -50766 -63688 37350 59038 23869 -34505 -56880
1386 -56880 39993 72185 258 -42131 -35214 26338 70432 -9189 -62196 -15278 28297 53263
1398 53263 -6602 -67758 -10482 46873 31178 -13568 -58383 -20398 53581 16160 -39367 -52321
1410 -52321 -23601 38061 12615 -57626 -51326 -3662 25455 16193 -50382 -46429 22522 32013 11840
1423 11840 -30469 -32897 30047 46640 -1393 -23057 -14449 25444 53366 -3639 -24306 6753
1435 6753 33850 48268 11343 -19412 18919 52858 32886 14042 -13564 8972 50078 16270
$$ packed form
1350g169n7885K785Q0789O5092r3774q4203O0428O1361L3899o3742r8392P4880
1362b5931Q5886j5562n6899o5186M5325J09698l5050q4695j5957L1921R2927j9445
1374D7032j08307M481O2424M6812r875r3333j2922J01038K1688l5169n8374k2375
1386e6880R6873L2192p1927m2389O917O1552M4094p9621n3007M6918M3575K4966
1398E3263n9865o1156N7276N7355j5695m4746m4815L7985P3979l7421n5527j2954
1410e2321K8720O1662k5446p0241O300M7664K9117r262o6575L953O8951R491k0173
1423A1840m2309k428O2944J6593m8033k1664Q608L9893K7922n7005k0667L1059
1435F753K7097J4418l6925l0755L8331L3939j9972j8844k7606K2536M1106l3808
$$ plain form
1447 16270 -9760 -15891 -3105 24557 9579 -34567 -20672 1069 6461 9117 -31361 -21117
1459 -21117 12971 6638 -958 -17251 -22769 9162 13100 -18075 -13203 -15796 -108 17676 -15300
1472 -15300 -9761 6033 9413 21421 12541 -1288 24395 27406 14932 27809 5886 18387 27924
1485 27924 4165 10957 8136 -375 11673 3999 -7784 15146 -768 -362 14680 -5353 14537
1498 14537 9381 -7815 8248 9020 -2504 5692 -11544 -12685 15593 -12209 -9546 -3918 -10860
1511 -10860 17648 10143 -11361 8304 19481 20585 32735 300 6621 38590 20999 21893 1793
1524 1793 -7785 28110 24586 -6150 -5416 -4436 15594 36453 -10104 -11812 14562 20952 32055 -957
1538 -957 -24114 12499 28796 7004 -7997 -33754 -3732 31713 -8370 -26641 -24745 -2571
$$ packed form
1447A6270k6030o131J2786K7662j4978m4146J3895K1741N392K656m0478J0244
1459b1117L4088o333p596j6293n518L1931L938l1175M872k593J5688J7784l2976
1472a5300N539J5794L380J2008q880j3829K5683L011j2474J2877k1923J2501R537
1485B7924k3759O792k821q511J2048p674j1783K2930j5914M06J5042k0033J9890
1498A4537n156j7196J6063P72j1524Q196j7236j141K8278k7802K663N628o942
1511a0860K8508p505k1504J9665J1177J104J2150l2435O321L1969j7591Q94k0100
1524A793r578L5895l524l0736P34R80K0030K0859m6557j708K6374O390J1103l3012
1538i57k3157L6613J6297k1792j5001k5757L0022L5445m0083j8271J896K2174
$$ plain form
1550 -2571 34314 9912 -30541 -5293 25420 37004 27249 -26343 -4014 43452 33956 10561
1562 10561 -21330 -14804 39650 37416 -14606 -20903 -7448 36075 48188 -16446 -25444 18061 42966
1575 42966 42463 -7654 -37351 23988 49147 12658 -18017 -43186 8930 52557 -947 -38016
1587 -38016 -24608 11440 54554 15988 -44474 -2357 40240 53226 26893 -38442 -6006 61149
1599 61149 44736 3462 -30234 -18386 59622 48283 -23741 -27081 -3583 52722 57443 -24540
1611 -24540 -35444 26914 51292 44673 -18254 -51912 29902 52593 8567 -31853 -55923 11417
1623 11417 59110 -11226 -53366 -31840 11831 62544 3602 -62109 -7339 40015 53950 14654
1635 14654 -52807 -9007 69446 43558 -2644 -37007 -15514 76886 50841 -23615 -24446 9954
$$ packed form
1550b571L6885k4402m0453K5248L0713J1584r755n3592K2329M7466r496k3395
1562A0561l1891O526N4454k234n2022o297J3455M3523J2113o4634q998M3505K4905
1575D2966n03n0117k9697O1339K5159l6489l0675k5169N2116M3627n3504l7069
1587c8016J3408L6048M3114l8566o0462M2117M2597J2986k6333o5335L2436O7155
1599F1149j6413m1274l3696J1848P8008j1339p2024l340K3498N6305M721q1983
1611b4540j0904O2358K4378o619o2927l3658Q1814K2691m4026m0420k4070O7340
1623A1417M7693p0336m2140K1526M3671N0713n8942o5711N4770M7354J3935l9296
1635A4654o7461M3800P8453k5888m6202l4363K1493R2400k6045p4456q31L4400
$$ plain form
1647 9954 72730 68250 -22857 -26053 45748 66589 57592 -17885 -42491 49237 66812 18234 -30437
1660 -30437 -45864 25874 71426 -8838 -52314 -25589 19641 67018 -5317 -65975 -10155 41343
1672 41343 46248 -2014 -64999 -16541 64584 29735 -19082 -49874 -16968 72195 39789 -34029
1684 -34029 -30191 14336 70632 61144 -31403 -24788 51873 70238 55410 -19706 -30248 59911
1696 59911 77278 22306 -20349 -26435 44060 84277 547 -35734 -5800 38591 75549 3459
1708 3459 -52901 3959 53275 46279 2952 -58056 -6729 67548 24358 -19160 -44964 -11125
1720 -11125 67568 31634 -42213 -28774 12828 55921 47462 -42170 -27206 44950 53443 36202
1732 36202 -26375 -32136 52660 64905 4999 -18793 -22449 42428 76618 -9013 -29900 3982
$$ packed form
1647I954O2776m480r1107l196P1801K0841q997p5477k4606R1728J7575m8578m8671
1660c0437j5427P1738M5552q0264m3476K6725M5230M7377p2335o0658N5820N1498
1672D1343M905m8262o2985M8458Q1125l4849m8817l0792L2906Q9163l2406p3818
1684c4029L838M4527N6296r488r2547O615P6661J8365j4828p5116j0542R0159
1696E9911J7367n4972m2655o086P0495M0217q3730l6281K9934M4391L6958p2090
1708C459n6360N6860M9316o996m3327o1008N1327P4277m3190m3518k5804L3839
1720a1125P8693l5934p3847J3439M1602M3093q459q9632J4964P2156Q493j7241
1732C6202o2577n761Q4796J2245n9906k3792l656O4877L4190q5631k0887L3882
$$ plain form
1744 3982 38694 67087 3724 -45713 17925 53908 39795 9416 -44082 9663 70564 25862
1756 25862 -7344 -23618 4868 70033 35049 -30067 -6466 21409 55498 44969 -33392 -10521
1768 -10521 45838 44574 29110 -18859 -22781 52735 49405 -847 -11239 -18806 37479 54887 -16478
1781 -16478 -27501 710 22696 42315 -10299 -47578 11366 28701 18077 -4191 -43669 4933
1793 4933 45958 7350 -13600 -19188 -667 50479 17699 -29042 -1100 14113 37550 29903
1805 29903 -25535 -3079 40222 31433 23342 -3030 -7937 50751 42192 7087 7422 2580 36507
1818 36507 47544 -4113 -8390 16875 19170 33068 -558 -26204 18575 22310 11465 2528 -19793
1831 -19793 7041 36073 3036 -7016 -2019 -2045 31121 7111 -21958 1704 4029 10932 11872
$$ packed form
1744C982L4712K8393o3363m9437O3638L5983j4113l0379n3498N3745O0901m4702
1756B5862l3206j6274K8486O5165l4984o5116K3601K7875L4089j0529p8361K2871
1768a0521N6359j264j5464m7969l922P5516l330n0252j0392p567N6285J7408p1365
1781a6478j1023K8211K1986J9619n2614l7279N8944J7335j0624k2268l9478M8602
1793D933M1025l8608k0950n588J8521N1146l2780m6741K7942J5213K3437p647
1805B9903n5438K2456M3301q789q091k6372m907N8688q559l5105L35m842L3927
1818C6507J1037n1657m277K5265K295J3898l3626k5646M4779L735j0845q937k2321
1831a9793K6834K9032l3037j0052M997k6L3166k4010k9069K3662K325O903R40
$$ plain form
1844 11872 -21431 -7898 22402 3464 7865 -425 -9394 28664 15373 -2020 9508 1992 12279
1857 12279 23002 -8948 -3974 12608 -4861 13238 -2129 -14389 14765 4828 122 11971
1869 11971 -1389 8513 24892 -884 13183 17562 430 21786 7223 -1467 17826 4101
1881 4101 -1033 14788 -905 7285 17899 -5775 16401 17249 6001 19742 6496 6751 25406
1894 25406 8003 -2063 9363 -5123 9788 6325 -22692 -2971 -579 -1792 3878 -13128 -11079
1907 -11079 17988 9443 2385 4919 -6917 23803 22376 -3963 708 1988 13237 22282 -6327
1920 -6327 -15834 12019 13579 17617 4878 -13813 21883 33378 17013 6950 -124 15936 40647
1933 40647 12020 -12749 -2131 4839 23241 413 -32982 -14882 8627 10557 -2089 -27553
$$ packed form
1844A1872l3303J3533L0300j8938M401q290q969L8058j3291j7393J1528p516J0287
1857A2279J0723l1950M974J6582j7469J8099j5367j2260K9154r937m706J1849
1869A1971j3360R902J6379k5776J4067M379j7132K1356j4563q690J9293j3725
1881D101n134J5821j5693Q190J0614k3674K2176Q48j1248J3741j3246K55J8655
1894B5406j7403j0066J1426j4486J4911l463k9017J9721K392j213N670j7006K049
1907a1079K9067q545p058K534j1836L0720j427k6339M671J280J1249R045k8609
1920f327r507K7853J560M038j2739j8691L5696J1495j6365j0063p074J6060K4711
1933D0647k8627k4769J0618O970J8402k2828l3395J8100K3509J930j2646k5464
$$ plain form
1945 -27553 -15659 29549 18216 -3722 -12902 -6409 34884 26860 -13413 -16825 2425 23282 23964
1958 23964 -18917 -27953 15046 27477 22176 -7873 -18489 28692 49369 21741 -2408 -4766
1970 -4766 26079 53707 10194 -22019 -8329 13987 32935 -3874 -44523 -18568 18742 18211
1982 18211 -8394 -41744 -15363 35797 20383 -12158 -31866 -9125 37672 23025 -28566 -34580
1994 -34580 -3968 27486 19599 -37589 -36286 11994 33329 19031 -24212 -26232 32242 53946
2006 53946 16468 -13631 -13329 34457 56578 2371 -30543 -14876 23087 37709 -11453 -52125
2018 -52125 -15917 24691 23567 -13462 -53446 -11695 37822 20517 -21800 -45428 -11622 37861
2030 37861 13920 -44908 -47108 -12916 27658 6881 -55787 -46309 4193 31960 8385 -41044
$$ packed form
1945b7553J1894M5208j1333k1938r180O493M1293q024m0273l412J9250K0857O82
1958B3964m2881r036M2999J2431n301l0049j0616M7181K0677k7628k4149k358
1970d766L0845K7628m3513l2213J3690K2316J8948l6809m0649K5955L7310n31
1982A8211k6605l3350K6381N1160j5414l2541j9708K2741M6797j4647n1591o014
1994c4580L0612L1454p887n7188J303M8280K1335j4298m3243k020N8474K1704
2006E3946l7478l0099L02M7786K2121n4207l2914J5667L7963J4622m9162m0672
2018e2125L6208M0608j124l7029l9984M1751M9517j7305m2317k3628L3806M9483
2030C7861k3941n8828k200L4192M0574k0777o2668R478N0502K7767k3575m9429
$$ plain form
2042 -41044 -35352 31548 47061 6738 -28460 -23726 38201 50584 -6030 -38388 -17852 30128
2054 30128 40082 -16491 -53159 -8756 32435 32214 -15267 -50038 310 44399 25510 -24075
2066 -24075 -43869 -4219 44405 11141 -46863 -46097 -9615 32788 774 -59015 -47063 5380
2078 5380 29159 34 -49475 -40647 28083 35892 -5960 -42514 -32482 29756 35259 -22459 -51860
2091 -51860 -25040 20233 28450 -31929 -62123 -13035 24223 20803 -29387 -55400 -3837 37783
2103 37783 12047 -34381 -46985 -7361 40172 536 -50258 -43250 -5971 31944 -2299 -56059
2115 -56059 -38596 14513 29391 3038 -43769 -29668 37747 36134 -1678 -33552 -20002 37471
2127 37471 38909 -18007 -39029 -10790 26178 33569 -27155 -47574 -407 25772 19917 -27346
$$ packed form
2042d1044N692O6900J5513m0323l5198M734O1927J2383n6614l2358K0536M7980
2054C0128R954n6573l6668M4403M1191k21m7481l4771N0348M4089j8889m9585
2066b4075j9794L9650M8624l3264n8004P66L6482M2403l2014n9789J1952N2443
2078E380K3779k9125m9509Q828O8730P809m1852l6554J0032O2238N503n7718k9401
2091e1860K6820M5273Q217o0379l0194M9088L7258l420n0190k6013N1563M1620
2103C7783k5736m6428j2604L9624M7533l9636n0794P008L7279L7915l4243n3760
2115e6059J7463N3109J4878k6353m6807J4101O7415j613l7812l1874J3550N7473
2127C7471J438n6916k1022K8239L6968P391o0724k0419M7167K6179n855m7263
$$ plain form
2139 -27346 -49582 -101 32384 -397 -35897 -49746 -13122 28238 -18708 -56895 -48693 -17417
2151 -17417 12986 -19408 -68391 -44197 -625 5749 -13196 -58654 -36853 19986 11470 -17410
2163 -17410 -40917 -26773 25783 24353 -26828 -32743 -9817 23254 29964 -24469 -31129 9402 28095
2176 28095 22934 -14117 -31620 13997 36277 5309 -17518 -29602 3739 31688 -8567 -37169
2188 -37169 -27857 -4823 16107 -11933 -53183 -27014 153 1252 -13698 -49749 -29980 10185
2200 10185 117 -23384 -37411 -28714 11573 8056 -32558 -29185 -14399 8998 13159 -26169 -29132
2213 -29132 3802 13468 8710 -13456 -28725 11282 21080 -2486 -11259 -21750 2106 22553 -8287
2226 -8287 -25264 -11505 -4122 12430 -5094 -36368 -11660 1382 -219 -7342 -31291 -19292 11187
$$ packed form
2139b7346k2236M9481L2485l2781l5500j3849L6624M1360m6946l8187Q202L1276
2151a7417L0403l2394m8983K4194M3572O374j8945m5458K1801N6839q516k8880
2163a7410k3507J4144N2556j430n1181n915K2926L3071O710n4433o660M0531J8693
2176B8095n161l7051j7503M5617K2280l0968k2827j2084L3341K7949m0255k8602
2188c7169R312K3034K0930k8040m1250K6169K7167J099j4950l6051J9769M0165
2200A0185j0068k3501j4027Q697M0287l517m0614L373J4786K3397M161l9328k963
2213b9132L2934R666m758k2166j5269M0007R798k3566q773j0491K3856K0447l0840
2226h287j6977J3759P383J6552j7524l1274K4708J3042j601p123k3949J1999L0479
$$ plain form
2239 11187 -3565 -16467 -17064 -20248 10190 5032 -22819 -12308 -7041 2609 9879 -16364 -17037 7275
2253 7275 848 3300 -5249 -22539 7813 8593 -7952 -3946 -12286 -4904 13348 -9959 -15168 -1723
2267 -1723 -11642 4803 -4658 -24409 -4635 -6128 -9983 -2374 -17981 -15790 5563 -11834 -6470
2280 -6470 -1799 -15728 6528 1442 -11039 4139 -2507 -4245 10676 -4779 -3787 9051 -8554
2293 -8554 4357 5831 -10044 6383 -468 -5944 9148 -2047 -8457 7156 -8060 -567 4526
2306 4526 -20105 -4876 -3257 -13659 -4484 -17111 -22239 -1087 -10710 -17909 -8341 -23193 -3650
2319 -3650 4281 -18037 -9391 -6031 -4450 9450 -5919 -18601 4761 649 1662 1226 -21770 935
2333 935 12277 -2902 -2385 -7836 -5284 20286 6586 -13307 1491 -1302 13311 10381 -21886
$$ packed form
2239A1187j4752j2902n97l184L0438n158k7851J0511N267R650P270k6243o73K4312
2253G275o427K452q549j7290L0352P80j6545M006q340P382J8252k3307n209J3445
2267a723r919J6445r461j9751J9774j493l855P609j5607K191K1353j7397N364
2280f470M671j3929K2256n086j2481J5178o646j738J4921j5455R92J2838j7605
2293h554J2911J474j5875J6427o851n476J5092j1195o410J5613j5216P493N093
2306D526k4631J5229J619j0402R175j2627n128K1152r623p199R568j4852J9543
2319c650P931k2318Q646L360J581J3900j5369j2682K3362m112J013m36k2996K2705
2333I35J1342j5179N17n451K552K5570j3700j9893J4798k793J4613k930l2267
$$ plain form
2346 -21886 -10419 5435 1773 -475 -19699 -25063 9582 3594 -12031 -12923 -20122 9236 17431
2359 17431 -11934 -13553 -1246 8424 21814 -6211 -23640 6303 12067 9074 -4900 -26828 191
2372 191 20400 1110 -11249 -15508 -4206 27252 5141 -22127 -9502 405 17062 5263 -32499
2385 -32499 -21882 6599 866 -7591 -35124 -33279 8455 4062 -18800 -26624 -24205 11948 20102
2398 20102 -17849 -23460 -2298 14366 25094 -11679 -28307 7056 20924 13946 -8798 -27065
2410 -27065 6237 35062 8576 -9561 -13307 9335 41685 13154 -17166 -5389 15550 30685
2422 30685 10833 -30426 -16418 17193 12186 -4818 -37142 -27021 15786 10820 -19209 -31789
2434 -31789 -21089 16405 20915 -24518 -30945 -7314 16150 18120 -24827 -37763 -1267 18323
$$ packed form
2346b1886J1467J5854l662k248j9224n364L4645n988j5625q92p199K9358Q195
2359A7431k9365j619J2307R670J3390k8025j7429K9943N764k993j3974k1928K7019
2372A91K0209j9290j2359m259J1302L1458k2111k7268J2625R907J6657j1799l7762
2385c2499J0617K8481n733q457k7533J845M1734m393k2862p824K419L6153Q154
2398B0102l7951n611K1162J6664J0728l6773j6628L5363J3868o978k2744j8267
2410b7065L3302K8825k6486j8137l746K2642L2350k8531l0320J1777K0939J5135
2422C0685j9852m1259J4008L3611n007j7004l2324J0121M2807m966l0029j2580
2434c1789J0700L7494M510m5433o427K3631K3464J970m2947j2936L6496J9590
$$ plain form
2446 18323 4099 -23817 -37874 -29 29068 457 -22894 -22979 7438 35577 5765 -27752
2458 -27752 -14121 15351 26726 3118 -38450 -19112 16596 13801 -10108 -40393 -23675 18667
2470 18667 14564 -20912 -30806 -13757 22911 23297 -22894 -27760 -455 24067 18420 -20938 -32931
2483 -32931 5815 26958 6839 -19594 -31766 10648 34376 4670 -18954 -16519 16147 38485
2495 38485 7637 -26726 -8008 18549 28010 41 -38403 -15122 16755 12637 -15428 -39654
2507 -39654 -21937 19228 10384 -26058 -31717 -16129 20915 14097 -29542 -30120 -3816 17789 8605
2520 8605 -28914 -35590 5318 19774 1056 -23896 -29616 13274 30094 2064 -18870 -11147 20635
2533 20635 37927 6819 -20272 607 22824 32260 3077 -27547 -2165 23925 18633 -7958
$$ packed form
2446A8323j4224k7916j4057L7845K9097k8611k3351q5L0417K8139k9812l3517
2458b7752J3631K9472J1375k3608m1568J9338L5708k795k3909l0285J6718M2342
2470A8667m103l5476r894J7049L6668L86m6191m866K7305K4522n647l9358j1993
2483c2931L8746K1143k0119k6433j2172M2414K3728k9706k3624K435L2666K2338
2495C8485l0848l4363J8718K6557R461k7969l8444K3281L1877m118k8065k4226
2507c9654J7717M1165q844l6442n659J5588L7044o818m3639n78K6304K1605r184
2520H605l7519o676M0908J4456j8718k4952n720M2890J6820k8030k0934P723L1782
2533B0635J7292l1108k7091K0879K2217R436k9183l0624K5382K6090n292k6591
$$ plain form
2545 -7958 -27394 -8608 25503 11748 -17509 -22875 -6945 24161 10259 -24380 -24163 -996 16757
2558 16757 4424 -27888 -29127 5303 12208 -1942 -25713 -24654 12455 21121 -1299 -18359 -9362
2571 -9362 18058 29900 483 -16247 1960 21307 26955 -381 -19001 3267 23495 17476
2583 17476 -4012 -18006 1628 26945 12361 -8831 -13544 2920 24066 9420 -16311 -13643
2595 -13643 5190 15097 4749 -22458 -17557 6959 9612 -2686 -20344 -15799 10466 14555 -5378
2608 -5378 -13923 -6458 13356 19782 -5776 -11044 1960 14669 16708 -3898 -14295 4165 16373
2621 16373 7878 -3734 -13597 4648 19571 5117 -5402 -7524 4376 18011 5070 -12880
2633 -12880 -5058 4838 9349 3148 -16587 -6285 8133 5537 -115 -10401 -5986 13064 10890
$$ packed form
2545g958j9436J8786L4111j3755k9257n366J5930L1106j3902l4639K17K3167J7753
2558A6757j2333l2312j239L4430O905j4150k3771J059L7109Q666k2420j7060Q997
2571i362K7420J1842k9417j6730J8207J9347N648k7336j8620K2268K0228o019
2583A7476k1488j3994J9634K5317j4584k1192m713J6464K1146j4646k5731K668
2595a3643J8833R907j0348k7207M901K4516K653j2298j7658M545K6265M089j9933
2608e378q545P465J9814O426k5558n268J3004J2709K039k0606j0397J8460J2208
2621A6373q495j1612r863J8245J4923j4454j0519k122J1900J3635j2941j7950
2633a2880P822R896M511o201j9735J0302J4418k596n652j0286M415J9050k174
$$ plain form
2646 10890 -2017 -1264 73 14188 15335 -1209 1676 8734 13520 14201 1804 -1150 13892 13763
2660 13763 7794 5953 -2251 11821 14607 3006 2156 2069 5736 11124 1061 -5970 3859 -2 1759
2675 1759 -2152 -11029 -632 1139 -4315 -4646 -5881 -5534 4163 -4628 -7140 1819 -3529 3916 1169
2690 1169 -4312 4221 5843 1813 5304 2189 3772 13267 2776 3684 9085 5890 13508 7750 1995
2705 1995 10854 12395 6375 8710 1852 6614 16056 2135 3066 4126 4626 11182 3951 -5003 2764
2720 2764 8593 4130 4992 -7986 844 12765 2728 -335 -3218 171 12455 8230 -6885 712
2734 712 5514 9326 11288 -9209 -2475 10835 8160 4391 -5479 -7841 10512 11199 -5223 -4420 -6071
2749 -6071 6888 14140 -7831 -10733 267 6897 9418 -3144 -17689 3400 11346 2556 -2654
$$ packed form
2646A0890j2907P53J337J4115J147j6544K885P058M786O81j2397k954J5042j29
2660A3763n969j841q204J4072K786j1601q50q7L667N388j0063p031R829l861J761
2675A759l911q877J0397J771n454l31j235L47R697q791k512Q959n348P445k747
2690A169n481Q533J622m030L491l115J583R495j0491R08N401l195P618n758n755
2705A995Q859J541o020K335o858M762R442j3921R31J060N00O556p231q954P767
2720B764N829m463Q62j2978Q830J1921j0037l063k883L389J2284m225j5115P597
2734G12M802L812J962k0497O734J3310k675l769r870k362J8353O87j6422Q03j651
2749f071J2959P252k1971k902J1000O630K521j2562j4545K1089P946q790n210
$$ plain form
2762 -2654 -15052 2030 18620 2053 -8522 -5568 2468 20189 9151 -13917 1351 12002
2774 12002 17021 10771 -12039 -2604 20197 15432 4030 -6469 -7387 21727 16563 -6532 -7238 -3090
2788 -3090 16172 19476 -9896 -12954 6999 13154 14513 -6325 -19860 9622 17657 3810 -7470
2801 -7470 -18082 5578 23435 16 -13583 -7147 5633 26219 5142 -18602 -26 14734
2813 14734 19649 7402 -18772 -5377 23788 13516 -1528 -14428 -8983 23844 14563 -13439
2825 -13439 -13651 -3216 17381 17757 -16580 -17879 7696 15025 12632 -13843 -22509 11011 19863 2045
2839 2045 -13233 -18021 8609 27741 -1459 -15799 -4435 12310 30508 5384 -17852 3574
2851 3574 24064 24293 8819 -17041 1363 32194 17276 -362 -14065 -1960 29293 18905
$$ packed form
2762b654j2398J7082J6590j6567j0575K954Q036J7721j1038k3068J5268J0651
2774A2002N019o250k2810R435K2801m765j1402j0499r18K9114n164k3095p06M148
2788c090J9262L304k9372l058J9953O155J359k0838j3535K9482Q035j3847j1280
2801g470j0612K3660J7857k3419j3599O436J2780K0586k1077k3744J8576J4760
2813A4734M915j2247k6174J3395K9165j0272j5044j2900N445L2827r281k8002
2825a3439k12J0435K0597L76l4337j299K5575P329k393k6475q666L3520Q852j7818
2839B045j5278m788K6630J9132k9200j4340J1364J6745J8198k5124k3236K1426
2851C574K0490K29j5474k5860J8404L0831j4918j7638j3703J2105L1253j0388
$$ plain form
2863 18905 -12939 -13013 3711 21265 19671 -18272 -17103 11559 17166 10236 -17645 -22499 11194
2876 11194 19512 -3964 -16990 -19228 6749 26427 -7252 -20251 -7024 11927 25590 224
2888 224 -22046 2386 23988 18833 4334 -20344 2132 31690 15168 -3392 -13363 1432 29673
2901 29673 18449 -14312 -9731 7524 23309 18840 -19180 -13262 14345 18939 8381 -16282 -19602
2914 -19602 13855 19481 -5907 -16216 -17564 9902 23023 -9910 -19618 -6007 11632 20485 -3175
2927 -3175 -23262 3382 20049 14803 -562 -20703 2470 26599 11271 -6554 -12028 2145
2939 2145 27136 13558 -14774 -6273 8185 23140 14316 -16915 -8646 14410 17964 6072 -13376
2952 -13376 -14765 16102 17712 -4734 -12352 -11086 13011 19462 -7115 -15537 -651 13481 17530
$$ packed form
2863A8905l1844p4J6724J7554j594l7943J169K8662N607o930k7881m854L3693
2876A1194Q318k3476j3026k238K5977J9678l3679j2999J3227J8951J3663k5366
2888B24k2270K4432K1602n155j4499k4678K2476K9558j6522j8560r971J4795K8241
2901B9673j1224l2761M581J7255J5785m469l8020N918K7607M594j0558k4663l320
2914a9602L3457N626k5388j0309j348K7466J3121l2933r708J3611J7639Q853k3660
2927c175k0087K6644J6667n246j5365k0141K3173K4129j5328j7825n474J4173
2939B145K4991j3578k8332Q501J4458J4955q824l1231Q269K3056L554j1892j9448
2952a3376j389L0867J610k2446p618J266K4097O451k6577q422J4886J4132M049
$$ plain form
2965 17530 -3300 -18732 5035 17015 11597 -2620 -15511 4479 21185 8282 -7274 -9186
2977 -9186 2774 21402 8122 -13944 -5692 6204 15577 6453 -15989 -10331 10530 9617 134
2990 134 -13420 -13671 10618 9859 -8300 -12568 -9052 8142 11398 -7864 -14229 -88 8330 11941
3004 11941 -3162 -14082 6660 14199 8776 239 -7708 6104 20693 7596 -819 826 6887
3017 6887 21342 9390 -3797 4186 10673 14894 10222 -5177 -432 14033 8416 3325 -5001 -6355
3031 -6355 10587 6114 -5823 -6104 -4859 2505 7327 -9871 -10155 -559 -1002 4371 -6481 -12610 1019
3046 1019 2875 -1552 -3230 -8757 -402 7301 -2117 -2497 -2057 -15 9339 2277 -2966 2649 4873
3061 4873 6028 6987 -2534 1578 8300 2095 4474 -166 105 7375 3417 -1300 2286 -252 1054
$$ packed form
2965A7530k0830j5432K3767J1980n418j4217j2891J9990J6706j2903j5556j912
2977i186J1960J8628j3280k2066Q252J1896R373r124k2442N658K0861r13r483
2990A34j3554k51K4289p59j8159m268L516J7194L256j9262o365J4141Q418L611
3004A1941j5103j0920K0742P539n423q537p947J3812J4589j3097q415J645O061
3017F887J4455j1952j3187P983O487M221m672j5399M745J4465n617n091q326j354
3031f355J6942m473j1937k81J245P364M822j7198k84R596m43N373j0852o129J3629
3046A019J856m427j678n527Q355P703r418l80M40K042R354p062n243N615K224
3061D873J155R59r521M112O722o205K379m640K71P270l958m717L586k538J306
$$ plain form
3076 1054 5616 -3260 1949 2647 -879 4062 -309 -1639 2991 -88 -2629 4224 -1073 920 2207
3091 2207 -2681 5529 2905 -419 2716 2374 2941 6547 -512 -1155 6292 1643 4917 817 -3054 4353
3107 4353 3574 -72 -812 -2799 -430 6455 -3209 -5795 -1711 -2144 4881 -2846 -8519 -3047 1539 255
3123 255 -1973 -9109 -5777 5095 -488 -3771 -7973 -4032 6745 3752 -5082 -5801 1970 7297 8452
3138 8452 -5761 -4795 7297 8095 7246 -5237 -5480 7660 11796 2507 -4466 -4862 6603 13521 -2147
3153 -2147 -6292 -2560 7012 12252 -1383 -10801 -2280 8826 7598 -1672 -13376 -1830 11095 3914
3167 3914 -5463 -12608 -1910 12648 5718 -10088 -10058 804 11849 7372 -12375 -9075 5243 11760
3181 11760 5228 -12290 -10921 8535 12000 670 -11175 -9851 9472 13894 -4366 -13241 -6125
$$ packed form
3076A054M562q876N209O98l526M941m371j330M630l079k541O853n297J993J287
3091B207m888Q210k624l324L135l42N67L606p059o43P447m649L274m100l871P407
3107D353p79l646p40j987K369O885r664k586M084m33P025p727n673N472M586j284
3123B55k228p136L332J0872n583l283m202L941J0777k993q834p19P771N327J155
3138H452j4213R66J2092P98q49j2483k43J3140M136r289o973l96J1465O918j5668
3153b147m145L732R572N240j3635r418Q521J1106j228r270j1704J1546J2925p181
3167C914r377p145J0698J4558o930j5806L0J0862J1045m477j9747L300J4318O517
3181A1760o532j7518J369J9456L465j1330j1845J324J9323M422j8260q875P116
$$ plain form
3194 -6125 9395 12791 -6565 -16134 -2865 10554 9332 -6402 -18519 -307 13195 5949 -9491
3207 -9491 -16605 -640 16075 5859 -13226 -12093 2198 17144 5845 -16545 -9757 7528 16052
3220 16052 2923 -16449 -11683 11333 13414 -2642 -15996 -12316 12955 13222 -7770 -17407 -8287
3233 -8287 11698 12574 -10126 -21024 -1872 11146 9393 -10945 -21748 -100 14751 5374 -12551
3246 -12551 -17692 559 19819 3606 -16111 -11560 4031 20228 3943 -17618 -10141 10702
3258 10702 16925 2152 -18195 -11695 14833 13809 -4077 -18904 -11309 14757 13028 -10911 -20764
3271 -20764 -6892 10379 12925 -14575 -23824 -1362 9623 6405 -16793 -25230 -918 13688 -8
3284 -8 -17227 -21160 -1307 18179 -2239 -19359 -14191 3273 17226 199 -21803 -11324 11099
$$ packed form
3194f125J5520L396j9356r569J3269J3419j222j5734j2117J8212J3502p246j5440
3207i491p114J5965J6715j0216j9085J133J4291J4946j1299k2390O788J7285Q524
3220A6052j3129j9372M766K3016K081j6056j3354L680K5271K67k0992r637R120
3233h287J9985Q76k2700j0898J9152J3018j753k0338j0803K1648J4851r377j7925
3246a2551n141J8251J9260j6213j9717M551J5591J6197j6285k1561P477K0843
3258A0702O223j4773k0347O500K6528j024j7886j4827P595K6066j729k3939r853
3271b0764J3872J7271K546k7500r249K2462J0985l218k3198q437K4312J4606j3696
3284hj7219l933J9853J9486k0418j7120N168J7464J3953j7027k2002J0479K2423
$$ plain form
3297 11099 13073 1314 -21086 -9750 16866 11669 -4536 -17835 -8793 15825 13913 -12651 -16254
3310 -16254 -3342 13349 13873 -15155 -19629 1240 11682 6891 -14509 -21418 1398 15213 -1964
3323 -1964 -14700 -18366 2194 18334 -3954 -17831 -11208 5215 15709 -772 -22367 -8606
3335 -8606 10122 9437 -1524 -22489 -8917 14903 7803 -8354 -17370 -8911 13828 9635 -15846
3348 -15846 -15360 -4501 8344 7734 -18949 -19467 558 7461 267 -16997 -22609 1857 11210 -6944
3362 -6944 -14848 -17050 1998 15075 -5424 -17686 -7651 4213 12911 -969 -20291 -3816 10368
3375 10368 8251 -581 -16985 -3781 16306 8119 -6090 -9945 -3171 16307 9886 -11229 -7022
3388 -7022 1654 9944 8360 -13326 -13721 4493 6503 40 -12986 -18093 4230 7890 -7441 -11322
$$ packed form
3297A1099J974j1759k2400J1336K6616n197j6205j3299R042K4618j912k6564l603
3310a6254J2912J6691N24k9028m474K0869J0442m791k1400o909K2816J3815j7177
3323a964j2736l666K0560J6140k2288j3877O623J6423J0494j6481k1595J3761
3335h606J8728o85j0961k0965J3572K3820p100j6157r016Q459K2739m193k5481
3348a5846M86J0859J2845o10k6683n18K0025O903p194j7264n612K4466R353j8154
3362f944p904k202J9048J3077k0499j2262J0035J1864Q698j3880j9322J6475J4184
3375A0368k117q832j6404J3204K0087q187j4209l855O774J9478o421k1115M207
3388g022Q676Q290j584k1686l95J8214K010o463j3026n107K2323L660j5331l881
$$ plain form
3402 -11322 -12649 1729 11085 -6569 -15367 -4501 1901 7867 -3936 -17624 -2944 5658 2706
3415 2706 -3688 -14456 -4279 11147 1788 -6679 -6655 -3513 11321 6175 -9159 -4731 1894 6242
3429 6242 4998 -10333 -9902 4694 1841 -1251 -9086 -12850 3767 3165 -6424 -7293 -7074 1124 7145
3444 7145 -5020 -9398 -250 427 6243 -2231 -10810 643 4797 648 -736 -6204 -1075 10601
3458 10601 868 -862 759 423 10492 5138 -3806 1003 3886 2868 4539 -5515 -4802 4186 -2188
3473 -2188 -361 -3924 -7756 1959 974 -5534 -1890 -2841 -1708 3702 -5325 -4940 202 -3669 516 -3095
3489 -3095 -6850 -529 -379 -5183 -946 -4419 -2168 4684 -2856 1016 3211 25 3614 2976 -413
3504 -413 5311 3150 -1767 4399 -656 1281 2774 -4443 -144 2114 -1725 414 -1376 -3509 4916
$$ packed form
3402a1322j327J4378R356j7654q798J0866O402N966j1803j3688J4680Q602k952
3415B706o394j0768J0177J5426r359q467K4L142J4834n146j5334M428O625M348
3429F242j244j5331M31J4596k853l092p835l764J6617o02r589q69K19Q198O021
3444G145j2165m378R148O77N816q474q579J1453M154m149j384n468N129J1676
3458A0601r733j730J621l36J0069n354q944M809K883j018J671j0054P13Q988o374
3473b188J827l563l832R715r85o508L644r51J133N410r027L85N142l871M185l611
3489c095l755O321J50m804M237l473K251O852p540L872K195l186L589o38l389
3504d13N724k161m917O166n055J937J493p217M299K258l839K139j790k133Q425
$$ plain form
3519 4916 750 -3583 927 -3255 2120 1570 -6302 -4407 -166 -2324 -749 -4669 -8207 2708 -268
3534 -268 -2510 -1691 -5242 3066 6578 -2012 -2469 1821 2347 8487 -245 -5535 3571 2765 3671 185
3550 185 -6306 1000 8672 1647 -629 -1464 -173 10465 3558 -3966 -170 2148 7133 3965 -8213
3565 -8213 -5257 4063 2433 926 -9328 -8780 6088 2797 -3666 -7282 -6441 5019 7856 -5895
3579 -5895 -8552 -1262 3069 7343 -6740 -12114 -527 4327 2565 -5247 -11869 -146 10704 1010
3593 1010 -5565 -6457 1973 13696 3203 -7159 -3013 5199 10708 3902 -9893 -4747 8569 7623
3607 7623 1729 -9837 -5114 11099 9141 -1906 -7474 -1635 10813 12080 -5039 -7655 1391 9054
3621 9054 9904 -7325 -11422 2338 10141 3230 -6875 -12629 2163 12656 367 -8454 -9184 2851
$$ packed form
3519D916m166m333M510m182N375n50p872J895M241k158J575l920l538J0915k976
3534b68k242Q19l551Q308L512q590m57M290N26O140q732n290R106q06R06l486
3550A85o491P306P672p025k276q35J291J0638o907p524L796K318M985l168j2178
3565h213K956R320j630j507j0254N48J4868l291o463l616Q41J1460K837j3751
3579e895k657P290M331M274j4083n374J1587M854j762p812o622J1723J0850r694
3593A010o575q92Q430J1723j0493j0362M146Q212N509o806j3795N146J3316r46
3607G623n894j1566M723J6213j958j1047n568N839J2448J267j7119k616R046P663
3621I054Q50j7229m097J3760P803o911j0105n754J4792J0493j2289q821p30J2035
$$ plain form
3635 2851 13028 1931 -11955 -6285 5758 9731 1083 -14985 -6103 7844 8042 -1779 -13371
3648 -13371 -6089 10818 8966 -6125 -9998 -3371 12020 9418 -8439 -10819 439 11909 7610
3661 7610 -8805 -12773 4159 11067 3862 -8688 -11771 6555 13361 1581 -8781 -7412 7289
3674 7289 14385 1295 -11479 -3328 9609 13569 1426 -12839 -1992 10941 10188 -1186 -12044
3687 -12044 -1467 14501 9069 -5218 -9427 -1418 14891 8573 -8093 -9829 2277 12164 6613
3700 6613 -9594 -11188 5447 11047 3339 -10371 -11430 7069 11422 -235 -11599 -8652 6053
3713 6053 12131 -2116 -13006 -3763 7402 12111 -3739 -13003 -1339 10227 10639 -3330 -11842
3726 -11842 -210 14186 7753 -5220 -8684 1118 15106 6810 -6560 -7498 3997 14245 6560
$$ packed form
3635B851J0177j1097j3886N670J2043L973q648j6068Q882J3947J98r821j1592
3648a3371P282J6907j852j5091l873O627J5391k602j7857k380J1258J1470m299
3661G610j6415l968J6932O908p205j2550l083J8326O806j1780j0362J369J4701
3674G289P096j3090j2774Q151J2937L960j2143j4265J0847J2933p53j1374j0858
3687a2044J0577J5968n432j4287m209Q009J6309o318j6666j736J2106R887n551
3700F613j6207j594J6635N600p708j3710j059J8499M353j1657j1364K947J4705
3713F053O078j4247j0890R243J1165M709j5850r264J1664J1566M12j3969q512
3726a1842J1632J4396o433j2973l464R802J3988q296j3370r38J1495J0248p685
$$ plain form
3739 6560 -8280 -7898 7505 12150 4747 -9483 -7458 7673 10680 -589 -11213 -6520 6688
3752 6688 10197 -4219 -9909 -3625 7554 11305 -4505 -10890 -540 10087 7367 -4016 -10750
3765 -10750 905 12212 3784 -4703 -8699 2181 12382 4989 -6487 -4158 5447 12339 6170
3778 6170 -7150 -2637 8758 10222 4328 -7469 -4209 7969 8836 -1456 -7210 -4498 6735 7456
3792 7456 -5442 -7484 -2088 5966 6879 -5240 -9498 56 5051 2935 -4653 -10818 -395 5748
3806 5748 -1678 -6325 -8231 -803 8006 -211 -7588 -2254 2984 7867 3904 -6222 377 7533 6651
3821 6651 3239 -3736 -2035 8464 6061 -2520 -2039 -2696 6749 6215 -3216 -2406 2594 6425 6481 -1776
3837 -1776 -4778 4356 3689 2764 -1735 -6737 1715 3747 -2084 -3132 -4514 -332 3496 -2015 -4051
$$ packed form
3739F560j4840L82J5403M645p403j4230K025J5131L007j1269j0624M693J3208
3752F688L509j4416n690O284J1179L751j5810o385J0350J0627k720j1383o734
3765a0750J1655J1307q428q487l996J0880J0201p393j1476K329R605O892o169
3778F170j3320M513J1395J464n894j1797L260J2178Q67j0292n754K712J1233P21
3792G456j2898k042N396Q054R13j2119m258R554M995k116p588o165J0423O143
3806E748p426m647j906P428Q809q217p377N334N238M883l963j0126O599P156q82
3821F651l412o975J701J0499k403q581M81o57R445n34r431Q10N000L831N6q257
3837a776l002R134o67r25m499n002Q452K032n831j048j382M182L828n511k036
$$ plain form
3852 -4051 1614 1721 5387 1960 -3106 2673 5524 1816 1983 -2038 -843 6011 -632 -1998 -671
3867 -671 -1572 3093 1747 -3388 335 2643 888 3729 -1208 -1031 4752 -384 -148 -293 -2896 1062
3883 1062 -68 -4725 -1666 -602 -2453 2237 -2309 130 5223 288 1795 3079 1570 4912 4529
3898 4529 -1065 3021 2851 877 4534 -2605 148 4329 1048 1221 1360 928 5901 5595 -842 4207
3914 4207 3051 4003 5706 -1936 -309 3039 404 298 -2083 -5871 3469 2239 -3112 -559 -2620
3929 -2620 2707 5703 -1208 -1585 2922 2889 5443 1812 -4827 4097 4200 754 -279 -5827 1295 6791
3945 6791 725 -2369 -167 1591 9516 4376 -3885 3271 4807 7452 3830 -5659 -2369 7083 3065
3960 3065 -612 -4987 -5541 8061 4486 -4708 -2725 -1653 7609 7484 -4000 -4335 4974 6014 7211
$$ packed form
3852d051N665J07L666l427n066N779K851l708J67m021J195O854o643j366J327
3867f71r01M665j346n135L723K308j755K841m937J77N783n136K36j45k603L958
3883A062j130m657L059J064j851M690m546K439N093m935J507J284j509L342l83
3898D529n594M086j70j974L657p139K753M181l281J73J39m32M973l06o437N049
3914D207j156R52J703p642J627L348k635j06k381l788R340j230n351K553k061
3929b620N327K996o911l77M507l3K554l631o639Q924J03l446j033n548P122N496
3945F791o066l094K202J758P925n140q261P156J536K645l622r489L290R452m018
3960C065l677m375n54J3602l575r194J983J072R262j25j1484l35R309J040J197
$$ plain form
3975 7211 -2429 -7797 5721 6140 1487 -3730 -6130 3518 10017 -27 -3995 -190 4878 12369 2792
3990 2792 -5064 2607 8696 9577 2419 -7295 -1668 10731 5560 -1228 -6935 -3376 11260 6324 -4970
4005 -4970 -5627 934 9901 8808 -5986 -6293 5832 7881 6299 -6103 -9142 6168 8241 -439
4019 -439 -7622 -8768 3588 11379 -3402 -7704 -3242 4820 11013 -788 -10171 -325 9053 6889
4033 6889 245 -11019 -2326 11411 5128 -3298 -9124 -2141 12718 7205 -6519 -4996 3288 11772
4047 11772 9644 -7105 -5625 7977 10707 5966 -6922 -8971 7136 10473 -919 -7466 -7591 5835
4061 5835 12701 -2882 -9273 -2541 7799 11861 -1352 -11252 829 9838 7047 -1154 -12242 -1033
4075 -1033 12290 4304 -4529 -8787 199 12993 6903 -8221 -4803 4327 12226 8162 -8480 -5370
$$ packed form
3975G211r640n368J3518M19m653n217k400R648O499j0044l968L805N068P491r577
3990B792p856P671O089Q81p158r714N627J2399n171o788n707L559J4636m936j1294
4005d970o57O561Q967j093j4794l07J2125K049j582j2402l039J5310K073q680
4019d39p183j146J2356P791j4781m302M462Q062O193j1801r383R846R378k164
4033F889o644j1264Q693J3737o283q426n826O983J4859n513j3724J523Q284Q484
4047A1772k128j6749J480J3602K730m741j2888k049J6107L337j1392o547j25J3426
4061E835O866j5583o391O732J0340M062j3213r900J2081R009k791q201j1088J1209
4075a033J3323p986q833m258Q986J2794o090j5124L418R130P899m064j6642L110
$$ plain form
4089 -5370 7495 10428 2884 -7282 -7912 7823 10461 -2507 -8700 -6734 6390 10525 -3498 -10314
4103 -10314 -2849 7043 7746 -3495 -13474 376 8622 4586 -4950 -12955 -620 10208 2931 -8077
4117 -8077 -8707 -1211 11111 4393 -9244 -4304 4397 11812 5910 -7770 -4731 8252 11125 2689
4131 2689 -6053 -5409 10646 11505 -635 -5480 -2675 10284 11529 -2007 -8020 1391 9248 9268 -1952
4146 -1952 -9882 2738 8916 4918 -4675 -10263 836 9049 1916 -8446 -7282 -309 8777 674
4160 674 -11306 -6315 1887 7235 312 -9882 -5947 5416 5668 -1400 -7958 -6679 6817 6930 -3562
4175 -3562 -7088 -3267 6683 7264 -4026 -7713 295 5965 7755 -3661 -7092 3101 8076 4873
4189 4873 -3147 -5491 2280 10066 1430 -4794 -3737 2362 9291 1279 -6112 -3019 4241 7260 1353
$$ packed form
4089e370J2865K933p544j0166o30J5735K638j2968o193J966J3124M135j4023o816
4103a0314P465R892P03j1241r979J3850Q246m036r536q005J2335J0828p277j1008
4117h077o30P496J2322o718j3637M940Q701P415n902j3680L039J2983K873q436
4131B689q742O44J6055Q59j2140m845K805J2959J245j3536o013R411P857K0j1220
4146a952p930J2620O178l998r593n588J1099Q213p133j0362J164O973R086q103
4160F74j1980M991Q202N348o923j0194L935J1363K52p068o558J279J3496J13j0492
4175c562l526L821R950N81j1290l687Q008N670J790j1416l431J0193M975l203
4189D873q020k344P771P786q636o224J057O099O929q012p391L093P260L019n907
$$ plain form
4204 1353 -6638 -3440 6184 4788 -28 -5602 -3490 6455 3856 -2665 -6170 -2726 3776 4748 -5589
4219 -5589 -6097 -1104 3588 3972 -4368 -6181 586 4717 1498 -2628 -4797 2566 6611 -325 -2637
4234 -2637 -4100 385 6002 -324 -4550 -1924 2245 3561 1125 -4815 -481 4104 3436 1075 -3130
4249 -3130 -482 5230 3120 -837 -2246 -1078 3902 3143 -3842 -1934 -850 2582 3026 -1835 -2358 2005
4265 2005 2808 2117 90 -1925 2024 3227 -355 -1380 -1775 -1569 1660 -1447 -2718 -454 -1136 734
4281 734 954 -3215 -245 1308 1693 702 493 2043 2152 1940 1717 480 -23 1442 917 -418 1727
4298 1727 -144 1105 2905 1972 2179 3146 1935 3449 4594 1688 3661 1818 1575 3417 718 -31
4314 -31 -218 -606 1110 1413 -2896 -210 843 579 1151 -2721 -302 2535 1461 -1029 -1721 -3407 437
$$ packed form
4204A353p991L198R624j396m816n574K112R945k599o521l505L444O502R72j0337
4219e589n08M993M692L84q340j813O767M131l219m126k169P363M045o936k312
4234b637j463M485N617o326m226K626M169J316k436n940M334M585o68k361m205
4249c130K648N712k110l957j409J168M980p59o985J908J084L432M44m861n23M363
4265B005Q03o91k027k015L949J203l582j025l95K06L229l107j271K264o82J870
4281G34K20m169K970J553L85r91k09J550J09k12k23j237n03J465n25j335K145
4298A727j871J249J800r33K07R67j211J514J145k906J973j843k43J842k699p49
4314c1j87l88J716L03m309K686J053k64N72l872K419K837j074k490o92j686L844
$$ plain form
4331 437 1621 -3544 -3038 -2931 355 1520 -2191 -3534 -461 2543 2924 1133 -3331 3151 5306 2509
4347 2509 1148 -1813 2351 6077 2917 -1387 -405 1653 5323 3157 -2969 346 4048 6592 3422
4362 3422 -1600 -256 6547 5996 1547 -1683 -2805 4842 4699 -2236 -3644 -2428 2676 4144 -3476
4377 -3476 -6188 778 3858 4010 -1764 -5781 2735 6466 3627 -2998 -5392 759 6348 861 -5875
4392 -5875 -3919 -616 5228 2331 -7027 -2414 3458 6515 2483 -4959 -2797 6768 6080 611 -4616
4407 -4616 -4125 5075 4718 -4286 -7283 -2343 3555 5048 -5915 -7665 616 4464 4502 -3271 -7980 2981
4423 2981 7519 3121 -3722 -6872 1348 7786 177 -7314 -4979 -752 8288 1139 -9167 -2812 5960
4438 5960 6497 2221 -6511 -2004 8239 6298 -1045 -6530 -2799 6947 5530 -5829 -7885 -2593 4304
$$ packed form
4331D37J184n165N06J07L286J165l711j343L073L004L81j791m464O482K155k797
4347B509j361k961M164L726l160m304R82K058L670k166o126L315L702K544l170
4362C422n022J344O803n51m449l230j122P647j43o935j408J216N104J468p620
4377c476k712O966L080J52n774m017Q516L731k839o625k394O151N589n487o736
4392e875J956L303N844k897r358M613N872L057m032p442K162R565o88n469n227
4407d616M91R200l57r004k997M940N898J493j0963j750Q281L848L8p773m709J0961
4423B981M538m398o843l150Q220O438p609p491K335M227R040p149j0306O355Q772
4438E960N37m276q732M507J0243j941p343n485L731R746j417j1359k056N292O897
$$ plain form
4453 4304 4564 -7290 -8789 1376 5336 3609 -6435 -9625 1298 7162 -1248 -7068 -9697 -462
4467 -462 7131 -3270 -10934 -7304 885 5780 -1137 -11086 -4638 4861 5562 -145 -9945 -3277 8167
4482 8167 4710 -2332 -7490 -3220 8155 6291 -7186 -7487 -1120 6657 6525 -7035 -7615 2778 7294
4497 7294 3874 -4832 -8882 4054 8259 -1061 -6242 -7763 1034 7876 -3814 -10398 -6603 1995
4511 1995 6679 -1276 -11852 -3971 5833 4449 -1360 -10055 -3137 6744 3772 -5049 -8558 -3754 6460
4526 6460 4571 -8427 -7287 -983 5553 4677 -7304 -7473 2826 6827 1985 -5693 -8352 4270
4540 4270 7558 -1505 -7263 -7457 2049 7167 -3353 -10309 -3978 1811 5952 -1928 -11302 -1835 4676
4555 4676 4371 -2317 -8590 -3347 7695 2900 -5830 -6541 -3170 6877 3423 -7684 -5916 678 5404
$$ packed form
4453D304K60j1854j499J0165L960j727j0044l190J0923N864q410n820k629R235
4467d62P593j0401p664L630Q189M895o917r949O448R499P01n707r800O668J1444
4482H167l457p042n158M270J1375j864j3477l01O367P777j32j3560n80J0393M516
4497G294l420q706m050J2936M205r320n181j521Q797O842j1690o584L795Q598
4511A995M684p955j0576P881R804j384n809q695O918R881k972q821l509M804J0214
4526F460j889j2998J140O304O536q76j1981j69J0299M001m842p678k659J2622
4540D270L288r063n758j94R506N118j0520o956O331N789M141p880r374R467O511
4555D676l05o688o273N243J1042m795q730p11L371J0047l454j1107J768O594M726
$$ plain form
4570 5404 3615 -5716 -6423 4214 5833 1450 -5081 -7403 4510 5881 -1814 -5875 -4927 1340 5611
4585 5611 -3589 -7770 -2288 1026 4173 -2745 -9098 -1542 4199 3364 -1632 -6545 -1721 6459 1823
4600 1823 -4499 -3830 -1821 6209 1322 -5562 -2574 2048 4504 2713 -4445 -4133 5308 3265 169
4615 169 -3698 -4118 4643 4557 -1902 -4539 -3157 1342 4009 -4269 -7077 -1294 199 1985 -3353 -7369
4631 -7369 -2422 1874 -1257 -3745 -6199 -2919 3125 -2215 -4804 -4534 -2776 2662 -460 -5152 -2953
4646 -2953 1032 1474 1497 -4874 -2205 3201 1500 -224 -2377 -1515 3001 3260 -1360 -1237 -260 2180 4281
4663 4281 -1216 -2282 1184 2240 2636 -819 -2468 513 2962 -462 -754 -2408 -510 2351 -1443
4678 -1443 -2711 -1251 -828 249 33 -4003 -1162 -306 -1747 -832 -3716 -2261 100 -1829 -2903 -1965
$$ packed form
4570E404j789r331p07J0637J619m383o531k322J1913J371p695m061R48O267M271
4585E611r200m181N482L314L147o918o353P556N741q35m996m913M824Q180m636
4600A823o322O69K009Q030m887o884K988M622K456j791p158L12R441k043l096
4615A69l867m20Q761q6o459k637J382M499K667q278k808N783J493J786n338m016
4631g369M947M296l131k488k454L280O044n340k589K70J758N438l122m692K199
4646b953L985M42K3o371K669N406j701j724k153Q62M516K59m620J23R77K440K101
4663D281n497j066L466J056L96l455j649K981K449l424k92j654J898K861l794
4678a443j268J460M23J077k16m036K841Q56j441R15k884J455K361j929j074R38
$$ plain form
4694 -1965 -2871 -548 -362 -3569 -915 -1131 -1433 -570 -2627 -1824 -800 -1588 -1860 -1233 -2370 202 -1889
4711 -1889 -2650 13 -745 27 211 -1817 -512 1690 617 -1192 -590 -852 2263 388 -1933 177
4727 177 -277 1093 356 -2296 -937 2676 -142 -24 -1521 -1131 2726 -112 -1822 -2134 -470 741
4743 741 1085 -3514 -3169 869 -349 -349 -3883 -3381 788 566 -1325 -2962 -2692 789 2564 -2476 -3478
4760 -3478 -2046 628 1924 -2161 -3896 -1391 1635 789 -1738 -5108 -1641 3511 352 -2263 -3981
4775 -3981 -592 3356 -1 -3885 -3307 450 3192 264 -4688 -3216 2016 2252 242 -5124 -2708
4790 -2708 2426 3730 -642 -3995 -1567 3910 5197 -1860 -3130 -720 3598 4308 -3268 -4411 28
4805 28 3990 2688 -2325 -4845 1250 4894 1976 -3562 -4362 1415 5610 1064 -4639 -3182 1320 4923
$$ packed form
4694a965r06K323J86l207K654k16l02Q63k057Q03J024p88k72O27j137K572k091
4711a889p61K663p58P72J84k028J305K202j073j809O02k62L115j875k321K110
4727A77m54J370p37k652J359L613k818J18j497L90L857k838j710l12J664J211
4743G41L44m599L45M038j218%l534N02M169k22j891j637K70L481J775n040j002
4760c478J432K674J296m085j735K505L026q46k527l370L467N152l159k615j718
4775c981L389L948l357l884N78L757K742k928m952J472N232K36k010n366K416
4790b708N134J304m372l353K428N477J287p057j270K410M318P10p576j143M439
4805B8L962j302n013k520O095L644k918n538q00N777M195m546n703J457M502L603
$$ plain form
4821 4923 723 -6117 -2277 2302 4606 -186 -6435 -2335 4544 4723 -1310 -4064 -1479 5732 4866
4836 4866 -2213 -3593 -402 5358 4054 -2967 -5342 2160 5703 2694 -2990 -4876 3065 5320 1911
4851 1911 -3854 -4575 1675 6553 249 -6060 -3757 2300 5331 -897 -7697 -3040 2291 3966 -1673
4866 -1673 -6771 -2797 5720 2662 -2819 -5419 -1504 6201 3176 -3690 -4226 1733 5945 4777 -3198
4881 -3198 -4224 3112 6631 4862 -3621 -3967 4647 7042 2111 -3352 -1720 4921 7350 -337 -5269
4896 -5269 -2323 3465 6578 -1476 -7078 -1844 3785 4091 -2434 -7148 -2837 5691 2847 -3326 -7228
4911 -7228 -1619 5532 2261 -5168 -6705 7 4970 2440 -5905 -4755 1984 5240 3004 -5578 -4081
4926 -4081 3931 6691 499 -4839 -2697 4158 7265 -1725 -4150 -2327 3696 5029 -2320 -6704 -824
$$ packed form
4821D923m200o840L840M579K304m792o249M100O879J79o033k754K585P211q66
4836D866p079j380L191N760j304p021k375P502L543l009n684j886P941K255l409
4851A911n765p21O250M878o304o309K303O057L031o228o800M657N331J675n639
4866a673n098L974Q517l058n481k600L915P705l025o866n36N959M212j168p975
4881c198j026P336L519j769q483l46Q614K395m931n463J632O641K429p687m932
4896e269K946N788L113q054n602N234N629L06o525m714M311Q528k844o173l902
4911g228N609P151l271p429j537O712M963k530q345J150O739L256k236q582J497
4926d081Q012K760o192n338K142O855L107q990k425J823O023J333p349m384N880
$$ plain form
4941 -824 5141 3200 -2058 -7140 -2023 4206 2124 -3539 -6053 -786 6319 1048 -4466 -4819 400
4956 400 4840 2206 -6294 -3587 3114 4721 2435 -4518 -3272 5418 6128 -231 -2867 -1859 5807
4971 5807 7643 -612 -2423 -1192 5589 5630 -424 -3927 427 5758 3462 -941 -5923 582 4154
4986 4154 1716 -2869 -4494 -921 4451 814 -5064 -3914 -581 3199 289 -6625 -4258 1048 2090
5001 2090 -330 -4369 -3812 3461 2639 -865 -2431 -2541 3529 3901 -2190 -2381 571 3365 4332 -396
5017 -396 -3545 2528 3452 2564 78 -3426 1657 4377 1230 -1193 -1305 716 4031 814 -2554 147
5033 147 796 3090 1459 -3673 -721 1704 1960 902 -2539 -2587 3947 1667 -389 -576 -1201 2881 2651
5050 2651 -1003 -1514 1077 1415 3043 -1267 -2899 2023 703 949 247 -1955 1594 2624 -1505 -658
$$ packed form
4941h24N965j941n258n082N117O229k082n663k514N267P105n271n514l53N219
4956D00M440k634q500K707O701J607k286o953J246Q690P10o359k636J008P666
4971E807J836q255j811J231O781M1o054l503M354N331k296m403m982O505L572
4986D154k438m585j625L573N372l637n878J150L333L780k910o914K367N306J042
5001B090k420m039N57P273q22l504j566j10O070L72o091j91K952K794R67m728
5017c96l149O073R24q88k486l504N083K720l147k423j12K021L315l217l368K701
5033A47O49K294j631n132K952K425K56j058l441m8O534k280k056j87o25M082k30
5050B651l654n11K591L38J628m310j632M922j320K46p02k202L549J030m129Q47
$$ plain form
5066 -658 -512 -488 1618 -1141 -1695 -188 -393 991 -257 -2427 -382 1260 -1216 413 -1292 -920 2396
5083 2396 -602 256 405 -701 1654 2152 -900 885 1733 -160 1927 -16 41 2701 516 412 2108
5100 2108 1141 973 1623 -459 1984 857 -736 1520 -645 741 2336 -340 -736 950 -93 1420
5116 1420 331 -2229 1368 969 -185 1059 -1631 465 3211 357 -658 362 -447 2950 462
5131 462 -2135 1132 812 1809 1754 -2097 -849 3180 547 259 -628 -2071 3452 2588 -2426 -1534 184
5148 184 2072 2488 -2235 -2365 1333 1155 2290 -1095 -3028 2377 2846 -20 -1045 -2420 1102 4693
5164 4693 -755 -1951 111 1813 4682 1240 -3107 75 2487 2605 362 -3000 -1202 5140 2287
5179 2287 -832 -1464 -1305 4929 3763 -2167 -2557 433 3878 3776 -2647 -3554 2234 3705 2663 -2672
$$ packed form
5066f58J46K4K106k759n54J507k05J384j248k170K045J642k476J629j705L72L316
5083B396k998Q58J49j106K355M98l052J785Q48j893K087j943N7K660k185j04J696
5100B108r67j68O50k082K443j127j593K256k165J386J595k676l96J686j043J513
5116A420j089k560L597l99j154J244k690K096K746k854j015J020q09L397k488
5131D62k597L267l20R97n5l851J248M029k633k88q87j443N523q64n014Q92J718
5148A84J888M16m723j30L698j78J135l385j933N405M69k866j025j375L522L591
5164D693n448j196K062J702K869l442m347L182K412J18k243l362J798O342k853
5179B287l119o32J59O234j166n930l90K990L445j02o423r07N788J471j042n335
$$ plain form
5195 -2672 -2788 1838 5084 1568 -2050 -2747 2373 6314 1007 -3191 -590 2779 6113 776 -4700
5210 -4700 540 3971 4333 857 -4585 -1450 5987 2726 -974 -4273 -825 4877 2626 -3980 -4103
5225 -4103 298 3690 3034 -5335 -5027 2385 4265 2051 -4181 -4022 2388 5223 -73 -3562 -2564 2589
5241 2589 6764 -338 -4515 -1608 4255 6147 504 -5242 323 6286 4506 930 -5147 208 6950
5256 6950 4477 -2759 -3943 209 6569 4370 -4210 -3120 1149 5164 2973 -5187 -3740 3244 4871
5271 4871 1576 -4101 -4073 3698 5401 -1263 -4153 -3076 3669 5851 -847 -5057 -879 4307 5368
5286 5368 -487 -6817 -203 5833 4036 -1477 -5618 29 6370 2400 -3573 -4397 -402 5428 2361
5301 2361 -5912 -4964 635 4631 1269 -6607 -4795 1872 3901 372 -5318 -4776 3244 4359 -526
$$ packed form
5195b672j16M626L246l516l618o97N120L941n307m198K601L369L334n337n476
5210d700N240L431L62l476n442L135P437l261l700l299L448N702k251o606j23
5225d103M401L392o56q369L08P412J880k214o232J59O410K835n296l489R98N153
5241B589M175p102m177K907N863J892n643n746N565N963j780l576o077N355O742
5256F950k473p236j184M152O360k199q580J090M269M015k191q160J447O984J627
5271D871l295n677K8P771J703o664k890J077O745K182o698m210M178N186J061
5286E368n855o330O614O036j797n513m141N647O341l970n973q24L995N830l067
5301B361q273R48N599L996l362p876J812O667K029l529n690N42Q020J115m885
$$ plain form
5316 -526 -5368 -3450 4133 5048 -1341 -5537 -103 4410 5652 -1214 -4373 1758 6334 5015 -882
5331 -882 -3705 1995 7873 4118 -2204 -2759 1651 7260 1647 -3577 -2872 1604 4878 1766 -4985 -4469
5347 -4469 3499 3368 -820 -5451 -4631 3210 3582 -2650 -6781 -3429 2280 3312 -3231 -6612 -1024 2863
5363 2863 3403 -3656 -5137 681 4058 3052 -2248 -3701 1034 5637 1124 -2439 -2950 2009 5372
5378 5372 883 -3789 -3286 2026 4472 245 -5066 -3250 3351 2847 283 -5112 -2062 2752 2376 -1824
5394 -1824 -5568 -2414 2429 2271 -3238 -4359 -884 2594 3310 -2774 -4213 772 4036 2447 -1214
5409 -1214 -3037 2473 5079 1221 -1194 -2582 2475 5443 1189 -2418 -1194 2634 3864 653 -3263
5424 -3263 -639 2298 2061 -128 -3767 -1308 2321 2677 -2264 -4075 -1045 990 607 -3721 -2878 -1619
$$ packed form
5316e26m842J918P583R15o389m196N434M513J242o866l159O131M576j319n897
5331h82k823N700N878l755o322n55M410N609n613n224P05M476L274l112o751N16
5347d469P968j31m188m631Q20P841L72o232m131L352N709J032o543l381N588L887
5363B863N40p059j481N818L377j006n300j453M735M603m513l563n11M959L363
5378E372m489m672N03N312K446m227n311J816O601n04k564n395L050M814l76m200
5394a824l744L154M843j58n509j121L475L478P16o084j439M985L264j589l661
5409a214j823N510K606l858k415j388N057K968m254l607J224L828J230l211l916
5424c263K624K937k37k189l639K459L629L56m941j811L030K035l83m328Q43J259
$$ plain form
5440 -1619 1149 1196 -3335 -2968 35 1707 183 -1521 -2925 1349 1907 -145 -1074 -1576 1454 2387 -164
5457 -164 -1955 -547 1518 2176 327 -1719 598 1627 1742 538 -2242 375 1828 638 -773 -1831
5473 -1831 -1283 1034 388 -2079 -1536 -732 659 178 -1971 -1145 170 405 260 -967 -1167 1477 1106
5490 1106 38 348 -175 571 736 -341 -343 597 549 2586 315 -397 769 102 132 673 14 -467 796
5509 796 -1120 -506 -1047 -1125 -695 -1567 -1602 -1551 -1594 -1816 -978 -669 -545 -306 -1691 -259 267 -1419 -982 -1301
5529 -1301 -1290 -439 -285 -521 -443 -1133 -101 738 -2069 192 -933 671 1206 -62 -630 1175 595 -251
5547 -251 -390 -1819 1090 1378 -1367 -1350 -1063 156 611 0 -2935 637 165 1368 -29 -3548 181
5564 181 2306 751 -1002 -1761 -78 2726 526 -2342 -546 -837 2752 1106 -2125 -1425 1079 1482
$$ packed form
5440a619K768M7m531L67L003J672j524j704j404M274N58k052r29n02L030R33k551
5457a64j791J408K065O58j849k046K317J029J15j204k780K617J453j190j411j058
5473a831N48K317o46k467N43Q04J391m81k149Q26J315K35j45j227k00K644l71
5490A106j068L10n23P46J65j077kR40m8K037k271p12J166o67L0N41o59m81J263
5509G96j916O14n41p8M30q72l5N1m3k22Q38L09J24K39j385J432N26j686M37l19
5529a301J1Q51J54k36P8o90J032Q39k807K261j125J604N35j268n68J805n80q46
5547b51j39j429K909K88k745J7K87J219M55o11k935L572m72J203j397l519L729
5564A81K125j555j753p59J683K804k200k868J796k91L589j646l231P00K504M03
$$ plain form
5580 1482 986 -1585 -2815 1908 1262 -162 -1876 -2396 1289 2365 -2592 -2936 -1904 -700 1440 -1822
5596 -1822 -4762 -156 -157 1148 -2462 -5153 -248 1737 -197 -2667 -3380 -555 3414 -126 -3003 -1862
5612 -1862 -101 3286 1069 -3054 -1579 1962 2437 1430 -3319 -2019 3109 3044 330 -2289 -2254 2516
5628 2516 3330 -1788 -3128 -1135 1733 3636 -1964 -3870 31 2889 2047 -1510 -3817 186 3852
5643 3852 1532 -2530 -3807 -838 5049 -196 -3230 -2556 446 3502 666 -4654 -2767 1779 2437
5658 2437 615 -4155 -3266 2860 2418 -1600 -3874 -3045 2808 3035 -3180 -4313 -1648 2320 2704 -3876
5674 -3876 -4952 -613 2271 1554 -2034 -4836 512 4401 824 -1527 -4049 725 4583 975 -3567
5689 -3567 -1503 1989 4858 1779 -4120 -1417 2614 3212 141 -3853 -2108 4344 3379 -1107 -3143
$$ packed form
5580A482m96k571j230M723o46j424j714n20L685J076m957l44J032J204K140l262
5596a822k940M606jJ305l610k691M905J985j934k470p13K825L969l540k877J141
5612a862J761L387k217m123J475L541M75j007m749J300N128o5k714k619L5M770
5628B516Q14n118j340J993K868J903n600j906L901K858q42l557k307M003L666
5643C852k320m062j277K969N887n245l034O74L002L056k836n320J887M546O58
5658B437j822m770Q89O126m42m018k274Q29N853K27o215j133K665L968L84o580
5674c876j076M339K884p17l588k802N348L889l577k351k522M774L858l608m542
5689c567K064L492K869l079n899K703M031N98l071l994J745O452r65m486k036
$$ plain form
5704 -3143 -1753 3088 3409 -3842 -3477 -1002 3301 2271 -2453 -4814 796 3423 1079 -2473 -4273
5719 -4273 733 3937 269 -3010 -3380 1855 4822 658 -3647 -1643 1955 4250 594 -4258 -745
5734 -745 2959 3445 -301 -3354 -965 4140 3005 -2337 -3209 -2019 3052 2326 -3196 -3347 -680 2319
5750 2319 1585 -4141 -5265 337 1984 672 -3007 -4011 941 2503 -866 -3430 -3120 1764 3300
5765 3300 419 -4282 -1837 684 3673 380 -4480 -916 3596 3395 -215 -2252 -595 4245 2807
5780 2807 -547 -1377 -133 3813 2209 -2921 -3262 750 2083 1124 -3383 -4195 1176 1566 -300 -3157
5796 -3157 -3333 1254 2248 -1021 -2895 -1590 700 2308 -719 -3806 -1339 634 1758 -581 -3682
5811 -3682 -1439 2155 1331 -1198 -2443 -792 3433 1038 -839 -1415 209 2774 1177 -2978 -2926 -405
$$ packed form
5704c143J390M841L21p251L65K475M303j030m724k361N610K627k344l552j800
5719d273N006L204l668l279l70N235K967m164m305K004L598K295l656m852L513
5734g45L704M86l746l053K389N105j135n342q72J190N071p26n522j51K667K999
5750B319p34n726j124N602J647j312l679j004M952J562l369k564L10M884J536
5765C300k881m701K445K521K989l293m860L564M512k01l610k037J657M840j438
5780B807l354q30J244L946j604n130l41M012J333r59m507q12N371L90j866k857
5796c157j76M587R94l269j874J305K290J608l027l087K467J973J124k339l101
5811c682K243L594q24k529j245J651M225k395j877n76J624K565j597m155N2K521
$$ plain form
5827 -405 230 4 -3177 -3549 -212 254 -207 -2744 -2691 714 1539 -1215 -1998 -1180 104 1070 -2053 -2614
5845 -2614 -942 850 -32 -1327 -2201 -81 2139 376 -238 -970 907 2795 1129 -427 -437 430 2204
5862 2204 656 -1176 -147 1388 1324 832 -1968 -1926 404 111 -1543 -1092 243 1132 1179 -1601 -1704 -2106
5880 -2106 -876 -327 -2144 -2112 -1178 -855 -1126 -1077 -2350 -71 -226 -743 200 -1245 273 869 -198 -753
5898 -753 430 -1 1117 -50 -938 469 -60 -864 -321 -1832 871 467 -104 -888 155 245 1059 -358
5916 -358 -687 721 263 -1306 -2221 -1429 -1324 608 -1912 -1418 -109 -649 286 -1208 -1552 1050 2103
5933 2103 1124 105 376 593 1815 111 -71 -944 309 2159 392 -1487 -359 581 868 824 -1654
5950 -1654 61 1625 1416 244 -828 136 1387 978 -1221 -2130 -512 815 -312 -2339 -2253 -628
$$ packed form
5827d05O35k26l181l72L337M66m61k537N3L405Q25k754p83Q18J284R66l123n61
5845b614J672J792q82j295q74K120K220j763o14p32J877J888j666j556j0Q67J774
5862B204j548j832J029J535o4m92k800M2K330k93j654M51J335Q89M7k780j03m02
5880b106J230N49j817L2R34L23k71M9j273K279j55n17R43j445J518N96j067n55
5898g53J183m31J118j167q88J407n29q04N43j511K703m04n71p84J043R0Q14j417
5916c58l29J408m58j569r15P92J05J932k520M94J309n40R35j494l44K602J053
5933B103r79j019K71K17J222j704j82q73J253J850j767j879J128R40K87m4k478
5950a654J715J564k09j172j072R64J251m09k199r09J618J327j127k027Q6J625
$$ plain form
5966 -628 1540 318 -2723 -1863 477 2407 372 -1635 -1466 1398 2119 -783 -840 -825 1319 2184 -904
5983 -904 -1717 -702 1924 1612 -692 -2336 948 1972 1348 -1139 -1737 970 2335 1317 -1902 -2437
5999 -2437 74 2971 972 -2798 -1728 -70 3069 591 -2725 -1570 1803 3285 219 -1194 -1112
6014 -1112 2916 2589 -451 -1781 -422 2864 2162 -641 -2521 53 2193 2109 -1227 -3204 1613 3235
6030 3235 2130 -1776 -2618 769 3138 1273 -2348 -2060 238 3709 -35 -3789 -2271 888 2768
6045 2768 165 -2962 -2007 2576 2720 69 -2749 -1717 3138 2555 -513 -2541 -1407 2446 3075 -1920
6061 -1920 -3117 1 2958 3332 -2285 -2681 1420 3319 1334 -2210 -2903 1659 3963 560 -2440 -2357
6077 -2357 1132 4007 110 -3445 -1501 1868 3687 158 -3513 -1355 3400 2366 111 -2796 -725
$$ packed form
5966f28K168j222l041Q60K340J930k035k007J69K864P21k902n7J5K144Q65l088
5983i04q13J015K626l12k304j644L284J024o24k487n98K707J365j018l219n35
5999b437K511K897j999l770J070J658L139k478l316J155L373J482l066j413Q2
6014a112M028l27l040j330J359L286p02k803j880K574K140q4l336j977M817J622
6030C235j105l906q42L387K369j865l621K88K298L471l744l754J518L159J880
6045B768k603l127R55M583J44k651k818J032M855n83l068k028J134L853O29m995
6061a920j197L118K957L74n617l96M101J899j985l544o93M562K304l403l000Q3
6077b357L489K875l897l555J944L369J819l529l671K158M755j034k255k907K071
$$ plain form
6092 -725 3912 3193 -883 -3404 -219 3024 3023 -2403 -2108 1189 2743 2566 -2819 -2796 1532 3550 867
6109 867 -2408 -2897 1040 3699 -732 -2761 -2416 1488 3001 -824 -4147 -2283 1257 2136 -691 -4287
6125 -4287 -1943 2339 1807 -864 -3246 -354 3267 2459 -2766 -2877 -41 3049 3327 -2183 -1354 2135
6141 2135 2092 1882 -1478 -2635 1906 3210 15 -1270 -1866 2551 3907 -521 -1673 -1384 1669 3524
6157 3524 -313 -2906 -613 1867 2346 -215 -3148 -643 2751 1811 -827 -2233 43 2711 2155 -1796
6173 -1796 -1287 907 3401 1902 -2421 -1397 708 2205 740 -1788 -2063 1681 1879 -131 -2734 -2039
6189 -2039 1412 2308 -800 -2799 -1983 923 2646 -1042 -3353 -420 1938 1352 -543 -2745 -1095 1970
6205 1970 583 -1358 -1826 -422 2191 1790 -1847 140 1119 3266 1699 -1714 -968 1457 2238 950
$$ packed form
6092g25M637p19m076k521L185L243jn426K95L297J554j77n385K3M328K018k683
6109H67l275m89L937K659m431k029L45L904J513l825l323J864L540Q79k827l596
6125d287K344M282n32k671k382K892L621q08n225j11K836L090K78n510Q29L489
6141B135m3k10l360j157M541J304l195j285n96M417J356m428j152K89L053J855
6157C524l837k593K293K480M79k561k933K505L394r40k638j406K276K668n56l951
6173a796N09K194K494j499m323J024K105J497j465k528k75L744J98k010k603O95
6189b039L451Q96l108j999Q16K906J723l688k311K933K358n86j895k202J650L065
6205A970j387j941m68J404K613m01l637J987R79K147j567l413P46K425P81j288
$$ plain form
6221 950 -1189 -1185 2099 1040 -458 -766 -1454 1242 2753 -1064 -2369 -147 565 1701 -1206 -2178 -103
6238 -103 280 735 -1949 -2452 -1060 1338 -463 -908 -839 -532 2447 992 -913 -139 886 1599 1347 -238
6256 -238 -474 1590 807 693 -530 -769 1533 1082 380 409 -80 1178 2241 -812 -1353 363 -203 728
6274 728 -677 -1691 118 -701 -233 -954 -1425 -966 -852 -984 -1263 -1295 -957 680 -344 -463 -229 673 -180
6293 -180 520 -457 -263 726 -211 909 494 130 1157 312 635 1964 1114 824 1162 338 1666 1276 54
6312 54 896 1038 309 861 189 -950 994 98 174 18 -609 497 681 -211 326 648 -375 1171 -440
6331 -440 -403 577 -138 387 -832 -1229 -148 610 -577 -192 -587 118 2329 1086 -599 508 785 1704
6349 1704 719 -1549 -397 740 544 89 -882 -811 1824 970 -423 -943 -721 1664 1249 -729 -1055 671
$$ packed form
6221I50k139ML284j059j498l08o88K696J511l817j305K222P12J136k907r72K075
6238a03L83M55k684n03J392K398j801m45O9L07K979j455j905P74J025P13k52j585
6256b38k36K064p83j14j223k39K302m51p02K9m89J258J063l053n41J716n66R31
6274G28j405j014J809q19M68p21m71M59J14j32k79l2L38J637j024j19K34R02q53
6293a80P00r77J94R89r37J120m15l64J027q45L23J329q50k90L38q24J328l90j222
6312E4Q42J42p29N52o72j139J944q96P6j56o27J106J84q92N37L22j023J546j611
6331d40L7R80p15N25j219l97J081P58j187L85l95P05K211j243j685J107K77R19
6349A704r85k268J152J137j96m55r71P1K635q54j393n20K22K385m15j978l26J726
$$ plain form
6367 671 553 1642 -569 -1222 1203 1187 1186 -914 -696 335 2480 999 -664 -505 851 3144 568
6384 568 -539 494 1601 2726 1099 -1166 -749 1657 1565 591 -2219 -691 1602 1153 -322 -1353
6400 -1353 -467 2005 2017 -1284 -723 387 1845 2000 -1165 -2265 133 2423 566 -1904 -1523 1140
6416 1140 2618 -176 -1549 -2355 747 3027 98 -1853 -980 1268 2489 765 -2331 -216 1866
6431 1866 1665 -607 -2297 -80 2577 1150 -845 -2055 -1145 2681 1915 -1641 -1337 63 2335 1711
6447 1711 -1204 -1862 1021 1864 904 -2088 -2177 1233 3158 472 -1586 -859 2156 3071 815 -1797 -866
6464 -866 2871 3039 692 -2287 -543 2558 2410 -316 -2159 92 2260 2610 -1056 -2306 660 3584
6480 3584 2135 -1776 -2260 963 3191 1464 -2290 -2410 1472 2955 -18 -2462 -2734 331 2448 631
$$ packed form
6367F71j18J089k211o53K425j6jk100K18J031K145j481j663J59J356K293k576
6384E68j107J033J107J125j627k265M17K406r2r74k810J528K293m49j475j031
6400a353Q86K472J2l301N61J110J458J55l165j100K398K290j857k470L81K663
6416A140J478k794j373q06L102K280k929j951Q73K248J221j724l096K115K082
6431A866k01k272j690K217K657j427j995j210R10L826p66l556L04J400K272o24
6447A711k915o58K883Q43r60k992q9L410J925k686k058P27L015R15k256k612R31
6464h66L737J68k347k979J744L101j48k726j843K251K168L50l666j250K966K924
6480C584j449l911m84L223K228j727l754j20L882J483k973k444k72L065K117j817
$$ plain form
6496 631 -2239 -1918 1923 2453 -947 -3258 -693 870 1837 -1673 -2753 240 2801 2045 -1244 -2356
6512 -2356 553 2582 2181 -1363 -2492 -36 3227 1255 -1481 -1894 1417 3181 1289 -1599 -2143 842
6528 842 2538 439 -2511 -1782 2054 2310 419 -2081 -368 2825 1731 177 -1730 -347 1307 2108
6544 2108 -1201 -2612 -497 2779 1782 -1520 -2979 386 3284 1414 -1423 -1853 509 3010 903
6559 903 -1337 -1787 936 2390 540 -2627 -1493 1994 1546 759 -2712 -1560 1636 2366 -176 -1799
6575 -1799 -1425 2131 2277 -1873 -2246 -386 1739 1491 -1445 -1913 -196 1342 1596 -981 -2038 471
6591 471 2317 483 -1051 -2508 -126 2104 445 -2364 -1536 110 2566 574 -1776 -619 1185
6606 1185 1191 373 -2512 54 2368 1569 -151 -1151 -568 1962 1874 -754 -704 211 1480 1997 -670 -1331
$$ packed form
6496F31k870L21L841N30l400k311K565J563R67l510j080K993K561p56l289j112
6512b356K909K029m01l544j129K456L263j972k736m13L311J764j892k888n44K985
6528H42J696k099k950P29L836K56j891k500J713L193j094j554j907J383J654Q01
6544B108l309j411K115L276r97l302j459L365K898j870k837m30K362K501k107
6559I03k240m50K723J454j850l167J134L487m48p87l471J152L196P30k542j623
6575a799L74L556J46m150l73J860K125k48k936m68J717J538K54k577j057K509
6591D71J846j834j534j457K382K230j659k809Q28J646K456j992k350J157J804
6606A185Oq18k885K566K314p99j720j000N83K530q8k628N0R15J269N17k667o61
$$ plain form
6624 -1331 674 1867 1375 -680 -1800 382 1407 415 -828 -1507 1004 1792 565 -1910 -1930 -422
6640 -422 875 -344 -2389 -495 488 143 -233 -1951 -1454 649 1002 -949 -997 -1002 786 662 -1097 -753
6658 -753 -135 792 1249 -1277 -798 374 738 374 -114 -1152 1174 595 688 -470 -642 669 393 -213
6676 -213 -934 -296 -68 2000 300 -800 419 703 -317 -100 -468 -953 1293 -955 -214 -529 -489 732
6694 732 141 -840 -573 147 -348 268 -659 -679 653 -32 -224 -472 -610 70 88 -807 -256 -430 -1086 317
6714 317 -796 -678 509 -324 -677 -723 -660 367 -723 -1318 -223 -201 -101 -239 -1613 -483 -412 -1050 220
6733 220 -370 -662 651 -314 -661 170 -575 677 548 -1675 -315 476 73 36 -1003 -806 1646 551
6751 551 -1113 -436 -515 994 -68 -851 -711 -339 -211 1016 -1641 -1712 731 -172 604 -259 -1742 -456
$$ packed form
6624a331K005J193m92k055j120K182J025r92j243o79K511P88j227k475k0J508
6640d22J297j219k045J894R83l45l76j718M97K103L53j951m8nJ788j24j759L44
6658g53O18R27M57k526M79J172L64l64m88j038K326n79R3j158j72J311k76o06
6676b13p21O38K28K068j700j100J219K84j020K17l68m85K246k248P41l15M0J221
6694G32n91r81K67P20m95O16r27k0J332o85j92k48j38O80J8q95N51j74o56J403
6714C17j113J18J187q33l53m6O3J027j090n95J095K2J00j38j374J130P1o38J270
6733B20n90k92J313r65l47Q31p45J252j29k223J360P91m03l7j039J97K452j095
6751E51j664O77p9J509j062p83J40L72J28J227k657p1K443r03P76q63j483J286
$$ plain form
6769 -456 1070 -146 -1776 -1192 -293 500 -145 -1337 353 524 1665 -576 -1647 -336 928 345 -300
6786 -300 -1050 -335 1597 256 -259 -1681 -323 1123 1165 -1435 -1160 765 151 530 -1118 -1590 608
6803 608 398 -106 -1492 -1508 -288 1060 -1015 -2222 -859 177 1389 -654 -2090 -1117 454 596 -1251
6820 -1251 -3052 -843 1097 446 -743 -1307 -762 1512 745 -1274 -1267 789 1845 1204 -1079 -1190 910
6837 910 1560 1343 -791 -1717 1487 1344 404 -1728 -897 1314 2205 -935 -1122 -609 1254 1956 -762 -2317
6855 -2317 -18 592 661 -503 -2942 -231 1965 626 -1573 -2457 -290 1472 33 -2063 -1487 590
6871 590 1644 1206 -2373 -1724 891 1548 481 -2028 -1801 1084 1747 -630 -2221 -1275 974 1392 -1149
6888 -1149 -2194 -998 1201 1810 -1027 -1962 120 1617 958 -513 -2491 229 2283 616 -1255 -1806
$$ packed form
6769d56J526j216j630N84Q99P93o45j192J690J71J141k241j071J311J264n83o45
6786c00p50P15J932j341n15j422J358J446M2k600K75J925o14L79j648m72K198
6803F08k10n04j386j6J220J348k075j207J363J036J212k043j436R73J571J42j847
6820a251j801K209J940o51j189n64N45K274p67k019PK056J056o41k283j11K100
6837I10O50k17k134r26L204j43r40k132Q31K211Q91l140j87N13J863P02k718j555
6855b317K299O10O9j164k439K711K196j339k199q84K167J762j439k096N76K077
6871E90J054m38l579O49K615O57j067k509K27K885O63k377j591R46K249M18k541
6888a149j045J196K199O09k837r35K082J497o59j471j978K720K054j667j871n51
$$ plain form
6904 -1806 -64 2371 1401 -1057 -1204 696 2228 805 -1733 -1645 1533 2272 228 -1497 -1006 714
6920 714 2771 -208 -1657 -588 1208 1270 -647 -2269 -493 1671 1729 -421 -2025 -202 1098 932
6936 932 -1704 -2577 19 1278 1132 -1709 -1578 -93 1053 473 -2211 -2548 332 1900 -178 -1937
6952 -1937 -876 1680 1739 -405 -2288 -885 1457 1670 -958 -1705 -578 1889 1131 -80 -1590 53
6968 53 1008 1573 -1200 -1954 512 1533 958 -1017 -1417 127 2466 621 -1329 -605 424 1673 -887
6985 -887 -2117 -538 1283 1199 -178 -2359 -281 2327 784 -66 -1566 -1303 1236 1275 -785 -1483 -220
7002 -220 637 1127 -712 -1077 960 856 1395 -1279 -1533 -283 1287 866 -1148 -1558 -58 915 -723
7019 -723 -1382 -1000 45 2215 -845 -1607 -483 -114 401 -265 -2133 -1072 969 1143 -76 -1130 -88
$$ packed form
6904a806J742K435r70k458j47J900J532j423k538Q8L178P39k044j725M91J720
6920G14K057k979j449J069J796O2j917j622J776K164N8k150j604J823J300j66
6936I32k636q73K596J259j46k841J31J485J146n80k684l37K880J568k078j759
6952a937J061K556N9k144j883J403K342K13k628p47J127K467p58j211j510J643
6968E3R55N65k773p54K466J021n75j975m00J544K339j845j950P24J029J249k560
6985h87j230J579J821q4j377k181K078K608j543q50j500K63K539L9k060o98J263
7002b20Q57M90j839l65K037j04N39k674k54J250J570m21k014m10J500R73j638
7019g23o59L82J045K170l060p62J124L69N15o66j868J061K041J74j219j054J042
$$ plain form
7036 -88 200 609 -613 -1304 824 2090 1432 229 -147 -651 1127 1090 215 -486 300 1052 222 -408 -1136
7055 -1136 222 148 -485 -1487 -28 1096 542 -312 -284 149 680 135 -468 -1367 -181 -35 409 -469 -1572
7074 -1572 -59 1520 -341 52 -134 -34 555 -255 -768 190 -22 566 -911 -146 476 650 529 223
7092 223 68 -679 764 849 -78 -946 98 -99 282 -449 -155 -303 -116 -547 -598 -811 646 -432 -800
7111 -800 -691 -628 884 381 -453 -759 460 -46 421 -439 -524 445 254 -264 -2 571 282 322 -599 112
7131 112 17 430 429 -477 -822 796 1494 -577 269 -144 833 -119 -449 -804 95 1079 783 -595 -427 -276
7151 -276 1606 -220 -1268 -964 522 1678 -48 -582 261 432 479 -159 -543 608 1161 1002 -644 -293
7169 -293 -406 647 333 -609 -1973 -363 538 -603 -1246 -1437 -641 -85 606 -2151 -945 342 726 287
$$ packed form
7036h8K88M09j222o91K128J266o58j203l76n04J778l7q75p01P86P52q30o30p28
7055a136J358p4o33j002J459J124n54q54K8M33N31n45o03q99J186J46M44q78j103
7074a572J513J579j861L93j86J00N89q10n13R58k12N88j477P65O22J74j21l06
7092B23j55p47J443Q5r27q68J044j97L81p31K94j48J87m31n1k13J457j078l68
7111h00J09O3J512n03q34l06J219n06M67q60q5R69j91n18K62N73k89M0r21P11
7131A12r5M13jr06l45J618O98k071Q46m13R77r52l30l55Q99R84k96j378J68J51
7151b76J882j826j048L04J486J156j726n34Q43J71M7o38l84J151N53j59j646L51
7169b93j13J053l14r42j364J610R01j141o43j91P96N56O91k757J206J287L84m39
$$ plain form
7187 287 -1367 -1344 859 734 98 -1259 -871 1235 931 -244 -800 -837 881 1630 -680 -499 -498 2000 1695
7206 1695 -386 -1320 808 1037 713 -779 -1408 1701 1825 885 -1334 -772 -169 1538 1275 -1346 -638
7223 -638 568 2581 417 -1767 366 1714 1714 618 -869 56 1127 1524 66 -1708 -214 1305
7239 1305 1603 -240 -1506 51 1349 1831 -1177 -1509 -84 1549 781 -1520 -2015 660 1692 49
7255 49 -1306 -1346 320 2449 306 -2381 -1091 1669 1619 155 -2217 -1079 1338 1388 88 -1772 154
7272 154 1803 1290 13 -1585 518 2459 2776 -611 -1213 604 1835 1692 -717 -1806 880 1997
7288 1997 1103 -979 -1451 485 1962 209 -1169 -1479 4 2451 95 -1707 -1436 1213 1460 -292
7304 -292 -2059 -1009 978 1224 -225 -2114 -647 1552 1267 -934 -1821 -700 1520 1128 -1287 -1753
$$ packed form
7187B87j654K3K203j25o36j357L88K106l04j175n56l7J718P49k310J81JK498l05
7206A695k081r34K128K29l24j492o29L109J24r40k219N62O03J707k63k621P08
7223f38J206K013k164k184K133J348%j096j487R25J071L97j458j774J494J519
7239A305K98j843j266J557J298M82l008l32J425J633p68k301m95K675J032j643
7255D9j355m0J666K129k143k687J290K760n0j464k372J138K417N0j300j860J926
7272A54J649n13j277j598K103J941L17l387o02J817J231j43k409j089K686J117
7288A997q94k082m72J936J477j753j378l10J483K447k356j802K71K649K47j752
7304b92j767J050J987K46j449j889J467K199k85k201q87J121K220l92k415m66
$$ plain form
7320 -1753 445 2021 1095 -826 -1444 856 2198 221 -1422 -1408 770 2157 624 -1327 -1190 798
7336 798 1242 -378 -2382 -1038 386 1061 121 -2297 -883 1097 432 109 -1754 -1192 2317 1346 -1513
7353 -1513 -1289 -387 1866 2034 -884 -1380 799 1563 1046 26 -1449 1540 2125 1024 -374 -595 748
7370 748 1838 -100 -1563 -910 1428 1829 -111 -2023 -441 1022 1337 93 -1162 -454 1572 711
7386 711 -516 -1749 -224 2061 538 -1384 -1459 119 1081 1109 -1412 -1601 1143 1225 921 -1089 -964 1493
7404 1493 1221 -294 -603 -1232 1057 1988 -55 -922 -422 737 1709 -792 -1573 -66 589 283 -52 -1559
7422 -1559 -303 1565 784 -760 -879 -631 1857 107 -554 -1249 -458 692 226 -548 -834 1091 827
7439 827 558 -585 -1272 675 1453 316 85 -222 324 1669 -151 -683 -233 997 1640 -186 -741 158
$$ packed form
7320a753K198J576r26j921o18K300J342j977j643J4K178J387j533j951J37J988
7336G98M44j620k004J344J424O75r40k418J414J980o65l23j863N62L509r71k859
7353a513K24R02K253J68k918m96K179P64n17j020j475K989N85j101j398k21J343
7370G48J090j938j463O53K338M01j940j912J582J463L15j244j255P08K026q61
7386G11j227j233J525K285j523j922p5J578R62K8k521j89K744Q2l04k010J25K457
7404A493k72j515l09o29K289R31k043q67N00J159R72k501p81J507O55l06l35j507
7422a559J256J868p81j544j19K48K488j750o61o95P91J150m66p74k86J925k64
7439H27k69j143o87J947P78j137k31l07N46J345j820n32M50J230O43j826n55Q99
$$ plain form
7457 158 419 636 -86 -929 -108 1503 -158 82 -624 38 538 -520 -1195 -1066 -57 170 -259 -650 -663
7476 -663 -83 158 96 -1116 -556 165 399 617 -260 132 298 470 -368 142 -183 -7 581 445 690 197
7496 197 943 143 -350 136 -476 996 85 699 -943 151 70 582 -229 459 -236 -526 359 -752 406
7515 406 1245 165 219 564 280 5 1112 875 162 8 -86 189 -340 92 -39 175 902 261 -263 19
7535 19 -755 72 -218 -308 -312 -82 -517 -539 -183 -436 -1375 -235 -107 212 -394 -761 -288 -261 15 -915 -913 335
7557 335 537 -92 -813 -527 112 1179 42 -701 -548 1046 816 -87 -692 212 861 1292 300 -961 -301
7576 -301 731 583 371 -1075 276 567 500 -518 -502 276 531 722 -567 -1001 -465 119 774 -575 -1218
7595 -1218 -397 783 107 -1514 -1167 232 1485 -679 -772 -552 221 -275 557 -1446 -427 472 1311 -1259
$$ packed form
7457A58K61K17p22q43Q21J611j661K40p06O62N00j058o75J29J009K27m29l91j3
7476f63N80K41o2j212N60P21K34K18q77L92J66J72q38N10l25J76N88j36K45m93
7496A97P46q00m93M86o12J472r11O14j642J094q1N12q11O88o95k90Q85j111J158
7515D06Q39j080N4L45k84k75J107k37p13j54r4K75n29M32j31K14P27o41n24K82
7535A9p74Q27k90r0mK30m35k2L56k53r39J140J28L19o06l67M73K7K76r30KJ248
7557C35K02o29p21K86O39J067j137p43J53J594k30r03o05R04O49M31r92j261O60
7576c01J032j48k12j446J351K91o7j018J6P78K55J91j289m34N36N84O55j349o43
7595a218Q21J180o76j621L47J399J253k164r3K20P73m96Q32k003J019Q99Q39k570
$$ plain form
7613 -1259 -2319 -531 1430 1479 269 -305 -251 447 271 -465 -604 -197 1073 457 -599 -944 32 1729
7631 1729 709 -595 -909 842 1697 87 -1243 -1687 296 -132 295 -1670 -789 250 1929 492
7647 492 -1139 -422 1415 1454 -316 -989 250 424 550 -439 -2178 -342 764 650 -1975 -1467 -118
7664 -118 1482 803 -867 -1612 138 1699 832 -1176 -1288 -44 1431 570 -1115 -829 551 1545 528
7681 528 -1731 -1124 1012 1792 -757 -725 -262 809 1056 -213 -1979 705 1584 715 -851 -1818 -1200 1990
7699 1990 514 -1401 -3144 258 1025 597 -1643 -2018 450 1133 1773 -2256 -1963 706 1785 111
7715 111 -600 -1627 -346 1086 -72 -1184 -819 977 1931 -415 -1562 -707 587 1430 -1070 -793 -314
7732 -314 1975 1048 -96 -1165 -383 2504 1685 -742 -862 -42 1685 688 -1066 -1203 590 1378 1284 -1463
$$ packed form
7613a259j060J788J961M9j210n74N4O98j76p36j39M07J270o16j056l45R76J697
7631A729j020j304l14J751Q55j610j330m44J983m28M27j965Q81J039J679j437
7647D92j631P17J837L9j770o73J239J74J26r89j739J836J106j14k625N08J349
7664a18J600o79j670p45J750J561q67k008j12J244J475q61j685K86J380R94j017
7681E28k259O07K136P80k549L2M63J071K47j269j766K684Q79q69j566r67O18L190
7699A990j476j915j743L402P67m28k240l75K468O83O40m029K93K669J079j674
7715A11p11j027J281J432j158j112L65J796R54k346j147Q55J294Q43k500K77M79
7732c14K289r27j144j069P82K887q19k427j20Q20J727r97j754j37J793P88r4k747
$$ plain form
7750 -1463 -880 1007 710 880 -1278 -663 1524 1702 -621 -1475 -8 1552 1702 -219 -823 -550 1458
7767 1458 730 -87 -1535 337 855 470 -1244 -1552 139 1260 1171 -1526 -915 303 1717 347 -1123
7784 -1123 -551 374 1380 269 -1326 -666 718 1597 39 -1063 -874 1045 1636 -417 -505 384 1329
7801 1329 1717 -86 -1037 124 1221 2354 68 -1258 1038 1605 854 -895 -567 189 1555 738 -299
7818 -299 -255 168 1014 -55 -1386 -990 -14 308 -595 -909 -653 718 201 -452 -1389 -443 644 477 -569
7837 -569 -703 -489 1445 607 -379 -1116 185 723 362 -646 -918 745 820 158 -1035 -695 -418 1192
7855 1192 -124 -551 -275 181 916 488 -123 -264 47 -84 -373 -1076 -436 620 265 -802 -605 -411 383
7874 383 369 -390 217 1062 -109 1234 -203 -331 900 581 1039 -327 -462 616 342 15 -1119 562
$$ packed form
7750a463N83J887k97J70k158O15K187J78k323q54J467J560J50j921o04K73K008
7767A458p28q17j448J872N18l85j714l08J691J121q9k697O11J218J414j370j470
7784a123N72R25J006j111j595O60J384Q79j558j102J89J919N91k053q8Q89R45
7801A329L88j803r51J161J097J133k286j326K296N67p51j749L28P56J366q17j037
7818b99M4M23Q46j069j331L96R76L22r03l14K56J371n17o53r37R46J087j67j046
7837e69j34K14J934q38r86p37J301N38l61j008k72J663P5o62j193L40K77J610
7855A192j316m27K76M56P35m28o11j41L11j31k89p03O40J056l55j067J97J94P94
7874C83j4p59O07Q45j171J343j437j28J231l19M58j366j35J078k74l27j134J681
$$ plain form
7892 562 151 710 -337 155 655 496 471 -91 -437 20 574 -269 346 -253 26 -385 -44 -292 84 184
7912 184 493 427 -794 -404 -540 -163 439 83 -406 0 -161 301 506 -110 -169 195 230 303 352 -99 311
7933 311 341 810 892 55 337 764 -118 490 -282 -816 341 -483 -472 -8 -1603 -218 534 -393 -875 19
7953 19 -853 -430 139 -812 -465 51 394 -701 -950 -705 253 -597 -83 -427 -721 703 573 -58 224 -91
7973 -91 -18 847 234 -1261 19 410 374 -6 -967 -137 608 454 -469 -1285 392 688 -618 -225 -212 678
7993 678 401 231 -1294 -785 131 138 -186 -1185 -248 299 1006 -220 -923 -142 930 833 -467 -852 -333 81
8013 81 856 -1204 -1252 263 1119 475 -985 -957 -98 1106 -13 -777 -423 397 1602 -118 -1260 -457
8031 -457 1035 1017 103 -1087 -440 1253 1456 160 -1347 -220 1128 793 -554 -615 -39 759 1012 -521
$$ packed form
7892E62m11N59j047M92N00j59k5n62l46M57N54q43O15n99K79m11L41k48L76J00
7912A84L09o6j221L90j36L77O02l56m89M06j61M62K05o16n9L64L5P3M9m51M10
7933C11L0M69Q2q37K82M27q82O08p72n34J157q24J1M64j595J385P52r27m82Q94
7953A9q72M23N69r51L47N16L43j095k49K45R58q50N14l44k94J424j30o31K82l15
7973i1P3Q65o13j495J280L91l6l80r61Q30P45j54r23q16J677K96j306L93J3Q90
7993F78k77j70j525N09R16Pl24r99R37N47P07j226p03P81J072r7j300l85N19M14
8013H1P75k060m8J515Q56o44j460K8Q59J204j119p64L54Q20J205j720j142Q03
8031d57J492j8r14j190O47J693K03j296j507J127J348l35j347o1N76P98K53j533
$$ plain form
8049 -521 -811 93 790 1259 -964 -931 1046 1565 624 -238 -1346 733 1556 -191 -1124 -674 667 854
8067 854 253 -1505 -1158 800 547 -208 -1752 -308 338 609 -634 -1933 -588 1153 957 -1571 -1797
8084 -1797 -735 1079 1160 -412 -835 73 1316 560 -1340 -903 689 1281 439 -446 -1704 717 1388
8101 1388 -4 -392 -760 443 1243 -191 -1409 -583 935 1334 -534 -1454 295 1211 1590 114 -2172
8118 -2172 199 1741 753 -606 -293 -489 855 254 -120 -829 -36 1532 769 -1460 -1043 397 823
8135 823 922 -629 -522 858 675 -1423 -469 -1046 27 -149 -331 -1416 -819 1287 850 -386 -1734 -176
8153 -176 915 12 -956 -1446 138 1338 610 -780 -1345 -288 789 910 -454 -810 380 1127 415
8170 415 -1171 -1022 1159 1032 58 -663 -281 1145 1294 381 -1252 -464 356 827 -285 -2327 -659 1198
$$ packed form
8049e21k90R04O97M69k223L3J977N19r41q62j108K079Q23j747r33M50J341J87
8067H54o01j758L47J958k53p55j544J444O46K71j243j299J345J741j96k528k26
8084a797J062J814Q1j572m23R08J243p56j900M37J592N92q42q85j258K421O71
8101A388j392l88l68J203Q00j434j218Q26J518L99j868r20J749R16L79j476k286
8118b172K371J542r88j359L13j96J344o01l74p09P93J568p63k229M17J440M26
8135H23R9j551J07J380j83k098R54n77J073j76j82j085N97K106m37j236j348J558
8153a76J091r03r68m90J584J200p28j390n65J057J077J21j364l56J190P47p12
8170D15j586J49K181j27r74p21L82J426J49r13j633P88Q20M71j112k042J668J857
$$ plain form
8188 1198 1059 -883 -935
$$ packed form
8188A198j39j942n2
8191i35
$$ Imaginary data points
##PAGE= N=2
##DATA TABLE= (X++(I..I)), XYDATA
$$ plain form
0 0 0 0 0 0 0 0 0 0 0 0 -58 58 -58 58 -83 116 -116 174 -174 232 -290 348 -406 466 -580 640 -756 872
28 872 -1007 1162 -1336 1514 -1721 1948 -2196 2468 -2775 3106 -3470 3868 -4303 4777 -5299
43 -5299 5864 -6495 7157 -7902 8713 -9597 10572 -11649 12832 -14140 15607 -17254
55 -17254 19104 -21218 23651 -26483 29826 -33858 38818 -45091 53311 -64605 81139 -107728
67 -107728 157507 -283085 1295210 2058974 152993 626729 367233 1469879 1503292 -307489
77 -307489 -401336 645292 748812 924649 -348192 -809455 629891 919776 329995 -265660
87 -265660 -699779 396732 1058382 18494 -628651 -409666 162835 948461 21398 -834627
97 -834627 -116518 533480 899572 400127 -509970 237364 1249063 1054997 613145 -22010
$$ packed form
0@%%%%%%%%%%n8J16j16J16j41J99k32K90l48M06n22O38p54Q72j046J220j396J628
28H72j879K169k498K850l235L669m144M664n243N881o576P338q171R080j0076
43e299J1163j2359J3652j5059J6615j8310K0169k2221K4481k6972K9747l2861
55a7254L6358m0322M4869n0134N6309o3684P2676q3909R8402j17916J45744j88867
67a07728K65235m40592J578295P63764j905981M73736k59496J102646L3413j810781
77c07489r3847J046628J03520J75837j272841m61263J439346K89885n89781n95655
87b65660m34119J096511O61650j039888o47145K18985N72501P85626r27063q56025
97h34627P18109O49998L66092m99445r10097P47334J011699j94066m41852o35155
$$ plain form
107 -22010 377632 1545650 1102535 303754 65784 362379 1221636 1011934 -86317 -141513
117 -141513 527998 946110 853111 -73174 -254555 708266 1021685 555012 -30644 -200833
127 -200833 539121 1026744 219893 -328910 -146316 320636 778879 111960 -561452 -67824
137 -67824 508704 618622 231593 -372771 54023 866693 677713 195397 -128951 124699
147 124699 841481 674866 -94511 -215660 152132 550829 517907 -273189 -398117 262246
157 262246 479991 340857 -170468 -382492 349303 644449 163051 -123324 -244273 248221
167 248221 683379 24824 -316581 -99156 178044 532545 101639 -426896 45740 428428
177 428428 441078 285012 -206223 136318 743889 499481 229151 47982 128584 698468
$$ packed form
107b2010L99642J168018m43115p98781k37970K96595Q59257k09702j098251n5196
117a41513O69511M18112r2999r26285j81381R62821L13419m66673n85656j70189
127b00833P39954M87623q06851n48803J82594M66952M58243o66919o73412M93628
137f7824N76528J09918l87029o04364M26794Q12670j88980m82316l24348K53650
147A24699P16782j66615p69377j21149L67792L98697l2922p91096j24928O60363
157B62246K17745j39134n11325k12024P31795K95146m81398k86375j20949M92494
167B48221M35158o58555l41405K17425K77200L54501m30906n28535M72636L82688
177D28428J2650j56066m91235L42541O07571k44408k70330j81169Q0602N69884
$$ [...]
8191G
##END NTUPLES=NMR FID
##END=
