##TITLE=1H_SA_sl.Ac3
 CDCl3, 8 sc, 
 4.06.2021
##JCAMPDX= 6.0         $$ Bruker NMR JCAMP-DX V2.0
##DATA TYPE= NMR FID
##DATA CLASS= NTUPLES
##ORIGIN= UXNMR, Bruker Analytische Messtechnik GmbH
##OWNER= root
$$ XWIN-NMR		Version 3.5
$$ Fri Jun  4 11:05:12 2021 Russian Standard Time (UT+4h)  she@DPX200
##.OBSERVE FREQUENCY= 200.131506
##.OBSERVE NUCLEUS= ^1H
##.DELAY= (6, 6)
##.ACQUISITION MODE= SIMULTANEOUS
##.ACQUISITION SCHEME= undefined
##.AVERAGES= 8
##.DIGITISER RES= 18
##SPECTROMETER/DATA SYSTEM= spect
##.PULSE SEQUENCE= zg30
##.SOLVENT NAME= CDCl3
##.SHIFT REFERENCE= (INTERNAL, CDCl3, 0, 15.7039)
##AUDIT TRAIL= $$ (NUMBER, WHEN, WHO, WHERE, WHAT)
$$ ##TITLE= Audit trail, XWIN-NMR		Version 3.5
$$ ##JCAMPDX= 5.01
$$ ##ORIGIN= Bruker BioSpin GmbH
$$ ##OWNER= she
$$ F:/spectra/data/she/nmr/H-F/1/audita.txt
$$ ##AUDIT TRAIL=  $$ (NUMBER, WHEN, WHO, WHERE, WHAT)
(   1,<2021-06-04 11:03:29.40 +0400>,<she>,<DPX200>,
      <created by zg, POWCHK disabled, PULCHK disabled
       configuration hash MD5:
       00 E9 B6 7A A2 85 ED C7 34 08 36 98 17 FE 4E 26
       data hash MD5: 16K
       7B 57 49 9A 1B 4B B8 09 3C 3F 0A 31 FF 55 C6 0D>)
$$ ##END=
$$ 
$$ hash MD5
$$ 5E 2C D0 4D F8 43 53 BE FB 55 C4 0E 78 A2 F9 08
##$RELAX= 
##$RELAX= 
##$RELAX= 
##$RELAX= 
##$RELAX= 
##$RELAX= 
$$ Bruker specific parameters
$$ --------------------------
##$DU= <F:/spectra>
##$EXPNO= 1
##$NAME= <H-F>
##$PROCNO= 1
##$TYPE= <nmr>
##$USER= <she>
##$AMP= (0..31)
100 100 100 100 100 100 100 100 100 100 100 100 100 100 100 100 100 100 
100 100 100 100 100 100 100 100 100 100 100 100 100 100 
##$AQSEQ= 0
##$AQ_mod= 1
##$AUNM= <au_zg>
##$AUTOPOS= <>
##$BF1= 200.13
##$BF2= 200.13
##$BF3= 200.13
##$BF4= 200.13
##$BF5= 200.13
##$BF6= 200.13
##$BF7= 200.13
##$BF8= 200.13
##$BYTORDA= 1
##$CFDGTYP= 0
##$CFRGTYP= 5
##$CHEMSTR= <none>
##$CNST= (0..31)
1 1 145 1 1 1 1 1 1 1 1 1 1 1 1 1 1 1 1 1 1 1 1 1 1 1 1 1 1 1 1 1 
##$CPDPRG= <>
##$CPDPRG1= <>
##$CPDPRG2= <>
##$CPDPRG3= <>
##$CPDPRG4= <mlev>
##$CPDPRG5= <mlev>
##$CPDPRG6= <mlev>
##$CPDPRG7= <mlev>
##$CPDPRG8= <mlev>
##$CPDPRGB= <>
##$CPDPRGT= <>
##$D= (0..31)
0 1.2 0 0 0 0 0 0 0 0.06 0 0.03 0 0 0 0 0.0002 0 0 0 0 0 0 0 0 0 0 0 0 
0 0 0 
##$DATE= 1622790208
##$DBL= (0..7)
120 120 120 120 120 120 120 120 
##$DBP= (0..7)
150 150 150 150 150 150 150 150 
##$DBP07= 0
##$DBPNAM0= <>
##$DBPNAM1= <>
##$DBPNAM2= <>
##$DBPNAM3= <>
##$DBPNAM4= <>
##$DBPNAM5= <>
##$DBPNAM6= <>
##$DBPNAM7= <>
##$DBPOAL= (0..7)
0.5 0.5 0.5 0.5 0.5 0.5 0.5 0.5 
##$DBPOFFS= (0..7)
0 0 0 0 0 0 0 0 
##$DE= 6
##$DECBNUC= <off>
##$DECIM= 32
##$DECNUC= <off>
##$DECSTAT= 4
##$DIGMOD= 1
##$DIGTYP= 9
##$DL= (0..7)
0 120 120 120 120 120 120 120 
##$DP= (0..7)
150 150 150 150 150 150 150 150 
##$DP07= 0
##$DPNAME0= <>
##$DPNAME1= <>
##$DPNAME2= <>
##$DPNAME3= <>
##$DPNAME4= <>
##$DPNAME5= <>
##$DPNAME6= <>
##$DPNAME7= <>
##$DPOAL= (0..7)
0.5 0.5 0.5 0.5 0.5 0.5 0.5 0.5 
##$DPOFFS= (0..7)
0 0 0 0 0 0 0 0 
##$DQDMODE= 0
##$DR= 18
##$DS= 0
##$DSLIST= <SSSSSSSSSSSSSSS>
$$ [...]
##$SUBNAM2= <"">
##$SUBNAM3= <"">
##$SUBNAM4= <"">
##$SUBNAM5= <"">
##$SUBNAM6= <"">
##$SUBNAM7= <"">
##$SUBNAM8= <"">
##$SUBNAM9= <"">
##$SW= 20.0188882624521
##$SWIBOX= (0..15)
0 0 2 0 0 0 0 0 0 0 0 0 0 0 0 0 
##$SW_h= 4006.41025641026
##$TD= 16384
##$TD0= 1
##$TE= 0
##$TE2= 300
##$TE3= 300
##$TEG= 300
##$TL= (0..7)
0 120 120 120 120 120 120 120 
##$TP= (0..7)
150 150 150 150 150 150 150 150 
##$TP07= 0
##$TPNAME0= <>
##$TPNAME1= <>
##$TPNAME2= <>
##$TPNAME3= <>
##$TPNAME4= <>
##$TPNAME5= <>
##$TPNAME6= <>
##$TPNAME7= <>
##$TPOAL= (0..7)
0.5 0.5 0.5 0.5 0.5 0.5 0.5 0.5 
##$TPOFFS= (0..7)
0 0 0 0 0 0 0 0 
##$TUNHIN= 0
##$TUNHOUT= 0
##$TUNXOUT= 0
##$USERA1= <user>
##$USERA2= <user>
##$USERA3= <user>
##$USERA4= <user>
##$USERA5= <user>
##$V9= 5
##$VALIST= <valist>
##$VCLIST= <CCCCCCCCCCCCCCC>
##$VD= 0
##$VDLIST= <DDDDDDDDDDDDDDD>
##$VPLIST= <PPPPPPPPPPPPPPP>
##$VTLIST= <TTTTTTTTTTTTTTT>
##$WBST= 1024
##$WBSW= 4
##$XGAIN= (0..3)
0 0 0 0 
##$XL= 0
##$YL= 0
##$YMAX_a= 304813
##$YMIN_a= -153910
##$ZGOPTNS= <>
##$ZL1= 120
##$ZL2= 120
##$ZL3= 120
##$ZL4= 120
##$ABSF1= 10
##$ABSF2= 0
##$ABSG= 5
##$ABSL= 3
##$ALPHA= 0
##$AQORDER= 0
##$ASSFAC= 0
##$ASSFACI= 0
##$ASSFACX= 0
##$ASSWID= 0
##$AUNMP= <proc_1d>
##$AZFE= 0.1
##$AZFW= 0.1
##$BCFW= 1
##$BC_mod= 2
##$BYTORDP= 1
##$COROFFS= 0
##$CY= 11.3945322036743
##$DATMOD= 1
##$DC= 2
##$DFILT= <>
##$DTYPP= 0
##$F1P= 15.9154993809931
##$F2P= -4.1035820241983
##$FCOR= 0.5
##$FTSIZE= 0
##$FT_mod= 4
##$GAMMA= 1
##$GB= 0.15
##$INTBC= 1
##$INTSCL= 1
##$ISEN= 128
##$LB= 0.24
##$LEV0= 0
##$LPBIN= 0
##$MAXI= 10000
##$MC2= 0
##$MEAN= 0
##$ME_mod= 0
##$MI= 1.114404
##$NCOEF= 0
##$NC_proc= 0
##$NLEV= 6
##$NOISF1= 3.799351
##$NOISF2= 2.8
##$NSP= 1
##$NTH_PI= 0
##$NZP= 0
##$OFFSET= 15.70392
##$PC= 1
##$PHC0= -11119.34
##$PHC1= 9.200991
##$PH_mod= 1
##$PKNL= yes
##$PPARMOD= 0
##$PSCAL= 0
##$PSIGN= 0
##$REVERSE= no
##$SF= 200.130013532006
##$SI= 16384
##$SIGF1= 3
##$SIGF2= 2
##$SINO= 400
##$SIOLD= 16384
##$SREGLST= <1H.CDCl3>
##$SSB= 0
##$STSI= 0
##$STSR= 0
##$SW_p= 3612.71676300578
##$SYMM= 0
##$S_DEV= 0
##$TDeff= 0
##$TDoff= 0
##$TI= <>
##$TILT= no
##$TM1= 0
##$TM2= 0
##$TOPLEV= 0
##$USERP1= <user>
##$USERP2= <user>
##$USERP3= <user>
##$USERP4= <user>
##$USERP5= <user>
##$WDW= 1
##$XDIM= 8192
##$YMAX_p= 0
##$YMIN_p= 0
$$ End of Bruker specific parameters
$$ ---------------------------------
##NTUPLES= NMR FID
##VAR_NAME=  TIME,          FID/REAL,        FID/IMAG
##SYMBOL=    X,             R,               I
##VAR_TYPE=  INDEPENDENT,   DEPENDENT,       DEPENDENT
##VAR_FORM=  AFFN,          ASDF,            ASDF
##VAR_DIM=   8192,          8192,            8192
##UNITS=     SECONDS,       ARBITRARY UNITS, ARBITRARY UNITS
##FACTOR=    0.0002496,     1,               1
##FIRST=     0,             0,               0
##LAST=      2.0444736,     0,               0
##MIN=       0,             -153910,         0
##MAX=       2.0444736,     304813,          0
$$ Real data points
##PAGE= N=1
##DATA TABLE= (X++(R..R)), XYDATA
$$ [...]
2257h89k76M23K214M93k477k014J294L445l91k791n67J119Q11j67O03q19j338
2274a327J21K470P1k206m02J873R7r34j80J207J41j731L96R87n21r3K79K70j801
2293a283j92K740L98j911j568J348J658J08q66p79q56M32J886J014k241k469J174
2310a407L139j34k006p21O25K62J395P20j612k049N64K892J52k329q12J304Q53
2327H36q96O6Q07j106o79J247O27j023o55J232J59j380k43J665N93j479j047J100
2345a76O69P4k70j60j163l54K092J453k240k538J305K569p5j033q41m99K75J512
2363F00J078j202k545O42K567Q08k245j083J141K74J30M13k20j294l72J764Q79
2380A335j695o65J127O17j146k94J083M85j277RM80J29j86L75L23j162p81J715
$$ plain form
2257 -889 -1165 -742 1472 1965 -512 -2526 -1232 2213 1822 -969 -1536 -417 394 227 830 11 -1327
2274 -1327 -1206 1264 1335 -871 -1273 600 697 -237 -417 790 931 -800 -404 583 62 -31 248 518 -1283
2293 -1283 -1475 1265 1663 -248 -1816 -468 1190 1298 432 -347 -1203 -771 1115 2129 -112 -2581 -1407
2310 -1407 1732 1598 -408 -1129 -504 -242 1153 1873 261 -1788 -1224 1668 1820 -509 -1321 -17 836
2327 836 -60 6 813 -293 -972 275 902 -121 -776 456 615 -765 -1008 657 1250 -229 -1276 -176
2345 -176 493 567 297 137 -1026 -1380 712 2165 -75 -2613 -1308 1261 1186 153 -688 -1187 -912 600
2363 600 1678 476 -2069 -1427 1140 1948 -297 -1380 -239 35 165 578 358 -936 -1308 456 1335
2380 1335 -360 -1025 102 719 -427 -721 362 847 -430 -421 59 188 2 377 700 -462 -1243 472
2398D72J465j512j609J16J453Q86p96n41n94p08J837J515j154k567J13K517Q57
2415A750j516q88k03L93Q72P91m93j887n31K556P69j619j077P11R79o37j85Q17
2433F02n14r91P83M98m80n75R17P11j299q75J415J504j431j354K78J066J16l77
2451fP11j238q91J554J849j095k132m09K420K78n18n55r75L1P74J256N2k624m69
2470a987K740Q38j149j039J8R36nK04J54j025o25J285P47n09j180K50J402j255
2488b00o32J204L31l47n37n6Q38p99O64N97j562m89R71J448m89k021k41J660L56
2507F96k15k32q13n54Q03J779J4k685k44J829J416r55j094l60L60K93R47Q6j529
2526d58q72J308J347j079j141N18Q55p86m3L71O8l63k74Q29j51n66L81R21r76
$$ plain form
2398 472 1937 425 -1184 -1068 385 1271 475 -66 -660 -1368 469 1984 830 -1737 -1624 893 1750
2415 1750 234 -654 -857 -464 408 1199 706 -1181 -1712 844 1613 -6 -1083 -372 607 -30 -215 602
2433 602 88 -903 -120 378 -102 -677 240 951 -348 -1223 192 1696 265 -1089 -811 255 371 -6
2451 -6 705 -533 -1424 130 1979 884 -1248 -1657 763 1041 523 -32 -1007 -976 -202 1054 1106 -1518 -1987
2470 -1987 753 1591 442 -597 -579 357 352 556 710 -315 -940 345 1092 583 -597 -347 1055 -200
2488 -200 -832 372 703 356 -181 -237 601 -198 466 1063 -499 -988 -17 1431 942 -1079 -1320 340 696
2507 696 481 249 -564 -1118 -315 1464 1478 -1207 -1451 378 1794 839 -255 -615 -255 38 985 1071 -458
2526 -458 -1330 -22 1325 246 -895 -377 478 -308 -351 20 88 -275 -549 280 129 -437 -56 865 -111
2545a11j108J033J134m15j464RJ158R8o1K60o62r74M31K356m28k076p22J771J052
2564A281n26m97m49l21J22J868k87j491j462J618J433n84j174K1L43j99M50M43
2582E89o77o58M16J312n00j056N77J202r07r88Q60P64o84n70J41J03P2J51O38
2601G85r13j100N50J593J24j596o27J111O17l49K86n84r80N72J332K34j894r25
2619a764J387R73j17m75n48Q7o0O22R95r92j426J201J234m09j180K21N67m05k66
2638c55N43j2m25k04L09L91q91M64Q01p72r73L98J389K33j240o48Q57J64M52N08
2658I89j127q88L94J314Q57j836j188J267Q28K33n66j60q84N8J446O67j698q49
2676a143O57J283Q7j181k29P08m86L15M21n7n72j93P65l3j187Q89N87o51m44K67
$$ plain form
2545 -111 -1219 -186 948 533 -931 -922 236 334 273 533 -129 -1103 -672 1684 1256 -820 -1542 229 1281
2564 1281 755 258 -191 -512 -390 1478 1191 -300 -1762 -144 1289 705 -469 -448 -105 -304 146 589
2582 589 -88 -746 -330 982 482 -574 3 1205 298 -690 170 934 250 -320 -179 -76 -4 147 785
2601 785 -128 -1228 -678 915 1039 -557 -1184 -73 544 195 481 -103 -1083 -511 821 1055 -839 -1764
2619 -1764 -377 596 479 4 -544 -457 -517 105 1100 108 -1318 -117 1117 708 -472 -251 316 -89 -355
2638 -355 188 176 -249 -453 -144 247 -644 -180 621 -151 -1124 -726 663 896 -344 -992 -135 29 481 989
2658 989 -138 -1026 -632 682 1539 -297 -1485 -218 610 843 277 117 -767 -709 737 1404 -294 -1143
2676 -1143 -486 797 884 -297 -526 182 -304 11 432 375 -197 -390 375 342 -845 44 631 -20 -464 -197
2696a97O07j13k37j37J8j4K35J61Rj205k2J455P38j615l56R9N72L46N1k48r25
2717g78j33J745N08j265j049K64J438Q0q29j38j37l03O30O05m23j009L96J125
2735G27j15j026J24O43j34j52P6J85j51l90M78J1o17L76P28n16q62j47J391K89
2755I18o24p82L23L28K56M27k85j146k31J305P30q32j092M1J270J64m86k69l27
2774c12n82J299O37p04j142K75J000J73n52k63J91qj92L61N9o75L6P41p3m81j75
2795c87Q88j51r28m6R43K69o85k85J02K50m9P39j32j033n38J344P82n07j202L2
2815e94O74J06J91j06o93n05R77R84n41j098n6R03L20n04K7m43k39O76O79l35
2835D23p14k59P91L60p13l09O43p0n57L3P84n9o72M19J2m73J48P49J8j058k52
$$ plain form
2696 -197 410 297 60 -77 -59 -73 162 323 332 -873 -895 560 1298 -317 -673 -574 -2 344 395 147 -778
2717 -778 -911 834 1342 77 -972 -708 730 810 -19 -157 -294 -597 33 638 215 -794 -398 727
2735 727 612 -414 -290 353 219 67 143 328 177 -213 265 276 -341 35 763 247 -615 -762 629 918
2755 918 294 -488 -165 163 419 846 561 -585 -816 489 1219 387 -705 -664 606 770 284 15 -312
2774 -312 -894 405 1042 338 -804 -529 471 644 92 -171 20 12 -180 181 240 -435 -399 342 269 -212 -387
2795 -387 501 350 -578 -624 319 588 -97 -382 -280 -30 -79 660 528 -505 -1043 301 1083 576 -626 -594
2815 -594 80 186 377 271 -422 -927 50 1034 493 -605 -661 242 562 58 85 -358 -597 79 758 423
2835 423 -291 -550 241 601 -112 -421 222 152 -405 -372 412 353 -319 100 112 -361 -213 536 554 -504 -756
2856g56N51J044n90m23k52K17L90K04J07p10r04J075J154o55j053m21J135J35
2874B48j73J43n14n81J134K34l0r70k57Q78M76o06o1J22j86k00K81M33o57m6N37
2895B05k20k52lN64J29o37k43O28L24m42l54J36K7q8O22J75j028o96J388P41l19
2916F57r83k41M17M03J13K03q60l76N12Q25J87j350n9O77L11l60J40l72l42L61
2936a37L20L81o60m69P48P4p7l91M06N07q33qK66mM5m21K21l12PN76K44p17n29
2959g63N17P86J46j101J90Q3L1N37L94q46r46P45O13N27j325k19O20K48L04j56
2979C85o68l77J5J062K47j078m66P81N89m63m18N51j24m81M50L15m76N6J69Jj12
3000d2k24M19N19o66n98M87O52j49n38j3j14J6M08K78l87j029M83R01L45r43j11
$$ plain form
2856 -756 -205 839 249 -174 -426 -209 181 385 492 -218 -1122 -47 1107 452 -601 -1022 113 248
2874 248 75 218 -296 -877 257 491 461 -509 -766 112 588 -18 -79 43 -143 -343 -62 371 -286 -332 205
2895 205 -15 -267 -270 294 423 -214 -457 171 495 53 -301 -165 -138 -226 396 571 -457 -1153 235 976 657
2916 657 -326 -567 -150 253 366 569 -291 -667 -155 670 857 -493 -552 125 436 76 216 -156 -498 -137
2936 -137 183 564 -96 -565 183 257 180 -211 195 702 -131 -139 127 123 168 -253 -32 -344 -337 239 483 -234 -763
2959 -763 -246 540 686 -415 -225 -142 -111 426 820 -26 -972 -227 386 913 -412 -631 -11 237 541 385
2979 385 -283 -660 -645 417 664 -414 -880 -99 490 27 -391 160 36 -445 5 320 -156 -100 69 70 -42
3000 -42 -266 153 672 6 -592 -105 547 398 -140 -153 -267 -251 157 435 48 -981 -498 403 748 -195 -306
3021c06J75Q8K22J38k97n79L40Q35O9r18m30M93O87k48p7Q7k58m27M20L38k44
3042A08p07L38P41m44m52M25M1l20p9O47j56j96K89N7l54n12P61L69n87o17L46
3063c02Q90J43q87j82J52j39O96N36p73q95J97O32L72l27o05l3P41K34k96j96
3083d2l33m2N28M02n96n87O68L09k60l45J46K84m08K87Jk1k57L44J63l96k32N25
3105A38K27m07l81L90O6M80m36J44j41j56J83M67l65q42R1P53L23o57n07K95N40
3126B05K6L39l26p48m11R17N64n11n99K39O51l45M6j47J20l00J86O18o19J13j97
3147a79M54p4o23L87J55j61n26O0L56P8K02k76O0m79L70J042q50j58o40P83L65
3168C46q18M19l34k66M59J89P29j247j27O93O01l55r39N83L27k80O21p56K13l53
$$ plain form
3021 -306 -131 -43 179 317 20 -559 -219 616 685 -233 -663 -170 517 269 192 279 21 -406 14 352 108
3042 108 -599 -261 480 36 -416 9 50 -270 -349 298 142 -54 235 292 -62 -574 187 556 -31 -648 -302
3063 -302 588 731 -156 -338 -186 -325 371 907 134 -761 -564 68 440 113 -492 -525 216 450 154 -42
3083 -42 -375 -417 111 513 -83 -670 -2 307 47 -298 -152 132 -276 11 12 -9 -266 78 241 -155 -387 138
3105 138 365 -42 -423 -33 33 513 77 221 80 -76 107 574 209 -633 -542 211 534 -123 -630 -335 205
3126 205 231 570 244 -504 -915 2 566 55 -544 -305 346 1 47 -100 20 -280 -94 524 -95 18 -179
3147 -179 275 201 -422 -35 120 -41 -567 -507 -151 -73 129 -147 -87 -566 -196 846 -4 -162 -802 -19 346
3168 346 -472 -53 -387 -653 -194 -5 724 -523 -650 43 644 289 -650 -67 260 -20 601 -155 58 -295
3188b95J74Q91m04p57J28N29k18L64k35k10k70N53R33j143j10K40ln45K94n05
3208e89M86j78k08K55O8J02o37jQ28m98K37Q1n0o41L10P93K00l98j79j50J74J72
3230A77K10k56n21p79J286L42k72p86L16L59j56k15L69l9j36K41J98j31m55j31
3250c79L58J82n55J25O41j86m20K77R9k62L65j92l11K13k46R12j87p07k87P64
3270B04n8N6k84l0O0Q6N77l16o28j05K59R21m52q32j67M86K92N81l72p6j106K44
3292f60J068q05L73L5L61O2l09J49j42k11P9m15L98k65J62l22O10p22L05Q32K01
3313G84n75n36L29O18o69Q3m48m74P00O49r9m36p48L18Q95r7m42n09R85k01l10
3334a83J51k23p55Q32O74m74j52r64Q60O60k93q2P8r17Q77J38r9l5n90O07o7P4
$$ plain form
3188 -295 -121 770 366 -391 -263 266 48 412 177 -33 -303 250 1183 40 -70 170 167 -378 -84 -589
3208 -589 -103 -281 -489 -234 -166 -64 -701 -702 126 -372 -135 -54 -104 -745 -435 358 558 160 -19 -169 5 177
3230 177 387 131 -390 -1169 117 459 187 -599 -283 76 -80 -295 74 35 -101 140 338 207 -248 -379
3250 -379 -21 161 -394 -269 372 186 -234 43 142 -120 245 53 -258 -45 -291 621 434 -273 -560 204
3270 204 146 202 -82 -112 -52 34 611 295 -333 -438 -179 742 290 -542 -709 -223 69 650 278 202 -904 -660
3292 -660 408 -397 -24 11 372 434 125 274 132 -79 0 -415 -17 -282 -120 -442 168 -554 -249 583 784
3313 784 209 -327 2 620 -49 34 -414 -888 -188 461 362 -74 -822 -504 391 294 -148 -657 328 127 -183
3334 -183 -32 -255 -1010 -178 496 22 -130 -1094 -234 426 133 51 129 -788 89 227 128 93 -497 110 43 117
3356A17n30O68m20N4j81R86l31n81j36Q6m70K54N64L24o49k25j80J311q55N61
3376C67o85L59M8M8K58q11O27j21K59n72M51j43K17l83L31r17K78k08M64O72o7
3397D72r32J220q42K43n14M68L64k88k82J24N05r47Q05r0k97q01J000r38P74l79
3417c35N69r8O44K4j201L01m21L5k81J614j811L49N23L19m4m07j77k4J73R55n51
3438A56m98J16j62L13K75n25l93M46M55J6J24J4p18J87L91m87Q93j525J623l06
3458C95p44M41j54k13q11J364n20P35n4l58N39l23r56N90N56j470J284p29L03
3477a25K26n12N90l60j48L88J17m54m83j69J240L28j168M92j01L4j55O58%o80
3497b82M96j61o8K47n42o45R43J38J59N91q56J95l12L83l1k06N79l34o45O56j40
$$ plain form
3356 117 -413 255 -165 -111 -292 694 363 -218 -354 -268 -738 -484 80 404 -245 -470 -650 661 -194 367
3376 367 -318 41 89 137 395 -416 211 90 349 -223 228 85 302 -81 250 -667 -389 -597 -133 539 472
3397 472 -460 760 -82 161 -353 115 479 191 -91 33 538 -409 396 306 9 -792 208 -730 44 -335
3417 -335 234 136 780 804 -397 -96 -517 -482 -763 851 -960 -611 -88 231 187 -220 -397 -421 -248 707 156
3438 156 -342 -226 -388 -75 200 -325 -718 -272 183 199 323 337 -381 -194 197 -290 603 -922 701 395
3458 395 -349 92 -62 -275 -1086 278 -242 493 439 81 620 297 -659 -69 487 -983 301 -428 -125
3477 -125 101 -411 179 -181 -329 59 176 -278 -761 -930 310 638 -530 -38 -139 -105 -260 398 398 -282
3497 -282 214 53 -15 232 -310 -955 -12 126 285 876 20 215 -97 286 255 49 628 294 -351 305 165
3518A65Q89n06o25j84M99l96K95j99l65K39R4J19j4j06m85O01Q91r97n87O79n58
3539e51M83N39l49o02K82N51n6q01P26j53j95O20m8p69K95Q8j08M36p19J06M06
3560A81k66p6J43r3K38J48K9m48k4M01k8J14n39k36M76K27p2q61M00K39K37j02
3582H8N9p32L23o57J581r13L1R01j84R65k081N12j2J40k73R90p86m21M54O2K4
3603G1l71O23k17j45K16k73O9K92l73j5j83M22j57J61m81M95n89N72J59L45r11
3624b90J90K44L28j40j48l29K3N0O51m36m12P8M45J30m76J07j04l4k48K97M42
3645C68o40J14L40j13j91J9J64n9j76J64p3K14j47k71K93K09j95q0N17m53l75
3666c71O59j21J6l30n9J96M7l3J21j42j95K65L31m30l03J85K19K03k61Mj71j96
$$ plain form
3518 165 1054 548 -77 -261 238 -158 137 -62 -427 -188 -94 25 11 -95 -580 21 912 -85 -672 7 -551
3539 -551 -68 471 122 -480 -198 353 297 -504 222 69 -126 494 446 -323 -28 60 -48 388 -331 -225 181
3560 181 -85 -161 -18 -111 127 275 304 -144 -168 233 205 319 -220 -456 20 247 175 -686 -286 -47 190 88
3582 88 147 -585 -262 -919 662 -251 -220 681 497 1462 -619 -107 -119 21 -252 738 -48 -469 -15 47 71
3603 71 -300 323 106 -39 177 -96 -27 265 -108 -123 -306 116 -41 120 -361 134 -455 117 276 621 -290
3624 -290 -100 144 472 332 184 -145 -122 -72 579 143 -269 -191 254 384 -92 15 -89 -123 -371 -74 368
3645 368 -272 -158 182 69 -122 -103 61 2 -174 -10 -83 131 -16 -287 6 215 20 -60 457 4 -371
3666 -371 288 167 183 -147 -206 -10 37 4 125 -17 -212 53 384 -46 -349 -164 55 258 -3 1 -170 -366
3688c66J70L62m4m49Q9J56N2O4J0j17j36J70K84p1k57j30J51N15j13m57j10M32
3710B05o8l71P8J99M2n3N1L0j34K10k65K30l24K69Q8O4l50p1R9L3K85k01p2o25
3734f51M56M56K72p40R3J27J75K03n24K0j08J07L56J24n77K7m1N23j45j47k98
3755b92K50L7J17j38nl0L0K18k23N9k01M41l55q5Q7O2J38l79L52l27L20J54l18
3778h8K82l83J17L74q8n71J41%J70M9J85n83K14K10O5K80o64P8L69J00j80j49
3800g2R2q3r6l32L77K02k15K32K66o83J14l01R67n43l72K82L34n8l81m7Q18m14
3822H7j35K8R9n95P3R68j41p96J79N22o05R38j38m37K25k20K02J88n47j02J88
3843a9J04J69n57J1L36J93j00l7k9l86K52O5K04k56K62l3j39k35N79o11p5K60
$$ plain form
3688 -366 -196 166 122 -327 -238 -82 -30 34 44 -73 -209 -39 245 174 -83 -213 -62 453 340 -117 -227 205
3710 205 137 -234 -156 43 85 32 83 113 -21 189 -76 154 -170 99 187 251 -99 -170 -71 -38 247 46 -26 -651
3734 -651 -195 261 533 -207 -114 13 188 391 -133 -113 -221 -114 242 366 -211 -184 -225 298 153 6 -292
3755 -292 -42 -5 112 -26 -31 -61 -31 187 -36 23 -178 263 -92 -177 -90 -28 110 -269 83 -244 76 230 -88
3778 -88 194 -189 -72 302 214 -357 -216 -216 -46 3 188 -395 -181 29 94 374 -290 -212 157 257 77 -72
3800 -72 20 -63 -159 -491 -114 88 -127 105 371 -312 -198 -499 468 -75 -447 -165 169 111 -270 -317 501 87
3822 87 -48 -20 79 -516 -443 525 384 -412 -233 289 -316 622 484 47 272 52 254 442 -105 -207 -19
3843 -19 85 254 -303 -292 44 237 137 100 71 -315 -63 2 206 -50 212 179 40 -195 384 -227 -302 -42
3865d2K82j7n18l9J64M0M50q10Q36j96Q4k65L84k02O3p5n1m36R6L30n15l8O06
3888A31o67Q41m79nQ1l16L36l15O66p09M50p13M79K71n7J11L60k77p3j8P4m54
3910b83j66L6j10L98J49k35N13j082R85K1j67m47O79J44p08m2M84k1o80J16P14
3931B98l35m69Q15n50Q58m08j84J077j297j66L82m00L67o65R37K8r11o2j69M35
3951d19P5K97K18L52l38n75N73m34k11R8M70k48K4k82L00L29l81M62k01M43p2
3972D80n11J75K06j47p16K79j9L74L59n41l3L56k85j55j84L56J32K84n11K7J9
3993e5M50J20l26k87J16n25L68L53q87M55o9P50n68J68J15o31N93j16K12m95J221
4014I62r27n75O69L78n99J033j298K7OJ417q49m66m33Q10r2N6J62m74N99r01P19
$$ plain form
3865 -42 240 223 -295 -334 -170 -130 320 -490 346 150 234 -31 353 151 214 139 88 -348 -252 78 -437 -475 131
3888 131 -536 305 -174 -179 -98 -414 -78 -393 273 -436 14 -699 -220 51 -6 105 465 188 115 97 171 -283
3910 -283 -449 -413 -523 -125 24 -211 302 -780 205 226 59 -388 291 435 -273 -315 169 148 -532 -416 298
3931 298 -37 -506 309 -241 617 209 25 1102 -195 -361 21 -379 -12 -677 260 288 -623 -685 -854 -419
3951 -419 -344 -47 171 523 185 -390 183 -251 -462 -364 106 -142 -118 -400 -100 229 -152 310 109 552 480
3972 480 -31 144 350 203 -513 -234 -253 121 480 -61 -94 262 -23 -178 -362 -6 126 410 -101 -74 -55
3993 -55 395 515 189 -98 18 -507 -139 214 -673 -218 -287 463 -105 63 178 -453 140 24 236 -259 962
4014 962 35 -540 129 507 -92 941 -357 -330 -324 1093 244 -222 -655 155 63 119 281 -193 406 -495 224
4035B24j73M08j97l13k21O38l05n93L53m5j46L17l52j6Q45J00n53J00K63k13p37
4056f16P53p12M06k9M58l6n53K8j75M70j99J87j68J91K06l85R0q5K6L7N05k25
4078A74m56K59m6N2R5j97Q3l4R9k8j46j0O4L60l37Q1j7nJ44j63Nl5k7N9J08J10
4104A92j91j78L09k24K16l10J75J22k53oP1j21P7M47j98j49M3j91J68Ok52L06
4126E9j75o0K11k82N0O1K40j52Kk17L76rK3k2j52j98L66J26l40M2l07M51J00j67
4150B6l00J9J96J5q3K51M0r1j87J29J00k70R6L57o9j13J39k50J34j08m00L44j30
4173a55J72j10M51l71r9K30J15l21p4K71K62j88k1k53J29J74j47K70m54m8O2L88
4195B83l18Jl64L72n3M15j97j92NJ04p0L85j46m30M67k36M4j27l1L29k74L0NN0
$$ plain form
4035 224 51 459 262 -51 -272 366 61 -532 -179 -224 -370 -53 -405 -421 424 524 -29 71 334 121 -616
4056 -616 137 -575 -169 -198 260 224 -329 -301 -476 -6 -205 -18 -186 5 211 -174 -84 -169 -143 -106 399 174
4078 174 -282 -23 -69 -17 78 -119 -36 -70 29 1 -145 -155 -91 269 -68 13 -4 -9 135 -28 -23 -58 -85 -26 82 192
4104 192 1 -177 132 -92 124 -186 -11 111 -142 -148 -77 -198 -121 326 128 -21 22 -169 -1 5 -247 59
4126 59 -116 -176 35 -247 -197 -136 104 -48 -46 -263 113 104 127 105 -47 -245 121 247 -93 -51 -358 93 193 26
4150 26 -274 -255 -59 -44 -127 124 164 73 -114 15 115 -155 -59 298 229 116 255 5 139 31 -369 -25 -155
4173 -155 17 -93 358 -13 -112 118 233 -88 -162 109 371 183 162 -91 38 212 65 335 -119 -167 -105 283
4195 283 -35 -34 -398 -26 -79 336 139 -53 -48 56 -14 371 225 -205 262 26 70 -57 -88 241 -33 -3 2 52
4219E2o2J60l4k04J25p7L96n48j47L09K11j96Q2l90K64j10M96j38K2m12J08J15
4241B2K10k37P2J13k83K10R7j25k39K53Q3j70J09k67j4K93j24j21j3M6J2J33j27
4264f7K27l22q5O1O9J44K4P5o5j61K5Kl4K62M3j63k66J76K72k13j24j63O03l12
4288Hk12J80j59k5M31j61P1k86J23lK17M0m49K32PL02j25l9k48P7R8K62m71N2
4312g8K34j14J18q0k76J90m14K63K57l16J09K46ok49j9J63J41k22J06J5J3j92
4334a11J21l11L0O9K33O8M8j46k87J30K97j77O5k89L17j02L36j81k37Q9M8L13
4356C23j93j11j19Q6l0Q3n2K4Q6m7K35l57J43j26K0p4%J97k5k45K27r3q9J72J03
4381A38k35j50k7L96p8K5k6j96J47J42k9p7P1l06K21J87k75k2m3K91K2j89R8j78
$$ plain form
4219 52 -10 150 116 -88 37 -40 356 -192 -339 -30 181 -15 67 -323 -59 -169 327 189 211 -201 -93 22
4241 22 232 -5 67 180 -103 107 204 79 -160 93 176 6 115 -152 -166 127 3 -118 -131 -85 -73 60 -67
4264 -67 160 -162 -247 -186 -117 27 51 126 61 -100 -75 -73 -107 155 198 35 -231 -55 217 4 -120 -283 320 8
4288 8 -204 -24 -183 -208 223 62 133 -153 -30 -33 184 224 -225 7 14 316 191 152 -96 -19 79 341 -130 -78
4312 -78 156 42 160 80 -196 -6 -420 -157 100 -216 -107 139 133 -116 -135 28 169 -53 53 68 81 -111
4334 -111 10 -301 -271 -202 31 99 147 1 -286 -156 141 -36 29 -260 57 -45 291 110 -127 -38 10 323
4356 323 130 19 -100 -14 -44 39 -13 11 97 50 285 -72 71 -55 -35 -109 -109 88 63 -182 45 -48 -137 35 138
4381 138 -97 -247 -274 122 44 69 43 -153 -6 136 107 30 101 -205 16 203 -72 -94 -137 154 176 -13 85 -93
4405i3J72J44j07j28j08k8J20L7j45J92l56L44j7k15M4J80j52N7j33L16j66n0
4427i2J22m8q4J87p4K79o42K79Q7K61l19K33l61m7J66M6N9j45J8P2j17l1J67l8
4451b2j26L07p5r5k32J26K04O3q8k78L21j43L2K18n22L59Q2k22r8J30k8m6K07
4474G4jj95M9J10r1j22J01mo0r7M58l59k23L75lJ45r2j04k36K32L13j19j10J61
4498B02n77L55J47j15m00K32J56m5j86P5L50j47K13m83J47j06K47J91l7ll65J25
4520b4J44k33J55j34J03%O4j97p9M34j56l7j76OJ39Nj56j76L34K35l23J73N7j79
4544b1j39J79J24j15j97R4L9N3k0R8m25K09j03K40K17l47J20J59J98l18Jk60J76
4567c8o9J93K03q14L78O4J19l22K75J83O3j32k82L11Ll75J01J84p5J41N8J7m17
$$ plain form
4405 -93 79 223 116 -12 -120 -148 -28 9 -136 56 -300 44 27 -188 -144 36 -116 -59 -192 124 -42 -92
4427 -92 30 -18 -102 85 11 290 -352 -73 14 275 -44 189 -172 -219 -53 -7 52 -93 -75 -3 -120 -151 16 -22
4451 -22 -148 159 84 -11 -243 -117 87 150 62 -216 105 -38 -6 212 -310 49 131 -91 -189 -59 -87 -133 74
4474 74 73 -122 -73 37 -54 -176 -75 -79 -139 -236 222 -137 -360 15 12 157 65 -39 -275 -43 270 151 41 202
4498 202 -375 -20 127 12 -388 -156 0 -45 -231 -156 194 47 260 -223 -76 -182 65 256 219 216 -149 -24
4520 -24 120 -113 42 -92 11 11 75 -122 -201 233 77 40 -136 -130 9 14 -142 -318 16 251 -72 101 158 -21
4544 -21 -160 19 143 28 -169 -75 -36 17 -3 95 -330 -121 -224 16 233 -114 6 165 363 45 46 -214 -38
4567 -38 -107 86 289 -525 -147 -83 36 -286 -11 172 235 103 -179 132 135 -240 -139 45 -30 111 169 186 -231
4590b31K57K2P5k88q1K09J50n0K31k7m17J3L38k4j56j57K0N3r6k2P4j59M27j05
4614E6J02j15J70l67M44j41l52J87J15Kj02M79m52j39J51j15K80k07p4K09k27
4635i6Q9j26J84r5p5J27Q2j88J23j45K00k08j01L03K74l39j02q5J93m3n3K63m83
4658c01J37q1L08j50L2l1J23J90k70l8q5J71J61j54n8m7O9j03Q8J22m34J48N25
4681C22j69k06K07j4j50L8K3J6k26J12M27k71k78J28K47k03k27L00K06Mj45j70
4703b9k66K9L89L1Q2l47J71J09J70l58KL2J8l7NR7j47m5J34L71k68q7n3J19l45
4728b23K43L63j92j67O5k9k94j42K74J10J44k82J69L26l45l49K12k26K39J28J01
4749A25k63J29N8J27R9l78k82K23M99l79J91k52R6J83j32l1k25Q0J09K6k16J13
$$ plain form
4590 -231 26 48 123 -165 -246 -37 113 63 294 267 -150 -137 201 177 21 -136 -116 -63 -159 -181 -107 -266 161 56
4614 56 158 43 213 -154 290 149 -203 -16 99 101 -1 478 26 -113 38 -77 203 -4 -78 131 -96
4635 -96 -7 -133 51 -44 -119 8 90 -98 25 -120 80 -128 -229 74 348 9 -93 -178 15 -28 -81 182 -301
4658 -301 -164 -245 63 -87 -55 -86 37 227 -43 -81 -166 5 166 12 -46 -93 -24 -127 -39 83 -351 -203 322
4681 322 153 -53 154 140 -10 28 51 67 -159 -47 380 109 -169 -41 206 3 -224 76 282 286 141 -29
4703 -29 -295 -266 123 154 236 -111 60 169 339 -19 -17 15 33 -4 1 98 -49 -94 40 411 143 56 3 122 -223
4728 -223 20 383 191 24 89 60 -234 -376 -102 8 152 -130 39 365 20 -329 -117 -343 -104 24 125
4749 125 -138 -9 49 176 275 -103 -385 -162 337 -42 149 -103 -7 176 44 13 -212 -132 -23 3 -213 -100
4771a00R3j15j13l2J08J16p5N7J43k78l1J08N4K35j54k24L67j21l28K81L3k22
4793a98J67K06M2k20J13J59K44l76k23L7Q0K01k66j27k15J05J79Q3p4L4L48k37
4815F2Q8M2k74M3l7ML80k53j50N8J06m1j71j94K81M5Rk1R9j82j22K26pJ32k57
4840a34K14o3k60j02M89j14m30R1K62J49j00om2j44J35p2J65k6l09M55J58j47
4862A69j69M7l37K61J28m4j46J70l79L02P2p8j35K39j82j50P1J14J4o0K35l94
4884b52L54j15L9K45j68j26O3L72l69r7P5k18K85q8O0j6j62M85m07J32j53J37
4906G6j59K69N9r7L5j82R1J2k29l00M69K7p5K1o7n9r2L09%k13J00k41K05n8J15
4931A6m0O2k37j3K52J89l21J99j44j75J97lkK41n32M06m3j28Pk7J01j31K75j52
$$ plain form
4771 -100 -7 -122 -235 -267 -159 -43 -118 -61 82 -196 -227 -119 -65 170 16 -208 159 38 -290 -9 24 -198
4793 -198 -31 175 217 -3 110 269 513 137 -86 -49 31 232 -34 -161 -376 -271 -92 -9 -83 -49 299 62
4815 62 150 192 -82 -39 -76 -72 308 55 -95 -37 69 28 -143 -337 -56 -11 -2 -23 76 -106 -228 -2 -9 123 -134
4840 -134 80 17 -243 -345 144 30 -400 -309 -47 102 2 -4 -46 -190 -55 -127 38 12 -297 158 316 169
4862 169 0 47 -290 -29 99 55 -91 79 -300 2 74 -4 -139 100 -82 -232 -161 -47 -33 -93 142 -252
4884 -252 102 -13 26 271 103 -23 40 412 43 -54 21 -197 88 0 60 44 -118 367 -40 92 -61 76
4906 76 -83 186 245 148 183 1 92 104 -125 -425 44 71 -4 17 -50 -109 -201 108 108 -105 -5 -246 -41 -99 16
4931 16 -24 38 -199 -212 40 229 -92 107 -37 -212 -15 -18 -20 221 -311 95 52 -76 -69 -96 5 -126 149 -3
4955cJ00l20J76J67K3l0j59j9O7J07j23M0J6j7rJ18j21k16J74j15K42%j84K87
4979B01l11J64P4J47l11K8J91j43R2j64j52J70J17k34M34j99R1j75l6p5P3J03
5001H5lk16N8O4P2K8K3p1j29J13k00J23j05J78j62K24J02j28j04K57j71p0L11
5024B79n56J87P4Oj14O4p3L13j37k58K88K17l93L4n2J81L00m82K18k23J0J16K01
5047B00Q1l34N3j36M15K6m13K34l65J54j24J92j46J76j95M15j03n3L7l6l0n3J15
5070A10k84K12J44j8j66n5oj33K47Q4O4j7j80L0l04L98N2j79N6J94l54K75k56
5093h6R4j00j1L4J01K5p5M6k23M5J98n1r5Q9j38K24k5j17k04K82mn9j66J46J93
5118A23j76K49L3j80m3l0J71O9j2j79J5j50m1J69p3k28M16o3j62N93m83K71m54
$$ plain form
4955 -3 97 -223 -47 120 143 113 -46 -65 2 109 -14 26 42 25 16 134 13 -203 -29 -144 98 98 -86 201
4979 201 -110 54 128 275 -36 -8 183 40 132 -32 -184 -14 103 -131 303 104 195 20 -16 -91 -18 85
5001 85 82 -134 -76 -12 60 88 111 40 -89 24 -176 -53 -158 20 -142 82 184 56 -48 209 38 -32 279
5024 279 -277 -90 -16 -10 -124 -60 -133 180 43 -215 73 290 -103 -69 -121 60 360 -122 96 -127 -117 -1 200
5047 200 281 -53 0 -136 279 305 -108 126 -239 -85 -209 -17 -163 13 -182 233 130 77 114 78 48 -5 110
5070 110 -174 38 182 164 -2 -57 -63 -196 51 135 199 182 2 32 -272 126 178 -1 55 249 -105 170 -86
5093 -86 8 -92 -103 -69 32 57 -18 28 -195 -150 48 -3 -98 -9 -147 77 52 -65 -269 13 9 -50 -216 -70 123
5118 123 -53 196 229 49 6 -24 147 216 204 25 40 -110 -151 18 -55 -283 133 70 -92 501 18 289 -165
5141a65L87%l48K59J87k90J43j25m53M14J36j51O6J25j50j96M6K01M1n9j44J62
5163H6k98J10M76m56m21Q23l38P64j283N02rJ50K13m57M08n25M11k17J23J63k79
5184e4k30K45j3J51k64r5J17l02k90P90l02K18k5P5r2m99L41j78L61m25Q50n32
5206a53M51n89P00j133P52k34j47L24j24J20J64L22k63j32k17J9l48Q01m2j066
5226g95O75J62J42l91O09J8o65R4r3P08o40K58l03J72K6m80j70N53j91K83j07
5247a35j56J55L81j08j95k99P41K56j216O65l24K49K61k20o73M08M82L76n76m39
5267c67O81n57P05l75j66M87m35K47k29j74K65k30j83J123j191k67J647r16p8
5286a3J36N82j014k25N77l95L55l76L11n66Q31r87J229J58K94q91q49O81k68L15
$$ plain form
5141 -165 222 222 -126 133 320 30 173 48 -405 9 145 -6 60 185 35 -161 -115 86 127 68 -76 86
5163 86 -212 -102 374 -82 -503 320 -18 746 -537 -35 -44 106 319 -138 270 -255 156 -61 62 225 -54
5184 -54 -284 -39 -52 99 -165 -260 -143 -445 -735 55 -247 -29 -54 21 -71 -570 -229 -407 -46 -471 379 -153
5206 -153 298 -291 409 -724 28 -206 -353 -29 -153 -33 131 453 190 58 -159 -140 -488 313 271 -795
5226 -795 -120 42 184 -207 402 420 -245 -151 -244 464 -176 82 -221 -49 -23 -503 -673 -120 -311 -28 -135
5247 -135 -291 -136 245 137 -58 -357 384 640 -576 89 -235 14 275 55 -618 -210 272 648 72 -367
5267 -367 314 -243 462 87 -79 408 -27 220 -9 -183 82 -148 -331 792 -399 -666 981 65 -13
5286 -13 123 705 -309 -534 43 -352 3 -373 -62 -628 203 -784 445 603 897 6 -843 -162 -430 -115
5306a15J61k93l8K03N0J87n02K10J19k36K24j06P9L6J54k74J21m6O3j19j44M72
5328B06m51K73M41q67O54l33k54L21R1l44k91K62K05k32N78K37j158J092m7k37
5348A46J88L05L03j305N66O3m52P93n99P31r54J75J16k59M17k96N41p34M81o14
5368c88P08M99r52m51L74O07j025J25L35j55j77L25k34N6j15M33q17O56N9L96
5388B59n83L66l3K00n52n37L3J477j013p4N10k92k38k57N57j78R23j43p94N66
5408A97p94L89J01M72n6k23P3l85J11K6P37j001P94p00J567j315l13K02O20j284
5428g82N12m22M49Q37j050K75n10J076j197P03j89L91p41J685j122j21J28M73
5446C95l82O16q82j01jO1K15L88Pp23M16P82q44l63M42L97j205J041m29K08o95
$$ plain form
5306 -115 46 -247 -285 -82 -32 155 -347 -137 -18 -254 -30 -136 -57 -21 133 -141 -20 -66 -3 -122 -266 206
5328 206 -245 28 469 -398 256 -77 -331 -10 81 -263 -554 -292 -87 -319 259 496 -662 430 383 146
5348 146 334 639 942 -363 203 266 -186 607 8 739 -215 -40 76 -183 234 -62 479 -255 226 -388
5368 -388 320 819 -133 -584 -210 397 -628 -503 -168 -323 -500 -175 -409 -353 -468 -35 -852 -196 -137 259
5388 259 -324 42 9 209 -343 -880 -847 630 -383 -457 53 -239 -477 -734 -177 -355 568 425 -369 197
5408 197 -597 -208 -107 365 309 86 159 -226 -115 -89 648 -353 441 -259 1308 -7 -320 -118 502 -782
5428 -782 -270 -692 -243 594 -456 -181 -691 385 -812 -109 -298 93 -648 1037 -85 -206 -78 395
5446 395 13 629 -253 -354 -355 -294 -79 309 316 -407 9 791 -53 -416 26 423 -782 259 -170 38 -657
5467f57N82O53q90Q36J4k1M14j064O38l28p60M81p42J340r46n5L43m32k79o37
5487a510J453N04l14J33P1j77q1m99k18R47M18L3p47n2j33N46p00Q42l42l30M05
5508B49l9m31N77q11O40l44r88J651m05J52r48O04K61L7n18J145j188o21J641
5527F64r27j31N7J58L34M84r90K88J89n43p3J08l26P42o20J019n92j77O22o25
5547c39j66Q4l01J131J10n27N62m39l15M30J4K56o76n9P2J99L01l10J60j486J236
5568f3K27K17k64j27j28K17l8l43M46m29R9lq5k87R22m19J63l06M37K80o30J44
5590C0p82M76K02J11n8M13k81M2K58j78l45J41J19M07k08k76K33l1k6p39O19P2
5612A99n41J03L31J85j49k89j50M11j45L46n12J50Q4M14m73j96K37K94o61j8K33
$$ plain form
5467 -657 -75 578 -312 524 538 517 931 -133 505 177 -583 -102 -844 496 -450 -505 -162 -594 -873 -1510
5487 -1510 -57 447 133 266 337 160 79 -420 -638 309 727 760 13 -39 -172 374 -326 516 174 -156 249
5508 249 210 -221 356 -455 185 -159 -1147 504 99 251 -697 -93 168 205 -313 832 -356 -977 664
5527 664 -263 -394 -337 -179 155 639 -351 -63 126 -417 -490 -382 -708 34 -586 433 -159 -336 286 -339
5547 -339 -505 -421 -722 409 519 -8 554 115 -200 230 244 500 -176 -235 -163 36 337 27 187 -1299 -63
5568 -63 164 381 117 -10 -138 79 41 -302 144 -285 -186 -189 -274 -561 361 -58 105 -201 236 516 -114 30
5590 30 -752 -276 -74 37 -21 392 111 153 411 233 -112 29 148 555 347 71 304 273 247 -492 127 199
5612 199 -342 -239 92 277 128 -161 -311 100 -45 301 -211 -61 23 437 -36 -232 5 299 -362 -380 -147
5633a47K47k57J68J16j10K53k92k18K47j62L80j39l1M6j55lk6J90o22K83L90k11
5655e3O1K18j58mk95L05j62M27m20o2K67Pk18J73j58l6J32J30j85J69q3m52M53
5678E6p0R7N8m6K39l89n9o4L26j67j99J70J37q9j90M62l33J6L9q9K99r1p5j0K04
5703B32r1k11L9J36L9q9oM6j42J50k1j92R6Rj67o4j6K78l30K99k16K12J44k17
5727h2J43k02L63l64l1l0K01RJ46R4k80K20J7k77m1K0Q2Q1l02L05j06j67K72k31
5751a60J19R4R4j02L80l91j54m3L10n8o5j07n9J76m6jJ43j37J2M0O7k25o5K73
5775I5J28l26K46j36j94L93j59P2O7p4k84L39k14M4R4K81l73rJ93k59k22M22j35
5798a1l45J14k39J98K62K55n97L82j0J02q6j78L21K20o03P4L3K43j70M22k71m51
$$ plain form
5633 -147 100 -157 11 127 17 270 -22 -240 7 -155 225 86 55 101 -54 -57 -83 107 -515 -232 158 -53
5655 -53 8 226 68 64 -231 74 -88 339 -81 -143 124 131 -87 86 -72 -108 24 154 -31 138 55 -397 56
5678 56 -14 83 141 95 334 -55 -114 -178 148 -19 -218 -48 89 0 -190 272 -61 -45 -6 -95 204 113 38 28 232
5703 232 141 -70 -31 105 144 55 49 95 -47 103 82 -110 -14 -5 -172 -236 -252 26 -304 -5 -221 -9 135 -82
5727 -82 61 -141 222 -142 -173 -203 -2 7 153 247 -33 187 204 -73 -114 -94 -12 69 -233 72 -34 -201 71 -160
5751 -160 -41 53 147 45 425 34 -120 -163 147 89 24 -83 -142 34 -12 -13 130 -7 5 45 112 -113 -178 95
5775 95 223 -103 143 7 -187 206 47 119 186 112 -172 167 -47 -3 91 372 -1 -10 183 -76 -298 124 -11
5798 -11 -356 -242 -481 -283 -21 234 -363 19 9 111 25 -153 168 388 -215 -141 -108 135 -35 387 116 -335
5820c35M43O7j15lm84L93R1l0%K44j69J99j56j83j69K52K24k39o5o3q8K65q3J96
5844A92j51j79K14j19J71k37k5L49j15k21K13n18N98rr6qr2L04o26M71k08k38
5866c30L51q3k56K72n8J63J12k16L2o9m7O7Q0P1J06k44l22K52N00m38j82L22k38
5889a55J84J38j99M3q8Ro0M1rJ93o4k45k8K77k07J52J01J4k73M14j08k1l4j78
5913a03K03P4j62l47J63K67j48M01k04k88m52P60l74j38l4P19m64M72l22n57O29
5934I5k29N95j050M59K16M39l76p8J41q60M63o4M6M10P20j218M01o03k68R68n48
5955c41R0O1K02K30n37K10l75r4J82N40j02K29n49O48l01k36K78J72m14K8J79
5976A00J86o6j49k90j63P46Nn84P5L5l75J30N42j44k06K64j62K89k95J99L5k07
$$ plain form
5820 -335 108 175 60 57 -427 -34 57 27 27 271 102 301 145 -38 -207 45 269 30 -35 -98 -186 79 -4 192
5844 192 41 -138 76 -43 128 -109 -134 215 100 -121 92 -426 172 163 67 59 -33 271 -355 116 -92 -330
5866 -330 21 -62 -318 -46 -104 59 171 -45 -13 -82 -129 -62 18 89 195 -49 -371 -119 381 -57 -239 83 -155
5889 -155 29 167 -32 11 -77 -68 -128 -87 -96 97 33 -212 -240 37 -170 -18 83 97 -176 238 130 109 75 -103
5913 -103 100 174 12 -335 -172 95 -53 348 144 -144 -596 164 -210 -348 -382 337 -127 345 23 -534 95
5934 95 -134 461 -589 -130 86 525 149 71 212 -648 -185 -249 -203 207 927 -291 110 -493 -761 207 -341
5955 -341 -251 -190 12 242 -295 -85 -460 -554 -372 168 66 295 -254 394 93 -143 135 307 -107 -79 100
5976 100 286 220 71 -219 -382 364 369 -215 -140 -105 -480 -350 192 48 -158 106 -56 233 -62 137 172 -35
5998c5R5j86N1J09O1j4j18k4q0K76j57J15k23P1m8p8J33j29L40k45J10q8N3K33
6022B22o5j57J61k18J40j1j43k9K7k8J77j82L29j14j75L31m83J94m2l1K48j01
6044E0k14K16j14Q5k37K68o1J1M7j72L1J27L6J30l68M12l65J79j90j67N01j69
6066C6j5n1l2J06j15K38J45j08l8l4j80j34K7L33K47o95M53j16J16j18j0m1k50
6089b36l4M42j51r2K34p3k24O9J29l1k02L01k52K33K43l33o8o7K98l65J38J53
6111A12k27K62j62J6N2Q8l74J78J38j46J20l2R3j82L0J55k28J76j5M5k72K12K6
6134F5k06K69j32J83J2k87M8K58n1j68K07m45J57K20j39Q0j4j33j68L93k89J69
6156B9l3rj63O3J71j52P9m0J06q0Jk32M15j67L36k46k04J87Q8R3j31N4O3J75l06
$$ plain form
5998 -35 60 -126 -75 34 95 81 -37 -61 -141 135 -22 93 -130 -59 -107 -185 -52 -181 159 -86 24 -64 -11 222
6022 222 157 0 161 -57 83 72 -71 -100 -73 -101 76 -106 223 109 -66 265 -218 -24 -66 -97 151 50
6044 50 -164 52 -62 23 -214 54 -7 4 51 -121 -90 37 73 203 -165 247 -118 61 -129 -296 205 36
6066 36 21 -30 -62 44 -71 167 312 204 166 132 -48 -182 -155 178 425 -270 183 67 183 65 55 14 -236
6089 -236 -270 172 21 -71 163 90 -134 -65 64 33 -169 132 -120 113 356 23 -45 -112 186 -179 -41 112
6111 112 -115 147 -15 1 53 141 -233 -55 83 -63 57 25 118 -64 -34 121 -107 69 54 99 -173 39 65
6134 65 -141 128 -4 179 191 -96 -48 210 159 -9 198 -247 -90 130 -9 71 57 -76 -244 149 -140 29
6156 29 -4 -13 -176 -113 58 -94 -15 -55 51 -29 -28 -260 155 -12 324 78 -126 61 149 242 111 165 228 403 97
6181I7l50L71l35K13j14K21l8k31K42j75PK19l86J94K3n6R9K45p6j05j88J36R9
6204A12l5j93L67j34k22j2L40j58j57Q6j25J48k4j00K13j03P0p2J26n00O27k17
6226C7k86J1N9J30m2N4J7K9j55J98K3N5k03j04j18M25k05L4J39K7P5j28j47K2
6250e3O6oj39nK50j08N0j48K63k83J93k5j71L48k11j46P3J9O8k22J17L0J0R9j29
6275f0L32k71j22n2M5K78pn1k60j40L04m9m1L52k04nP8j23J05j48K1L3P5Q3l65
6300a92K96K56l29Q5j16K0J96m6l20K7n8jN24l17j13K99j79L14m29K8k21J91j2
6323i7K6J85j84L19l02N0o0q0%m5JL79j55p6Q9k30J62K47j45N7j51p9J02k83M77
6348B07k27j10J73P0j92J91j18n2j85L32q4l2j25j35K70O3n4J36L3l38L6J43k68
$$ plain form
6181 97 -253 118 -217 -4 -118 103 65 -166 76 -99 -92 127 -259 -65 -42 -98 1 246 170 65 -123 13 112
6204 112 77 -116 251 117 -105 -117 223 65 -92 -6 -131 17 -7 -107 106 3 73 1 127 -373 254 37
6226 37 -249 -238 -179 -49 -91 -37 -20 9 -146 52 75 130 -73 -177 -295 130 -75 -41 98 125 200 72 -75 -53
6250 -53 13 7 -132 -137 113 5 55 -93 170 -113 80 55 -116 232 21 -125 -52 -33 35 -187 -70 -40 -30 69 -60
6275 -60 272 1 -121 -173 -128 150 143 92 -168 -308 -4 -53 -94 258 54 49 127 4 109 -39 -18 15 90 173 -192
6300 -192 104 360 31 116 0 20 216 170 -150 -123 -181 -182 342 25 -88 211 32 346 -83 -55 -276 -85 -97
6323 -97 -71 114 -70 249 -53 -3 -63 -143 -143 -188 -187 192 37 -39 50 -180 -18 229 84 141 -10 -89 13 -270 207
6348 207 -20 -130 43 113 -79 112 -6 -58 -243 89 5 -27 -152 -287 -17 46 -8 128 161 -177 -141 2 -266
6371b66K02J65j0p7p4j52j48M66k13K46q8k26K93K6j22j57K55k24J57J68M6k16
6393E1J21l68L17n1k01J41J13j00o0L4o3J05Q1Kr8Kl3J4k35L52j36q7P9o1m5n4
6419a80J32J38r6j08L17K7k25J52j08r6J52Q9k02J35j20n3O9p7J28j23J90l59
6441b18K97k42J51J27j95L39k28Lj75L02j34J0Orj71l1K02m4j95K14j07N7J73
6464A32Kk17pk6R2Oj44J58j88L77m48L9J78J51l24K16k65L24J54k72j4K42J8k42
6488e8QR8L4k39J22J11k83K28r2J39j27o7K56j11k36J03J21J38j00L28m05K60
6510B28k07Q4o6J8p3M2j45k5J39r2p0R7N3K56l28J45J23j34j05J64N6k72N7M8
6534gM6K40l65MR7j97J18J16J07R1j19k7k00Q9q3l3J03L3j57L4q1K70o4j01K74
$$ plain form
6371 -266 -64 101 91 14 -60 -212 -360 106 -107 139 51 -175 118 144 22 -135 120 -104 53 221 267 51
6393 51 172 -196 121 70 -131 10 123 23 -37 -3 -66 39 120 122 24 26 -7 7 -228 124 -12 -99 -20 -81 -126 -180
6419 -180 -48 90 -6 -114 203 230 5 157 49 -47 105 194 -8 127 7 -46 23 -54 74 -49 141 -218
6441 -218 79 -163 -12 115 -80 259 31 34 -141 161 27 37 43 34 -137 -168 34 -10 -205 9 -98 -41 132
6464 132 134 -83 -90 -116 -24 -18 -162 -4 -192 185 -263 -224 -46 105 -219 -3 -268 56 210 -62 -76 166 184 -58
6488 -58 -50 48 82 -157 -35 76 -207 21 -71 68 -59 -126 130 19 -217 -114 7 145 45 373 -32 228
6510 228 21 105 39 57 -16 26 -119 -144 -5 -97 -167 -70 -17 239 -89 56 179 45 -60 104 160 -112 -55 -7
6534 -7 39 279 -86 -82 15 -182 -64 52 159 250 131 104 -96 -7 -90 -123 -20 13 -144 -110 -191 79 15 -86 188
6559A88j73J33n7m52K59J66k50J83lnM6j20K62j67J0L97l40k62K82k08O7l5J3
6582f6J41n5ol4O5r3R6j62M2L2l9K5M7P4R8k17J13l0j59N7K46j44j8j65J33P7
6608E8k60J88j56J17O4r4O7J41k27O4J32k16K60l97K51l4l0J94j23O7p8J18j02
6631Dk21K27J27j10O9k46K92j90Q6j67J63J93k81J90p2j05j66m9L90j78j62M57
6653B51k47K5j70L61l13L52j97QP9N3k33J92q4j72L08k94J83l66K13Q0K7K43l67
6676f8Q6k11L44k36k46J80J13j23N3J69j49rK92o2P6j88p3N9K10l31J91j78k7
6699a28P0Q6j50M06l89n1K42k62K40l4J04kj0l4m8j65J68J14k98K36j92P8R8k31
6723a52J57L6j6J20k63J06J64J69j65o3k64K4J45K99l65r2P4J65K2P6j9m22K00
$$ plain form
6559 188 15 148 91 -361 -102 64 -186 -3 -6 -11 35 -85 177 10 20 417 77 -185 97 -111 -44 -79 -66
6582 -66 75 20 14 -20 45 -48 48 -114 -72 -40 -79 -54 -7 67 165 -52 61 31 -128 -71 175 31 13 -152 -19 58
6608 58 -202 -14 -170 -53 11 -83 -16 125 -102 -38 94 -122 138 -259 -8 -42 -72 122 -1 66 -12 106 4
6631 4 -217 10 137 27 96 -150 142 -48 38 -129 34 227 -54 136 64 -41 -207 -256 134 -44 -206 251
6653 251 4 29 -141 220 -93 259 62 70 149 202 -31 161 77 -95 213 -81 102 -264 -51 29 56 299 -68
6676 -68 18 -193 151 -85 -331 -151 -38 -161 -108 61 -88 -97 195 133 209 21 -52 7 217 -114 77 -101 -128
6699 -128 -58 28 -122 284 -105 -156 86 -176 64 30 134 132 122 88 40 -125 43 157 -141 95 -97 -19 79 -152
6723 -152 5 41 25 145 -118 -12 152 321 156 93 -171 -147 -2 297 -68 -160 -86 79 101 177 158 -264 -64
6746f4N8J5j35J52Q0k53J77L3j65j49M94l22J8K54kj04R0l4j99oJ19R2r3p6O8
6771D8Q3j46J23r6l39M87m04L36M6n3K90m62K84l18J59L6j03L92k65k59K8K02
6793F9j82J88j03q5o0J18p3O4j06K65K12j53J46k29M8M5l70R3R8J5j86M42p1l86
6817b01K67J17j41j62J54l5p9o2M27m10J30P9nM2k57K36K02k23k4j05K08l76L35
6840A17k23O3j8j35K64r6L1O1j44J54j37J90nO8J7j97k7R6q0J75j37j13Q8j82
6864a70K69j87K36r3m6K56k07J40k54j2P2l05K20j03L05j25jr1M38m11mJ36p5
6887a2K26k60J09rN1j72j53K01J92j81j12K70j73k35K71k12k0K38j08J35j75L8
6909i1K18l01l0J29J31R0j39j05K61k24L8j17j9j9R2J62L3o5O9N2l01M36k48N1
$$ plain form
6746 -64 -6 9 -126 26 106 -147 30 63 -102 -251 243 -79 -61 193 191 87 177 143 -56 -62 57 149 56 -20 48
6771 48 131 -15 108 12 -327 160 -244 92 138 85 375 -87 197 -121 38 74 -29 363 98 -161 -133 69
6793 69 -113 75 -28 -113 -173 -55 -128 -64 -170 95 307 154 300 71 119 164 -206 -113 -15 0 -186 256 185 -201
6817 -201 66 183 42 -120 34 -1 -80 -142 285 -125 5 84 79 121 -136 100 302 79 55 -50 158 -218 117
6840 117 -106 -43 -61 -196 68 -28 3 64 -80 74 -63 127 122 190 207 10 -17 79 -1 174 37 -76 12 -170
6864 -170 99 -88 148 55 9 265 58 198 -56 -68 4 -301 -81 -184 121 -4 -5 -96 342 -69 -73 63 -12
6887 -12 214 -46 63 54 105 -67 -220 -19 173 -8 -120 150 -23 -258 13 -199 -219 19 -89 46 -129 -91
6909 -91 127 -174 -204 -75 56 146 7 -98 163 -61 -23 -140 -159 -178 -86 76 109 44 113 165 -136 300 52 103
6933A03k8j73K35j55J38J79n72L60k91M02q6j93K25k45K46k23j2L0n9J47j81J64
6955A1k5q5om3M19j88N4l83M12l19P7J04M9k02M1N0j77J80L2j69L7K26k6j35J41
6980G5j42r0K63K76m01q0Q3k45N89l81J00l0m8Kj00M13k15j2m5N6j05M6K7l04
7004b68J36K42m0j9j36K15J14l69J70K22l80j5L24k17J91j51j4j08J48L46l43
7025D8j47K09j75Q2Q2LP3l10N77n31qo2J94o2L5o2N5L2n5k01K59O5L7N2l15k6
7051a51J77k72r0K97M8k5J88m4k72J24j04J47o1J18n8j35J02p3J55j0j27K5j36
7074a77J59n8P5q5J66j3j64Q0q6J54j57L5J47P5j66j51JP5J60j38J73j22L57k78
7098F2J52n04L05R1j51Q5l2l07K26J94k19L40k06j1j80J05j92J74L2l65M26Q4
$$ plain form
6933 103 75 -98 137 -18 120 299 -273 87 -204 198 112 -81 144 -101 145 -78 -90 -60 -119 28 -153 11
6955 11 -14 -99 -105 -148 271 83 137 -246 166 -153 -76 28 77 -125 -84 -34 -211 -31 1 -168 -131 95 69 -66 75
6980 75 -67 -157 106 382 -19 -99 -16 -261 328 -53 47 17 -31 -29 -129 284 69 57 12 68 -37 9 36 -268
7004 -268 -132 110 70 51 -85 130 244 -125 45 267 -113 -128 196 -21 170 19 5 -103 45 391 48
7025 48 -99 110 -65 17 99 102 175 -135 442 -89 -97 -159 35 -27 8 -54 1 33 -22 -223 36 101 138 190 -125 -151
7051 -151 26 -246 -336 -39 9 -16 172 128 -144 -20 -124 23 -38 80 22 -113 -11 -84 71 61 -66 -41 -177
7074 -177 -18 -76 -1 -86 80 67 -97 -17 -103 51 -106 -71 76 151 -15 -166 -165 -90 70 -68 105 -17 340 62
7098 62 214 -290 15 106 -45 40 8 -299 -73 121 -98 242 36 25 -155 -50 -242 -68 -36 -401 25 109
7120A09l08Q0K18OJ48l11L04k10j74J98j94K26m58M78J1j2m13P9M26l00j8J21
7142Fj82J75n3k45K72J82k09jJ35k78K35JP2J7j80o7K83l93L56j56L6l2R1j71
7166a06J14K12k22J02k77L28j07nl3k21M07p4j73k43J35L53j79k31K22J17m3p5
7188Ao0j5j7J54N5r9k61l1L27J04J50j19k28J40j62J39j95M76k17k43k07J39L44
7211A75l43J69J44m67J47o0K22j90J50P8k44J75J22k19pL56l46K65n2j88K06j30
7233c7J35k73K83K9j6Qm17J94M57l13n5N8j12N5R6j4n1j99j05O31m20K49k27J2
7257c2M90m54Rl79L97Ll00L47j14rQ8N7k37J4P5j23J98o7J60k56K77l50O6J81
7281D1j29pK56J78l62l4J57J54j75k92J66o3l1k7K51k21P9Q7o0q1J89m15L88l2
$$ plain form
7120 109 -199 -119 99 105 253 -58 246 36 -138 60 -134 92 -366 112 123 111 -302 -223 203 -97 -115 6
7142 6 -176 -1 -54 -299 -27 155 -54 -55 80 -198 37 38 110 127 -53 -120 163 -230 126 -30 6 -26 65 -106
7166 -106 8 220 -2 100 -177 151 44 39 6 -215 192 118 -55 -298 -163 190 11 -220 2 119 76 1
7188 1 -59 -74 -91 63 118 19 -242 -273 54 158 308 189 -39 101 -61 78 -117 359 142 -101 -308 -169 175
7211 175 -168 1 145 -322 -175 -235 -13 -203 -53 25 -219 -44 78 -141 -148 208 -138 127 75 -113 93 -37
7233 -37 98 -175 108 137 121 129 -288 -94 363 50 -5 53 -59 -4 92 78 27 -172 -277 354 -66 183 -44 -32
7257 -32 458 4 13 -366 31 34 -266 81 -33 -42 46 103 -134 -120 -45 -168 30 -37 123 -133 144 -206 -140 41
7281 41 -88 -95 161 339 -23 -57 100 254 79 -213 -47 -110 -141 -168 83 -138 -59 28 -32 -113 76 -339 49 17
7305A7m1L9j2J26k47n5J18j00K94j79n5M05l65KL72l90l88L10J40J18p5j9Kj23
7329a06K98J3j44l5o2J24R0k00RQ2j2k84K60k5j96J10K28m1o8q4l3kPL54j38l82
7355b37J22K61q4Oj30j05K5Pl7J08K47k31KJ85k84J32j7N1p2j55L60n32M49q6
7379a5J31l71R7J46j72Q8L9J31k03K50K36m00K91m07K09l8OJ75l90K96o8j15J4
7402g0pJ24k33J35K80o4j67K20m5k23j35L33k54J18l9J06m7k16L82m34J97O4m
7425B1q5Q5j49oJ07j39J96j1R4L8k10K80j94Om2j07l5J16J65J05l58L7LJ46J48
7450B11J39l53j30J75N1n0M7r6k11N38l18Q0k80K90j50L6j0j07K17j16K05ro4
7473I5m93J34J56L09k89O7P3j6l1J31K7J37k46L3n9j03N9k72J29J66Rj64K64J45
$$ plain form
7305 17 -24 15 3 129 -118 -173 -55 -155 139 -40 -95 310 -55 -53 319 -71 -459 -149 -9 109 34 15 17 -106
7329 -106 192 205 61 26 -36 88 178 -22 -13 69 57 -227 33 8 -188 -78 150 109 41 -43 -76 -78 -71 283 145 -237
7355 -237 -115 146 62 68 -62 -167 -142 -135 -172 -64 183 -48 -46 139 -145 -13 -30 21 -51 -206 154 -378 71 -15
7379 -15 116 -255 -158 -12 -184 -96 -57 74 -129 121 357 -43 248 -159 50 12 18 193 -197 99 31 -84 -70
7402 -70 -77 47 -186 -51 229 165 -2 218 173 -50 -185 148 -106 12 -27 79 32 -184 198 -236 -39 25 21
7425 21 -64 21 -128 -134 -27 -166 30 19 113 151 -59 221 27 33 -9 -116 -151 -35 130 235 -123 -86 -83 63 211
7450 211 350 -3 -133 42 93 43 90 -6 -217 321 3 83 -197 93 -57 -21 -31 -138 79 -37 168 159 95
7473 95 -398 -264 -108 201 -88 -21 52 36 5 136 163 300 54 87 28 -75 -16 -288 -159 7 16 -148 116 261
7497B61j49j08k53J25L67o1l32O7N0K25l25oJ10J06j9q5M20l76n9P2M3j45NJ07
7521D0R7j64O7j79J39Q9l12R9J50k3j06j6K63J50j56k45m7J05k23K02m6K30k47
7544a33J6K60l06L69l89K67p3O8j11P0j13l7K39j92K46m48J23J32R7j25k8MJ47
7567H3j43j06J64j31r6M7J76j3J8L2j70L15m04K2J09J98m0j19K09m19Q5J52m1
7590g2K58N7k87J81l98L22mq8K77j94N0j78j6J83k61J28m4j36L65m7p5j02j1J02
7614A0j21m7M1J13M1j80J28j46L0N6M9K7J22m34J75M00m80l0K11J00k46K42k75
7637b14K45J86r7k77MK7k00M06k12l84N90k9L0k57K83Q0L0k96K29Jj21j06M5O9
7661C2r8K8k69M00J17J9p7k45J04m5J65k38K50l57Q2J72J1l48L66Q2J87n61K38
$$ plain form
7497 261 112 4 -249 -124 243 182 -150 -83 -33 192 -133 -139 -29 77 58 -27 393 17 -42 30 73 -72 -67 40
7521 40 137 -27 40 -139 0 89 -223 -124 26 3 -103 -119 144 294 138 -107 -154 -49 -272 -70 -116 114 -133
7544 -133 -117 143 -163 206 -183 84 11 79 -32 38 -75 -112 127 -65 181 -267 -144 -12 85 -40 -68 -64 83
7567 83 -60 -166 -2 -133 -229 -182 -6 -19 -1 31 -139 176 -228 -206 -97 101 61 -58 151 -268 -183 -31 -72
7590 -72 186 243 -44 137 -261 61 57 -31 246 52 102 -76 -92 91 -170 -42 -86 -222 143 96 21 -81 -92 10
7614 10 -111 -158 -117 -4 37 -143 -15 -161 -131 -75 -26 1 123 -311 -136 264 -216 -246 -35 65 -181 61 -214
7637 -214 31 217 120 -157 -153 -126 -326 80 -132 -516 74 45 75 -182 101 181 211 -85 144 145 24 -82 -37 32
7661 32 -66 -38 -307 93 210 229 152 -93 11 -34 131 -107 143 -214 -132 40 51 -297 69 151 338 -223 15
7684A5p6L04j10j17j33N7K79l70K70k17K0J1K03j54j20k9J7M67k20l54K71L34
7706C48m32PK14l33K96l09Q4K44K14k14n0r4r8K53j87k12J90J46j80o5K06j23
7728i5J3J04K6n5o2l0pq6J5K95k94M6K8J12K63k86J26j50K32m5r0m0r3Q4K80l1
7754B60k95RK8p4K04L0q4j87J77p1m2j19N2L69l07n1J98j10J66k55J07l3J0J32
7778A14j41O5J26m26N7J64L0K15j90q3Q2J33j62M9j20j6j2l8K17R4k10J70k29
7801a11q6L6L72j49j52Pj76J43qK37K04l66M0N2j44L14l86L1j02O84n77K88l13
7824a62L1J02NO8k16l4K24M3q7l6j7K77L7l35L8oL2J2R3L1P8k66M21l16j36K29
7850A10m65M38Pj23p0J56MJ10K5l48J38J47l75J68K55p0m7k4k60L25k39K37J19
$$ plain form
7684 15 -61 243 133 16 -117 -60 219 -151 119 -98 -78 -67 136 -18 -138 -167 -150 317 97 -257 14 348
7706 348 -84 -77 137 -196 100 -209 -125 119 333 119 69 -25 -123 130 -57 -269 -79 67 -113 -178 28 -95
7728 -95 -82 22 48 -7 -69 -99 -106 -192 -177 118 -176 -130 -102 10 273 -13 113 -37 195 150 60 20 -73 11 291 260
7754 260 -35 -26 2 -72 132 162 78 -109 68 -3 -45 -164 -112 257 -50 -101 97 -13 153 -102 5 -28 -18 114
7778 114 -27 38 164 -262 -205 -41 -11 204 14 -69 13 146 -16 33 -87 -103 -115 -153 64 158 -52 118 -111
7801 -111 -197 -161 211 62 -90 -83 -259 -116 -124 113 317 -49 -9 43 -101 213 -173 -142 -244 440 -137 151 -162
7824 -162 -131 -29 -24 44 -172 -206 18 61 -26 -62 -79 198 235 -100 -62 -68 -36 -24 69 100 178 -88 333 17 -119 110
7850 110 -355 83 90 -33 -103 53 57 167 192 -156 -18 129 -246 -78 177 107 60 36 -224 101 -138 99 218
7873B18k51L65l42K06k55J32r4R5j12kJ70Q0j35j56J44q8N9r4m0J12k05J29J16
7896E2L39n85M39M9m22J02J19j2o0j29J91K23l58P4l1L6j07J41K57k59k62J26
7918g7m6J27k45K14L4k21K20J39K1j49m6L38j13j52k4K81j91j23J10j54J6m3j8
7941a02K19j78j76J71k5M2K71j34r7L2k36K25o5K65k24n8n1K98r2p4n1k9Q4J6
7965C1J43j77J7q8J41j71J06j88K57j58L40k88J76O7n10M18j72K86j32J40k60
7986b2J09j24Rk5K2p0L08o6m5k5j0J00m27K36J63k46J00r3Jo4K62n6k15J84Q6
8011I2j23RQ2r0O0k21L95k17o5J0J13K2m18K13O9O6J78l27J47M9j87J24Q4r3L4
8036FL1k8l1j77O6L37j97jr6m7K42j92PP9o1O2J55P3k74J17j00Q3p1j21Q8l6J21
$$ plain form
7873 218 -33 332 -10 196 -59 73 -21 74 -38 -40 130 210 75 -81 63 -25 34 -60 -100 12 -193 -64 52
7896 52 391 -194 245 294 -128 -26 93 81 21 -108 83 306 -52 22 -9 27 -80 61 318 59 -203 -77
7918 -77 -123 4 -241 -27 7 -214 6 145 166 17 -29 309 196 44 20 301 110 -13 97 -57 -41 -84 -102
7941 -102 117 -61 -237 -66 -91 -49 222 88 -9 23 -213 12 -53 212 -12 -70 -121 177 85 11 -40 -69 15 31
7965 31 174 -3 14 -74 67 -104 2 -186 71 -87 253 -35 141 208 -302 116 -56 230 98 238 -22
7986 -22 87 -37 -28 -53 -31 -101 207 141 96 71 61 161 -266 -30 133 -113 -13 -106 -105 -169 93 37 -178 6 92
8011 92 -31 -22 60 -30 30 -191 204 -13 -78 -68 45 67 -351 -138 -69 -3 175 -152 -5 44 -143 -19 65 -28 6
8036 6 37 9 -22 -199 -133 204 7 6 -90 -137 105 -87 -80 -1 -62 0 155 228 -46 71 -29 54 -17 -138 -50 -86 35
8063C5J2l0J3kj99J11L41l18P4J34k01J4J09k94JM5J83O6J17j43R9j83j90K82
8087G6lj38j43K83j44j09K32k11N7J68k14%lK30k32q6L30k46J0K19J20m6j67j0
8111b7P1j05K89j13k6%l31L66k86K26l72M27j65L8k1J91J05k13M4l1j62K09k31
8134a17J32J02pj8o1j35L42k48q9k7QJ29k03J60p7J31P8J61m47J10J74Q6r3k08
8158a17rK20l8j66m9J61J65l32K30Q2M0j01R5j35J07j7j75p1Q9J4mJ13j32j09
8182a39Q7P3k35K20k5J01n20M18q3
$$ plain form
8063 35 47 17 30 28 -171 -60 281 -37 37 171 -30 -16 93 -201 -200 -155 28 94 211 68 167 -16 -206 76
8087 76 73 -65 -208 75 -69 -178 54 -157 -100 68 -146 -146 -149 81 -151 -237 93 -153 -143 76 196 150 -17 -27
8111 -27 44 -61 228 115 89 89 -242 124 -162 64 -308 119 -46 -8 -29 162 267 54 98 67 -95 114 -117
8134 -117 15 117 110 92 31 -104 238 -10 -99 -126 -118 11 -192 -32 -109 22 100 261 -186 -76 98 184 91 -117
8158 -117 -126 94 56 -110 -159 2 167 -165 65 147 187 86 181 46 153 136 -39 -110 -21 -7 -11 102 -30 -139
8182 -139 -52 21 -214 6 -19 82 -438 -20 -103
8191a03
$$ Imaginary data points
##PAGE= N=2
##DATA TABLE= (X++(I..I)), XYDATA
0@%%%%%%%%%%%%qJ6j6J6k4L2m0M8n6O8p7R0j10J33j52J75k05K36k69L06l48L95
34B10m47N05n70O39p13P96q89R90j099J218j347J489j647J817k000K204k430K677
52A403k950L252l590L969m399M890n455O115o896P842r017J0519j2509J5298j9528
67a1056K6787m2690J44288p1545r6029K24751J9303j8133l4799p0942p5783N8578
79E2730Q9949J2564j21225j06100O3749J70554l9025j28911N7181O7185p1448
90D7203K3240Q5648l4308q9070K5656O7319m3079n9932N4448L4948n8774o6900
102a3601L3279J18419N991j15585j082P4325l365J9749P0735o5970j46183O2055
114C8767J79067k6596j46228n3729L3079Q0675L2485n9905m6734l7634q288J22908
$$ plain form
0 0 0 0 0 0 0 0 0 0 0 0 0 0 -8 8 -8 8 -16 16 -24 24 -32 36 -41 49 -61 72 -80 95 -110 126 -143 163 -185 210
34 210 -237 268 -302 337 -376 420 -469 521 -578 640 -707 782 -865 952 -1048 1156 -1274 1403
52 1403 -1547 1705 -1885 2084 -2315 2575 -2880 3235 -3661 4181 -4836 5683 -6826 8472 -11056
67 -11056 15731 -26959 117329 45784 -50245 174506 193809 175676 140877 69935 -5848 52730
79 52730 142679 155243 34018 -72082 -8333 162221 123196 -5715 51466 118651 47203
90 47203 70443 156091 121783 32713 58369 125688 82609 22677 77125 112073 53299 -13601
102 -13601 19678 138097 144088 28503 27421 101746 98381 118130 188865 122895 -23288 38767
114 38767 217834 191238 45010 -8719 24360 105035 137520 77615 30881 -6753 -15041 107867
126A07867Q0405j43091j27665J05346J20352m8884n2127J2394k8844n442O6883
137H7194K9713m6275o1375J5470Q1716J903p2842Q619O2269l1432p1464M1957
149D5453O7961n4192n0729L7244q740l6303N1211N0389o0969q4243K7601J05143
161H9826L3820q6712p7915L8093N8114k920R778j7918j12395j2522J52475M7402
173A19126j27053p4679N3287P1178K5510j7884l6774k2955N320N2082O0819m7781
185F0196j12950J8356J02101j8617p9626J3279K3808m0991m989M7785M11m0595
197c1832J272L5602K697k7899J3960N0403j2114p9255m992R0449J5061q0672k1440
210d8760K3215j4726K2336N8430l5635r4925O997J06375N1373o3074p6940J0189
$$ plain form
126 107867 188272 45181 -82484 22862 143214 94330 42203 54597 25753 20311 87194
137 87194 116907 70632 9257 24727 106443 108346 35504 44123 106392 74960 3496 45453
149 45453 113414 59222 8493 45737 36997 694 51905 102294 41325 -42918 -15317 89826
161 89826 123646 36934 -40981 -2888 55226 52306 62084 44166 -68229 -80751 71724 119126
173 119126 -7927 -82606 -29319 41859 67369 49485 12711 -10244 -4924 47158 107977 60196
185 60196 -52754 -34398 67703 49086 -30540 -17261 6547 -34444 -39433 8352 8763 -31832
197 -31832 -30560 5042 7739 -20160 -6200 44203 32089 -47166 -52158 38291 53352 -27320 -48760
210 -48760 -25545 -40271 -17935 40495 4860 -90065 -83068 23307 74680 11606 -65334 -55145
222e5145P0070K4770k0275j2888m9304m3543Q1793Q0472p8873r8178L0134P1783
234H16M452k6543p551r961p657K4364L5152l81n1374k0208O1997J7703o2585J500
248d0276N5695k0400n6218J8431N1137j3443k8884J1419o092j8355K6596L9796
260A9406p207o9158l3745Q1655O3039n8939o4016J5462K8549Q514L0364K898q3248
273f6426l3572R3403O1829m8637p3938q727O0537L3281k2811j5043j6292k6042
285f2438K6579O5661p741q5455p753P8251N454m2748Q348J4481j3875j0688J5376
298a6548K1718j7123k3558J8565J1611k6007p420M8604J5879p4119k3786P6265
310D081K6969l8848j6725l270m076J9325M2154N42o8840l6496N9696O9875j9635
$$ plain form
222 -55145 14925 39695 19420 6532 -42772 -86315 -4522 75950 -2923 -101101 -70967 816
234 816 5268 -21275 -28826 -38787 -46444 -22080 13072 12691 -38683 -58891 3106 20809 -41776 -40276
248 -40276 15419 -4981 -61199 -42768 8369 -5074 -33958 -22539 -28631 -46986 -20390 19406
260 19406 12199 -56959 -90704 -9049 53990 -4949 -68965 -53503 -24954 -16440 13924 16822 -66426
273 -66426 -99998 -6595 55234 6597 -67341 -76068 -15531 17750 -5061 -20104 -36396 -62438
285 -62438 -35859 29802 22061 -63394 -71147 7104 12558 -30190 -21842 -7361 -21236 -31924 -16548
298 -16548 5170 -11953 -35511 -16946 -5335 -31342 -38762 9842 25721 -48398 -72184 4081
310 4081 31050 -7798 -24523 -27793 -31869 -12544 29610 30152 -38688 -75184 -15488 54387 34752
323C4752q1427j3498N4424J3130J966J2841m6248m6711N0240P3094j9548p5820
335d2805q749N1084K1172j2396j4437k945l103q980K8965K6832m6176k9017M5222
348D667J7092m1224o506M2411N66m5850m83L4733Q649r234r799l635m258j139
362a4010L7449K5577n9481n1553N1531O5362k2910n4685l497J1879P057L6404
374B9123R874n5584m0024L6974O8373L301o8726k9411M3785L1088r883m830o039
387H021l4581N00O1326J1542o2526j7771M0692J6686j8822q653J4625L214j9662
400e409j26K6510J961k4402M805K0371k4416j8007M7546K3408n4634l2715L8264
413C156L6264q710k3288j3640n631R487L0223J8141l8395n6566K0439P5903N972
$$ plain form
323 34752 -46675 -60173 -5749 7381 9347 22188 -24060 -70771 -20531 52563 33015 -42805
335 -42805 -51554 -470 20702 8306 -6131 -9076 -12179 -21159 7806 34638 -11538 -40555 4667
348 4667 21759 -19465 -25971 16440 17006 -28844 -29327 5406 14055 4821 -4978 -8613 -12871 -14010
362 -14010 23439 49016 -10465 -62018 -10487 54875 31965 -22720 -26217 -14338 -7281 29123
374 29123 38997 -16587 -56611 -19637 48736 52037 -16689 -46100 -2315 28773 18890 14060 8021
387 8021 -26560 -26060 35266 46808 -15718 -33489 7203 23889 5067 -3586 11039 14253 -5409
400 -5409 -5535 20975 22936 -1466 3339 23710 -706 -18713 28833 52241 -2393 -35108 3156
413 3156 39420 30710 7422 -6218 -11849 -2362 27861 46002 7607 -48959 -28520 47383 53355
426E3355o3114k0109K7959J3576J3291J7985k7361m4904J7319N7655J0603m8760
438G495l3508K4936L1517j1847j7363P926o813k0885K2057L2479k7003k7780L0311
451A1522J8769k6681q912K8529J2210k8637k3993J6610K2378p338j6967j962p881
464a2353j4247L1211M0822l7129n5481K7321N8932O649l0632j7708O31Q729K5714
477C2459J7167k9707m7710j833N3255K8003n1191m1646K6170K3125l305P980N1
490A2818k8041q483M1252K4911l3040k5694J6597J9195p709j9765Q851J5934k4138
503g312j5332K6748P822j8519N115J7486j7318j9498L5672L2766l1576l6692R259
516a1379L3786J3480k3729j9433l458n882J8624L2935j9235n7107n722O1068K5450
$$ plain form
426 53355 -9759 -29868 -1909 11667 24958 42943 15582 -29322 -12003 45652 56255 7495
438 7495 -26013 -1077 30440 18593 1230 9156 2343 -18542 3515 35994 8991 -18789 11522
451 11522 30291 3610 -5302 23227 35437 6800 -17193 -583 21795 14457 -2510 -4472 -12353
464 -12353 -26600 4611 45433 8304 -47177 -19856 39076 45725 15093 -2615 -1984 6745 32459
477 32459 49626 19919 -27791 -29624 23631 51634 443 -41203 -15033 8092 4787 12767 12818
490 12818 -15223 -23706 17546 42457 9417 -16277 320 19515 11806 -7959 892 16826 -7312
503 -7312 -22644 4104 11926 -6593 -1478 16008 -1310 -20808 14864 47630 16054 -20638 -11379
516 -11379 22407 35887 12158 -7275 -10733 -16615 2009 34944 15709 -41398 -47120 13948 39398
529C9398m2564k4559Q813O770J7418J5606j3992l2649j0235L9155L2833k8107
541G887l7178J1617L0957l235j4530J4232k124k6464J4082K5233j5531j9859Q232
554f681J4445j2237j9416J6483K4524j4764k8758M016L0189L191j5398O234r449
567g621k3893K5186L8178k0104n0316n749M2458K1249k0287k0360o181O394K0483
580e63K1724J368l8412k1189M7275L8683l0422l4797O276J5333j594K058K570
593H310k4817j7808K1040K1642r211k4692L14K8062j77k0300J3484K0483j5871
606D59j6018J4743J0168j3881j70J1679j8097k0262J8112K8475m909l5468j1323
619c6492L4696K3256j2136j0485l471q707J0854L5513P30n1436k1368L9387K7147
$$ plain form
529 39398 -3166 -27725 -18912 -12142 5276 20882 6890 -25759 -35994 3161 35994 7887
541 7887 -29291 -17674 13283 10048 -4482 9750 7626 -18838 -4756 20477 4946 -14913 -6681
554 -6681 7764 -4473 -23889 -7406 17118 2354 -26404 -22388 7801 10992 -4406 1828 -7621
567 -7621 -31514 -6328 31850 11746 -38570 -44319 -1861 19388 -899 -21259 -27440 -21046 -563
580 -563 21161 22529 -15883 -37072 10203 48886 18464 -16333 -10057 5276 3682 5740 8310
593 8310 -16507 -34315 -13275 8367 -844 -25536 -25222 2840 2663 -17637 -4153 16330 459
606 459 -15559 -816 9352 -4529 -4699 6980 -11117 -31379 -13267 15208 10299 -25169 -36492
619 -36492 -1796 21460 9324 -1161 -4632 -13339 -2485 33028 33758 -17678 -39046 341 27488
632B7488j8456k7711p884P414J0556J2727L134k3160k1478K2545L8405p665l6053
645b0138K799K5519m267r086J1944j513j7680J872J6431K45j3805N92J3895k209
659D599j9089M455K9523p53l2685l746K3893L812o878M445j0484k1213J2215L4903
673B2997M90l6888k0243K5588L1206o317k2495p012J047M815K1735J1379l2419
686f117l0219K7049L8025j1352k7031j356J0726N503M860N792q773j7566M550
699e909K3038K360k4311p854K0928L03k2880O881J9434j0724j4687O877Q616j820
713B52K000Q730o150j8005L907K8084R875l1001k5026K2198K2170q100p209o568
727d843j5399N149L0879J2591l1377k7527K1237L2657Q1k0706j2459N611N875
$$ plain form
632 27488 9032 -18679 -26563 -19149 -8593 4134 7268 -15892 -37370 -14825 23580 15915 -20138
645 -20138 -17339 8180 3913 -5173 6771 5258 -12422 -10550 5881 6126 -7679 -7087 6808 4599
659 4599 -14490 -10035 19488 18735 -13950 -17696 6197 10009 3131 7576 -2908 -24121 -11906 22997
673 22997 23487 -13401 -33644 -8056 23150 16833 -5662 -12674 -11627 -6812 14923 26302 -6117
686 -6117 -36336 -9287 28738 17386 -9645 -11001 -275 5228 10088 15880 7107 -10459 -5909
699 -5909 17129 19489 -4822 -12676 8252 8555 -14325 -7444 11990 1266 -13421 -6544 2072 252
713 252 2252 10982 4832 -13173 -9266 18818 28693 -2308 -27334 -5136 17034 8934 1725 -4843
727 -4843 -20242 -15093 15786 28377 -3000 -30527 -9290 23367 23448 2742 -9717 -4106 1769
740A769O603J1509j4190k9829Q218L1821K75k6902n598J8268K71p360R308L316
754G479q769l540P345R331q585q373J5086K020k2680k268K5907O915k6021j1058
768a7211J6193O106K20N690r172j6351J844K5011J7482k5019l0989J3015K9587
781A6406K339j6545r207k102k732J7944K0502k2551k9647J0963K8437N786k0048
794d55j1310Q442L880P82O443j344j4043o648J7684J2531k0430q190J9135M23
808F900j5988J687J5016J661j3765l623P563K08L41O324j086j5825r464K4066
822D015K1648k3616k5107J1680J7374L477k941o197j2859m762K2937J9371j8014
835G006k7969J202K7554J2493j8482j1670L571p09O106J5102n125k3871l139K5162
$$ plain form
740 1769 8372 19881 5691 -24138 -15920 15901 16176 -10726 -16324 1944 2215 -5145 4163 7479
754 7479 -1290 -4830 2515 11846 3261 -5112 9974 11994 -10686 -12954 12953 19868 -6153 -17211
768 -17211 -1018 5088 5308 10998 1826 -14525 -12681 12330 29812 4793 -26196 -13181 16406
781 16406 18745 2200 -7007 -9109 -11841 6103 26605 4054 -25593 -14630 13807 19593 -455
794 -455 -11765 -3323 557 1339 7782 6438 -7605 -14253 3431 15962 -4468 -12658 6477 6900
808 6900 -9088 -7401 7615 9276 -4489 -8112 -549 -341 0 6324 5238 -10587 -20051 4015
822 4015 25663 2047 -23060 -11380 5994 9471 6530 333 -12526 -17288 5649 25020 7006
835 7006 -20963 -19761 7793 20286 1804 -9866 -6295 -7004 -898 14204 9079 -14792 -17931 7231
849G231R140j8136p337R236L220l968o1O921j102j1385K741J0746o572p499J1179
864D354O071j8847r121K1965J2636j5909j2867M239Q730N378K171k650j2874r468
878a6192J7938K4075j2230l1428o17K5043P213r906n339o806o577J3728J8959
891A7861p214k5210l888K2415J3730j2676j2660M429M889l165M917O351j2326
904b547j1398J3124J0999j2315q053J2031M632j1343m038J1180Q332p752q518
917e666M062M517k256N531N830j5410j5222J6961K2694j1266k3660N84J2584P808
931G091Q28m525j0880p943J1470K2173k681k7053q718K1478J5789j1135r566J743
945a929l447K522J5086J428j7674q781J4247J2617r155j0773N258N300n100m097
$$ plain form
849 7231 16371 -1765 -9102 134 3354 -614 -675 6246 5144 -6241 -3500 7246 674 -6825 4354
864 4354 10425 -8422 -17543 4422 17058 1149 -11718 -7479 1251 6629 8800 6150 -6724 -16192
878 -16192 1746 25821 13591 -17837 -18454 6589 13802 3896 -1443 -8249 -14826 -1098 17861
891 17861 10647 -14563 -18451 3964 17694 5018 -7642 -3213 1676 -1489 3428 9779 -2547
904 -2547 -13945 -821 10178 -2137 -10190 1841 6473 -4870 -8908 2272 10604 2852 -5666
917 -5666 -1604 2913 657 6188 12018 -3392 -18614 -1653 21041 9775 -13885 -13301 -717 7091
931 7091 7919 3394 -7486 -15429 -3959 18214 15533 -11520 -20238 1240 17029 5894 -3672 -1929
945 -1929 -5376 -2854 12232 13660 -4014 -12795 1452 14069 4914 -5859 -601 4699 -401 -4498
959d498Q018L880j1649r65J0635m410o609J0215O803j2889j1932J1990J5695o563
973G721j5065l452O471O384J502O84q044j5503R554K7059j312k4920o998J6718
987G99J2523l085m680o120q587O271J5810L25j7958j5201J3008J7716r184j1518
1001i881L584L105k458L930Q907n117j1866Q182J0577p163o778M706O141o202
1015c33j1947O833J2509o244q869J690L472l56M782J0123r247j7637J0972K1617
1029A7365j227j6977j0053P857R809l05j807q019j2418L378J9149O607j9985j6017
1043b2643J5760J5615n326m230j729l542J543Q916O864j0173j3210P382J2577
1056G804l277j0281J521Q450m317p513R257M642q506r58N058j836n239N252R321
$$ plain form
959 -4498 3520 7400 -4249 -5214 5421 1011 -5598 4617 11420 -1469 -13401 -1411 14284 7721
973 7721 -7344 -10796 -4325 2059 3561 4245 -3799 -19302 -9748 17311 15999 -8921 -15919 799
987 799 13322 10237 5557 -563 -9150 -2879 12931 13256 -4702 -19903 -6895 10821 1637 -9881
1001 -9881 -6297 -3192 -5650 -1720 7187 2070 -9796 -1614 8963 1800 -4978 -272 5869 -333
1015 -333 -12280 -5447 7062 818 -8051 -6361 -2889 -3245 1537 11660 2413 -15224 -4252 17365
1029 17365 16138 -839 -10892 -3035 6774 6469 4662 -3357 -15775 -12397 6752 13359 -6626 -22643
1043 -22643 -6883 8732 3406 -824 -2553 -6095 -4552 4364 11228 1055 -12155 -4773 7804
1056 7804 4527 -5754 -4233 4217 -100 -7613 1644 6286 -2220 -3178 1880 44 -5195 57 9378
1071I378q713j4335M778J5297K656j3126q706O899M607J231O630o246j6932K735
1085a3847K1100O747j8375j3268R360J0944K197k541n448n506N61J2308J0936
1098A5168j2038j6607P880J5496k429j0307K64K241m834R18P408l689q517J329
1112g717P541O6p337K494J0511l247j1424L482J2796J13r810o67J723l389M526
1127c39Q833o733j6049Q75J7571Q141j1822j1968M812R898L109J410k407j1837
1141f506l870J6804J1332j5574j6147N136J1707J20m922l258k234j617N532Q854
1155E357k649j1910J182J3064R02r282R34P885l854p640M796N609m828l258K613
1170a079j105l895L208R290j619j3682k328J5531P325r728q897K982K934J343
$$ plain form
1071 9378 665 -13670 -8892 6405 9061 -4065 -12771 -5872 -1265 -34 6596 350 -16582 -13847
1085 -13847 7253 14000 -4375 -17643 -8283 2661 4858 2317 -3131 -8637 -8076 4232 15168
1098 15168 3130 -13477 -5597 9899 7470 -2837 -2573 -332 -5166 -4248 3160 -529 -9046 -7717
1112 -7717 -176 -110 -7447 -4953 5558 2311 -9113 -5631 7165 7278 -2532 -3199 -1476 -4865 -339
1127 -339 8494 1761 -14288 -13413 4158 12299 477 -11491 -6679 3219 6328 7738 5331 -6506
1141 -6506 -10376 6428 17760 2186 -13961 -8825 2882 3002 -1920 -5178 -7412 -9029 -3497 5357
1155 5357 2708 -9202 -8020 5044 5946 -3336 -2402 5483 1629 -6011 -1215 4394 -434 -3692 -1079
1170 -1079 -2184 -6079 -2871 6419 4800 -8882 -11210 4321 11646 1918 -6979 -3997 -1063 280
1184B80P394k446j6207l437J5788J0824r460j4934J784J1064L582j071k471n369
1198d679m310P993J3622o069j6592K812J2348M06n876r26K417j965k100O297J852
1213E230o476j990M971K393o909j604J0629q37j2625j55J0333L042n684l130J152
1228a660j927K762J0063j901j2829n216J1420J3352p216j4382J360O370J955L502
1242E653m61r768p106J0693J4793o890j4074O73Q704M984l222l910P49m013J96
1257b999R526k14j1089k131R245K661q078o36Q213k152o256K270M854J348l575
1272I87n06K455n121j04R642J179j1594p459J0385J1230o707q087P96l52L490
1287B34P622K73j0186q407R368J4634m012j3711k905P660N520j832k96l040q323
$$ plain form
1184 280 7674 5228 -10979 -14416 1372 12196 2736 -12198 -10414 650 4232 3161 690 -4679
1198 -4679 -8989 -996 12626 6557 -10035 -7223 5125 5531 -345 -1271 1146 -819 -2919 3378 5230
1213 5230 -1246 -3236 1735 4128 -2781 -4385 6244 5407 -7218 -7373 2960 6002 318 -2812 -1660
1228 -1660 -3587 -825 9238 7337 -5492 -10708 712 14064 6848 -7534 -6174 196 2151 5653
1242 5653 5192 -4576 -11682 -989 13804 6914 -7160 -6487 2217 7201 3979 69 818 -3195 -2999
1257 -2999 6527 6313 -4776 -6907 2338 4999 -3079 -3715 4498 2346 -3910 -1640 3214 4562 987
1272 987 481 2936 -2185 -2289 7353 8532 -3062 -10521 -136 11094 4387 -3700 -2904 -3256 234
1287 234 7856 8129 -2057 -10464 -1096 13538 9526 -4185 -7090 570 6090 4258 3962 922 -7401
1302g401M970J2619j774j1547k676Q278M499n339j299K939j888k411K484M064
1316E518k958m917M583L528p631r86Q790J534r160m536P856N739l587l235j070
1331e32k130J999O700K869q975j0872P923J4154l102j1009k136M077K746L330
1345E042K551p471q868N699J1898Q3j1022n658P220O011l347j464O81m028j277
1360c950P261L691p949m072O739L229n686j450N426J607n881k482M696K803k993
1375I89o20J444m134k589Q372N493r623r535P064J0303j207o618j983n44K204
1390i84O425L403p111j0286L286J3461J974j1756n323M960L814J80J403k315p720
1405f589J138J0297K336q102m939M996N680k908l354L271j23m426R41M439j702
$$ plain form
1302 -7401 -2431 10188 8414 -3133 -5809 2469 6968 1629 330 3269 1381 -1030 1454 5518
1316 5518 2560 -2357 2226 5754 -1877 -2863 5927 7461 -1699 -6235 1621 7360 3773 538 -532
1331 -532 -2662 -663 6037 8906 -69 -10941 -3018 11136 8034 -2975 -5111 -1034 1712 5042
1345 5042 7593 122 -8746 -3047 8851 8934 -2088 -7746 -526 5485 2138 674 1355 -2673 -3950
1360 -3950 3311 7002 -947 -5019 1720 4949 -737 -2187 3239 4846 -1035 -3517 1179 3982 989
1375 989 369 1813 -2321 -4910 3462 8955 -668 -10203 -3139 7164 5957 -661 -2644 -3188 -984
1390 -984 5441 8844 1733 -8553 -5267 8194 10168 -1588 -6911 -1951 1863 2043 3446 1131 -6589
1405 -6589 -5451 4846 7182 -920 -5859 -863 4817 1909 -1445 1826 1703 -2723 -1782 2657 955
1420I55m325K711L060n565k527P738L560o030o091L461P354r7l741j122k318p03
1436c680N823N895o166j2540K722J2999J036q070m029Q50K976L577L174l681q756
1451g870P06J0634M111p593p405M087O393k475r92J984m311k207M964L819l782
1466F3m896L799M151m086k734L978L459l635n379L399M662k672m67J609m396k327
1482e472N744O877m857j1060K555R036J958l863m801r20J516L187O073k661j1220
1497g908l96J1625N358p276o780L407L108K79K755j655o397j224N162N146m056
1512A148q094L328N117k464k420K626K017l835j286N391j95l641K667K161l832
1527a312l298L848O022l323q608J097O489J682k203j836j249j928M132R179l415
$$ plain form
1420 955 -3370 -659 2401 -3164 -5691 2047 5607 -423 -6514 -3053 4301 4204 463 -659 -2977 -3680
1436 -3680 2143 8038 1872 -10668 -7946 5053 6089 -1981 -6010 -5160 -2184 1393 4567 886 -7870
1451 -7870 -7164 3470 7581 -12 -7417 -3330 3063 588 -404 1580 -2731 -4938 26 3845 63
1466 63 -4833 -1034 3117 -969 -3703 275 3734 99 -5280 -1881 2781 109 -358 1251 -3145 -5472
1482 -5472 272 7149 2292 -8768 -6213 2823 4781 918 -3883 -4803 -3287 -100 5973 3312 -7908
1497 -7908 -8304 3321 8679 1403 -5377 -1970 1138 1417 4172 2517 -3880 -5104 58 5204 1148
1512 1148 -6946 -3618 1499 -965 -3385 -759 1258 -2577 -3863 1528 1333 -2308 359 2520 -1312
1527 -1312 -4610 -762 5260 1937 -6671 -5574 915 2597 394 -1442 -2691 -4619 -487 8692 5277
1542E277j0834p21R108N122m801o083m98J245K266L654j751p146l448P173P655
1557F218n153p497L413M277l11n2J402j123l708K283M676j798m595R61L531j447
1573A077m679K785N529k989n411K132L710r6k18J271l092m203L793P723k195q822
1589c685k717O603N566l474m045j203q68K513O395M16q882m636Q442P071m091
1604C405o095L6K514J364J932N70l902l929L322O226j599o474P45M837j275l382
1620a705K393J941l046j912K188J055j864N46K674k187m238K306O814K95p827
1635b567k159N678K948j437r23k353l174J891P727O04r110l861N784O980j206
1650D822n221j484J256J440L942J508n907n513M149P480k055p098R0L147l61k98
$$ plain form
1542 5277 -5557 -6278 2830 7952 3151 -2932 -3430 -2185 81 3735 1984 -5162 -8610 -1437 6218
1557 6218 1065 -6432 -3019 1258 947 895 2297 1174 -2534 -251 4425 2627 -1968 -1007 2524 1077
1573 1077 -3602 -817 4712 1723 -3688 -1556 2154 2058 1840 3111 19 -4184 -391 7332 5137 -3685
1589 -3685 -6402 201 5767 2293 -1752 -2955 -3823 -1310 5085 5501 -3381 -8017 425 7496 3405
1604 3405 -2690 -2654 -140 1224 3156 3726 -176 -4105 -783 5443 3844 -2630 -1885 2952 1677 -1705
1620 -1705 688 2629 -417 -2329 -141 914 -950 -404 2270 83 -4155 -1849 4965 5260 -2567
1635 -2567 -4726 952 3900 2463 1540 -813 -3987 -2096 5631 6235 -2875 -6736 -952 6028 4822
1650 4822 -399 -1883 -627 813 4755 6263 356 -5157 -1008 6472 4417 -2681 -2591 556 195 -103
1666a03J179l67k374m20M366J158l993N2L837l13m580O01O028j038n527j01K313
1683G18N91N96K06j894m130J087P612J605p189m250M185O113r02l823q38j840
1699b153R1N994K150o986n649L504P426n84n274j269J447J351J707J010r67m554
1715b756M81O242P4n504l20L535j25k876N61L068j657k246J036R97k28m25K231
1732B088L34n316o08O844J992n906l652K675L805j23n37j064m629J035O549K513
1748F000n200o734K706P763k59l994j570p23R18K750K949k987o557J817P077k64
1764C692m279j398J643J492j319O55J336k545j357K679J367k693j728L861K25
1779A631m477l12N203N35k981k192R68K361K02R08n06m603r23O007L381m530o549
$$ plain form
1666 -103 1076 709 -1665 -2085 2281 3439 -554 -502 3335 3022 -1558 -957 5071 4033 -1494 -1595 718
1683 718 1309 1905 2111 217 -3913 -2826 4786 6391 -798 -5048 -863 5250 4348 525 -313 -2153
1699 -2153 -2062 3932 6082 -904 -6553 -3049 4377 3793 -1481 -2750 -1303 48 1755 2765 1798 -2756
1715 -2756 -2275 3967 4041 -1463 -1783 1752 1627 -1249 -688 2380 723 -1523 -487 510 282 -143 2088
1732 2088 2422 -2894 -3502 3342 5334 -572 -4224 -1549 2256 2133 1596 532 -4097 -3062 3487 6000
1748 6000 800 -5934 -3228 4535 4276 282 -1288 -2011 -1093 1657 4606 1619 -4938 -3121 3956 3692
1764 3692 -587 -1985 -342 1150 -169 486 1822 -723 -2080 599 1966 -727 -2455 1406 1631
1779 1631 -2846 -3158 2045 2580 -401 -2593 -1625 736 938 1846 1340 -3263 -4186 1821 5202 672 -5877
1796e877K283N578P7j561j471k200m69M621L993l542o984J297O530J478l673l075
1812b995J429R01k9K255J3m698n93M640J469l413j464K952N59k597l81L029K65
1829A342k367o54J744j33j089K654P44m857j938N300L986l718m840J147L021J375
1845A717J18j309l097j545M258N033k801o995J73N809K446l245j657n19o23J998
1861b39L623j215n459n26M813J954k879k383J485J512j785M71J753j137k220J695
1877e37J966j844j481L008R47l729j596L793K421k316k791J07J697M42R29M88
1893A504l408l055M371N154k039o160k34M509J742n42j357k208j047K562L893
1908C685k59o218j573M791K927k304k675P35L27k07J923J095l374j522L251J763
$$ plain form
1796 -5877 -3594 1984 2061 500 -971 -3171 -3640 981 4974 1432 -5552 -4255 2275 3753 80 -2995
1812 -2995 -1566 -665 -694 1561 1574 -3124 -3717 923 2392 -1021 -2485 467 1026 -1571 -1952 1077 1342
1829 1342 -1025 -1679 65 -68 -1157 1497 2241 -2616 -4554 746 4732 1014 -3826 -2679 342 1717
1845 1717 1835 526 -2571 -4116 142 5175 2374 -4621 -4448 1361 3807 562 -1095 -1614 -2237 -239
1861 -239 3384 2169 -3290 -3816 997 2951 72 -2311 -826 686 -1099 -628 1125 -12 -2232 -537
1877 -537 1429 -415 -1896 1112 2059 -1670 -3266 527 2948 632 -2159 -2052 -355 87 1016 1504
1893 1504 -1904 -4959 -588 4566 2527 -3633 -3867 642 2384 1842 485 -1723 -2770 -208 3685
1908 3685 3426 -2792 -4365 426 3353 1049 -1626 -891 -564 -771 1152 2247 -1127 -2649 602 2365
1924B365j852j766J471K005k468j430K527J258j593j714J251P6j327K463J291
1939B557l607k574L504M067o13m742j020K907J442M57n89k283k333J368N567j49
1955C959o511j645L714K555r79j258r80q42Q25L532M45l973j695K698K917j075
1971A687l205J486J344j953K8J914p11j604J18J807j048j254K192J627k863j848
1987b283J714L484o32l679k14J346j64J893P62k809l524J738N798m18m955j378
2003c321K415K537L32j094j425j502O04M487R18m789k547K694L658j164k560N72
2019a85j78n16J778R31j534k027R38K488j106k535J789J653j690k138J789K622
2035B079j780j166O52k82n64J932J434k294l297R65M651O89m002j774J297J797
$$ plain form
1924 2365 513 -1253 218 2223 -245 -1675 852 2110 517 -1197 54 130 -1197 1266 2557
1939 2557 -1050 -3624 -120 3947 3334 -1408 -2428 479 1921 2378 1789 -494 -2827 -1459 4108 3959
1955 3959 -2552 -4197 -483 2072 1093 -165 -1145 -1987 -1162 2370 2815 -1158 -2853 -155 2762 1687
1971 1687 -1518 -32 1312 -641 -613 1301 590 -1014 -896 911 -137 -1391 801 2428 -435 -2283
1987 -2283 -569 2915 2283 -1396 -1610 -264 -428 1465 2227 -582 -4106 -2368 3430 3012 -1943 -3321
2003 -3321 -906 1631 1963 869 -556 -2058 -1454 3033 3951 -838 -3385 -691 2967 1803 -757 -185
2019 -185 -363 -879 899 1830 296 -1731 -793 1695 589 -1946 -157 1496 -194 -2332 -543 2079
2035 2079 299 -867 -215 -497 -1061 871 2305 11 -3286 -2321 2330 3019 -983 -2757 -1460 337
2051C37Q47K95j063l383M42N189J418m529l132K396K757P9j794n67j294mK223
2068B17J161k157k911J646L448q14k319J211J059q24p06J603P07j891OJ097n14
2085A9j349Q20K294j401l064N04L673L51k220j077N60L20J283J981j773l938N00
2102b517M375J390l314k913P71K522O56m53p64k139k99L577K509k990l616K015
2118a190L391m65j592k30L04p00N81J218n63j968j25K317q0k378J127K059j065
2135F41k125N3K612l87j153l2k76n42J352J719p91l365o57L955J786k768k202
2152b180N77J591O87Q95p55k855r59L895K207k478l117K64L185N57j040l20p16
2169e62j006J814J715q21k852O2K654r8k206P56R14p00o43O45R39o58o99P46L5
$$ plain form
2051 337 1184 1479 416 -2967 -2525 2664 4082 -447 -3579 -1183 1574 1653 -141 -708 -2002 -2006 217
2068 217 1378 -779 -3690 -2044 1404 590 -1729 -518 541 -283 -989 614 1321 -570 -564 533 19
2085 19 -1330 -510 1784 383 -2681 -2177 1496 1847 -373 -1450 -890 -570 713 2694 921 -3017 -2517
2102 -2517 1858 3248 -66 -2979 -2208 314 970 517 -247 -2386 -2685 892 3401 411 -3205 -1190
2118 -1190 2201 1736 144 -86 218 -482 99 1317 754 -1214 -1339 978 898 -1480 -353 1706 641
2135 641 -1484 -1431 1181 794 -359 -391 -667 -1209 143 1862 1071 -2294 -2951 1004 2790 22 -2180
2152 -2180 -1603 -12 675 1570 815 -2040 -2999 896 3103 625 -2492 -2228 957 1514 474 154 -562
2169 -562 -1568 246 1961 1140 -1712 -1650 1004 906 -1300 -544 370 -330 -973 -328 611 -47 -746 0 35
2188C5j091Q29J779J98l218o54L399Q66j997q67j22J56J081J367p7l752p84L558
2206G06K319j576l036j5K177O39k35J92k410j177K633K177j156l266m3K654O36
2223A219j536J5J98k09j94J239P58k270m01J889K93j779K31J757k10k442j5K001
2241E44J76m98o12m59j53L59K279K82l185j351K757K455j402k497k83Q41M60J655
2259A368j50k660j313K467K668o92l227m94K501M15n94K69o93j191M62K327j06
2276A357k731K58J751K94j024o58J272q1j090P0J039K04p99K91M88j461M1K116
2294A337L69k496j462K249J856q38j473j61n8O50J520K97k584j812J753L470p35
2311A882k991n01J533O63K21K59j400j749J235K708q6k510p35J513J102r94m24
$$ plain form
2188 35 -1056 -227 1552 1750 -1468 -2122 1277 2143 146 -721 -843 -687 394 1761 1684 -2068 -2852 706
2206 706 3025 1449 -1587 -1602 575 1214 979 1171 -1239 -2416 217 2394 1238 -2028 -2071 583 1219
2223 1219 -317 -302 -104 -313 -507 732 1490 -780 -1181 708 1001 -778 -547 1210 1000 -1442 -1457 544
2241 544 720 222 -390 -849 -1002 -643 1636 1918 -1267 -2618 139 2594 1192 -1305 -1588 -747 -287 1368
2259 1368 1218 -1442 -2755 -288 2380 1688 -1539 -2033 468 883 289 558 -135 -1326 -864 1463 1357
2276 1357 -1374 -1116 635 929 -95 -753 519 438 -652 -582 457 661 -138 153 641 -820 -779 1337
2294 1337 1706 -790 -2252 -3 1853 1015 -458 -619 -677 -27 1493 1790 -794 -2606 -853 2617 1882
2311 1882 -1109 -1610 -77 586 807 1066 -334 -2083 -848 1860 1774 -736 -1471 42 1144 150 -274
2328b74L90n95k61R55O93j246m70J024M14j401k38J604M99j586r33J233J097l34
2346E71p29j60m37j3J747J031k387k179J634K650l18j955o18L60Q32Q37P82j847
2364a99j937J254K627M54k979j076J840P72k68J07n95q35j0J497J039k425n70
2381a304J614K62o76n21P45O85j219n11J432P0m82K25j04p10q36K121R83k020
2399b46j813J492J548L25j338r85L68j77J411J206j918j969O67K684M11k187j000
2416a521J062O35M54K78p23j249k65K003J132k008j559J471P41j56q12N85k23
2433a55p96P50Q75r33l44P18K59o02r33J405Q88j165j033N92J225q1o02L5o93
2452e90n52J607J127j481j804M27K133O48j344p77L0M45Q21P43j035j860m54K960
$$ plain form
2328 -274 116 -479 -740 215 908 -338 -808 216 630 -771 -1009 595 1094 -492 -1425 -192 905 571
2346 571 -158 -318 -755 -768 979 2010 -377 -2556 -922 1728 1410 -545 -1163 -803 29 866 1648 -199
2364 -199 -2136 -882 1745 2199 -780 -1856 -16 756 488 595 0 -835 -845 652 1691 -734 -1304
2381 -1304 310 572 -104 -625 120 805 -414 -925 507 577 95 320 216 -494 -1330 791 1774 -246
2399 -246 -2059 -567 981 1306 -32 -1017 -649 -826 585 1791 -127 -2096 -1429 1255 1666 -521 -1521
2416 -1521 -459 176 630 908 185 -1064 -1329 674 1806 -202 -1761 -290 451 295 -517 68 -155
2433 -155 -951 -201 674 -259 -603 115 374 -228 -1161 244 1132 -33 -1066 -474 751 670 68 103 -590
2452 -590 -1142 465 1592 111 -1693 -1266 867 1515 171 -606 -576 -131 690 1433 398 -1462 -1916 1044
2470A044O10j770j175O74J119L1l26J34q86m46J392O79r79q77P47J150j042q60
2488g81J230K76q30n95N79L34l8j10L69j076n74J537J392j295j618L36J430M17
2506I83j040k21l82l18Q97J353n68k440q1K360Q36j431o05J81N07K66L56q4j401
2525h32q3J215R34j096j302P76Q49l34j37M05j51q09R2N87K93j002M89Q51p72
2544b7q97N71J504p06j484K21J432k20j41k51m35p60J101J703o75k148j23J411
2562G6J485r59r61l88L42O70P87j01j793q66J886J428j273j387O72N50j18k3O37
2581F64r55o07O24O97l92q01K13J078l07j019Q08R04m54j084L95J71j45M63J13
2600C66n64r64P89J621l78j770o95J575Q78m82j27n90n97P11J606l27k110n69
$$ plain form
2470 1044 1654 -116 -1291 -617 502 533 207 341 -545 -991 401 1080 101 -776 -29 1121 79 -781
2488 -781 449 725 -105 -700 -121 213 175 65 434 -642 -1216 321 1713 418 -1200 -864 566 983
2506 983 -57 -278 -660 -978 -81 1272 704 -1736 -1817 543 1379 -52 -657 -476 31 297 653 569 -832
2525 -832 -915 300 1234 138 -1164 -388 461 127 -10 395 244 -565 -473 114 407 -595 -106 745 -27
2544 -27 -924 -353 1151 445 -1039 -818 614 394 253 2 -433 -1193 -92 1611 936 -1212 -1335 76
2562 76 1561 602 -359 -747 -405 265 1052 951 -842 -1708 178 1606 333 -1054 -382 168 50 27 664
2581 664 -291 -898 -274 423 31 -770 -557 521 214 -805 3 907 453 -631 -236 -65 -210 253 366
2600 366 -198 -1162 -373 1248 870 -900 -1595 -20 858 376 249 -341 -938 -227 1379 1052 -1058 -1627
2618a627J625J325r53j046J45K5O46L36J76j208o11J050J259o38j029L95P48k70
2636C48o19P25O5l95l76K36M16m56l18R37n65j119O16J445o2j253o06J146L01
2655D66l9j84m63o57L88J206N14j795q57J301J047j75p84o97L49K61O86M08j504
2674e29r12J126J263l01j369J10P29l62K71K43j24p46K81J002q4j307L09P60q1
2693B79j008L50M47M12r36l01Q76l41N10L8o55n26K93J361M95j724n33N99Q46
2712D82k19j77l53n35J26J308N71j394j023P31J327J18j091n40O22Q2K19L59n11
2731A02q88M32J205j64j183K18O90m17l24J67N97j34o72M76J42m34L40K65j56
2750B62j013O6J457K2r28n87L22P78nm15j62o34N6J370N81j060j408O30J329L9
$$ plain form
2618 -1627 -2 1323 370 -676 -531 -506 140 476 652 -556 -1167 -117 1142 504 -525 -130 618 348
2636 348 -271 454 519 124 -252 -16 400 -56 -374 563 -2 -1121 -505 940 878 -375 -981 165 466
2655 466 427 243 -220 -877 -489 717 1231 -564 -1421 -120 927 752 -32 -729 -380 -119 567 975 -529
2674 -529 -1441 -315 948 647 -722 -612 117 -245 26 269 145 -601 -320 682 598 -709 -400 360 279
2693 279 -729 -379 68 480 -456 -757 119 -222 288 326 -329 -855 -562 799 1294 -430 -963 -364 482
2712 482 263 86 -267 -802 -676 632 1203 -191 -1214 -483 844 962 -129 -669 -47 35 254 613 102
2731 102 -786 -354 851 687 -496 -278 412 -5 -329 -162 435 301 -371 105 247 -187 153 418 262
2750 262 -751 -685 772 794 -134 -721 -399 379 374 -41 -203 -837 -781 589 1170 110 -1298 -668 661 700
2770G00q37Ok31N1O37O24q42r34L42J060O5j030j62P52k12j66M20k19m05k07P14
2791A26J91n05J2M63N1p55J4P63O8m46j41j25J4M57L07p4q57k99J312K76o47j109
2813i04P43O52J33L9n67p51J37J092Q13j015j483L60J303J74n64o55K38K46K46
2832B37L39m53n42L2Q09j6m86k45O35J51o08p6N28k9n18K43M49p72k7O75q7r11
2854f72L9O05O89o41q27L67L83M77o4k21l58n98J029J040j022j034J07P95O79
2873G73o72l79r1l44M85R39l42j244L11R45N52r77o21O10k72J48O65k09m86j63
2893c72Q18j65n61J1L91L32o21k24N69M76q63k37N60k6j45M14R0q50o16J022P50
2914G53l34q82j47Q44N17o73q6ln99M54J141m17j003m06J471J20m35n83J91P7
$$ plain form
2770 700 -137 -131 -362 -311 326 950 108 -826 -484 576 641 -389 -551 201 -11 -177 243 24 -381 -588 126
2791 126 317 -188 -176 287 338 -417 -403 360 428 -18 -159 -284 -270 187 494 420 -437 -736 576 852 205 -904
2813 -904 -161 491 624 663 96 -655 -518 574 1387 372 -1111 -751 552 726 162 -493 -255 -9 237
2832 237 576 123 -419 -387 422 406 -80 -325 310 461 -147 -223 305 276 -242 1 450 -322 -349 326 239 -672
2854 -672 -633 -28 661 20 -807 -440 -57 420 356 135 -223 -821 208 1248 226 -808 -701 94 773
2873 773 101 -278 -369 -713 -228 711 369 -875 -564 381 933 -44 -665 -55 -327 -179 486 277 -209 -372
2893 -372 446 281 -280 -269 122 454 -167 -391 178 654 -209 -446 114 88 -57 357 447 -403 -1019 3 753
2914 753 419 -463 -610 234 751 78 -8 -11 -610 -156 985 568 -435 -841 630 750 315 -268 -77 0
2934@K6M63j38o60k96P86J68k23n13M97J76o64K4K65K75k35j98J68K63m17L05
2955G2K72p60l42P79N85k43p41q1P08j0qM0q17j98P59P54J59j491r3P66M21k75
2977B56j48j98l16L90R06k94r86k43O82M69m48m10M86M0k92J18M63o94k48R08
2997D41k29k78j79L56N44q37k97L42O48j65q62L81K15k24N50K68p90r16Q46J012
3017H26k79r05k09O59M00Q2k73o87l34M23P18K78r81l61O39M16q3n28O2J8o3K59
3039G7J61k27m63N27J66k79J8J13j5j49j52K55J53k83j03R3K83l38K46M45p46
3060b18o86O42R06l97m60j15M8M42J40R6m61o84N37R42j93q11l93N41L23O9p8
3081A90k89l09K59M96K92q31k33L06M60O8n73O4K32k20J12N5ml48L33r6R5m89
$$ plain form
2934 0 26 489 351 -309 -605 181 349 126 -387 110 286 -378 -354 -89 186 -49 -247 -79 184 -233 72
2955 72 344 -416 -758 21 606 363 -378 -459 249 239 231 271 -546 -744 15 769 928 -563 -656 110 531 256
2977 256 108 -90 -406 -16 890 596 -390 -633 49 518 70 -340 146 186 -106 12 475 -219 -467 441
2997 441 212 -66 -245 111 655 -182 -479 -137 511 346 -516 -135 80 -144 406 674 -116 -1032 -186 826
3017 826 547 -358 -567 92 492 574 301 -386 -720 -297 421 699 -282 -643 -4 412 329 -199 -137 -119 -182 77
3039 77 238 11 -452 75 241 -38 -20 93 78 -71 -223 32 185 -98 -201 -108 175 -163 83 528 -218
3060 -218 -904 -262 644 247 -213 -328 -280 162 302 398 -63 -747 -210 732 539 -272 -665 -124 199 268 190
3081 190 -99 -408 -149 347 639 -192 -425 -119 341 409 -164 -100 132 -88 24 79 75 -273 60 -36 59 -430
3103d30M58Q73r86m39L61N39J56o40l8J03p0L15M55q55o88O65P45M04j060l21
3123d53M03N32j26n6l12m90J60P59L40q51j02j34O39K49o09p2j69P0Q5N40o42
3144b39j95K55L66l03r8L07L15k87n3j56O47p8m54K07l12L17r0j0n46K39k03M46
3166G5P33q98j01K94l04N72k3j86r50M25P77O71j391p2M66k36R00n68k65M78l77
3187B0Q3R50o54q78O08J64M90n85p67O76m24m8K48p2l14n4N04L94j59k49N06j59
3209B80p76l4J168j393l6Q05k13P97n55L03j24m55n15Q14N11j031j42K50M95o7
3229H2L16j90m53k93Q42p4k75p1K27J07R0n44K90l34P0M65L37j36n12J30K73j69
3251A78k81J46Q6j74k89o0N79l11Q6Q3M8j60J17K51K24j179m2P32L87m27k86j5
$$ plain form
3103 -430 28 901 -85 -524 -163 376 532 -108 -146 -43 -113 202 657 -198 -886 -221 524 928 -132 -453
3123 -453 -50 482 356 300 -12 -502 -342 417 757 -94 -196 -330 309 558 -51 -123 -292 -222 -137 403 -239
3144 -239 -434 -179 187 -116 -214 93 408 121 68 -88 559 481 27 234 -78 239 149 139 -407 -168 -371 75
3166 75 808 -90 -191 103 -201 371 348 162 -788 -363 414 1085 -306 -378 88 -148 752 184 -81 397 20
3187 20 103 1053 399 -479 129 293 783 198 -569 107 -317 -365 -117 -189 -503 -557 -53 341 182 -67 439 280
3209 280 -496 -530 638 -755 -791 14 -199 598 43 346 222 -233 -748 66 577 -454 -596 -346 149 82
3229 82 398 208 -245 -538 304 230 -45 -116 111 218 308 -236 54 -280 -210 255 592 456 -56 74 347 178
3251 178 -103 43 129 -45 -334 -394 185 -126 -40 43 91 -69 48 299 523 -656 -698 34 421 -6 -292 -307
3273c07J4J31M36j26l72k44P10K29l66n41J44N28m91M85m39K59m51L82K95l3m99
3294b56n1K62J40q2k48N18p26K32J30K9j60L49R8j84n7P5j8K6j62Q9K82K47n35
3317bj19J62k45L93o3J05p25l31P40Q07n49l50J93K78J47j82n74l77P64l57Q47
3338E62N3m88o34P16O0n01L30j95R8m67M86j21L01m7l97Ql1l73J053l22n60l26
3360g95N82K68K4J5m28L86L94M04p68k60p34Q34O60o63P7n00J001j87j14M10p09
3381a03n75K56R62j27k60m61K72O32n17L50o82n0L42R6p50N45o83L39N25n55O11
3402A67j27J83J39m63K54r85J014L39M54p94l57K00P1k26mM92p12J102n71L57
3422E33n77O6o2m7p47N82K64J55M82j335J125l17n53Q66l38Mj20K23K96k31J7
$$ plain form
3273 -307 -293 -162 274 148 -224 -468 242 471 105 -436 -292 236 -255 230 -209 50 -401 -19 276 243 -256
3294 -256 -307 -45 95 13 -235 283 -443 -211 -81 -52 -212 137 235 51 -6 69 51 77 -85 4 286 533 -2
3317 -2 -121 41 -204 189 126 231 -494 -825 -85 722 173 -177 16 294 441 259 -315 -692 72 -285 562
3338 562 615 127 -507 209 269 -232 98 -97 1 -466 20 -101 200 153 -244 -236 -267 -640 413 91 -469 -795
3360 -795 -213 55 79 94 -334 52 446 850 82 -178 -912 -78 582 -81 -4 -504 497 310 196 606 -103
3381 -103 -678 -422 540 413 153 -308 -36 596 79 429 -253 -303 39 135 -615 -70 -753 -414 111 -444 167
3402 167 40 223 362 -101 153 -832 182 521 975 181 -176 24 95 -131 -135 357 -355 747 176 533
3422 533 -44 22 -40 -87 -834 -252 12 167 649 -686 439 122 -431 435 97 101 -19 204 500 269 286
3443B86n55N75o11O0K40P12l22K60m01K14p76k50nJ046n68l20J107l91J1q5K23
3464D50o77P28o03m70Q27P8L64l41n95J16O05J83j092P14k81P20j182M08J190
3483A142j965N57L42K30r69M09J14N57M43q30N64o22l78PM79n08N69r53J125j70
3503A43k86q6K54K29k96k05Q17J79k82p74O38k64O2O81p23m32J71J1K38L08m51
3524f8k56K20n0K89R9o0L2l96P03l28l69r9N35l9n6J8j2m20J16N02k70Q1m39K12
3548e5L56N6m19M47k65p01P07J72p00J64N01l78J61J1K02K32m36o25R04q6j88
3569F0j29m7J03j96N19J94m53p93O99j83K28l0l07L8M2j57O73m59J03l90M29k1
3591g7J06j207P59N71J38J94j89l62m67J12N85p02L89L15k29k99N21k21M85n26
$$ plain form
3443 286 -269 306 -305 -245 -5 707 385 645 244 458 -318 -568 -573 473 -95 -415 692 301 312 227 450
3464 450 -227 501 -102 -572 255 333 697 356 -239 -123 482 665 -427 287 6 726 -456 -48 1142
3483 1142 -823 -266 76 306 -663 -254 -140 417 860 30 594 -28 -406 -399 80 -428 141 -812 313 143
3503 143 -143 -229 25 254 -42 -247 570 749 467 -307 331 67 129 810 87 -345 -174 -163 75 383 -68
3524 -68 -324 -104 -154 135 234 174 206 -190 513 185 -184 -283 252 213 157 175 163 -257 -141 361 91 172 -267 -55
3548 -55 301 357 -62 385 120 -581 126 298 -402 -238 263 -115 46 57 259 491 55 -570 334 248 60
3569 60 -69 -116 -13 -209 310 504 51 -742 -43 -226 2 -28 -335 -297 -255 -412 261 -198 -95 -485 -56 -77
3591 -77 29 -1178 -419 152 290 484 295 -67 -534 -422 163 -539 -150 165 -64 -363 158 -63 422 -104
3611a04J58J28p96P89Q1k79l51L31q7N83m81J3k39K94J44j91P5k07j52K98L45
3632C52j66n98L07J48Q8j63j06q5O4K85J97q5m83J84K9K90q5k83Q3n2O0j26q9
3655b34K39J4L89m56J22n0J6J39l81J16M8L94m04K8l23K32K05k99J64Lk30J50
3677a18O68l74m55j79M98J34m07L98m02L30q5J81J20n06J4L79j39N2k79M0K24
3698I4l30L40K95l24l36J27K58l2j8l0Q2J59l40o1J49R4j79J66N1m0oK38m65j00
3722b08K93J14r7j77P5K26K8k9l20k62J99K41K2L33o36k19M40K73k80k87J50P9
3744d2p3L51j48q4j81J54K40j28j02k31L87k26l1J16J8L6J47J6j91j61M4J37L
3767E1m06J74N09j36k20k36L57j88J88q2k71k5K73M68l10m58J06L92L8j82l3k96
$$ plain form
3611 -104 54 182 -614 175 256 -23 -374 -43 -130 453 -28 -15 -254 40 184 -7 68 -139 -291 7 352
3632 352 186 -412 -105 43 131 -32 -138 -223 -159 126 323 238 -245 -61 -32 258 173 -110 -27 -79 -19 -145 -234
3655 -234 5 19 408 -48 74 24 40 179 -202 -86 -38 356 -48 -20 -343 -111 94 -205 -41 -38 -268 -118
3677 -118 550 176 -279 -458 40 174 -233 165 -237 93 8 189 309 -197 -183 196 57 109 -170 -130 94
3698 94 -236 104 399 75 -261 -134 124 92 74 44 126 285 -55 -116 33 127 -52 114 165 125 119 357 -108 -208
3722 -208 85 199 102 -75 0 226 254 225 -95 -357 -158 83 105 438 -198 -417 23 296 16 -271 -121 -42
3744 -42 -115 236 88 4 -177 -23 217 89 -13 -244 143 -83 -114 2 20 56 203 219 28 -133 -89 48 51
3767 51 -355 -181 328 192 -28 -264 93 -95 93 11 -260 -285 -12 456 146 -312 -206 186 224 42 9 -287
3789b87n9L95M34l50j04l85M81L10l76q6J25k27J21p0J32K06k91J07J80j7o4j77
3811bL88k90q5M04j24m44K6K15M64K95q51J9M04k73l23K92J48P8j018R97L48o03
3833F5j96L77J6n05M13j43k92l24M06L08K93m81j3pk69M15Q3j42m16K78K39J69
3855B74m35j6K86K78k97j09J71K18o10M47l32j99O39j01j82j21K69j05m1q1k79
3876c26J77J94M01p61J18L47Q8l62R03j146l12Q70j66J28j31K56p85N43K89J36
3896D61j59l79J41l47M16k10k60L80M95o16L60k14rpN53J30j016N1N00q2k29n74
3918f15P01K16n85k37N41L2k7J15j89M9j18M09j11l1k21q0M40K41M11j034m02
3939d95q9O55J432k037J073p33J240m89r40N39m30M89j84k88K26N31o51L80L02
$$ plain form
3789 -287 -346 49 483 133 29 -356 125 435 59 -27 98 -129 -8 -78 54 260 -31 76 256 239 175 -2
3811 -2 386 96 11 415 291 -153 -127 88 552 847 -4 15 419 146 -177 115 263 341 -677 320 668 65
3833 65 -131 246 262 -243 170 27 -265 -589 -183 125 418 -63 -76 -83 -352 63 146 4 -412 -134 105 274
3855 274 -161 -177 109 387 90 -19 152 370 -240 207 -125 -324 315 214 32 -89 180 75 34 -47 -326
3876 -326 -149 45 446 -315 -197 150 238 -124 779 -367 -679 191 25 153 22 278 -507 36 325 461
3896 461 302 -77 64 -283 133 -77 -337 43 538 -78 282 68 59 52 605 735 -281 -230 270 188 -41 -615
3918 -615 86 302 -283 -520 21 53 26 141 -48 1 -117 292 181 150 -71 -151 289 530 941 -93 -495
3939 -495 -584 71 1503 -534 539 -194 1046 557 -383 156 -274 215 31 -257 -31 500 -151 229 531
3958E31J6l0j059P9P01q86J146l8j263J208k18m06L70o0q7j91M35K43p82P49m34
3979B4J99k52M61l37k93K50o78N97P2n84L70J58J38K36m20J42l08k8O34j64k32
4000a5m12o5P72M11k71n24m78M40J78l83P41n07J76K03j65k22n9N17j73p25L63
4021a98N20P0m71R73r13J54L34r92N8N07p45P13Q27j001l71M15O31l33l9j036
4041h97Q25L47j184J619q13K06%p3L21n25m9P45q23L80Q8J49l13RK31K72l81L55
4063D89k92k18L40l36K16k84R9j42J56J09R8J3j92j82r7K33P3J6m36K98K03O8
4085B32n7N0l22j88K87J87k03o8J67R5j16r9P2n2j54j13M19k10K20m32L11J42
4107A68l40K77q6R9l40K25l6J22k77J59K0k42J16K47l8n1k06K70K47k99r5l9N4
$$ plain form
3958 531 547 517 -542 -463 238 -648 498 460 -803 405 187 -219 151 91 4 -187 248 491 -291 458 24
3979 24 223 -29 432 95 -198 52 -626 -29 43 -541 -171 -13 125 361 -59 83 -225 -253 381 217 -15
4000 -15 -427 -492 280 691 420 -104 -582 -142 36 -347 394 -113 63 266 101 -121 -180 337 164 -561 -198
4021 -198 322 392 -79 894 -19 135 469 -523 -465 42 -703 10 837 -164 -535 -120 511 178 139 -897
4041 -897 -72 275 -909 710 -103 103 103 30 351 -174 -223 522 -301 79 167 316 3 12 243 515 134 489
4063 489 197 -21 319 -17 199 -85 14 -128 28 137 235 248 56 -126 -223 10 83 99 -337 -39 164 232
4085 232 175 225 -97 -285 2 189 -14 -82 85 180 64 -35 37 -15 -169 -282 137 -73 147 -285 26 168
4107 168 -172 105 19 118 -222 3 -33 89 -188 -29 -9 -251 -135 112 74 23 -183 87 334 35 -60 -99 -45
4130d5J17k77K99qn56M14J7M03m09j35J41nK53N4l82j9RM13j79n27J33K02K10
4153A23r0O1j36L16j39M6l0k1l36K98j20n9o1l3K38k45J68J80k9k63K48m2p8j15
4177a19L5J99l9l10L85r6j53q7k1k6K54J57q6o8l46M22J06J54m36j58K11L5J5
4200B8j92K41l53J06M36o9k72o9J6J99ml44K88J6m14K21K40J59k72J01l1N9K5
4223A15l12O02o69K49j44J61J8j5p3J49K8m1l7K61n99L63MJ73k39n0O1m3J46m0
4247F8n1k29J26J88J10k47N0j81K03P0m8j04k6j88M76r1J7O0j46m4k3q2K47j79
4271b4j42pK46j81N0M8K6N9k67K88j48N3l80K26K03n7J65k95K38o5Q7j40k87J31
4295a73J91NM6j32l57M02N6m7ll26K61K34k22K66m65l5L16K40q4m78L50K65m10
$$ plain form
4130 -45 72 -205 94 86 -470 -56 -39 364 -45 -180 -39 -44 209 263 -119 -138 -129 284 105 -422 -289 -87 123
4153 123 33 94 -42 274 135 181 151 130 -206 92 -28 -87 -148 -181 57 -188 -20 160 131 -132 116 74 -4 -119
4177 -119 -84 115 76 -234 151 55 -98 -185 -206 -232 22 179 93 25 -321 101 207 361 -75 -233 -22 13 28
4200 28 -164 77 -276 -170 266 197 -75 -144 -128 71 67 -277 11 27 -387 -166 74 233 -39 62 31 90 115
4223 115 -197 405 -264 -15 -159 2 20 5 -68 81 109 68 31 292 -307 56 60 233 -6 -56 5 -38 108 68
4247 68 17 -212 -86 102 212 -35 15 -166 37 107 59 -45 -71 -259 217 126 143 203 57 13 -10 -92 155 -24
4271 -24 -166 -173 73 -108 -58 -10 16 75 -192 96 -52 1 -379 -153 50 -7 158 -137 101 36 123 -17 -304 -173
4295 -173 18 23 69 -63 -420 -18 38 -9 -12 -338 -77 157 -65 201 -264 -299 17 257 173 -305 45 310 -100
4318a00J92q6NJ7O4j19l8k29J79L47l21M1j33K62p9J7k04J89n7K6K05m20J74k47
4342c15K86K19m0l86J82R1LM2J09n29J11L45J1j12j79j79M08k56J24J21q3J70
4364A43j77O9O7q9o4K30j11rM4O4l72K24j41L3M91m83K06J6l78L38k1q2j25K90
4388A63l01N48m27j13L2M9J47Pj43k67J19L68k39j97K56%P4q5l4J57n9j87J62
4411C0O4m2l92L04qJ55P0j40R2j46J65l9L3k18M6M4j8k72N09j14l64J72k47K44
4435g2j35J05K27j4n6j78J0M07k21l43N22K91l79j99j25L19q7LK10k59j89K34
4457G1Q8j87r7O4J17nj96K93k22q4O2M06k08l48J06J29j46j61K97L98j98m48K5
4480b44N03q6l30L13l71j0M48j41K22m52j19K90R8j00l9n5J0p9K60j8l7L0k4K23
$$ plain form
4318 -100 92 6 11 28 92 -27 -65 -294 -115 232 -89 -48 -181 81 2 19 -185 4 -53 -27 178 -242 -68 -315
4342 -315 -29 190 150 -236 -54 37 40 82 191 -338 -227 118 129 17 -162 -341 67 -189 -65 56 -27 143
4364 143 -34 35 102 13 -51 179 68 59 103 167 -205 19 -122 -89 402 -81 125 141 -237 101 80 -2 -127 163
4388 163 -138 410 -17 -130 -98 -49 98 105 -38 -305 -186 182 -57 -254 2 2 76 -9 -43 114 55 -132 30
4411 30 94 52 -340 -36 -44 111 181 41 133 -13 152 113 146 -72 -26 18 0 -272 237 123 -241 -69 -316 -72
4435 -72 -207 -102 125 111 55 -123 -113 294 73 -270 252 543 164 -35 -160 159 72 75 285 26 -163 71
4457 71 159 -28 -125 -61 56 51 -145 148 -74 -158 -96 310 102 -246 -140 -11 -157 -318 -21 377 179 -269 -244
4480 -244 259 173 -157 156 -215 -225 223 82 304 -148 -267 23 121 21 -18 -73 -63 -142 118 100 63 93 69 292
4504B92m53M8P5L6Kj63M54j7m71L75J67j23l80J14pL19l41O8L19m82p8J77J08
4527C9o0O3m8N4K0K6j2R7k98N3p7L21q9K37l34l81M21K37l8k95j28J14L69j82
4551A09j57N7Q8j20K51k84L49j83l07L63l04l9K39Nn2m85M69j15J2L8N9J21p6
4574C8l4n3P9o1j25L15j9l92r7K23L09l8k11P9k11l6R6K45ql08J23J40L46k59
4598A41p4J33p5J03J22m97j61K31J85PM0k92j4M6J33k01Q1q9K5k10M09J60j94
4621Ik47J61O5M8j3J07r4p3p8K10k05L56l26Q6j56p1N58k57n17N21k11N6J11o1
4645b1J31j40K07o0k81j26K71J25J3l17KJ64k00K25k1K37k26j69L19J55l27k77
4667c16N15k17l7K00k27m8l3M48k88J20j92NL1Q9K7k03J61K65j83k40J56P2m4
$$ plain form
4504 292 -161 -113 -38 -2 0 -163 291 274 -197 178 345 222 -158 -44 -51 268 -73 -5 314 -168 -246 -69 39
4527 39 -21 42 -6 48 68 94 82 179 -119 -66 -143 178 89 326 -8 -389 32 269 231 -64 -192 -78 291 109
4551 109 -48 9 97 -23 228 -56 293 110 -197 166 -138 -177 62 67 15 -470 -1 -116 -104 -66 -7 114 38
4574 38 4 -49 30 -31 -156 159 140 -252 -349 -126 183 145 -66 13 -198 -234 -138 107 99 -209 -86 54 400 141
4598 141 67 200 125 228 350 -147 -308 -77 108 115 155 -137 -151 -105 28 -173 -92 -181 -156 -366 43 203 9
4621 9 -238 -77 -12 36 23 130 36 -37 -115 95 -110 246 -80 6 -150 -221 337 80 -437 84 -127 -71 40 -21
4645 -21 110 -30 177 117 -164 -290 -19 106 119 -198 -196 -32 -232 -7 -28 209 -17 -186 133 288 -39 -316
4667 -316 199 -18 -55 145 -82 -130 -163 285 -3 117 -75 -70 -39 50 77 -126 35 300 117 -123 33 105 61
4690F1k59J80k5J70J80l21r5o8K65p9J03l08J56K03j08J25K05n76K17kM6j72j89
4713b91M41Q5j66k2j95K40l71R6J06Q6n4K27J23l45J28k80K92k47K14J3N9k04
4735f5M6j1km3J29J09k40R1j27K99j0j85O5k03J89J7O9j1j63m9lk00M48j93j58
4760b01K12J30p2j04k1j19M14j60m21L11j02J50J9M0k40N04j31l35Q4J21j52j20
4782a93L93k21j3K10p6J43k63j31N6Q5j5L21k0m19K15LK24k49o0J47k02K38k19
4805d6R1p1K26J11l56Q5j76oL50l11P9k24K66m8K11l48K03m91L71K42n00J84K53
4828I5j41K13k59J34LK5j04l9R3Q6k64N3Q8k80J67J71K41k81l2j31K66j76L92
4851C20o78m6L88L14j88l4M7j01L28n49R6R9J02k17J44p8P2l47L54J06l77L00
$$ plain form
4690 61 -198 -18 -43 127 307 -14 -109 -177 88 9 112 -196 -40 163 55 180 385 -191 26 24 70 -102 -291
4713 -291 150 235 69 47 -148 92 -279 -183 -77 9 -45 182 305 -40 88 -192 100 -147 67 80 139 -65
4735 -65 -19 -30 -32 -75 54 163 -77 14 -113 186 176 -9 56 -147 42 59 128 117 -46 -95 -98 -298 150 -43 -201
4760 -201 11 141 69 -35 -56 -175 239 79 -342 -31 -133 17 36 76 -164 340 209 -126 -42 79 -73 -193
4782 -193 200 -21 -34 176 100 243 -20 -151 -95 -10 -25 296 276 -143 72 75 299 50 -10 137 -65 173 -46
4805 -46 45 -26 200 311 -45 40 -136 -142 208 -103 -24 -248 18 -30 181 -167 36 -455 -84 158 -342 -158 95
4828 95 -46 167 -92 42 45 70 -34 -73 20 106 -158 -105 -17 -297 -130 41 282 1 -31 -162 104 -72 320
4851 320 -358 -404 -16 298 110 76 123 22 350 -199 -103 -4 98 -119 25 -53 19 -328 26 132 -245 55
4873E5l04K00J42K6J9j97o8o3L86p9j83rR2kj35L2J48J26l22J04l7J13K01o6j95
4898a6J3N0p1J19k0O7o2L2n8M0j72k26K48K7K35j05j75K15k9j20O0k25L61l17
4922a29R1J53j93o7O4J88j47r0J33J18k38N6N7K9o2KJ78l11M4J14R4N4k14P8P6
4947G8J19k10j25J47K0J04pk23j05p6N51K2m65Q5O7J3j1P2J39k58Q7j4J11J56
4971B77l36j52N36k67l7j14J89p0K7k88M34p1q6p8M9R0j18kq8K75k11J58j17K2
4995B2j59L54k41j17J51j0NK16r7p5j20J3jJ07l28L55n8j81r0L07j2k11J10J48
5019H8k0J35r3k09J6Q6J45k39j24J95M7L3k79K77R7k44J14m7m1q7N34k66k72L91
5043B37j27N8J6l1j11k24MM40n0m4j00J4j6p2J43k62Q7k62Q18o04k2J67j22j01
$$ plain form
4873 55 -249 -49 93 119 138 -59 -127 -190 196 117 -66 -75 17 15 -120 -88 60 186 -136 -32 -69 44 245 179 -16
4898 -16 -3 47 -24 95 75 142 80 112 54 94 -78 -304 -56 -29 206 101 -74 141 112 -8 52 -173 188 -129
4922 -129 -38 115 -78 -145 -81 107 -40 -130 3 121 -117 -61 -4 25 -37 -35 143 -168 -124 -10 84 138 -76 2 78
4947 78 197 -13 -138 9 29 133 126 -97 -202 -278 273 295 -170 -85 -18 -5 -16 56 195 -63 24 10 121 277
4971 277 -59 -211 325 58 21 -93 96 26 53 -235 199 128 42 -36 13 103 -15 -17 -105 170 -41 117 0 22
4995 22 -137 217 -24 -141 10 0 5 221 124 49 -71 -58 -59 48 -280 75 17 -164 -254 53 41 -170 -60 88
5019 88 68 203 110 -99 -83 3 148 -91 -215 -20 27 60 -219 58 155 -89 25 -22 -63 -150 384 118 -154 237
5043 237 110 168 184 153 42 -182 -178 262 212 168 68 82 66 -6 137 -125 -38 -300 518 -86 -108 59 -63 -164
5067a64K61j47k4J19k43K25J37l76K82J20m7k21O6M5l4J60k20j56K30q5n0P6o2
5090a08jK36j50j6J07k34O09o39K07M3K0n1M6Jj59k09K72K6K73j51k03K89k13
5113eJ72k73K48j28K46k76J61l03p1M6K39oj48K66j95j60R6J05l06K47J21Jj38
5136f1N40o14r1N21o58M00j69l14J031q42M55j14j43n4n1k35O89k36r5N0P0o7
5158A2o0k21K20L26r11M41M43k17J63k78K07j94j78l00J144o31K45J19j9n28Q2
5179a35L99k41K08j48K81j74k37R0J94m5k85M44K0p86M50k06N46p20L4k8l3J25
5201b47L86m41L99J17M2l19K68n6J09j06k09j39J08M70n24P57p96J70J48n34O67
5222B70Jj18m22J04K03L49k98K05j022N66J81l11L43L49q04Q79m21Q9l56oQ5K4
$$ plain form
5067 -164 97 -50 -74 45 -198 27 164 -212 70 190 143 -78 -12 33 -1 159 -61 -217 13 -72 -122 -46 -108
5090 -108 -109 127 -23 -39 68 -166 443 -196 11 54 74 23 69 70 -89 -298 -26 0 273 122 -81 208 -5
5113 -5 167 -106 142 14 260 -16 145 -158 -229 -183 56 50 -98 168 -27 -187 -91 14 -292 -45 76 77 -61
5136 -61 479 -135 -226 295 -363 37 -132 -446 585 -257 198 84 -59 -113 -164 -399 290 54 -41 9 79 12
5158 12 -48 -269 -49 277 -634 -193 250 33 196 -82 125 -69 -247 -547 597 -34 211 330 311 -217 -135
5179 -135 264 23 231 83 364 190 -47 43 237 192 -93 351 371 -415 35 -171 375 -345 -311 -339 -372 -247
5201 -247 139 -302 97 214 256 -63 205 149 258 152 -57 -196 -88 382 -142 615 -181 -11 137 -397 270
5222 270 271 153 -269 -165 38 387 89 294 -728 -162 19 -292 51 400 -404 475 54 143 -213 -219 -134 -110
5244a10N38o63N9J89o8j16k03j77N1N2J64L81n08L73o3L99o04J78M65m5l36q23
5266h67O39j4M01m51O45o17J42r9L50n86R50q94l21J031n18P62r38J011k83m46
5286a03J46l65O26r43P41L86M7m84l82M91J3m59L35j91n91L71L04q6L09p2n27
5307d34O12k53l1n9K34R0k4j4q4p7L3l65N53k69J51j51j88j22O72n91N98l00J87
$$ plain form
5244 -110 428 -235 -176 13 -55 -171 -374 -551 -500 -448 -284 97 -411 -38 -101 298 -306 -128 337 292 -44 -867
5266 -867 -228 -242 159 -292 353 -264 -122 -221 129 -457 493 -401 -722 309 -209 553 -385 626 343 -103
5286 -103 43 -322 304 -639 102 488 535 51 -331 160 173 -286 49 -142 -733 -362 -58 -144 165 93 -434
5307 -434 178 -75 -106 -165 69 159 135 121 37 -40 -7 -372 181 -88 63 -88 -276 -398 274 -317 281 -19 168
$$ [...]
8191a70
##END NTUPLES=NMR FID
##END=
