##TITLE=1H_SA_sl.1.1
 CDCl3, 8 sc, 
 4.9.2020
##JCAMPDX= 6.0         $$ Bruker NMR JCAMP-DX V2.0
##DATA TYPE= NMR FID
##DATA CLASS= NTUPLES
##ORIGIN= UXNMR, Bruker Analytische Messtechnik GmbH
##OWNER= root
$$ XWIN-NMR		Version 3.5
$$ Fri Sep  4 09:42:24 2020 Russian Standard Time (UT+4h)  she@DPX200
##.OBSERVE FREQUENCY= 200.1315066352
##.OBSERVE NUCLEUS= ^1H
##.DELAY= (6, 6)
##.ACQUISITION MODE= SIMULTANEOUS
##.ACQUISITION SCHEME= undefined
##.AVERAGES= 8
##.DIGITISER RES= 18
##SPECTROMETER/DATA SYSTEM= spect
##.PULSE SEQUENCE= zg30
##.SOLVENT NAME= CDCl3
##.SHIFT REFERENCE= (INTERNAL, CDCl3, 0, 15.7039)
##AUDIT TRAIL= $$ (NUMBER, WHEN, WHO, WHERE, WHAT)
$$ ##TITLE= Audit trail, XWIN-NMR		Version 3.5
$$ ##JCAMPDX= 5.01
$$ ##ORIGIN= Bruker BioSpin GmbH
$$ ##OWNER= she
$$ F:/spectra/data/she/nmr/H-F/1/audita.txt
$$ ##AUDIT TRAIL=  $$ (NUMBER, WHEN, WHO, WHERE, WHAT)
(   1,<2020-09-04 09:40:39.96 +0400>,<she>,<DPX200>,
      <created by zg, POWCHK disabled, PULCHK disabled
       configuration hash MD5:
       00 E9 B6 7A A2 85 ED C7 34 08 36 98 17 FE 4E 26
       data hash MD5: 16K
       E7 1C FB 20 DC 3A F1 DF C7 C1 60 C1 B6 16 DE 70>)
$$ ##END=
$$ 
$$ hash MD5
$$ 1F A7 83 54 54 F8 68 66 42 F5 9A 59 D6 8C 70 B3
##$RELAX= 
##$RELAX= 
##$RELAX= 
##$RELAX= 
##$RELAX= 
##$RELAX= 
$$ Bruker specific parameters
$$ --------------------------
##$DU= <F:/spectra>
##$EXPNO= 1
##$NAME= <H-F>
##$PROCNO= 1
##$TYPE= <nmr>
##$USER= <she>
##$AMP= (0..31)
100 100 100 100 100 100 100 100 100 100 100 100 100 100 100 100 100 100 
100 100 100 100 100 100 100 100 100 100 100 100 100 100 
##$AQSEQ= 0
##$AQ_mod= 1
##$AUNM= <au_zg>
##$AUTOPOS= <>
##$BF1= 200.13
##$BF2= 200.13
##$BF3= 200.13
##$BF4= 200.13
##$BF5= 200.13
##$BF6= 200.13
##$BF7= 200.13
##$BF8= 200.13
##$BYTORDA= 1
##$CFDGTYP= 0
##$CFRGTYP= 5
##$CHEMSTR= <none>
##$CNST= (0..31)
1 1 145 1 1 1 1 1 1 1 1 1 1 1 1 1 1 1 1 1 1 1 1 1 1 1 1 1 1 1 1 1 
##$CPDPRG= <>
##$CPDPRG1= <>
##$CPDPRG2= <>
##$CPDPRG3= <>
##$CPDPRG4= <mlev>
##$CPDPRG5= <mlev>
##$CPDPRG6= <mlev>
##$CPDPRG7= <mlev>
##$CPDPRG8= <mlev>
##$CPDPRGB= <>
##$CPDPRGT= <>
##$D= (0..31)
0 1.2 0 0 0 0 0 0 0 0.06 0 0.03 0 0 0 0 0.0002 0 0 0 0 0 0 0 0 0 0 0 0 
0 0 0 
##$DATE= 1599198039
##$DBL= (0..7)
120 120 120 120 120 120 120 120 
##$DBP= (0..7)
150 150 150 150 150 150 150 150 
##$DBP07= 0
##$DBPNAM0= <>
##$DBPNAM1= <>
##$DBPNAM2= <>
##$DBPNAM3= <>
##$DBPNAM4= <>
##$DBPNAM5= <>
##$DBPNAM6= <>
##$DBPNAM7= <>
##$DBPOAL= (0..7)
0.5 0.5 0.5 0.5 0.5 0.5 0.5 0.5 
##$DBPOFFS= (0..7)
0 0 0 0 0 0 0 0 
##$DE= 6
##$DECBNUC= <off>
##$DECIM= 32
##$DECNUC= <off>
##$DECSTAT= 4
##$DIGMOD= 1
##$DIGTYP= 9
##$DL= (0..7)
0 120 120 120 120 120 120 120 
##$DP= (0..7)
150 150 150 150 150 150 150 150 
##$DP07= 0
##$DPNAME0= <>
##$DPNAME1= <>
##$DPNAME2= <>
##$DPNAME3= <>
##$DPNAME4= <>
##$DPNAME5= <>
##$DPNAME6= <>
##$DPNAME7= <>
##$DPOAL= (0..7)
0.5 0.5 0.5 0.5 0.5 0.5 0.5 0.5 
##$DPOFFS= (0..7)
0 0 0 0 0 0 0 0 
##$DQDMODE= 0
##$DR= 18
##$DS= 0
##$DSLIST= <SSSSSSSSSSSSSSS>
$$ [...]
##$SUBNAM2= <"">
##$SUBNAM3= <"">
##$SUBNAM4= <"">
##$SUBNAM5= <"">
##$SUBNAM6= <"">
##$SUBNAM7= <"">
##$SUBNAM8= <"">
##$SUBNAM9= <"">
##$SW= 16.880792210976
##$SWIBOX= (0..15)
0 0 2 0 0 0 0 0 0 0 0 0 0 0 0 0 
##$SW_h= 3378.37837837838
##$TD= 16384
##$TD0= 1
##$TE= 0
##$TE2= 300
##$TE3= 300
##$TEG= 300
##$TL= (0..7)
0 120 120 120 120 120 120 120 
##$TP= (0..7)
150 150 150 150 150 150 150 150 
##$TP07= 0
##$TPNAME0= <>
##$TPNAME1= <>
##$TPNAME2= <>
##$TPNAME3= <>
##$TPNAME4= <>
##$TPNAME5= <>
##$TPNAME6= <>
##$TPNAME7= <>
##$TPOAL= (0..7)
0.5 0.5 0.5 0.5 0.5 0.5 0.5 0.5 
##$TPOFFS= (0..7)
0 0 0 0 0 0 0 0 
##$TUNHIN= 0
##$TUNHOUT= 0
##$TUNXOUT= 0
##$USERA1= <user>
##$USERA2= <user>
##$USERA3= <user>
##$USERA4= <user>
##$USERA5= <user>
##$V9= 5
##$VALIST= <valist>
##$VCLIST= <CCCCCCCCCCCCCCC>
##$VD= 0
##$VDLIST= <DDDDDDDDDDDDDDD>
##$VPLIST= <PPPPPPPPPPPPPPP>
##$VTLIST= <TTTTTTTTTTTTTTT>
##$WBST= 1024
##$WBSW= 4
##$XGAIN= (0..3)
0 0 0 0 
##$XL= 0
##$YL= 0
##$YMAX_a= 383003
##$YMIN_a= -432372
##$ZGOPTNS= <>
##$ZL1= 120
##$ZL2= 120
##$ZL3= 120
##$ZL4= 120
##$ABSF1= 10
##$ABSF2= 0
##$ABSG= 5
##$ABSL= 3
##$ALPHA= 0
##$AQORDER= 0
##$ASSFAC= 0
##$ASSFACI= 0
##$ASSFACX= 0
##$ASSWID= 0
##$AUNMP= <proc_1d>
##$AZFE= 0.1
##$AZFW= 0.1
##$BCFW= 1
##$BC_mod= 2
##$BYTORDP= 1
##$COROFFS= 0
##$CY= 11.3945322036743
##$DATMOD= 1
##$DC= 2
##$DFILT= <>
##$DTYPP= 0
##$F1P= 16.9975609425685
##$F2P= -3.02152046262296
##$FCOR= 0.5
##$FTSIZE= 0
##$FT_mod= 4
##$GAMMA= 1
##$GB= 0.15
##$INTBC= 1
##$INTSCL= 1
##$ISEN= 128
##$LB= 0.24
##$LEV0= 0
##$LPBIN= 0
##$MAXI= 10000
##$MC2= 0
##$MEAN= 0
##$ME_mod= 0
##$MI= 1.114404
##$NCOEF= 0
##$NC_proc= 0
##$NLEV= 6
##$NOISF1= 3.799351
##$NOISF2= 2.8
##$NSP= 1
##$NTH_PI= 0
##$NZP= 0
##$OFFSET= 15.70392
##$PC= 1
##$PHC0= -9973.615
##$PHC1= 13.60089
##$PH_mod= 1
##$PKNL= yes
##$PPARMOD= 0
##$PSCAL= 0
##$PSIGN= 0
##$REVERSE= no
##$SF= 200.130013532006
##$SI= 16384
##$SIGF1= 3
##$SIGF2= 2
##$SINO= 400
##$SIOLD= 16384
##$SREGLST= <1H.CDCl3>
##$SSB= 0
##$STSI= 0
##$STSR= 0
##$SW_p= 3612.71676300578
##$SYMM= 0
##$S_DEV= 0
##$TDeff= 0
##$TDoff= 0
##$TI= <>
##$TILT= no
##$TM1= 0
##$TM2= 0
##$TOPLEV= 0
##$USERP1= <user>
##$USERP2= <user>
##$USERP3= <user>
##$USERP4= <user>
##$USERP5= <user>
##$WDW= 1
##$XDIM= 8192
##$YMAX_p= 0
##$YMIN_p= 0
$$ End of Bruker specific parameters
$$ ---------------------------------
##NTUPLES= NMR FID
##VAR_NAME=  TIME,          FID/REAL,        FID/IMAG
##SYMBOL=    X,             R,               I
##VAR_TYPE=  INDEPENDENT,   DEPENDENT,       DEPENDENT
##VAR_FORM=  AFFN,          ASDF,            ASDF
##VAR_DIM=   8192,          8192,            8192
##UNITS=     SECONDS,       ARBITRARY UNITS, ARBITRARY UNITS
##FACTOR=    0.000296,      1,               1
##FIRST=     0,             0,               0
##LAST=      2.424536,      0,               0
##MIN=       0,             -432372,         0
##MAX=       2.424536,      383003,          0
$$ Real data points
##PAGE= N=1
##DATA TABLE= (X++(R..R)), XYDATA
$$ [...]
2015C80J48k169K39M53M77o29q84k03J158M51o27K95r4J261K73j53n76j89Q19
2034D30R5m48p75K59k97K90k61j214J078k12K42l2k28L56J098n44J6k21qP80j186
2055g82j33L62q24M29m25m79M52K34p7N86m32J190L24o89Q49OL62j12n31k07Q19
2076I22m82j006rk21J470j096r22J89P95J097r22j246N64J556p3r72j684P22J396
2095G8o39j174j793J588J706r68j814l36K040J804p03k636J207J993J597j774
2111A76k274J452K336P71k337j909J327K976p95k196q13J736L169j295k929n2
2127f57K722J518j256l319Q5L226L96j978l243J014L063k26k521k472J629L028
2143A009Ql465q53J952K354Q5l835k91K387K119j131l185l07L086J646j854k145
$$ plain form
2015 380 528 -1641 -1402 -949 -472 -1101 -1985 -2188 -1030 -579 -1206 -911 -1005 256 529 376 -200 -389 430
2034 430 525 77 -698 -439 -736 -446 -707 -1921 -843 -1055 -813 -845 -1073 -717 381 -163 -147 -368 -376 404 -782
2055 -782 -915 -553 -1377 -948 -1373 -1852 -1400 -1166 -1243 -657 -1089 101 425 -264 585 591 953 841 310 103 922
2076 922 440 -566 -575 -796 674 -422 -1344 -1155 -360 737 -185 -1431 -867 689 616 -356 -2040 -1318 78
2095 78 -561 -1735 -3528 -1940 -234 -1202 -3016 -3352 -1312 492 -211 -2847 -1640 353 1950 176
2111 176 -2098 -646 1690 2461 124 -1785 -458 2518 1723 -473 -1286 450 3619 2324 -605 -657
2127 -657 2065 3583 2327 -992 -907 2319 2715 737 -2506 -1492 1571 1345 -1176 -3648 -2019 1009
2143 1009 1017 -2448 -3301 -1349 1005 1090 -2745 -3036 -649 1470 339 -2846 -3153 -67 1579 -275 -2420
2160b420j26L638J488k380j910N03L954Q04k740k130J722K766P44l649k382K523
2176D05K917n70l444j609K957K559j083l266j068K876L158k400l267j01K903K910
2192C877l151l391K97L849J813l405l434J991M151N33l291l138K940M001o44m062
2208a064j886L311L878j263m937o54L715L345k434m968P45L854K539l218m360
2223c397J413M631J178m003l328J680N256q0m548k348K634M883j143m502j631
2238c305M107L465j556n015k26M622K488k299m519N19M531K028l254l427R83M474
2254C616J121m423k447J567M336K71m680k008K390M252j197m411j496L355L138
2269C384j557m002q64M075K422k300l905L00L698J970k686l632J323L677J651
$$ plain form
2160 -2420 -2546 1092 2580 200 -1710 -1207 2747 3551 811 -1319 403 3169 3913 264 -2118 405
2176 405 3322 2752 -692 -2301 656 3215 2132 -1134 -2202 674 3832 1432 -1835 -1936 967 3877
2192 3877 726 -2665 -2368 1481 3294 -111 -3545 -1554 2597 3130 -161 -3299 -359 3642 2998 -1064
2208 -1064 -2950 361 4239 2976 -1961 -2615 1100 4445 2011 -2957 -2212 1642 4181 963 -3397
2223 -3397 -1984 2647 3825 -178 -3506 -1826 3430 3350 -1198 -3546 -912 3971 2828 -1674 -3305
2238 -3305 802 4267 2711 -2304 -2530 2092 4580 2281 -2238 -1719 2812 4840 1586 -1841 -858 3616
2254 3616 4737 314 -2133 -566 3770 4041 -639 -2647 -257 3995 2798 -1613 -3109 246 3384
2269 3384 1827 -2175 -3039 1036 3458 1158 -2747 -2447 1251 3221 535 -3097 -1774 1903 3554
2284C554l555l171K377L505J032l885l012K862M056m49l673k187L152L859j908
2299B557l700j496L471L408k368m437M3L899K240k549m284J156L953J478k782
2314E89l964J998M186M04l599k956K118M518p77m312j577K735M180j749m167l37
2330b710L623K851k172l698k79M636J510k360l993O05M178R35l322l427K074L583
2346B034R0l969j610K715L097l41m119m53K476K519q77m009j14L106J750k158
2362A37k784j8L646J020k228k080O94L271Q82k691j881J808K444M12k554k402
2378b324K343J901p0l048j320K223J975q30k505o76J846K222j374k267j85K009
2394h0J773j785k052k4K157J090j767k589P34K593L97j408k022J464K452J91k199
$$ plain form
2284 3554 -1 -3172 -795 2710 3742 -143 -3155 -293 3763 3314 -359 -2546 606 4465 2557
2299 2557 -1143 -2639 832 4240 1872 -2565 -2522 1377 3617 1068 -3216 -2060 1893 3371 589
2314 589 -3375 -1377 2809 3213 -386 -3342 -1224 3294 2517 -1795 -3372 -637 3543 1794 -2373 -2710
2330 -2710 913 3764 1592 -2106 -2385 2251 3761 1401 -2592 -1987 2191 3126 -196 -3623 -1549 2034
2346 2034 2124 -1845 -3455 -740 2357 2016 -2103 -2556 -80 2439 1562 -2447 -2561 545 2295 137
2362 137 -2647 -2665 981 2001 -227 -2307 -1613 1658 2540 -151 -2032 -224 2220 2632 78 -2324
2378 -2324 19 1920 1850 -1198 -2518 -295 1680 850 -1655 -2331 -485 1737 363 -1904 -2089 -80
2394 -80 1693 -92 -2144 -2168 -11 1079 -688 -3277 -2543 50 447 -961 -2983 -1519 933 1124 -1075
2411a075r29J563K215k96k766k30J291K124r37k690J01J699J504j505k347M86
2427a792K242R61j276j985L11K554lj617j475Q02K082n45k074r78J432J589l27
2444i9k237k41J857R32m50j649K33J531R88j054j071J11J476L26j641m60J66J179
2462a03K57j415l61Q35Q13k41m22r04J308L77j09r75l90J017p6l32n74j22M80
2481i37P2m53j20L46k97Q61j98j35M14l30Q46k58J10o53P40J1K05l69m43L58n
2502b35N3k2l27M90K04l0j70l31J09P95o70k9n02J85M53o18m07k74K91K68l04
2523a071o27K24L72L93J52r58L58L24N39L9n34K19J0O02m83j76l54R02O2j26R
2544a24j66N06N47k11n00L72L20L74n9j065L76L45N66p23j166M27O30K84q49p66
$$ plain form
2411 -1075 -2004 -441 1774 1478 -1288 -1518 -227 1897 960 -1730 -1629 70 1574 69 -2278 -1792
2427 -1792 450 1411 135 -1850 -1539 1015 1012 -605 -2080 -1278 804 259 -1815 -2793 -1361 228 -99
2444 -99 -2336 -2577 -720 212 -238 -1887 -1654 -123 865 -189 -1260 -1149 327 653 -988 -1448 -1282 -103
2462 -103 154 -1261 -1622 -787 26 -215 -637 -1541 -233 144 35 -940 -1330 -313 -389 -721 -1295 -1417 -937
2481 -937 -865 -1318 -1438 -1092 -1389 -528 -726 -861 -447 -777 69 -189 -79 -732 8 19 224 -145 -588 -230 -235
2502 -235 -182 -204 -531 -41 163 133 -37 -368 -259 536 -134 -163 -665 -480 -27 -645 -1052 -1326 -1035 -767 -1071
2523 -1071 -1698 -1474 -1102 -709 -557 -1515 -1157 -833 -294 -255 -789 -570 -560 42 -441 -617 -971 -69 -7 -133 -124
2544 -124 -290 216 763 552 52 424 744 1118 1059 -6 370 715 1281 558 -608 -181 449 733 -116 -882
2564h82K31J439j32r25o47K38J460j22j265o39J251Q04k51j962j92J532P08l22
2582C24j833K38J787R92j203j654Q82J646N65j616j215Q75J878K5k138n93J021
2599a9J843p72j745o79J894J124r95j544m85K549P62j515j642K61K144N32j688
2616B5j736Q81J900L31k023j231J938J594l46j546r68J735J713p22j934o62J905
2633H54J566j588j248n33K140R30j367j503L17J640Q24j642j564Q78J608N94j558
2650C48j722P17K011p6j774j387J240J684P8k325l10J166K146j076k099l7K030
2667F14J419j094j985n3K377J154j541k195M37K863Q4j662j698J149K363M1k233
2684D0j382J717J849j37k544r31J732J857q00k653m36K228J654j643k382K69K476
$$ plain form
2564 -882 -651 788 656 -269 -916 -678 782 660 -605 -1244 7 811 560 -1402 -1594 -62 646 324
2582 324 -1509 -1271 516 1508 305 -1349 -467 1179 1744 128 -1087 -212 1666 1691 -447 -1040 -19
2599 -19 1824 1052 -693 -1372 522 1646 651 -893 -1378 1171 1933 418 -1224 -963 1181 1713 25
2616 25 -1711 -830 1070 1401 -622 -1853 85 1679 1333 -213 -1181 554 2267 1545 -389 -1051 854
2633 854 2420 832 -416 -949 1191 2121 754 -749 -432 1208 2032 390 -1174 -296 1312 1906 348
2650 348 -1374 -657 1354 1278 -496 -1883 -643 1041 1119 -1206 -1516 -350 1796 720 -1379 -1416 614
2667 614 2033 939 -1046 -1099 1278 2432 891 -1304 -867 1996 2080 418 -1280 -131 2232 2273 40
2684 40 -1342 375 2224 2087 -457 -1388 344 2201 1401 -1252 -1688 540 2194 551 -1831 -1562 914
2701I14J370k231j843N24K861J98k116j696J422K441Q8k670j166K148J432j96
2717A480k599o21K382J550r23k316j37K174J391j886j817M11J720J485k203j542
2733a451O93J844O08k104j336J265K108m95j692j188J475J795n07j861n83J504
2749G5J829j099j979k50J593J592r25k335N74J615J253j668j696N42J892M24j291
2766A46j446O89J927M4j666j125R15K033m05k016n85J369J610o87k127k93J843
2783B26J259q62k156J49J822J290j466j650M38J887Q37j764j428Q19J856N44k145
2800c44q47J193J498k60j824p66J530J614r19j704p82K227J035j216j671K99J709
2817G72N04j146j527N48J563L42j607j172J180J351j2j658p71J252J300m55j395
$$ plain form
2701 914 2284 53 -1790 -1266 1595 1793 -323 -2019 -597 1844 1932 -738 -1904 244 1676 1480
2717 1480 -1119 -1740 642 2192 1269 -1047 -1184 990 2381 495 -1322 -911 809 2294 91 -1451
2733 -1451 -758 1086 1694 -410 -1746 -481 1627 1132 -560 -1748 -273 1522 1015 -846 -1429 75
2749 75 1904 805 -1174 -1424 169 1761 836 -1499 -925 690 1943 275 -1421 -879 1013 1437 146
2766 146 -1300 -611 1316 1360 -306 -1431 -516 1517 1112 -904 -1489 -120 1490 803 -1324 -1617 226
2783 226 1485 623 -1533 -1384 438 1728 262 -1388 -950 937 1774 10 -1418 -599 1257 1801 -344
2800 -344 -1191 2 1500 1240 -584 -1350 180 1794 875 -829 -1611 616 1651 435 -1236 -937 772
2817 772 1276 130 -1397 -849 714 1056 -551 -1723 -543 808 796 -862 -1633 -381 919 464 -931
2834i31n22J413J375r68j574J32J229Q93q97j316L27J448J26m98j413N41J663
2851A028n19o29p61M66R50n4j180k14K42J141m8j078l40L90J120m52j090L59O87
2870A8M26k97j115M27Q88K58n79o02K8R96K7m98q18K58Q52K63q07o77O37N78L48
2891F11j228j44N56O23k38j071p5O78O61o09q37Q0M94N79r82k42L10P48N2n11
2911e45q34P51Q38j34p25k13O35M17j99n26l5N29K47l26j17l4L30L86m05l35M43
2932A48M22l99j35l48L67K15N6p39L85l0N6o30J99j75K59P4m25K43q8K4l2q3k4
2955f60K78r7k18J5P3M55l39k4KO4K85k26q0KM19j18o7l23M83rJ56k47l53O87
2979A58L2k96j77j09K39K0n5o58M34L89r4k06j7n6K89Q5l74j22K48O44n27l66
$$ plain form
2834 -931 -1453 -40 1335 367 -1207 -1075 154 1047 150 -1166 -839 609 735 237 -1176 -635 1028
2851 1028 509 -120 -881 -415 535 481 -699 -913 -671 470 422 -656 -996 -606 514 62 -1028 -669 18
2870 18 444 147 -968 -541 347 605 26 -576 -548 448 475 -23 -841 -583 269 532 -275 -952 -315 263 611
2891 611 -617 -761 -205 418 180 -891 -966 -288 373 -236 -1073 -993 -499 80 -902 -1144 -834 -86 -34 -545
2911 -545 -1379 -628 210 76 -649 -862 -227 190 -9 -535 -570 -41 206 -120 -237 -271 59 445 40 -295 148
2932 148 570 171 36 -312 55 270 326 -413 -28 -58 -2 -632 -433 -608 -349 -275 -700 -457 -545 -521 -553 -636 -660
2955 -660 -382 -479 -697 -682 -609 -154 -493 -517 -515 -451 -166 -392 -472 -470 -51 -169 -236 -559 -76 -85 71 -176 -529 158
2979 158 190 -106 -283 -392 -153 -133 -188 -846 -412 -23 -117 -323 -340 -396 -107 -22 -396 -518 -270 374 -153 -519
3001e19L6J30L80Ro91p7O89M7o3k45j61M20K34l55l74K99L99k1m76j94P7M54K16
3024B14q13k80K36O17K16p87m95P28M10p3o46k85N39N12l91n14k48O61N39m27
3044b87n79J18P37N16p03o94P12N99K90r08q50P14R16j88p04k98P32O64l21j132
3064f66J25O76N19n08j081M28N76O15r28o76M3J399j60q24n21K51J093k38q89
3083g66n01Q76P09k77p40j16O59N76j77j140j67J112Q51r63p67N24Q75N4m30j040
3103h48M71J086j20q25k85L44R97n2j026n24O96R14n24p72l17Q22M68j30r01j72
3123f98Q89M72m60j095O0R81M50r21n25L84J024J31r59p05N69J233j13q69n05
3142f57P58O72j19q23n28P35P25k51r80m18J057P55p95p95j6J273K58q28r96M28
$$ plain form
3001 -519 -483 -353 27 36 -655 -732 -43 4 -59 -304 -465 -45 189 -166 -540 -241 158 137 -339 -533 -456 -2 214
3024 214 -599 -879 -643 -26 190 -597 -1092 -364 46 -27 -673 -958 -419 93 -298 -812 -1060 -399 140 -287
3044 -287 -866 -748 -11 505 -198 -892 -180 419 709 -199 -1049 -335 581 393 -311 -609 123 787 466 -666
3064 -666 -541 135 654 146 -935 -507 69 684 -244 -920 -877 522 362 -462 -983 -732 361 123 -766
3083 -766 -1267 -391 318 41 -699 -815 -156 420 243 -897 -1064 48 899 -64 -831 -307 568 622 192 -848
3103 -848 -377 709 589 -236 -521 -177 820 768 -258 -782 -86 828 304 -468 -785 37 505 375 -526 -698
3123 -698 191 663 203 -892 -832 149 599 -322 -847 -463 561 692 -267 -972 -403 830 717 -152 -657
3142 -657 101 773 654 -169 -697 38 763 512 -468 -886 171 926 131 -664 -680 593 851 23 -973 -545
3162e45J051K51r35o54P94P80r3j097k48P50Q85l26j118j31J022N68n74j167K96
3181d91R98K96l10r93Q8J200K39q83r43N01R21J47j039o09R14N00K5p35m36N99
3201a1O90l96p19j50O89P16o43n93k20R89K18n13n56K01P54J42o82l77K05P25
3221D69K76n99o93N62N50Q6p36l03M71N72j16p69MN38M67m25r94L77M00N39l93
3242B83m90m32P86M27k26q86K68O80J8l58m87K56N21K24p37k15M44N81n7q93j72
3263d65L36P19j88o32j10N00M81m64o36J18M21N26m97o89L55O49k6m67l19K28
3283a60O44j59l92l88K27P91j71n65j84K86O69o26n73L93M59O9k28o32M82J94
3303A36L02l17l59M03L23j22k28m65LQ59k16j83j24R9M77m08k84J39K46r4j34
$$ plain form
3162 -545 506 757 -178 -832 -38 742 649 -448 -696 54 939 613 -505 -636 386 954 380 -787 -491
3181 -491 507 803 493 -500 -412 788 1027 144 -799 -298 623 770 -269 -878 36 536 561 -174 -610 -11
3201 -11 679 283 -436 -586 103 819 176 -417 -637 352 570 57 -499 -298 456 598 -84 -461 -256 469
3221 469 745 146 -547 15 565 651 -85 -388 83 655 539 -230 -226 312 779 354 -640 -263 137 676 283
3242 283 -207 -639 147 574 348 -538 -270 410 428 70 -417 -161 360 584 -153 -368 76 657 600 -293 -465
3263 -465 -129 590 402 -230 -340 160 641 177 -459 -341 80 606 109 -580 -225 424 398 -69 -388 -160
3283 -160 484 325 -67 -455 -228 563 392 -173 -357 -71 598 -28 -601 -208 251 320 92 -540 -58 136
3303 136 438 121 -238 165 488 366 138 -327 -324 535 319 136 12 111 588 180 -104 35 281 187 53
3324E3l04K60R3k2k55r9O1K83k08m04N3K98n9J98l40L55k08L68k0j96q3K5K32
3347H1l59K53k9k1K46R5l69N2j8K63n3j70R2N6J34k6k28p1j08L59k59O0j23J05
3371c8m5j39N7q2K74j74P9j81J27J75j46j65J32J33j87J82J50m12J90K27k68k30
3393c41J83K57J06jm16J59l5n7K49K70k60p1j38J01l2n8j80q8J32K35o6l22j16
3416d89L42N7l32k17N14O3op0m46L25L06m0k42l11N69K42j82l86J90J25J94m47
3438b41L1J61K23O1m74n%N96k72k67k98N34L06m14k78r8M24J71k84k41J48K89
3460G2J36j28n32K0M29J15k88k80K42M07k52k97j96K60L76j97Jk81M29N6J21r1
3482A22n80M87J61k24l96L65R8J10k18k29K42P4Q3j5o60K61M96J03m22MJ34M7
$$ plain form
3324 53 -251 9 102 80 -175 -274 -213 70 -138 -542 -489 -191 -250 -52 -392 -37 -245 123 103 -93 -176 -151 81
3347 81 -278 -25 -54 -75 171 266 -103 -51 -69 194 141 -29 63 119 253 227 -1 -72 -180 179 -80 -20 -143 -38
3371 -38 -83 -222 -165 -247 27 -147 -68 -249 -122 53 -93 -258 -126 7 -180 2 152 -260 -70 157 -111 -341
3393 -341 -158 99 205 204 -212 -53 -88 -145 104 374 114 43 -95 6 -26 -84 -264 -352 -220 15 -51 -373 -489
3416 -489 -147 -90 -422 -639 -125 -62 -68 -138 -584 -259 47 7 -235 -546 23 265 83 -303 -113 12 206 -241
3438 -241 -210 -49 174 235 -239 -244 -244 352 80 -187 -485 49 355 -59 -337 -435 -11 160 -124 -365 -217 72
3460 72 208 80 -452 -432 -3 112 -176 -456 -214 193 -59 -356 -552 -292 84 -113 -112 -393 36 92 213 122
3482 122 -458 29 190 -34 -430 -65 33 143 -75 -304 -62 12 95 80 -580 -319 177 280 -142 -138 -4 43
3504D3J51k87m25L94L29j06n02k09L87M99k42m78n9M15N18l73o44K68O34P0m61
3525g8l91J97L99J23m99j74J56N91K6o48K3K13N30j41n82j94L93L98j03o67r8
3546e26O76J09l02l87J85N58N9m25n37K95N53j04j20m69L47L30j09k70k35K84
3566h8M34l32o61K73O38m4j33k92n2N53L8k18n75K90K18L34k44m45R5L89O0n21
3588b83j34q3Q18j1n38j52Q4O38jo29n1N16J95j39m36j31L68M64j32m57J93M0
3610A39M09l16o75M32N13J83o30m40K09N42j53p1n96N01M44l93k81kL93J90k92
3631A06l81LK02O22n95l44J09O20P1m96k19K7M33J26l55q2J3O80k30n26n1L41
3653G4L26k51l63O6L16K31j71m77J05m0K22j77n9j29M89J26l17j06K13L84j01
$$ plain form
3504 43 194 -93 -518 -124 205 99 -403 -612 -225 274 32 -446 -505 -90 428 55 -589 -321 313 383 -78
3525 -78 -469 -272 127 250 -249 -423 -267 324 350 -298 -275 -62 468 327 -255 -449 -56 342 239 -428 -526
3546 -526 150 259 -43 -430 -245 313 372 -53 -590 -295 258 154 34 -435 -88 242 133 -137 -372 -88
3566 -88 346 14 -647 -374 264 220 87 -205 -257 296 334 116 -459 -169 49 383 139 -306 -211 178 238 -283
3588 -283 -417 -500 318 307 -231 -383 -299 339 338 -291 -342 174 369 230 -206 -337 31 495 363 -94 99 139
3610 139 548 232 -443 -11 502 685 55 -385 -176 366 213 142 -454 47 491 98 -183 -185 208 398 106
3631 106 -275 -272 -70 552 -43 -387 -278 342 413 -83 -302 -275 158 284 -71 -153 -140 540 310 -216 -267 74
3653 74 400 149 -214 -148 168 399 228 -249 -144 -184 38 -139 -198 -327 162 288 -29 -135 78 462 361
3674C61m30J06J56J74J12p80j66N83J86k47j50j57L98J40k16l82K30K82J06m6
3694B60n80K03L24L9k8l96K92j07J4R3m29K04L04P9m30n9K87J59l64J21J8R8J49
3717B51k75k13J13K51J43q7j59k46M30K2j00k19j37K31J45k71j14K71L06j03l47
3738a08j99K91J49J01l87q4K75L21l62j45N1J71K40r4l20J2L13k08J1k80K18J40
3760A06K0j35p7q9K37jJ04l54M01kj38l16L74k0j09N0j48O3J98q5J04j33oK50
3784B94k57K7j40L66k26K73m25J68j76K0M5O9K0k45L06q1o9P3j3k66J34M6J23
3807F6l62Q2M47l44m8K5Q0jm6N9J38l1j99K22j72L03p0Jl31L92j88K43m56J97
3831GpOk77K12j02n8M3K53M4j77qj9j64O4K38l1l0k03j0J15J54l0l5l0p8J35o3
$$ plain form
3674 361 -69 37 193 367 479 -301 -467 116 302 55 -95 -252 146 286 70 -312 -82 200 306 260
3694 260 -320 -117 207 246 218 -178 114 7 21 114 -315 -111 193 272 -158 -217 70 229 -135 -14 4 102 251
3717 251 -24 -237 -124 127 270 183 24 -222 208 230 130 -89 -226 5 150 -121 -235 36 342 239 -108
3738 -108 -307 -16 133 234 -153 -237 38 359 -3 -148 -97 74 314 220 -100 -88 225 17 28 -252 -34 106
3760 106 126 -9 -86 -175 62 61 165 -189 212 210 72 -244 130 110 1 51 -97 -34 164 79 183 50 44 294
3784 294 37 64 -76 290 64 337 -88 80 -96 -76 -31 38 58 -187 119 38 -31 42 29 -237 -103 -57 66
3807 66 -296 -214 233 -111 -159 -134 -54 -55 -101 -42 96 65 -134 88 -84 219 149 150 -181 211 23 266 -190 7
3831 7 0 6 -271 -59 -161 -219 -176 77 121 -56 -64 -83 -247 -183 55 24 -6 -209 -219 -104 50 20 -15 -45 -123 12 -51
3858e1l7J29j46J23k98K67j16J08M2O5j89J96p6J1q3qJ72j18k6O0J35l60M04m21
3882b17J11J69k97P4M9J95J18k07j20n8J71J9k68L17k59J36J56k14Q6K25p3p7
3904C6j27j30K33L35m62O4O0J51j65J21k34K06J94l06j41o2M23k43M0L1k5J11
3926A10J53k27j61q2L57Q4m24R8m9M10j87k05J66j19P0J33k75o4J28K11l67J22
3948a18k4K27m8K41l28l0K35p1j95j33J65K11k11j61J35K33J55j03j73j73L91
3969B25l15Q3J29j81K4J19n2J72l79K6L07k54n1J1K00r5J47j65M5k5K07p7l55
3992b54J57N9P6j21m2J73k6K1k13L2L22N5k93J92m31K03L69k93l2LM3R9j22k45
4016b68K95j2j96K70m20J87K91p1Pr7n8M79m08n9j12M49j13j57j05J98j17K29
$$ plain form
3858 -51 -88 41 -105 18 -280 -13 -129 -21 21 86 -103 93 17 28 -55 -63 109 -9 -35 25 160 -200 204 -217
3882 -217 -106 63 -234 -160 -111 84 202 -5 -125 -183 -12 7 -261 56 -203 -67 89 -125 -39 186 113 36
3904 36 -91 -221 12 347 -115 -51 9 160 -5 116 -118 88 282 -24 -165 -227 196 -47 -7 24 -1 110
3926 110 263 36 -125 -207 150 234 -190 -92 -141 269 82 -123 43 -76 -6 127 -148 -212 -84 127 -240 -118
3948 -118 -142 85 37 278 -50 -80 155 84 -111 -244 -79 132 -79 -240 -105 128 283 180 7 -166 225
3969 225 -90 -7 122 -59 -35 84 32 204 -175 -149 158 -96 -147 -136 64 -31 116 -49 -4 -29 178 101 -254
3992 -254 -97 -38 38 -83 -125 48 22 43 -170 -138 184 239 -54 138 -293 -90 279 -14 -46 -43 0 99 -23 -268
4016 -268 27 15 -181 89 -331 -144 147 76 83 -14 -72 407 -1 -60 -172 277 164 7 -98 100 -17 212
4038B12K9l09k7K23m00K78L2l1K41j38j19q5J55J71k82l1J30l2J70Lk46R7J94
4061B35nj53j68j82K08K4J19l5j20L9l8N3l37K59K6J21r8N2Mm8K6p5Q5l8K30m0
4087A44m16J48J78K54l20n4kJ65j84M3j28J47J71j99j31L24o3l5J77j69k23M34
4109B61J0l34k03P9K52J22Jk73M7J29j87J88j12lj8J02j08k61L42R2N3m77M30
4132A32j3L4n2k94J57m5J48j45K4j63M36J45k17l50J10J15K08l9n23N63l62J66
4154C5m2Rj5K1l3N4k52K69J22k3k33O5j9K23J9m30K46R4k47J65o7k15M52n0k64
4179a16k3K35J5l08R0o5n2L69l94J64Q6n5l0L44m87K02o7J62j56J98m62K46K40
4202A36l09J12k5K24k90K79o4r6lK47j47m3PL45k35r2Nj37J21K9n5j90J76J31
$$ plain form
4038 212 241 -68 -95 128 -272 6 38 7 248 110 -9 -94 61 232 -50 -81 49 17 187 190 -56 41 235
4061 235 230 77 -91 -273 -65 -41 78 43 -77 -38 -76 -23 -360 -101 -75 46 -52 0 4 -44 -18 -93 -8 -46 184 144
4087 144 -272 -124 54 308 -12 -66 -68 97 -87 -44 -172 -25 146 -53 -184 140 77 42 219 50 -173 261
4109 261 271 -63 -266 -187 65 187 188 -85 -38 91 -96 92 -20 -23 -41 61 -47 -308 34 126 179 -298 132
4132 132 119 153 101 -193 -36 -81 67 -78 -54 -217 219 364 147 -203 -93 22 230 191 -332 231 -131 35
4154 35 -7 2 -13 8 -25 29 -223 46 168 145 -88 -23 -42 181 200 -230 16 110 -137 28 -39 -254 198 148 -116
4179 -116 -139 96 111 -197 -107 -172 -224 145 -249 -85 1 -54 -84 260 -227 -25 -92 70 -86 112 -350 -104 136
4202 136 -173 -61 -86 138 -152 127 63 -33 -36 211 64 21 28 373 138 46 51 -86 35 64 9 -181 -5 126
4226A26q7J34P5j91J64k7k00j60L68j75r0n3L2J74m4k2j91L27k30o3k5J17q6J14
4250a3r0J4n7J9J01M2l4O1P6k02j31K16K77m40L1JJ82OP9k32K11j40q7J4Q3J16
4276A03NK19k69J3J6K01o0l19J0R0j32n8J60L48k60J05k29J19j34K39j76K39j25
4299A05J7J27l87M49m04L38m58K39m0k58J79R6r5J66J9n4j2p7L1L2j82J5L09j25
4323C0Pm7o6o0M07k07J38l10J0J33n9k24K37J16k02J62Q2k66P9Q2j0p8j4J13j41
4348h8k5K16p9j2L8l8J38l86L43M1P5l81J09J2m4K31j58o7n0J20PP8o9nMk3j92
4375b05K25o7j7Mj18R4J36j15j31J47J1q1K76J3j04l57L96k66k3N3o7N15l05J48
4399A62k09J93q5K39m25K57q1k08R0O3J00r2J72l45J35j17K53j13J41j83j5L30
$$ plain form
4226 126 39 173 248 57 221 194 -6 -166 202 27 -63 -116 -84 90 46 24 -167 160 -70 -133 -158 -41 -127 -13
4250 -13 -103 -89 -146 -127 -26 16 -18 43 119 -83 -214 2 279 -161 -130 -129 53 59 138 -94 117 -23 -110 -96 -13 103
4276 103 108 327 58 71 87 288 228 -91 -81 9 -123 -181 -21 327 67 172 -57 62 -72 167 -9 230 105
4299 105 122 249 -138 311 -93 245 -213 26 -14 -272 -93 3 -92 74 93 39 27 -50 -19 13 -169 -154 155 30
4323 30 37 -10 -76 -136 271 64 202 -108 -98 35 -24 -248 -11 105 -97 65 147 -119 -40 42 32 -46 -60 53 -88
4348 -88 -113 103 24 12 50 12 150 -236 107 148 223 -158 -49 -37 -81 150 -8 -75 -125 -5 2 80 11 6 10 -13 -205
4375 -205 20 -47 -64 -60 -178 -84 52 -63 -194 -47 -36 -117 159 172 68 -289 107 -159 -182 -129 -196 319 14 162
4399 162 -47 146 61 300 -125 132 51 -157 -67 -4 96 4 176 -169 -34 -151 102 -11 130 -53 -68 262
4421B62j48k93O9j3K36m72L25%L40j70k49J40j29L63j27j36J92j84j43L26l3j70
4443a4q9K33o9o5k09L04NN2pk49p1K15L0m4k5J7N6j22N0k11L14Kl52K12n3L43
4469B53j39j70J27p7rj3K25q2j45J62Q0k47j75L02ml8k64K27Q1q2J51j03j18L65
4493C07j05l53R7J03J02l5k77K85j92J28L15m82j26L54J5J26n03K13O8J4M3l17
4515b20KK58o2J45k79Q4ONJ04n2P2K28o8m44n0L01j2J20j67j37K53q1j02M92m02
4540fQ4m4m1J89j73j50K33Mk54m5L49K0n6R0l36J59M3Rj6l7J30k0jK7j03k43L66
4567A78o4l16J63Lk27L58k89K26p1J79j50j97J79J00j11l4k52M26j08J78j23k0
4589B8R7r5l6k9J90q7L6p9J8j12k5l1J93k7j73K26q7l0p8k8J78N6k05J12oJ60
$$ plain form
4421 262 114 -179 -110 -123 113 -359 -34 -34 306 136 -113 27 -102 261 134 -2 190 6 -137 189 156 -14
4443 -14 -103 130 61 -4 -213 91 96 148 141 -108 -179 36 66 22 -3 14 70 -52 -2 -213 101 103 -249 -37 -90 253
4469 253 114 -56 71 -6 -15 -28 197 115 -30 132 212 -35 -210 92 88 50 -214 13 94 12 163 60 -58 307
4493 307 202 -151 -54 49 151 116 -161 124 -68 60 375 -107 -233 121 136 262 -241 -28 40 54 97 -220
4515 -220 -218 40 -22 123 -156 -72 -66 -61 43 -9 63 291 223 -221 -271 30 18 138 -29 -166 87 6 -96 396 -6
4540 -6 78 34 -7 182 9 -141 92 96 -158 -203 146 166 110 200 -136 23 66 75 59 22 152 132 131 158 55 -188 178
4567 178 114 -202 -39 -36 -263 95 -194 32 -39 140 -10 -207 -28 72 -39 -73 -325 101 -7 171 48 28
4589 28 125 30 -6 -35 155 68 104 25 43 -69 -94 -125 68 41 -132 94 7 -23 -101 -129 49 105 -100 12 6 166
4615A66j79o4L56p1j99kq5OL9ok5k60K26J46K08m28K20j49O3K16l66J09j30J76
4639c3j51J26J58OJ1r9J13k71J36p1L7l2J58j91Q5j90J97j15M10l5k10r4K68k03
4663A0k8j07o7J16K10k97j74K54j01K46k23J80j42J81L5l16J45L8K18j47r6L4
4685c1K91j04k20Q2l8K91k89J72k47R2k4L7j26K44r1j98J63k16J83J22J94l27
4707d0N8k2k2J47j66P9j4J08o9M5k00k6J33j35J98j59L46K2k63J4J28l26J88P9
4731A03o2m5k38J33K06m1p4j03K02q1k5O0j19J30K90l43N6L7j79j76L42Q2o9j0
4755G6l28J35J83k81J53J18j84K60l00K38P6l42L8J43K04n05N12k26J08j51K89
4776B16m3l23K83L9j97k4L13k80j07J65j4k58K64q9m7J84j67l8M6J35j72J05r3
$$ plain form
4615 166 -13 -77 279 208 9 7 -78 -72 -33 -39 -64 -324 -98 48 256 -172 48 -101 -38 178 -188 -79 -209 -33
4639 -33 -184 -58 100 106 117 18 131 -140 -4 -75 -38 -70 88 -103 -18 -208 -11 -126 284 249 39 -55 213 10
4663 10 -18 -125 -192 -76 134 -163 -337 -83 -184 62 -161 19 -123 58 93 -223 -78 -40 178 31 -65 -31
4685 -31 260 156 -64 18 -20 271 -18 154 -93 -1 -25 12 -114 130 39 -159 4 -212 -29 93 287 -40
4707 -40 18 -4 -26 121 -45 34 20 128 59 104 -96 -122 11 -124 74 -85 261 283 20 34 162 -164 24 103
4731 103 41 -4 -242 -109 97 56 -18 -121 81 0 -25 35 -84 46 336 -7 49 86 -93 -269 73 155 86 76
4755 76 -252 -117 66 -215 -62 56 -128 132 -168 70 146 -196 -158 -15 189 -316 196 -30 78 -73 216
4776 216 173 -150 133 172 -25 -49 264 -16 -123 42 28 -230 34 -55 -102 82 -85 -123 -77 58 -114 -9 -102
4799a02K24j15j96M01m21L82j33K62j58k98M39l9k04k78Q3l2J5K78k28NJ30k44
4821b29K27j33J52K75k69j25K34m26M02j49k5O4N8N7q7O4j11J17r6j14j53L99
4843A32k10l5j8J1J52k9J25o2K2j51N4N4k39K50j69K97r9j90K39L7j05k21Q7J4
4867e4q9J81r2m0m4J77j58J76m02K94O13m06k07q5O2L31k59M2j32K19m8L8k18
4890a01K0M0J68k86J63j31M4N0j86J66O5P9Q6l40j49K68K69m16nP2K07n4k22k2
4914b15J38Q3J84l60Q1k00M00K7o1j89K37o5k2L7j75L24J64k89P5j85J3J99ll91
4938a93L4K35O7k61j48J02J57M86o19j31q2L69J49l26PK45j41J10j80j28K98o
4960D4j10Q0l07M57K5q6m1r7J42L6j80j09J98m3M6j96l6K48j01J97n1m63L03J60
$$ plain form
4799 -102 122 7 -189 212 -209 173 40 302 144 -154 285 246 42 -236 -153 -185 -170 108 -120 -115 15 -229
4821 -229 -2 -135 17 292 23 -102 132 -294 108 -41 -66 -2 56 113 26 90 -21 96 0 -114 -267 132
4843 132 -78 -113 -131 -120 32 3 128 66 88 -63 -9 45 -194 56 -113 184 85 -105 134 171 66 -155 -68 -54
4867 -54 -143 38 -54 -94 -138 39 -119 57 -345 -51 562 156 -51 -136 -74 257 -2 40 -92 127 79 117 -101
4890 -101 -81 -41 127 -159 4 -127 -83 -33 -219 -53 12 91 177 -163 -312 -44 225 -191 -196 -124 83 29 -193 -215
4914 -215 -77 6 190 -170 -89 -289 111 138 77 -112 125 60 38 75 -100 224 388 99 174 -11 2 201 198 -193
4938 -193 -159 76 143 -118 -266 -164 -7 479 -140 -271 -353 16 165 -161 -154 91 -50 60 -120 -248 50 44
4960 44 -66 14 -293 164 189 103 62 -35 107 143 -37 -146 52 9 55 -141 -177 71 -30 167 116 -347 -44 116
4984A16k02J81m7j3J05l75K50j99J15J9J06j12j48Q3L25k54O7l60K82J33j38L0
5006c6j26R3j00J75K12l44O2L31j83q1J52P4j38k28J51j2P1Q4n2o7J53k73R9j07
5030i0J94o4J16k44nK8JJ74l5l52J70K75j13J60l09K21j17J53m2j24J9J71j89
5053bq1j25K30k15K99J1n39M05j13J85k2j25K81j87J64k67K11m3K5k19m2p3L02
5076F0k57K25lJ57l7j89o4l0K86k21K5j1Q8J9N3j32q2J53Q5j28j27J29j60Q0j72
5101b53K44m7J05NmNM2j36J17j60N9R8n2k18J13J56o0j18L52l24j54L6K33pj37
5126a05o4K21p5o4J35j48J39l4j07K56L1j38l2j12J40m24L73M4p2o5J52K65l65
5149d9j45K54K0J6R2j66j29r2J58n8K55k47O2j95J76k1J45J51k77J29j58r6nK89
$$ plain form
4984 116 -86 95 48 35 140 -235 15 -184 -69 -50 56 -56 -204 -121 204 -50 17 -343 -61 72 -66 -36
5006 -36 -162 -69 -169 6 218 -126 -64 267 84 3 155 229 91 -137 14 2 73 157 105 38 191 -82 17 -90
5030 -90 104 40 156 -88 -93 -65 -64 110 75 -277 -107 168 55 215 -94 127 10 163 121 -3 16 187 -2
5053 -2 -83 -208 22 -193 106 117 -422 -17 -130 55 33 -92 189 2 166 -101 110 67 92 -127 -169 -242 60
5076 60 -197 28 25 182 145 -44 -108 -138 148 -73 -48 -59 29 48 101 -31 -113 40 125 -3 -130 -1 -161 -81 -253
5101 -253 -9 -56 49 54 50 55 97 -39 78 -82 -23 75 23 -195 -82 74 14 -104 248 -76 -230 -194 39 32 -105
5126 -105 -169 52 -23 -87 48 -100 39 5 -102 154 185 47 15 -97 43 -381 -8 36 -36 -101 51 316 -49
5149 -49 -194 60 80 96 188 22 -107 -199 -41 -99 156 -91 -29 -224 -48 -69 76 227 -50 79 -79 -175 -180 109
5173A09j91L1Q5M9j34J93l14K02k9l9K78p5k59K71k70p8K37l5J12M3j17O3k31
5196i9J94l2P7Lj04k80L03k11R6N9j25K77k50J27J77j77R1j83j39j6J25P9P5j84
5220a17P1M3roJ0k04K01J25J07k56k06J95J75p3J20j68j1n6o7m2L1J27K59k35
5244A4p3j82K41j35J2j2P0J36m1k18K58rj9n1KM7n9N5K11l38J59j7J1M9k51J49
5270IJ09q4n2n3m4J29J94l7j45J23j88J65n8r8k40L79j49n8J22J06K2j23j24o1
5294a56K48R0k56J09j33J29n6m1k24M06k32Q8p9p8R1k92L76l5J12j38J71J27k55
5317b8J22j22J45j50j70K49j19o3o5P0K01J4k00K09n7N4M9p6k55L07k55J84J21
5340A65j20k8%J23l44J09j04O4J82j15R3jL1K04k79k54J36J54L5k3j29J30R4p4
$$ plain form
5173 109 -82 -51 34 83 -51 142 -172 30 1 -38 240 165 -94 177 -93 -171 66 31 143 186 69 132 -99
5196 -99 95 63 140 143 39 -241 62 -149 -53 6 -119 158 -92 35 212 35 126 -57 -196 -212 -87 -8 67 -117
5220 -117 -46 -3 -12 -18 -8 -212 -11 114 221 -35 -241 -46 129 56 176 8 -3 -59 -126 -168 -137 -10 249 14
5244 14 -59 -241 0 -135 -123 -135 -65 71 30 -188 70 61 42 -9 -7 40 -19 36 247 -91 68 51 62 111 -140 9
5270 9 118 34 -18 -71 -115 14 208 171 26 149 -39 126 68 -30 -270 109 -40 -98 24 130 152 29 -95 -156
5294 -156 92 182 -74 35 -98 31 -25 -66 -290 116 -116 -28 -107 -185 -94 -386 -10 -45 67 -71 100 227 -28
5317 -28 94 -28 117 -33 -203 46 -73 -136 -201 -131 70 84 -116 93 36 90 139 63 -192 115 -140 44 165
5340 165 45 17 17 140 -204 -95 -199 -135 47 -68 25 24 55 259 -20 -274 -138 16 51 28 -101 29 123 49
5364D9l0J81k99m1Q2m2K32k24NJ28o1K7J78r1j69j1J41k26J45O0n0j63J11K8L2
5389hP2k46K64n2Q3j62M2O1J13l46J94J08k50M8L83k00j55K84r1n9R2j03j73R8
5413ck6K50k14k18q8O2K02p0K20k09l5Q5l59L47l3M9p1K27l36n1J17Q4Q2j61J07
5438d2J72k44J50j80K10q5L9K4P5l42L84J15k86l54M91k53K15j2J09m53K18J65
5460A16k03L03rj51k8J2k99K00j09L10J6k44P5J23j53K04j63L5K7O8K4j10j26
5483h2K47n6J22q4j77j04J41L3J6K11k74j9KlO3M3j53P5K42k49j8M4n5l3J12R1
5509A35j05j13Ko4N38o12K62j12J83j88nj33M11k26J7Q3j54J98o0n2L1m8m6K41
5533A83n07K52N1RJ22K3j44N2J9j14K38l63L35j07M1k13j82K92j01J02O9j9Ql0
$$ plain form
5364 49 19 200 -99 -140 -58 -100 132 -92 -87 41 -20 7 185 94 -75 -86 55 -171 -26 34 -16 -179 -68 -40 -8
5389 -8 64 -182 82 30 113 -49 -7 54 167 -179 15 123 -127 -79 304 104 -51 233 142 83 175 72 -101 -3
5413 -3 -29 221 7 -211 -299 -237 -35 -105 115 -94 -129 -44 -403 -56 -89 -40 -111 116 -220 -271 -154 -70 12 -149 -42
5438 -42 130 -114 36 -144 66 -19 20 44 119 -223 161 276 -10 -364 127 -126 89 77 186 -267 -49 116
5460 116 -87 216 207 56 28 40 -259 -59 -168 142 158 -86 -11 112 -41 163 0 35 62 130 154 44 -82
5483 -82 165 109 231 147 -30 -134 7 40 56 267 -7 -26 -24 -27 36 79 -74 1 243 -6 -24 20 -35 -68 44 135
5509 135 30 -83 -81 -145 393 -219 43 -69 114 -74 -79 -212 199 -27 -10 73 -81 117 57 5 36 -12 -58 183
5533 183 -324 -72 -21 -12 110 133 -11 41 60 -54 184 -179 156 49 90 -123 -305 -13 -114 -12 57 38 46 16
5557A6o3P3o9QJ32o5j3J04k29J41r6K0J38n7j89P4L7J15l3K0j0n9J04n1j52nQ0
5584b9K08j90J41k49QJ74K4k2J55k06j50R6m1Q5j62P3J79k17N3J30J58l65j7K08
5608D4M1l1j99L98j49r6M5m7j21N6Q2m7L20k05j73J59o4O9K9rj87L5J1j51J91
5633Aj09q1L97k16o6O5J33j86o5K84j10m7nk0qJ57n0pj90mL54l05R1M5O8m36K28
5660h2M4K54l99j36L35j5J24k86L2J47L33k85l20L63Q9l03L4J53j33J64m8j16
5682e1j39K51L8j21R4N5j68J84P4l35K47k76L38l20J21J18o4K1n7J4p5M1PJ68
5706A65j31L6k03Q6j21K05m8J96q1j35k3M6k59L98j63pk36N86o78J70L36q8P1
5729A22k03q7M37j75k25Q8j88L03j35L36k86J78j79K25k10j5o0N8K7J26k49K02
$$ plain form
5557 16 -47 26 -43 -35 97 32 19 123 -106 35 -61 -41 97 40 -149 -75 -38 77 44 64 54 -5 99 48 -104 -109 -29
5584 -29 179 -11 130 -119 -111 63 87 65 220 14 -136 -40 -81 4 -158 -85 94 -123 -70 60 218 -147 -164 44
5608 44 85 54 -145 253 104 8 53 6 -115 -59 23 -24 296 91 -82 77 13 82 111 102 -85 -50 -39 -190 1
5633 1 -108 -189 208 -8 -74 -9 124 -62 -127 157 47 0 -5 -25 -33 124 74 67 -123 -127 227 -78 13 58 126 -310 -82
5660 -82 -38 216 -183 -319 16 1 125 -161 -129 18 351 66 -254 109 198 -105 -71 82 -51 113 65 -51
5682 -51 -190 61 99 -22 72 127 -41 143 217 -118 129 -147 191 -129 -8 110 46 67 10 24 -51 -10 -3 165
5706 165 34 70 -133 -47 -168 37 -11 185 104 -31 -54 -8 -267 131 -32 -39 -275 311 -367 -197 139 51 122
5729 122 -81 -168 269 94 -131 -43 -231 72 -63 273 -13 165 -14 211 1 -14 -74 -16 11 137 -112 90
5751I0l88L24n2N9k9lJ74k4p5p6k5P8K8j33N5k10J30R5L5M7k16P9O6P4l1j0n4
5778Hj42J61K2q9j89K91K1j3m5k36L55k07K69l36K14r5J70j28q9P1j9N3Lj00M3
5803gjM8r2p7p1J46J25j47j27K29L9j30Q8j60K64j45J73j90m4p4J44J64j02j32
5827g9K51j79J41k86J34j28K17j0k05r0M93n13L07p4R7n9J91j54K6K8j94J91k2
5850H3n0l9Q5j81K03l77K22p7J34j9j39J08j21oJ66o0J89k44J62j60nK09J31k84
5874g0K0j5k8j0L3J97q0j02o8J64rL24l09J0R2k71P4J29K6q2o4l4J2J86j69L3
5900a1j82L40k10J39l2j3J68l80P0K31o8j40q0M7K63l92L01q4N7K7n7K7j8KK9
5925C4K67l81K8J59R7k26k0k84K25K31j99R2j70J29N5K6j46j25L60j52l4k45K10
$$ plain form
5751 90 -298 26 -26 33 4 1 175 151 76 0 -25 53 81 -52 3 -207 -77 18 53 100 -116 -37 29 103 72 62 8
5778 8 -134 27 49 -40 -229 62 83 70 25 -211 144 -63 206 -130 84 -11 159 31 -58 13 -6 47 50 -50 -7
5803 -7 -8 40 -52 -129 -200 -54 71 -76 -203 26 65 -65 23 -137 127 -18 155 -35 -79 -153 -9 155 53 -79
5827 -79 172 -7 134 -152 -18 -146 71 61 -144 -234 259 -254 53 -21 76 17 208 54 80 108 -86 105 83
5850 83 33 -6 79 -102 101 -276 -54 -131 3 -16 -155 -47 -168 -174 -8 -68 121 -123 39 -121 -126 83 214 -70
5874 -70 -50 -65 -93 -103 -70 127 47 -55 -123 41 32 356 47 57 149 -122 -48 81 107 25 -39 -73 -61 125 -44 -11
5900 -11 -193 147 -63 76 44 31 199 -181 -111 120 52 -88 -168 -121 142 -250 51 -33 24 51 -6 21 3 5 34
5925 34 301 -80 -52 107 204 -22 -42 -326 -101 130 -69 23 -147 -18 37 63 -83 -208 152 0 -34 -279 -69
5948f9Q5N6j38Q9j12M19k14j19R7j05J34k04R4J76j67L5k5r5p1P0L7K02j85l7
5972d7O5n9O4k26K20K30k98j71J7QJ95j4n5J01j48Q3L59m44j47J54J54JL9n5J3
5997C9N8J12k59L1K7P1j84K59j34l4p2J59k90R0oJ39Q2q9MJ68j15J18k94J70j68
6022a18K45k6j04J13j64n3L4%J49j03J10N5j61Q1q0K52k58K5R1j70k3Q7K1J14
6046A17j09K4o7j79L11m0j75N1K3j69L39J48l71J75j67J7o5R0k35K38j9P6n3o2
6070a02K11k39M18j95N0j93J01p0K0O5j03J70k29J05j40K31J36j75J65k94J50
6091H2k28K65j70J11j91J69N1l10L74l05J63J25p0k6K8k7J46k65N8K11k06p5k
6114i2Q2K6P5j56K67k67Q4J1k34N9N3J56L9j45j32K39j1j20p3J77j97L73l87J27
$$ plain form
5948 -69 16 72 -66 23 -89 330 116 -3 94 -11 123 -81 13 189 22 57 32 -63 -134 -64 -27 175 -10 -47
5972 -47 18 -41 23 -203 17 247 -51 -222 -205 -197 -2 -16 -71 30 -118 -35 324 -120 -267 -113 41 42 81 26 39
5997 39 97 209 -50 -19 8 79 -105 154 20 -14 -86 73 -217 -127 -133 6 88 -1 3 171 56 174 -120 50 -118
6022 -118 127 101 -3 110 -54 -107 -73 -73 76 -27 83 138 -23 58 -22 230 -28 -3 88 -82 -105 -18 3 117
6046 117 8 32 -35 -214 97 57 -118 -67 -44 -213 126 274 -97 78 -89 -72 -137 -47 -282 -44 -63 13 -40 -102
6070 -102 109 -130 288 93 143 -50 51 -19 1 66 -37 133 -96 9 -131 100 236 61 226 -68 82
6091 82 -146 119 -51 60 -131 38 89 -221 153 -152 11 136 66 40 68 41 187 -78 -20 191 -15 -90 -92
6114 -92 -10 16 91 -65 202 -65 19 30 -204 -145 -92 64 103 -42 -174 65 54 -66 -139 38 -159 214 -173 -46
6138d6K31m92L39r1J93m06J84J78q9rJ23p0j18Q3%m0j97L29j17L1pO0k08J40j82
6163a81L83kj10p2j62P7Q7P2k39K70kk7j23n1O0L9o1k29J89P3J16Pk75J57n0M6
6189hj89P2R5o0K87k87q0K03j50J23q3n0lJ2R9K13j55k96L44K26k15j45L78k35
6213I6k0J50k76Q6J31k21j1O3j59J89J6O4o4J11pj58K16k71J33Ro6j28K3J40J23
6238A69n2l21K64Q9l21J31J03K35m58J66L2J25j33nm7J01q3kp7J86k14R7J23j29
6262b1Q5k19J03q3L7J41L1j69rK02R1Ll60K89k7p5o5K45j51j06J36p0o3J15q2
6287b2J0m5J26K09k23r8N0J50j99M8o7J41Q0j03r5N5n0Q5OR1j79J0L8Q2k57j9
6313a76K36%J8r7N3M2k03N9K7J78n4oL1J51j68J89k9m23M13j29j60M2rj42K03
$$ plain form
6138 -46 185 -307 32 -59 134 -272 -88 90 1 -8 115 45 -73 10 10 -30 -227 102 -15 16 9 69 -139 1 -181
6163 -181 202 200 90 18 -144 -67 20 92 -147 123 121 94 -29 -80 -20 19 -42 -271 -82 -9 107 114 -161 -4 -54 -8
6189 -8 -197 -125 -30 -90 197 -90 -170 33 -117 6 -77 -127 -130 -118 -19 194 39 -257 87 313 98 -47 331 96
6213 96 76 226 -50 36 167 -54 -65 -2 -161 28 44 108 44 155 148 -10 206 -65 68 77 11 -117 -94 46 169
6238 169 117 -204 60 149 -172 -41 62 297 -161 5 37 162 29 24 -23 78 -5 -7 -84 102 -112 -15 108 -21
6262 -21 64 -155 -52 -135 -98 43 74 -95 -104 98 189 192 -168 121 94 19 -46 199 48 -58 78 8 -55 60 -22
6287 -22 -12 -57 69 278 55 -43 7 157 -42 6 -61 80 160 57 -38 17 -33 52 58 149 -30 -20 18 100 -157 -176
6313 -176 60 60 78 -19 34 76 -127 -68 -41 137 83 77 108 259 91 280 251 -172 241 112 -48 -6 -15 -157 46
6338D6L3j46o4J70J93k49J14l39N8j12L31q7mj45L26j40J58m34L62J61j77Qj64
6361a01J29J27J7j37O7k59R4j12o6J05L88j36p5qk36P3K65j50p4J26Jj06j36K65
6385F1j90MJ87q7j61J79J36j99O0K1Jn8k30K29P9Rk12r0N40k74j1J6j05J16k33
6410b12R3j13K02j24J18M7J16p6k00K28R4l50K29j49N9l9J29P8n6J9j70K84k39
6433c2k4q7K93j77L14m57nL27k82K51j48O5j56K01k09Q8Q4J18l31K12L7L0r1k08
6457a87K09j16M25m26L00l2k36J73j9j53q7L60j50j4K3j03J14q4P1j15j30M53
6479B76j26k80L53k15j47K56q7J08k82K29q5N8Kj46J21j59M6J94N4n6k74J58J06
6502A04l98K5K46Ok5l2P8j05J3R9J17k30L60l05KJ93j00J2K22n59J69N2N6M1k41
$$ plain form
6338 46 79 -67 -131 39 232 -17 97 -242 -184 -296 35 -52 -56 -201 125 -15 143 -291 71 232 55 63 -101
6361 -101 28 155 172 35 102 -157 -63 -175 -241 -136 252 116 41 33 -203 -130 135 -15 -89 37 38 -68 -204 61
6385 61 -129 -125 62 -25 -186 -7 129 -70 -10 11 12 -46 -276 -47 32 41 -171 -261 279 5 -6 10 -95 21 -212
6410 -212 -119 -232 -30 -154 -36 11 127 51 -149 79 173 -177 52 -97 -38 -77 52 130 74 93 -77 207 -32
6433 -32 -56 -143 150 -27 287 -170 -175 152 -130 121 -27 38 -118 83 -126 -38 46 164 -167 45 82 112 21 -187
6457 -187 22 -94 331 -95 205 173 -63 110 91 -62 -149 211 61 47 70 -33 81 -3 68 -47 -177 276
6479 276 150 -130 223 8 -139 117 30 138 -144 85 0 58 60 -86 35 -124 -78 116 170 114 -160 -2 104
6502 104 -294 -269 -23 -17 -42 -74 4 -101 -88 11 128 -102 258 -47 -45 148 48 60 282 -277 -108 -56 0 41 -200
6527b00L45l26K91n4j63o8J99OO5n9j52J51k18J19J62k78L49M4j83p6K65j41k21
6550a43L7O0M2O4k36r8K18J69j84O1J06o8O3K7m9m5q8n4M31l22k61N19k07M3j23
6575c8j10J2n0q1L03k7k27J88J81k05J91j27q1J63k35J71L5k47K39n4n3j08Q3
6598g7m8J11p6k2K30j61j70K11J4j90K39l6k02L12j92N9J12j87J51q3r9rJ75j38
6622g6J46j89j80M03r6O9J07l72m1L10om0M9r7L47k56K7R3l18l1j03R2J89M1J46
6647B14m91K05J38k7j37KJ98K11m09J41j8K1n3j3j50L10j30k3p6K5j7K04o8O2
6671A19R8l88L17j20j12M1JK8L0K4l2j68J13J91k98R8J34m0j76K33j44J17K51
6694C17k06j81o3J43J31j16j22l8K73Q6k7l34N6J43O0J9j72J08j27J38k86J38
$$ plain form
6527 -200 145 -181 110 56 -107 -175 24 30 95 36 -116 35 -183 -64 98 -180 169 213 30 -46 219 78 -143
6550 -143 -106 -46 -4 60 -176 -274 -56 113 -71 -10 96 28 91 118 69 24 -64 -118 313 -9 -270 249 42 85 -38
6575 -38 -148 -136 -186 -267 36 9 -218 -30 151 -54 137 10 -71 92 -143 28 63 -184 55 1 -52 -160 -77
6598 -77 -125 -14 -90 -112 118 -43 -213 -2 12 -178 61 25 -177 135 -57 2 114 -73 78 -5 -104 -113 62 -76
6622 -76 70 -119 -299 104 8 77 184 -188 -229 81 75 35 84 -13 334 78 105 198 -120 -151 -254 -162 27 68 214
6647 214 -277 -72 66 39 -98 -96 102 313 -96 45 27 48 -5 -18 -168 142 12 -11 -87 -62 -79 125 57 119
6671 119 217 -171 146 26 -86 -45 -44 -16 14 38 6 -162 -49 142 -156 -58 76 36 -140 93 -51 66 317
6694 317 111 -70 -133 10 141 25 -97 -135 138 224 197 -137 -81 62 122 141 -31 77 -50 88 -198 -60
6716f0r5M38m59o5L39j56J29R6m56L40q7q4J33r8O5j16K90k25m9K22j45J63k59
6739a39j0M21m00K80J3k26J58Kl36K07j6j30J13J54n1o6J1J62j81P5k94L94j00
6762D1j42J90j14P9m4r8j12J58J69j84p4J95J5m8QM2j38j23L21j11J63j34j07
6785d8J22L4q9N4M9r7j05P2PJ90l63Q6K51l68K82O5k02J4rp2O8J8p0%K3O6N4k05
6813a73M4K14Q4k26Q3%J54o6j5j69J96N4J89n27P8K05m2j78Q8K23k71J21l06P8
6837a62K05j4J4j23j4J57j46j03J74O4O6J3j02q8J24K9j22p3N4M4j50J81k4K02
6861B06j89J04j97j12K31J42j98j28k3K92j98J67j71J01j5k2J14r4L2Lm1j25K36
6884A15l66L43P1l26L63j93O1j26J9J14Q2k86J22j0p4M9Pl7J29L0K0j34j49Q6
$$ plain form
6716 -60 -155 283 -176 -241 98 -58 71 167 -289 51 -36 -120 13 -85 -20 -136 154 -71 -120 102 -43 120 -139
6739 -139 -149 272 -128 152 165 -61 97 99 -237 -30 -46 -176 -63 91 40 -26 -15 147 -34 41 -253 141 41
6762 41 -101 89 -25 54 10 -88 -200 -42 127 -57 -131 64 79 31 39 81 -57 -180 141 30 193 59 -48
6785 -48 74 108 19 73 122 25 -80 -8 -1 189 -174 -88 163 -205 77 142 -60 -46 -55 -127 -59 -41 -111 -111 -88 -22 32 -173
6813 -173 -129 85 169 -57 26 26 180 114 99 -70 126 180 369 -158 -80 125 83 -95 -7 216 -55 66 -240 -162
6837 -162 43 29 43 -80 -94 63 -83 -186 -12 52 118 131 29 -59 65 94 -28 -101 -47 -3 -153 28 4 206
6861 206 17 121 -76 -188 43 185 -13 -141 -164 128 -70 97 -74 27 12 -10 104 10 42 45 4 -121 115
6884 115 -251 92 163 -163 200 7 68 -58 -39 75 157 -129 -7 -17 -91 -42 -35 -72 57 87 107 -27 -176 -90
6908i0K1P8R2j3j95n5p1J11O7K44j9j56m4j42J23J69j06l4J34Q0j70r9m8J09n0
6933f4J57Q8j86j2M3p8N0j87K45J84k28q4J21k72J60K49q8k20O6J4R2P9j81j21
6957a73K21r6R6K5j8m9J89k93p5K20l0K3k56M68l77K23k71Q8J41jj96P8l0JL9
6982e3K22l86J76K79l22R9j4j7k34L54k6k37Q0L73l02L01k46l8j38J79k3l32K62
7005d3O4J05k51K02p4JRk90L43L8j20K9j6O9m5J29j70J84k45J70k6M8j99o0mK81
7031A29J54l11J07l1nQj48Rk55L71k84MP6K29j56K38L0ln4j41K5j11L00K2l73
7056a70J78j29J21MJ24j61m6k05M04q9j01K23k34K56k20L4QJ9j85L08j74L52j76
7079A41N8k57N9K55k78pJ17M9R2k63K4l8m4j1L96m71K71l35L58m2J1n8m6M9O9
$$ plain form
6908 -90 -69 9 101 88 -107 -162 -233 -122 -55 189 170 14 -30 -172 -49 120 14 -20 114 194 24 -75 -123 -14 -64
6933 -64 93 181 -5 -17 26 -52 -2 -189 56 240 12 -72 49 -223 -63 186 98 -122 -56 -42 50 129 -52 -173
6957 -173 48 -48 48 73 55 6 195 -98 -173 47 17 40 -216 252 -125 98 -173 -85 56 55 -141 -63 -93 -92 -53
6982 -53 169 -217 -41 238 -84 15 1 -16 -250 104 78 -159 -79 294 -8 293 47 9 -129 50 27 -305 -43
7005 -43 21 126 -125 77 3 4 13 -277 66 104 -16 13 -3 66 21 150 -20 164 -81 89 63 111 -88 -148 -152 129
7031 129 283 -28 79 48 43 51 -97 -88 -343 28 -256 -252 -176 53 -103 135 165 162 108 -33 -8 -119 181 203 -170
7056 -170 8 -121 0 4 128 -33 -79 -284 120 31 -70 153 -81 175 -45 -11 -3 16 -169 139 -35 317 141
7079 141 199 -58 1 256 -22 -29 88 137 229 -34 -10 -48 -92 -103 293 -178 93 -242 116 74 85 27 -19 30 99
7104I9r4l35L60k9j46K59k9j72K09J7K70l45K12j74k09R8k47K31j75M7K97k50
7126a06L16n35K09L64l72K89l91m9K21j72M46l86J64j5l9j0J6N7j09o7L16j28
7148A9R5J8L2k39K14j30O6nk00P5j56K66p3P9j81N5%j92J54R9l4J77J89j37m25
7173b34L11q7O5M5r9P2R9l58K38r3K0J22j23J21k68K26j67O9K39r1o9%O4n5k02
7198a55K53j15j03j78L46J34k77k31J50K59%J08k90J12q5J44k03N0O6J87j46k72
7220b46J41j5K05j01j58K63j33p1K18j76Mm9J84J0L3p0M3k46N2j49R1Q3K11j91
7244f7k38K82m5K93j56r2J80m02J80K94j24Jj75M22k01q7p8o5K58m73L25NP6j98
7268h5J55r0r2K80k44J50j32j38L41l64K60k45K06J02j00J16k39J4n4m5J78j30
$$ plain form
7104 99 5 -330 30 1 -145 114 85 -87 122 139 409 64 276 102 -107 -9 -256 -25 -200 -153 144 -106
7126 -106 210 -325 -116 248 -124 165 -226 -275 -54 -226 220 -166 -2 -17 -56 -66 -50 7 -102 -169 147 19
7148 19 114 132 164 -75 139 9 75 70 -130 -55 -211 55 -18 61 -120 -65 -65 -257 -103 -4 -38 139 328 191 -234
7173 -234 77 -10 55 100 1 73 172 -186 52 -41 -21 101 -22 99 -169 57 -110 -41 198 107 38 38 102 47 -155
7198 -155 98 -17 -120 -298 48 182 -95 -326 -176 83 83 191 -99 13 -72 72 -131 -81 -15 172 26 -246
7220 -246 -105 -120 85 -16 -174 89 -44 -115 103 -73 -69 -118 66 76 109 39 82 -164 -112 -261 -170 -87 124 -67
7244 -67 -305 -23 -68 225 69 -23 157 -245 -65 229 105 106 -69 353 152 65 -13 -78 180 -293 32 37 113 -85
7268 -85 70 -20 -112 168 -76 74 -58 -196 145 -219 41 -204 2 104 4 120 -119 -105 -159 -204 -26 -156
7290a56J84j57%J19J54r7j73J58k62J20r8L17j97n4P8p3k2r2L77l38L0M8L32k58
7314f0p1L77l74K50k87J36J21k73K19j18RL1O5P2j97K78P6m52L95l06J37P3l27
7337b26O3K02j65K93k33p0K77j93Q5r4K02k76J51n9J97M6k93j8J08j19M2K8l4
7360h6j32K46nMj21n3R9l3L59k10k73j07K80N5J90pl23M4M2NK4n3J66j03j27M
7386a15l0M2K04j04J1j93K50n5K64k02n9m3j4J54j42J08k2k04P2L9j25J62K2j69
7410a49J11Krj5J66J78j43k43J40o5J42p7K6o1J24P9l19M9J61p7M5l8m3r7J07
7435fN6J47k47J58k37j29Q8J05n4Q9r2J73p3J63k52n3R6J43m0j77m5K05M4j74
7459a12lK85j58k7l99L71L3K6L8J26l38nL55j91K4q5j15J20L9J41j67K93k05m8
$$ plain form
7290 -156 28 -129 -129 -10 144 47 -126 32 -230 -110 -208 109 -88 -142 -64 -137 -159 -251 126 -212 -182 -134 198 -60
7314 -60 -131 246 -128 122 -165 -29 92 -181 38 -80 -71 -40 25 97 -100 178 254 -198 197 -109 28 101 -226
7337 -226 -163 39 -126 167 -66 -136 141 -52 33 -61 141 -135 16 -43 154 200 -93 -111 -3 -122 -80 -52 -86
7360 -86 -218 28 23 27 -94 -147 -48 -81 278 68 -205 -312 -32 23 213 206 -117 -73 -31 -26 -2 -55 111 8 -119 -115
7386 -115 -145 -103 101 -3 8 -185 65 10 274 72 13 -30 -44 110 -32 76 54 -150 -78 -39 -164 -2 20 -149
7410 -149 -38 -36 -45 -60 106 284 141 -102 38 -27 115 38 64 3 127 206 -113 -64 97 20 65 27 -16 -113 -6
7435 -6 50 197 -50 108 -129 -258 -170 -65 -119 -30 -122 51 -22 141 -111 -164 -68 75 35 -142 -187 18 62 -112
7459 -112 -115 170 12 -15 -414 -43 -10 16 54 180 -158 -163 192 1 25 -60 -175 -55 -16 125 -42 251 46 -2
7483bo4J28k6K26l09j35L03J7p1j15j52J91j28J83l2j09L07j16J61k55%J4R2J16
7507B24k37p8O2MJ52n0k15k15M55k39K07r6O1J48j62j71K40k01p0J19J10j05J9
7530c8K1n4O5j04K06rk11L49k48J80l70K22O3j20J86l7j38J24j92J51M1q4K02
7553B05p8m3k24r5O4K61j9J47l89K50r5n3OJ26m2J67k34j23K41P8l03J30k30K40
7577a3PP6J00k95N2m5Q7J28j35k3N9p3J38K03l24m3J50M8j90K37o2j60O6k44L19
7602F3k26l1J34L50k60jj92J72j12K01J9J1l55J57J14j25k2K17o0J44l91K13M8
7625F8j03J0j25k4J4K14J87k76K7J30k9j0Q0j17l89N73q9j25n2j27Q8q6R8QO4
7650IJ88j48J8Q5j28N6R3n6j72Q6K3j60p2L3L76l06L60m14J35k57K80j7j25l7
$$ plain form
7483 -2 -66 62 36 262 -47 -182 121 138 67 -48 -200 -9 -137 46 14 -95 212 96 257 2 2 16 108 224
7507 224 -13 -91 -29 -25 127 77 -138 -353 102 -137 70 -26 35 183 21 -150 90 -111 -181 -62 48 -57 -38
7530 -38 -17 -71 -6 -110 96 87 -124 225 -23 157 -213 9 72 -48 138 101 -37 87 -105 46 87 3 205
7553 205 127 84 -140 -235 -171 90 71 218 -171 79 -16 -69 -63 63 21 188 -46 -169 72 150 -153 -23 -253 -13
7577 -13 -6 70 170 -125 -73 -118 -31 97 -38 -61 -2 -75 63 266 -58 -101 49 97 -93 144 82 -78 -12 -256 63
7602 63 -163 -194 -60 290 30 29 -163 9 -103 98 117 128 -227 -70 44 -81 -103 114 54 198 -193 20 68
7625 68 -35 -25 -150 -174 -160 54 241 -35 -8 122 93 83 163 46 -343 230 141 16 -36 -163 -75 -161 -63 -55 9
7650 9 197 49 67 152 24 80 173 117 -55 31 54 -106 -178 -145 231 -75 285 -129 6 -251 29 12 -113 -150
7674a50L02K66l16o6r8o5J29M8k29L18q4j41J06J14r7j64L6J51k56J07J76j24
7696c7N4M4r4J20l06J15K82k36J87j70P4J79j74j39K4L1p6R6J82j89j86J82j6
7719e3j67J25J07j13J26PK5j05J38Qk11n7P7O0J54j3r2J26R9k01j15J48k24Q7
7743f4j7m8q8J04l0QK11l91M03M6j62N8R2j20J14l5k32J23N4j51J93lO0J4L3k21
7769d9j38J86J09j30j1n2j02J73J23o2k07K26Q8k51K13J54l04O2L8M2k20J77O
7792G1M6j86J63r6O0r9R5o1l40M03n9K23j37j40q4J05J21q0q9Q0L0K8k31o3L04
7817F4l0m2O7r4k36R8R7j80L84k22N4k5L36l98L39q9j26J30k64j11L67n8j18j28
7841a85J81q6K18K67k12k16P8Mj03J43J2j17Q5j69K35k33L34k34Q3J4N3p6j59
$$ plain form
7674 -150 152 418 102 36 -62 -127 2 50 -179 139 55 -86 20 134 37 -127 -91 60 -196 -89 87 -37
7696 -37 17 61 -33 87 -219 -104 178 -58 129 -41 33 212 38 -101 -77 -46 -122 -26 156 -33 -219 -37 -53
7719 -53 -220 -95 12 -101 25 32 57 -48 90 98 -113 -170 -93 -33 121 108 16 142 241 40 -75 73 -151 -64
7743 -64 -81 -129 -217 -113 -143 -135 76 -315 88 134 -28 30 122 2 116 81 -151 -28 26 -125 68 65 125 139 172 -49
7769 -49 -187 -1 108 -22 -33 -85 -187 -14 109 47 -160 66 154 -97 116 270 -34 28 66 108 -112 65 71
7792 71 117 -69 94 -2 58 -41 54 -7 -347 56 -3 220 83 -57 -141 -36 85 5 -84 -4 26 54 -177 -240 64
7817 64 34 -8 59 -35 -271 -173 -76 -256 128 -94 -40 -65 271 -127 212 123 -3 127 -137 -248 119 61 -57 -185
7841 -185 -4 -90 128 395 183 -33 45 49 -54 89 101 -16 69 -100 135 -98 236 2 85 99 152 76 -83
7864h3P0L9J01j74K9j87L46P0j92J23k58K22j72k8R7k0l82N03l64O8rJ55J1j1
7888d6m4J72Q2l49k4J54q8K68P8k55N3K3K6K68k63m0q2K8n6Q0J42P6l25M5J58
7913H1j45K3nP2k88L08P6k88K29R6j2o2j07q3k1L64j07k91R7J01j41Q3K2J0m9
7938c7P6l4Q2j71j30K70J68j18k74Q0K05m01L40j33lJ64m3k02Q8K79k29p0o7K69
7962A09q2P7j63m3j72K60j78J53P4J8j42Q8j73j36L65j39M6Nl5L12j16m54R8L00
7986G2j31q4k5K87j73J31mj62k3J64%L0j22p0J24K25l61J42r5J10M4K6j71K03
8010A37l75K23k0k02J51q5M0M43l08J01K35j79o1j57o8J41J90l78K18L5m0j18
8032g7j60K91J5J9Jp2k54K00m6J93l08J73K45j91R7m4k7N1l1k0j41M7J90k52j17
$$ plain form
7864 -83 -13 26 127 -47 -18 -205 141 211 19 142 -116 106 -66 -94 3 -17 -399 104 -260 -192 -201 -46 -35 -46
7888 -46 -90 82 164 -185 -209 -55 -143 125 203 -52 1 24 50 318 55 15 -67 -39 -95 -15 127 203 -122 -77 81
7913 81 -64 -41 -46 26 -262 46 122 -166 63 159 147 85 -22 -105 -126 238 131 -160 -63 38 -103 -20 2 12 -37
7938 -37 39 5 87 -84 -214 56 224 106 -168 -88 117 -284 56 -77 -80 84 41 -161 -73 206 -23 -93 -160 109
7962 109 27 104 -59 -102 -274 -14 -192 -39 35 53 -89 -1 -174 -310 55 -84 -38 -33 -68 244 128 -326 -228 72
7986 72 -59 -143 -168 119 -54 77 73 -89 -112 52 52 82 -40 -110 14 239 -122 20 -75 35 79 105 -66 137
8010 137 -238 -15 -35 -237 -86 -171 -131 312 4 105 340 161 100 -57 -125 16 206 -172 46 81 41 -77
8032 -77 -237 54 69 88 89 17 -237 -37 -83 110 -198 -25 220 29 126 82 55 106 75 55 -86 -39 151 -101 -218
8057b18n3J95J56K30l94o4k20M83L2l23J31K81q3l08J20K34l19M1K32l93J33P4
8079c3J58J44k95J54j82p5J85l74M87k81K05R1o8k03K77j99m3J57j44j16J96r6
8101e5J60Mk83M3K74j70K81k72k20J50K07j37k00K15j79K79o9R6k15J27o5kJ9
8124a2L5R5R3j25k05N9N9j66K14k50L69l9l57J27J46Lj4R3j42L1j43J29O6p3O5
8149E8j22J42q5J8k31J75O3n4j35J05K91j68N3r1k59L42QJ8j46J33j24j02K20
8172A09j62j24J75L7k96J96Q3j36L03k71K6J59n5k37J69K28m78K55J37
$$ plain form
8057 -218 -271 -76 80 310 -84 -148 -368 115 147 -176 -45 236 153 -155 -35 199 -120 -79 153 -240 -107 -33
8079 -33 125 269 -26 128 -54 -129 56 -318 169 -112 93 184 116 -87 190 -9 -52 105 -39 -155 41 -55
8101 -55 105 109 -174 -131 143 -27 254 -18 -238 -88 119 -18 -218 -3 -182 97 28 124 -91 36 -29 -31 -12
8124 -12 23 118 211 86 -119 -60 -1 -167 47 -203 166 127 -230 -103 43 46 32 125 -17 14 -129 0 66 -7 58
8149 58 -64 78 -7 11 -220 -45 18 -36 -171 -66 225 57 110 19 -240 102 110 128 -18 115 -9 -111 109
8172 109 -53 -177 -2 35 -261 -65 18 -118 185 -86 -60 99 44 -193 -24 204 -274 -19 118
8191A18
$$ Imaginary data points
##PAGE= N=2
##DATA TABLE= (X++(I..I)), XYDATA
0@%%%%%%%%qJ6j6J6k4M0m8N6p2Q8j12J36j60J93k33K80l28L79m41N12n89O77p75
31d13Q85j005J136j286J449j627J826k042K278k538K819l125L462l832M235m675
47b453N155n680O255o888P588q361R222j0185J1269j2498J3906j5536J7447j9730
61a0489K2508k5972L0435l6425M4915n7947Q0666j31307M38470K8149m83381L78921
73B78543k98329L67185k3366n08129K47594N6864q334J40706m27161J07094K51278
84A83945p8874k784j88245j7035K68077k9803j54260p0247K2756J49716P1275
95A54521k42263l0536J36962N4552Q8673j85532q8513K69740k919q32n6734j67320
107g0201K98097K3801j67034N6178j69371J98351J24203k77118M8546k6957N9274
$$ plain form
0 0 0 0 0 0 0 0 0 0 -8 8 -8 8 -16 24 -24 32 -40 48 -64 72 -88 105 -128 152 -176 203 -238 274 -315 362 -413
31 -413 472 -533 603 -683 766 -861 965 -1077 1201 -1337 1482 -1643 1819 -2013 2222 -2453
47 -2453 2702 -2978 3277 -3611 3977 -4384 4838 -5347 5922 -6576 7330 -8206 9241 -10489
61 -10489 12019 -13953 16482 -19943 24972 -32975 47691 -83616 354854 383003 -100378 278543
73 278543 -19786 347399 324033 -184096 63498 120362 112028 252734 -174427 -67333 183945
84 183945 105071 102287 -85958 -102993 165084 135281 -18979 -89226 -66470 83246 154521
95 154521 -87742 -118278 18684 73236 161909 -23623 -112136 157604 154685 153853 97119 -70201
107 -70201 227896 251697 84663 140841 -28530 169821 294024 16906 65452 38495 97769
118I7769J80317k53896l6842J22982j1029J33164j68339j19586J79241R044J3701
129A46526r1972j37337J42092R1100r4523o9874n6428P9011J34339r9210j01928
140e8204K7761O4082J11531n9270j65131Q6027R1036J0625j3135j80527O7014
151a8191J50054p0798k0814j13189J5107J99826p9376r1729n041l408J76476m6397
163I2520j54965N6720J6550J00528j1998j79822N0239Q4396J3193q765j35041
174g6445J2073J46027k2561m2563o0190l299J50088o848j01941n763J9362Q9042
186I6982K8055j48119j135P8562J6089K2279j24217k3222J23525j0626k1248n6892
198a9967m4355J30186P227q5071L053l9283Q6477M1059j21554L179J0279K9618
$$ plain form
118 97769 278086 24190 -12652 110330 99301 232465 64126 -55460 123781 132825 146526
129 146526 54554 -82783 59309 150409 55886 -13988 -70416 8595 142934 43724 -58204
140 -58204 -30443 33639 145170 85900 -79231 6796 97832 108457 95322 -85205 -18191
151 -18191 131863 61065 40251 -72938 -57831 141995 62619 -29110 -34151 -37559 138917 92520
163 92520 -62445 -5725 10825 111353 99355 -80467 -30228 54168 67361 58596 -76445
174 -76445 -64372 81655 59094 16531 -43659 -46958 103130 96282 -5659 -11422 7940 96982
186 96982 125037 -23082 -24217 54345 70434 92713 -31504 -54726 68799 58173 36925 -19967
198 -19967 -64322 65864 73091 -11980 -8927 -48210 38267 79326 -42228 -39049 -28770 848
210H48M8730j01545l2915P0411J627K5769m8689o1865R7476J7126k1571q098m7094
223e9790O4506N1318n9311m501m409Q540P3960n8046l4820L7019j0507N3669k4415
236C3213o2982N1484J0535L898J3658p6074L3151N3763m7825J7899m6180p918
248b3378P4282m5670k3878J745k2508N7046j0649o6026L6726r149K0522K6226
260A5289p9572K7429L5595j7539K1260m1284j1920O7666k4424j4734Q117l2020
272d6137O1749l897m6473L0416j5263K3064K5085n5606J5659K6214k2667L3971
284B6115l6119j9358N6404l3731L472M023l5543M0724l421l3826K7899k1194L561
297b0994K9526n0173K7897Q937l3238L9239k3060p267L5736l6496R135K6694l3505
$$ plain form
210 848 49578 -51967 -84882 -14471 -12844 12925 -35764 -97629 -153 16973 -4598 -12696 -59790
223 -59790 4716 56034 -3277 -7778 -12187 -3647 70313 12267 -22553 14466 3959 57628 33213
236 33213 -29769 21715 32250 36148 49806 -26268 6883 60646 12821 30720 -15460 -23378
248 -23378 50904 5234 -18644 -16899 -39407 17639 6990 -59036 -22310 -31459 -10937 15289
260 15289 -64283 -36854 -1259 -18798 2462 -38822 -50742 16924 -7500 -22234 -14117 -46137
272 -46137 15612 11715 -34758 -4342 -19605 3459 28544 -27062 -11403 14811 -7856 26115
284 26115 -10004 -29362 27042 -6689 -3217 806 -34737 5987 2566 -31260 -3361 -24555 -20994
297 -20994 8532 -41641 -13744 -4807 -38045 1194 -21866 -29133 6603 -29893 -20758 5936 -27569
310b7569K8713j1321k1172N0148k8665o71J5365k9817L9641K011m1490K7339n074
323b562K473K7639n5576J2227L0491k2306J8806l2552j4753N1276j7099j9865
335b1801K549k5062M5100M064n2748J9202p906K0257K3944n9921M562L5720p114
348a9154J7995l4119k2332O3317q068j0620q185k6786N7100Q962m2041O870q028
361b5089K5009L4054n5882m058K6779P12L1707m1119k5611M5764K742K681j6004
374A685m0482M2978K4019l4121j684l0161K4828M3224m5269j2750j98R064M4949
387B6082k9962m0888K9179Q799K4823j0319n9014L3282K8121j145q572m9200J8374
400c0440N4156j7534k3642j9075L623O6034j5632m7586L500J2169M7488o931o4261
$$ plain form
310 -27569 1144 -10177 -31349 18799 -9866 -10537 4828 -24989 14652 16663 -24827 2512 -2562
323 -2562 -89 27550 -28026 -15799 14692 -7614 11192 -21360 -36113 15163 -1936 -21801
335 -21801 -19252 -44314 786 4850 -47898 -28696 -36602 -16345 7599 -52322 -47760 -12040 -19154
348 -19154 -1159 -35278 -57610 5707 -2361 -12981 -21166 -47952 9148 18110 -23931 -17061 -25089
361 -25089 -80 33974 -21908 -25966 813 1525 33232 -7887 -33498 12266 15008 17689 1685
374 1685 -38797 4181 28200 -5921 -7605 -37766 -12938 30286 -14983 -27733 -27931 -18867 26082
387 26082 -3880 -44768 -15589 -6790 18033 7714 -51300 -18018 10103 8958 386 -48814 -30440
400 -30440 23716 6182 -17460 -36535 -32912 33122 17490 -30096 -26596 -14427 33061 26130 -38131
413c8131N440L6115J6578j937o6145m391O6368j946j7626m4552n419P6157M518
426B5029m6300k0026N292O4660J5450p5036n346K5077M0273J5707p9937j0339
438d5496N4068K5702m402n7384j7164P3879K2864l0906l3264j4823P2659K3476
450F9209n6348k7483O019M9056K0118o6158l5350L5701K6805J1073n5207m1426
462f3991N6853K8084j2025l8422l2318N3586M2559l9283l1930j4161L8466N1840
474C9258n7515l5919J5054K6936M3730m4449m8536M0239L8289J7277k4420n1010
486d1066M6228M9763r548j9943m3298L3084N8235k6652l9653j7034J8993N2969
498F2078k1458o0725N521K5967L7191j4379o4299R352M4261J6124j9264n4736
$$ plain form
413 -38131 -32691 3424 20002 18065 -48080 -52471 13897 11951 -5675 -50227 -55646 20511 25029
426 25029 -21271 -41297 -36005 28655 44105 -30931 -36277 -11200 29073 44780 -35157 -45496
438 -45496 8572 34274 29872 -27512 -44676 29203 52067 21161 -12103 -26926 45733 69209
450 69209 12861 -14622 -8603 40453 60571 -5587 -40937 -5236 21569 32642 -22565 -63991
462 -63991 -7138 20946 8921 -29501 -61819 -8233 34326 -4957 -36887 -51048 -12582 39258
474 39258 -18257 -54176 -39122 -12186 31544 -12905 -61441 -21202 17087 34364 9944 -41066
486 -41066 5162 54925 45377 25434 -17864 15220 73455 46803 7150 -9884 9109 62078
498 62078 40620 -20105 -14584 11383 48574 34195 -30104 -20752 23509 39633 20369 -34367
510c4367j407O1679K05l5600l6839m602O7470K484n4524j7243J4335N5337J4068
523C0996o5414r799M2837L5343Q904o5197j0814N9146J8943j0944n2246j4995
535c3240O5050J8453l9616l1216m761N8250K4247n6077k2720J5157M6239J6876
547E6642n8761k8270L6967L0617k419m8403l5038N1730K8655k4814l5131k1564
559d9789N1147L6907m1076k9522O401L5984L9593m7110l6256L0333K4067K3356
571D4035m1091m2135M0250K7085l016k5302l7338L5865M1765k3817j9132j9966
583b2797K6270M4253k8265k9355l220J9843L1264k1848m3816J0878K2766J2583
595A8556j2696m3171J3674L4716K282j5357k5710Q319M3113k395k7393o045R75
$$ plain form
510 -34367 -35774 25905 26110 -9490 -46329 -50931 16539 19023 -35501 -52744 -38409 16928 30996
523 30996 -34418 -44217 -1380 33963 42867 -22330 -33144 26002 44945 34001 -18245 -33240
535 -33240 31810 50263 10647 -20569 -25330 32920 57167 1090 -21630 -6473 39766 56642
547 56642 -2119 -30389 6578 37195 34776 -13627 -48665 3065 31720 6906 -28225 -49789
559 -49789 1358 38265 -2811 -32333 -25932 10052 49645 2535 -33721 -3388 20679 44035
571 44035 2944 -39191 1059 28144 25128 -174 -37512 -1647 40118 16301 -2831 -22797
583 -22797 3473 47726 19461 -9894 -13114 6729 37993 16145 -27671 -16793 5973 18556
595 18556 5860 -37311 -23637 11079 13361 -1996 -27706 -19387 23726 21331 -6062 -12107 -11132
608a1132L9243Q24m1301J468J0729K4017M009m1212k043L0320R801K972l3683
621e988p750M4195J833r668k2813q888L9844M869k8299j4966j695K7445J1543
634B9662l9705j1276J3686J8275J0190l6191j2425K6381J6826m129k4002j4852
646b7560L2046J7792k2155j2603r284K6456J9884k8542j3477Q894J7604J5873
658B4928k2613j8480K4095J0970P418j5362k2510K9083J1369r186j0111j4690
670e089J7963J7527k0448j0241l37P294J8878k1784j1112J0934L186R907j2871
683C807j4343J4911O561n938j561j4250J0796J2311j5381J471m699K720J4261
696A0666j1057n802Q022j368Q458j796j2759J4191k594l52O151j4319P037N457
$$ plain form
608 -11132 28111 28935 -12366 -10898 -169 23848 27857 -13355 -15398 14922 24723 27695 -5988
621 -5988 -13738 30457 32290 22622 -191 -9079 30765 35634 7335 -7631 -9326 18119 29662
634 29662 -10043 -21319 -7633 10642 20832 -15359 -27784 -1403 15423 11294 -12708 -27560
646 -27560 4486 22278 123 -12480 -21764 4692 24576 -3966 -17443 -8549 9055 24928
658 24928 2315 -16165 7930 18900 26318 10956 -11554 17529 28898 19712 9601 -5089
670 -5089 12874 30401 9953 -288 -625 6669 25547 3763 -7349 3585 6771 16678 3807
683 3807 -10536 4375 10936 4998 3437 -10813 -17 12294 -3087 -1616 -6315 -3595 10666
696 10666 -391 -6193 1829 461 8919 7123 -5636 8555 5961 5609 11760 -2559 4478 9935
710I935q033M176m163m533J1693q180j212M667q762R800k705n957Q141o228J65
725a196P041r663K958M424j0369R271l675m223R095q601L486M880p698O952M00
740C082p516J2207m909j457O617j1189J0226J887j0051N914m040N54R260j2068
754a483k535Q465m613P659q834p355J2904k473p6l235j0365J1191P957j3612m59
769f864m014M223J4271j6168n745N501M124R961j1998j2976J4790O890j229m462
783c696j7245J7395J3318j1871n116r749J3361J7222j5723j3119N017Q305J5230
796A3329j4407k0511J5409R865O450j3462j9487J6151J7626o527j2998j1594J1472
809h684K4753j5113j6555p37J0329K0987j3621k2285O843J5087R859r656k5703
$$ plain form
710 9935 1902 6078 1915 -2618 9075 895 -317 4350 -4412 5388 2683 -3274 4867 -1361 -1196
725 -1196 5845 -3818 -860 3564 -6805 2466 -1209 -5432 3663 -4938 -1452 3428 -4270 2682 3082
740 3082 -4434 7773 2864 1407 8024 -3165 7061 8948 -1103 4811 771 1325 10585 -1483
754 -1483 -4018 4447 -166 7493 -1341 -8696 4208 1735 1659 -1576 -11941 -750 7207 -6405 -6864
769 -6864 -10878 -6655 7616 -8552 -14297 -8796 -4672 5289 -6709 -19685 -4895 1995 766 -3696
783 -3696 -20941 -3546 9772 -2099 -7215 -16964 -3603 13619 -2104 -15223 -10206 -1901 13329
796 13329 -1078 -21589 -6180 3685 10135 -3327 -22814 -6663 10963 4436 -8562 -20156 -8684
809 -8684 16069 956 -15599 -16336 -6007 14980 1359 -20926 -14083 1004 10863 1207 -24496
822b4496J0937K2327k762p650k1694R807K6782p344j5518r726Q285K4323o247
835G024k4289P30Q307J8838m813k8354M145J5116J0368o221k4061O30K4124M854
849F398j1789j5968j602K7651L049j8078j1538K942K3115N369k3550j1019J3057
862a1963J5981O527k4887j2005K2398J2693Q93k1179j2356K5015J6417j1494j8043
875a2003q647K4213J8748k2683j5273k019K1809J8275k6826j9313J0150K0992
887G423J0148k4223k3211J9767K1142K31k3462k1786K4537K2977j0299k4360j1570
900c2686K3180K5142j6785k7736L058K2733K0880j8673k7781J0832K5572J0820
912A8556j8705k5968J2993L1592k339k0360j8644J2679L3925r947k4857q786J4718
$$ plain form
822 -24496 -13559 8768 6006 -1644 -23338 -13531 13251 5907 -9611 -19337 -11052 13271 7024
835 7024 -17265 -16535 -8228 10610 5797 -22557 -18412 -3296 7072 851 -23210 -22580 1544 6398
849 6398 -5391 -21359 -22961 4690 7739 -10339 -21877 -18935 4180 9549 -14001 -25020 -11963
862 -11963 4018 10545 -14342 -26347 -3949 8744 9637 -11542 -23898 1117 17534 6040 -12003
875 -12003 -20650 3563 22311 -372 -15645 -17664 4145 22420 -4406 -23719 -13569 7423
887 7423 17571 -6652 -29863 -10096 11046 11277 -12185 -33971 -9434 13543 3244 -21116 -32686
900 -32686 -9506 15636 -1149 -28885 -25827 -3094 17786 -887 -28668 -17836 7736 18556
912 18556 -149 -26117 -13124 18468 16129 -4231 -22875 -10196 23729 13782 -11075 -19861 -5143
925e143K8913r766l2518Q87J9908J6985r213l5072O065K4118P673j2401l0242
938b9806O960K9549J687j8852j7175O167L1101M67k5098r583J0802K7029j879
951A1369k6891o140J7208J8484l725k4850p661K5185J2499q358k0097o170K6224
964G077J2686j5629j7182m16K1562J4993k3876j6215P366J6276J2648k6364j7131
977b4205J5250J5429M916k1355j8467K1136J9214o790j6100j5543K1864K1660
989A7009j4050j7495p377K1402J9609j7035k1842M420J9144J5283j5990k5221
1001b2143J2654K1681O505j7127k0272J2965K4927j976k0693j2197J1473K6216
1013B2013q942k5011l320J3270K0856r999k7158J675K0503R848r324k4989M046
$$ plain form
925 -5143 23770 14004 -18514 -17627 2281 19266 10053 -25019 -18954 5164 12837 436 -29806
938 -29806 -22846 6703 8390 -10462 -27637 -21470 9631 10098 -15000 -24583 -13781 13248 11369
951 11369 -15522 -21662 -4454 14030 10305 -14545 -22206 2979 15478 7120 -12977 -19147 7077
964 7077 19763 4134 -13048 -13464 8098 23091 -785 -17000 -9634 6642 19290 -7074 -24205
977 -24205 -8955 6474 11390 -9965 -28432 -7296 11918 5128 -10972 -26515 -4651 17009
989 17009 2959 -14536 -21913 -511 19098 2063 -19779 -15359 3785 19068 3078 -22143
1001 -22143 -9489 12192 18697 1570 -18702 -5737 19190 17214 -3479 -15676 -4203 22013
1013 22013 13071 -11940 -15260 -1990 18866 8867 -18291 -16616 3887 13735 4411 -20578 -16532
1026a6532K5995O41j1493j8822N470K5863j637j7368j0244Q226K1371o4k2929
1039a1523k349J1005J5528j47k2646n50J5792J0868n517j6747k257J8990O887
1052A7334j0374j0815k441J8960N032j4619p842J845J3483N419j4950r386Q320
1065c4Q583L805j4321r454J2238O568L29j1256q965J2351R576n802q519n158R438
1080f21J2875r954q313m21P969J1088r337j0687L711R605N720o552j3136P180
1094h73J0951N59n412j1973O935J2670l592p986n414M297J2414l657j2248K83
1108c046L884J0409l357j3851K856P274N431l443j2029J729J2367n08n057p317
1122d658J037J2947k329o781l626K526R407l35r832l73N722L296J295r671j04
$$ plain form
1026 -16532 9463 10104 -1389 -20211 -14741 11122 9485 -7883 -18127 -9901 11470 11406 -11523
1039 -11523 -13872 -2867 12661 12514 -10132 -10682 5110 15978 10461 -6286 -8543 10447 17334
1052 17334 6960 -3855 -6296 12664 17696 3077 -4765 -2920 10563 15982 1032 -8354 -34
1065 -34 8549 12354 -1967 -11421 817 7385 7714 -3542 -12507 -156 9420 3618 -4901 -10059 -621
1080 -621 12254 2300 -6013 -6434 1535 12623 3286 -7401 -3690 5915 11635 5083 -8053 -873
1094 -873 10078 10637 5225 -6748 187 12857 9265 1279 -4135 162 12576 8919 -3329 -3046
1108 -3046 838 11247 7890 -5961 -3105 4169 9600 6157 -5872 -4143 8224 7716 2659 -4658
1122 -4658 -3621 9326 6997 216 -3410 -884 8523 8188 -1644 -2017 3705 7001 8296 -1375 -1479
1137a479P517J48j049n849j067P276J51m938O7k238N263J381o824K755r60J684
1153A838J967n002R76K054k062J769p92k644M096l272J383J482l174K350j476
1168e07N12K825j868j890K826q30J848L41m987L053J364J86o88l787J979M078
1184D455j728k320n27o08O876l081n002K701n51M759j680o454K301L052N66N77
1200C336p096R00O960k742M14n117l4P362j586l128k248l9N830J317p037R9R06
1217a903L584K843p624j006L259L579M59m954l626N803L454j810k534n897P230
1232H57N122m681l403k550N024O441m939o427J552L458P133n646q939M659L845
1247A506N145n226r661M182Q947M71n874p819M169J2075l542p808m775N238J1646
$$ plain form
1137 -1479 6038 6186 5137 -712 -1779 5497 5648 710 777 -1461 3802 5183 -1641 1114 154 1838
1153 1838 3805 -1197 -221 1833 -229 1540 748 -1896 2200 -1072 311 1793 -1381 969 -507
1168 -507 5 2830 962 -928 1898 1068 2916 3257 -1730 1323 2687 2873 2185 -1602 377 4455
1184 4455 2727 407 -120 -728 6148 3067 -1935 766 215 4974 3294 -3160 -859 2193 2759 3336
1200 3336 -3760 -2860 4100 1358 1772 -3345 -3379 3983 2397 -731 -2979 -3018 2812 4129 -2908 -2809 -1903
1217 -1903 1681 4524 -3100 -4106 -847 2732 3191 -1763 -5389 414 3868 2058 -476 -6373 857
1232 857 5979 1298 -2105 -4655 369 6810 1871 -4556 -3004 454 7587 1941 -6998 -2339 1506
1247 1506 6651 1425 -8236 -4054 4893 5364 -510 -8329 -4160 7915 4373 -3435 -8210 -2972 8674
1262H674m038j0786j883Q360P714l428j3171O33J1592M720n282j2439J991J4475
1276G132K233r880q560L434J4406R65j3902m717N093J2941m98j6121k619R309
1290g84R170k367j4840k785J3850O407n823j2400j587J6151M142r563j0042J787
1304h684J4205L932j2873q567O501J1239L198j4200o480R375R740k10j2714n665
1318a1203J0947J0404n723j0129m881J1213J0216r015r903j582J0965Q952r673
1331E88j1871L856J0439O151r065j3016P394J0889K594r639j1850Q802J2171p98
1345F645j1716p909Q271J4222m546j3784l649R651J3460p224j4046r38J2383R393
1359A0213p998j4865J332J5654M605r644j3422L425J6770K561j2943j0475O982
$$ plain form
1262 8674 4636 -6150 -8033 327 8041 4613 -8558 -7925 3667 8387 3105 -9334 -7343 7132
1276 7132 9365 -515 -9075 -5641 8765 9730 -4172 -8889 -3796 9145 8647 -7474 -10093 -784
1290 -784 8386 6019 -8821 -11606 2244 8651 2828 -9572 -11159 4992 9134 -429 -10471 -8684
1304 -8684 5521 9453 -3420 -11987 -5486 5753 8951 -5249 -11729 -2354 7386 7176 -5538 -11203
1318 -11203 -256 10148 4425 -5704 -10585 628 10844 1829 -8074 -9656 1309 10261 588
1331 588 -11283 -7427 3012 9163 98 -12918 -5524 5365 7959 -1680 -13530 -4728 7443 6645
1345 6645 -5071 -12980 -4709 9513 4967 -8817 -12466 -2815 10645 3421 -10625 -11563 820 10213
1359 10213 2215 -12650 -11318 4336 8941 -703 -14125 -10700 6070 8631 -4312 -14787 -7805
1372g805J5623J208j6540o278R655J3483m21j8669l078J2582J0414m421j6668
1385a0915k139J6213P560r370j3326k40J7832M918j2861j0308L378J6888K166
1398I796j4709q668P429J3684m9j5835p283J2494R746l133j4525l677J2989R401
1412G660o770j2905l50J2860Q726r928j1216K702J1548P213j1767j0698O046J1687
1426D808K387j0460j0208Q671J2033j493r062q453J0134J1534m308r791n044R303
1440E1J0657o052j1735r29Q157R110o955j3147K455R338O650p924j1364L517J1620
1455C449L710r265r427L760J3282k02j0516o995N556J1632j134j2031m976R207
1469c950R475j642j2670k226J1723P274l654j1994Q6J2707N111p909r238J044
$$ plain form
1372 -7805 7818 9026 -7514 -13792 -4137 9346 8925 -9744 -12822 -240 10174 5753 -10915
1385 -10915 -13054 3159 10719 1349 -11977 -12217 5615 10533 -2328 -12636 -9258 7630 9796
1398 9796 -4913 -13581 -6152 7532 7483 -8352 -15635 -3141 6605 3472 -11053 -14730 -1741 7660
1412 7660 890 -12015 -12365 495 9221 -707 -11923 -9221 2327 9540 -2227 -12925 -6879 4808
1426 4808 7195 -3265 -13473 -4802 7231 5738 -3324 -11777 -1643 9891 5583 -4208 -9252 51
1440 51 10708 4656 -7079 -8008 149 9259 2304 -10843 -8388 950 7600 -324 -11688 -8171 3449
1455 3449 7159 -2106 -11533 -7773 5509 5307 -5209 -12204 -6648 4984 3850 -8181 -13157 -3950
1469 -3950 5525 3883 -8787 -11013 710 7984 4330 -7664 -7578 5129 10240 2331 -6907 -5863
1483e863J2574L434j1576o254L416J1534K025j2589m879P172R375m89j1631m086
1497g837R951O590l775j0249l101J1437L926o812q300L51R626M372q134p045M358
1512d642Q420L072q509n192O180O596N23q371m319O296P110l717o398k706O274
1527F17O294m992n449j60O194N430m893n923K308N153K400l612p074L295M613
1542D201N55m017n971L332N434m85m337k754K366O565j025m874o62J877N699j597
1558D307n100q73K950L453j647n271r47N542J064j333m103p2N825J135k164l088
1574c22P36M682J734n091k047J842K788J101n685j364K789K321l03l969j352M190
1590B050K175j975k069j343M701J894l830j304k12L341M33l364j839J639J985
$$ plain form
1483 -5863 6711 10145 -1431 -7685 -4269 7265 9290 -3299 -8178 -1006 8369 7880 -3751 -7837
1497 -7837 2114 8704 4929 -5320 -8421 3016 6942 130 -8170 -7819 1807 6179 -1955 -9000 -4642
1512 -4642 3778 6850 -1659 -6851 -671 5925 6448 -1923 -6242 54 7164 3447 -2951 -5657 617
1527 617 6911 1919 -3530 -3690 2504 7934 3041 -2882 -574 4579 6979 3367 -3707 -412 4201
1542 4201 4756 739 -5232 -1900 3534 3049 -1288 -4042 -1676 4889 3864 -1010 -1672 205 5904 4307
1558 4307 -793 -1666 1284 4737 3090 -2181 -3128 2414 3478 2145 -1958 -2030 3795 4930 2766 -322
1574 -322 414 5096 6830 1739 -308 1534 4322 5423 -262 -1626 1163 3484 3181 -788 -2140 2050
1590 2050 4225 2250 181 -1162 3539 5433 1603 299 87 3428 3861 497 -1342 297 2282
1605B282K11k711j264L564L39K5j572n12L049M30j810p54M15J186P00k917q2J306
1623A885r17P03j823K06J648k36j056L51L46J370m24k247K413l2j74o31k173J957
1641A166J043j513r76k40J379K489k927m81J543J069K008k573j686K637J447k63
1657D122k006j806K375K469k708j290j397K121K695k626k036K95K239J707k274
1672A880l217J640J857M84k018l620K621K089p51k589j867J672L404j281k927
1687b623j84J646L634j812k984Q99J638K842p93l955Q09L522J023j012m077O14
1703h13M848K04j558l510J107M834M77l989j874J354L892R34n733j399K477L396
1719D647m46n781j850M307L268k290m751j971N671L218l738m358j026O384L125
$$ plain form
1605 2282 2493 -218 -1482 2082 2421 2446 874 362 3411 3841 2031 1277 1692 2878 3578 661 579 1885
1623 1885 968 1671 -152 54 1702 1466 410 761 1107 2477 2053 -194 2219 2187 2013 1382 -791 1166
1641 1166 2209 696 -280 -520 859 3348 421 -60 1483 2552 4560 1987 301 2938 4385 4122
1657 4122 2116 310 2685 5154 2446 1156 -241 1880 4575 1949 -87 208 2447 4154 1880
1672 1880 -1337 303 2160 2644 626 -2994 -373 1716 965 -1624 -3491 -1819 1585 304 -2623
1687 -2623 -2807 -1161 2473 661 -2323 -1424 214 3056 2263 -1692 -883 2639 3662 2650 -1427 -813
1703 -813 4035 4239 2681 -829 278 5112 5589 1600 -274 1080 4972 5906 173 -1226 1251 4647
1719 4647 4201 -1580 -3430 877 4145 1855 -2896 -4867 804 4022 284 -4074 -5100 1284 4409
1734D409n400m659J717N806K660o179m632M682M809R94o232l791N752N067j166
1749C837o178k389O096N861m427n733k72N990M896o044n468J688O240K484n918
1764F63n742L587O630p15n315n102N167O355k438o016k759N630N392k846o776
1779d285n14N661M539l767p345J755N518L036m198o422K420O102J886n129n023
1794e766K551P424l25n629l385L108P229j919o044k461M220N519j494p641o93
1809e306N706L465j612p147p03O929L697l898n942M95O801L192n494m933J388
1824c362O645K513p503l811L104O386M48o947l936N308N771j262o381l456P144
1839F61M884l455o462j395O975M008m936o968J174O458L667o523o113L620O535
$$ plain form
1734 4409 -991 -5650 -3933 1873 4533 -1646 -6278 -1596 3213 4207 -2025 -5816 -64 5003 3837
1749 3837 -2341 -4730 1366 7227 2800 -2933 -3205 2785 7681 1637 -3831 -2143 4097 6581 663
1764 663 -5079 -1492 5138 4423 -892 -5994 -827 5528 3090 -2926 -5685 -55 5337 2491 -4285
1779 -4285 -4799 862 5401 1634 -5711 -3956 1562 4598 400 -6022 -3602 2500 4386 -743 -5766
1794 -5766 -3215 4209 3884 -1745 -5130 -2022 5207 3288 -2756 -5217 -997 4522 3028 -4613 -5306
1809 -5306 400 3865 2253 -4894 -5597 1332 5029 1131 -4811 -4316 2485 5677 183 -4750 -3362
1824 -3362 3283 5796 -1707 -5518 -2414 3972 4420 -2527 -6463 -1155 4616 3354 -3027 -6483 661
1839 661 5545 2090 -4372 -5767 1208 5216 280 -6688 -5514 944 4611 -1912 -8025 -4405 2130
1854B130J810o779m803N116O793m43p139l178N765O429l395o385k123O159N614
1869E571m248p040J106O452L501m180o334K263O746J570m689n832L531O009j58
1884D268o015l848L463N867j428o427j526L375N880k053o293j06M931M034k709
1899A413n543K38N620J624k895m898N46O160M12l633l562J307N773P66m510k500
1915c682K998M208P39n326j968L210L774o77n801j737M078K944k373m018j341
1930d972M679L458l687k859l83N106K628m172l594J576M088J495m233m319L519
1945a670L605L35m178l261M225L858j008l779j533M166M456k392m399L37L176
1960A938L429l958l854N75L823J341l559l653J949L991j49k714k726K296M249
$$ plain form
1854 2130 3940 -2839 -7642 -2526 4267 3824 -3315 -6493 -728 5701 2306 -4079 -6202 -43 5571
1869 5571 1323 -5717 -4611 1841 5342 1162 -5172 -2909 3837 5407 718 -5114 -1583 4426 4268
1884 4268 -1747 -5595 -2132 3735 2307 -4120 -5646 -2271 3609 1556 -4737 -4843 88 4122 1413
1899 1413 -4130 -3892 1728 3352 457 -4441 -3895 2265 2677 -956 -4518 -3211 2562 3328 -1182 -3682
1915 -3682 -684 3524 4263 -1063 -3031 179 3953 3276 -2525 -4262 -184 2760 387 -3631 -4972
1930 -4972 -293 3165 -522 -3381 -3764 1342 3970 -202 -3796 -2220 1868 3363 -870 -5189 -1670
1945 -1670 1935 2270 -1908 -5169 -944 2914 1906 -1873 -3406 760 5216 2824 -1575 -1238 1938
1960 1938 5367 1409 -2445 -1870 1953 3294 -265 -3918 -1969 2022 1873 -841 -3567 -1271 2978
1975B978j213l082j431K896K307j472l739k63K619J245j253l840J420K660O37
1990D69j274k391J618L227j97j577j035M63L719q65k575j28O14J899q33k483J70
2007a179J149J099k83j864M87K017j33Q2j390J2J708j96n46j241j82J025L21j647
2025g61j77O3N82M90r78K98L32O28M35L8n64M50N01j99J80j340M44N64p42j58
2045H6n94K18P03m53l91O69k86R28j28p46J417j223P10m27o91L12j67q79M23n5
2065e74j59K72p45P97p0M50K79m12J022O15O2n63L92J55O65n17j159P73J90N74
2085B047p76j025N97J549k3j043m41N34J978q13j372p33R94J541j495k374J83
2102f72J460N76j436k393P98K708r8j543k187J889K617j93k511j204J874K359
$$ plain form
1975 2978 1765 -1317 -2748 148 2455 983 -2756 -3019 -400 845 -408 -4248 -2828 -168 469
1990 469 -805 -3196 -1578 1649 1452 -125 -1160 -697 3022 2157 -418 -546 68 1967 1134 -1349 -1179
2007 -1179 -30 1069 786 -1078 -591 1426 1293 1375 -15 -3 1705 1509 963 -278 -460 565 886 -761
2025 -761 -938 -875 -293 197 -781 -483 -151 477 912 950 386 836 1337 1138 1318 -22 422 986 244 86
2045 86 -508 -290 413 -40 -431 238 -48 880 752 6 1423 200 910 483 -208 104 -63 -942 -519 -574
2065 -574 -733 -461 -1206 -409 -479 -29 250 -162 860 1475 1537 974 1366 1521 2186 1669 510 1283 1473 2047
2085 2047 1271 246 843 2392 2369 1326 885 1419 3397 2584 1212 479 1473 3014 1519 -855 -672
2102 -672 788 1364 -72 -2465 -1667 1041 943 -600 -2787 -898 1719 1526 -985 -2189 -315 2044
2118B044q67l115J57K230K003j418l149O51L269J478k163j968P90L841J25k418
2134A490j485J136L504p92l040j239J712K549r13l614o38K844J435o95l535k55
2150a536L082J536j517l710O71L274J112l130k264Q53K987R15l725j314J338L244
2166A816K94l261j536K353L223n38k501k176L581K410j530k344j425L598K355
2181D319k274l422K79L054K480l168l142J329K958J790l387l066K061L221M16
2196C448l599k643K273M100j289l666j957K992M109k059l972r48M070L423k866
2211A416m200L69M413K152l350m250J906M478J034l740l681K394M493j47m399
2226a112k242K829M522j284n064r07L522L570j852n018o45M864K514k799m445
$$ plain form
2118 2044 1177 -1938 -1781 449 2452 1034 -2115 -1464 1805 3283 1120 -848 -58 3783 3908 1490
2134 1490 5 1141 4645 3853 813 -426 1286 3835 2922 -692 -1330 1514 2949 2254 -1281 -1536
2150 -1536 1546 3082 1565 -2145 -1474 1800 2912 -218 -2482 -1629 1358 2273 -1452 -2766 -1428 1816
2166 1816 2110 -1151 -2687 -334 2889 2351 -150 -2326 1255 3665 2135 -209 -1634 1964 4319
2181 4319 2045 -1377 -1098 1956 4436 1268 -1874 -545 2413 4203 816 -2250 -189 3032 3448
2196 3448 -151 -2794 -521 3579 2290 -1376 -3333 -341 3768 1709 -2263 -3211 859 4282 1416
2211 1416 -2784 -2415 1998 4150 800 -3450 -1544 2934 3968 228 -3453 -1059 3434 3287 -1112
2226 -1112 -3354 -525 3997 2713 -2351 -3258 264 3834 1982 -3036 -3681 1183 3697 898 -3547
2241c547K50N337J356l475l631J378M946P61m028k990K398M213L70m741j981L496
2257A12L620o78m999n37L346L226j851m306l40L959K209k808l389l62M387J535
2273C124l506k917J123M004N27l206l362K455L761Jl730k871L315K984k41m099
2289b638j817L234L530j556m042l46L427L440k526l794L43L583K509l006l727
2304c386J401M075R61l515l518K266M191j79l024l449L333L921q73l976j842L501
2320a13L610j588m598n93L424L007k433m546O61L880J962l038l138P08M746Q73
2336B824m037k124J692M357j63l844k025K657L253p10m301j488L812J993j220
2351F76m084R0L526J864k136l310Q02L392J448l147k392J210K885N82l384j738
$$ plain form
2241 -3547 -3297 2040 3396 -79 -3710 -2332 2614 3375 -653 -3643 -1245 2968 3338 -1403 -3384 112
2257 112 3732 3054 -1945 -2482 864 4090 2239 -2067 -2407 1552 3761 953 -2436 -2798 1589 3124
2273 3124 -382 -3299 -2176 1828 2355 -851 -4213 -1758 2003 2004 -1726 -4597 -1282 1702 1461 -2638
2289 -2638 -4455 -1221 2309 753 -3289 -3635 -208 3232 706 -3088 -2745 838 3347 341 -3386
2304 -3386 -1985 2090 3051 -464 -3982 -1716 2475 2296 -728 -4177 -844 3077 2204 -1772 -3614 -113
2320 -113 3497 1909 -2689 -3282 142 3149 716 -3830 -3169 711 2673 -365 -3503 -2795 1951 2824
2336 2824 -1213 -3337 -1645 2712 2549 -1295 -3320 -663 2590 1880 -2421 -3909 -97 1896 676
2351 676 -3408 -3318 208 2072 -64 -3374 -2572 820 2268 -879 -3271 -2061 824 1406 -1978 -3716
2367c716J767K705L83l434j181K074K593l26k426j000K746K140j359k224r89L062
2383H15J543j668k372o0K451J241k091j970R39J979J238j975j825O07K330Q35
2399B017k137k084J123K533m33k249j617J279K445j052k130o04K080J733r03k307
2415b306N7J941J667j245k360P91K090Q27j567j924M28K069R10k338j275J300
2431i35K219N6k102o20J108K190l61k477k29J729R61r13j770l90J934K91j083
2448c92j377N35J390O74j306r28R38J288M94j655l70R60O02R1j338l84J204P39
2466A165p19j110J6J287L84q62n3j27J066K06o90N5k53L10J76n41n39M04k26O5
2486A4j52n71M51k24N3L08l36K64Q9L81J64n8m50O69m02K21M8o30M11L41r6j77
$$ plain form
2367 -3716 -1949 756 1139 -2295 -3476 -1402 1191 865 -1561 -2561 185 2325 966 -1258 -2247 815
2383 815 2358 690 -1682 -1742 709 1950 -141 -2111 -1172 807 2045 70 -1755 -1148 1182 2017
2399 2017 -120 -2204 -1081 1452 1019 -1230 -2847 -1568 877 -175 -2305 -2909 -829 904 1 -2306
2415 -2306 -2249 -308 1359 114 -2246 -1455 635 1462 -105 -2029 -1601 468 1378 -960 -2235 -935
2431 -935 1284 1340 -762 -1382 -274 1916 1555 -922 -1151 578 1539 626 -1144 -1534 400 691 -392
2448 -392 -1769 -1234 156 830 -476 -1404 -466 822 1316 -339 -709 251 853 944 -394 -778 426 1165
2466 1165 446 -664 -648 639 1023 161 108 -19 1047 1253 563 618 365 675 851 310 -229 175 -51 14
2486 14 -138 -709 -258 -482 -429 -121 -457 -193 -104 277 441 383 -67 602 200 421 469 -161 250 591 495 318
2508C18R2J06P69j90m06M16o9Q13m02k53m5J36M78q07m75l21P22j76k88n67K82
2529A33K24%j94m24K91N23J67n17r8k36J37R36j218m61L81N25L91m46l94J39Q15
2550F74J26k6p08Q78N70n2n74o92R41O84j73p58p01N34J088k08j355j26P35J232
2570B089p33j309l8J040Q99n98j677j36J626M65j082j572J79J984n1j206j328
2587a448J095J536L92k007m57J668R42k23k052p2J428J254l63k327j8J775J248
2604B371j581j457L20J798R07k009j268J341J674K10k082j200J354J409R6k374
2620d91p21J807J303n32k136o60J906J278q03j778OJ968J286j895j500P30J832
2637A600P59j909j280P70J794K29j654j399J249J871k47j804j065J456K085q01
$$ plain form
2508 318 410 516 1285 1095 689 1105 1036 1849 1447 1194 1149 1285 1763 956 481 160 882 706 418 -149 133
2529 133 357 357 163 -261 30 553 720 203 105 -131 6 942 -276 -737 -356 169 560 114 -280 -141 674
2550 674 800 774 66 944 1514 1462 888 196 1137 1821 1648 890 189 723 1811 1603 248 122 857 2089
2570 2089 1356 47 9 1049 1948 1350 -327 -463 1163 1628 546 -1026 -847 1137 1086 -120 -1448
2587 -1448 -353 1183 1575 -432 -889 779 1721 1498 -554 -626 802 2056 1693 -634 -652 1123 2371
2604 2371 790 -667 -347 1451 2358 349 -919 422 2096 2306 224 -976 378 1787 1883 -491
2620 -491 -1212 595 1898 1366 -770 -1430 476 1754 951 -827 -821 1147 2433 538 -962 -232 1600
2637 1600 2359 450 -830 -60 1734 1963 309 -1090 159 2030 1783 -21 -1086 370 2455 1654
2653A654k268o82J837J495r94k459J56J772J298j249k411O36J953P12j435j795
2669a780L07K841J19j725j600R46K383J25k229j016J199K563o98k239r84K152
2685C64J896r10k306n21K309J534j367k324M28K295J143k082k219R66K139J144
2701B489k882j613J243K467j44k677r41J754K232p45k408j012K549J532j263k385
2717a804k20K686J198j766j873K65K382R50j968j881J257J930N57k438j364J661
2733d28J916k53k299o34J431K072r74j939m72J664J866j639j816j05K075R83j480
2750c2j764M21J928P63r87k439J253J991K92j536j742J100J789M37k052q49J146
2767b81J683j92k057n82J275J698p49k085n6J913R10r98j791j66K057R86j617
$$ plain form
2653 1654 -614 -1296 541 2036 1042 -1417 -1261 511 1809 560 -1851 -1215 738 1450 15 -1780
2669 -1780 -1473 1368 1487 -238 -1838 -892 1491 1616 -613 -1629 -430 2133 1435 -804 -1788 364
2685 364 2260 1350 -956 -1477 832 2366 999 -1325 -897 1398 2541 459 -1760 -794 1345 2489
2701 2489 -393 -2006 -763 1704 1560 -1117 -2058 -304 1928 1183 -1225 -2237 312 1844 581 -1804
2717 -1804 -2024 662 1860 94 -1779 -1514 868 1818 -150 -2031 -774 1156 1713 -725 -2089 -428
2733 -428 1488 1235 -1064 -1698 -267 1805 831 -1108 -1580 84 1950 311 -1505 -1610 465 1448 -32
2750 -32 -1796 -1375 553 1316 329 -2110 -857 1134 1426 -110 -1852 -752 1037 1474 -578 -1427 -281
2767 -281 1402 1210 -847 -1429 -154 1544 795 -1290 -1346 567 1477 479 -1312 -1478 579 1565 -52
2784e2j547R0K392M30j752j366P62J807L47k195r24J504J530k43j840r31J787
2801b01J416p76k138R6J884R59j325j537L25J896Q40j735j101M73J886R1j411
2818c58r48R71J568l98j321r95J467J457r18j698m41J653Q40q57j524K34J145
2835a23J074j025j314L21J296M92j053j000O59J351o6j029q81N50J302j97q11
2852d54l80L32J305n07q93l06R81N79n08r05QO36N09l96r72K06O37Q12j224m86
2872a026N6R70L25q49l73K04R40R3o40n93L83R80k2r60k67P51N84j73r57j09J024
2893C41L76m22p59J11O82M65o53n50K60O61K74j067j52J36Q09j63r65q1N52M37
2913B92l03n44l71Q68J01j42o37R6P17j38n38k58M88J86K64l63k91O38J14n5l33
$$ plain form
2784 -52 -1599 -1509 883 1313 -439 -1805 -1043 764 1111 -1084 -2008 -504 1026 783 -1057 -1988 -201
2801 -201 1215 439 -1699 -1603 281 1240 -85 -1622 -1297 599 1439 -296 -1397 -924 962 1053 -358
2818 -358 -1306 -335 1233 835 -486 -1481 -14 1443 525 -1173 -1614 39 879 22 -1502 -1268 -123
2835 -123 951 -74 -1388 -1067 229 721 -332 -1332 -673 678 612 -417 -1298 -748 554 357 -454
2852 -454 -834 -502 803 296 -597 -903 78 657 149 -756 -748 -112 397 1 -971 -765 -128 684 -540 -1026
2872 -1026 -970 0 325 -524 -897 -693 247 340 -300 -893 -510 470 448 -512 -779 -28 556 383 -574 -683 341
2893 341 717 295 -464 -353 329 794 141 -409 -149 512 786 -281 -433 -297 512 349 -616 -697 -145 292
2913 292 -11 -555 -926 -58 43 -99 -736 -640 77 -61 -599 -857 -369 -183 81 -282 -573 65 179 124 -209
2934b09jO43R6k41n36L49L07K05m55j00L22p8k45j02qK64N8j88l30J87N9O7j60
2957i6l06L07O1M2m94J59J19J69m53k29K07O96n08j36K37N9L08j14k45J77K45
2978B05O5k93n7p6N44k85K29n22L35M39m15j34r9M17K73m22j33j89L27J36K21
2999E66n55pK39K54l65m92K84K83K48n03m25j8P64O9k16l23J74N10N4p21O9L25
3021B14M30r8o97l57P97L71Pq36j33O38N62o49o14K2P53N48o28o26p1P26N00q93
3043c4m46K00N98K9m81o60P03N99k77l99o07Q63P62o86n86j11Q22Q11m37j241
3063e78K37Q26O08p65r23N37J142K93j162m82N93Q56j26j012j90N50O85l25p80
3082a6k73P12P17o34j036o7R43M35p38p56M03P75J07l87q81J90J251k62p79m10
$$ plain form
2934 -209 -210 433 529 288 -248 101 408 613 158 58 380 302 57 -45 -53 211 269 81 -249 -62 -3 64 -96
2957 -96 -402 -95 -34 8 -486 -327 -208 -39 -492 -721 -514 182 -326 -462 -225 -166 142 28 -217 -40 205
2978 205 270 -23 -80 -156 388 103 332 -190 145 584 169 35 -64 353 626 204 71 -118 209 345 566
2999 566 11 4 243 497 132 -360 -76 207 455 -48 -473 -491 273 342 126 -197 -23 487 541 -180 -111 214
3021 214 644 546 -151 -508 289 660 667 -169 -302 336 898 249 -365 -343 410 958 330 -296 -367 359 859 -34
3043 -34 -480 -280 318 347 -134 -794 -91 508 231 -168 -775 88 850 164 -422 -533 289 1100 663 -578
3063 -578 -341 485 1093 328 -595 -58 1084 1377 215 -267 326 1182 1056 44 -146 404 1089 764 -16
3082 -16 -289 423 1140 506 -530 -597 346 781 43 -713 -310 465 572 185 -696 -506 745 483 -296 -706
3102g06Q10P26k42r32N1L95R07m65r00n8O46P86p50o17r5J092K87o56o62j19J290
3123G88J85o08p89K00R16K89q51p17O02O02K19j076l19N76O46N1j247L16L65P08
3143H56m38q81MP39O77p14o18n9R94M37p89r34K48J288K56j118r33P53Q89N1j029
3164c21n71Q74Q77r4j429l03R33J056o26j131j43J260M22r97p67M44J090J93r67
3183b00n60M07J275j98r30n83P16Q98j38j125p3P88N39l10j096N5P25N72o43r10
3203g91M09P01O57p83q41J91Q03J57n92o32N19M96p1k54o99O23Q03j82q78l52
3223g16Q45N35m28m79l57N25O04l64p20O1Q53J90m33m87j65R07J53n60m45M00
3243h1J88L19o56l42P3J038k17p19k83M02P38m02l97l65P30N26n07o41O3P21L94
$$ plain form
3102 -706 104 830 588 -344 -293 102 1009 544 -356 -414 232 1018 268 -349 -444 648 935 279 -383 -502 788
3123 788 973 365 -424 -224 692 981 130 -587 15 617 836 -240 -559 17 663 714 -533 -217 148 856
3143 856 418 -463 -459 280 957 243 -375 -434 560 997 208 -726 -478 810 1066 -52 -985 -232 657 708 -321
3164 -321 -892 -18 859 765 -664 -967 -34 1022 396 -735 -878 382 804 -193 -960 -516 574 767 -200
3183 -200 -760 -353 922 724 -206 -789 -73 825 687 -438 -511 277 816 506 -590 -535 190 762 119 -791
3203 -791 -382 319 976 193 -648 -457 346 503 -89 -721 -202 294 223 -31 -730 -107 696 514 -364 -716
3223 -716 129 664 236 -243 -600 -75 529 165 -555 -494 359 549 116 -371 -536 371 524 -36 -481 -81
3243 -81 107 426 -230 -572 -499 539 322 -397 -680 -278 460 58 -339 -704 26 552 45 -596 -533 188 582
3264E82p10n89J86O99K51j79q11K37P34J92n64o28M20M66L2n88k40K02N61J30
3284C83r04K36L42M13o56k54j41N30L64n69m10K91P11l17n17j64M19L60Q5m96
3304b94l56O03J61o1o36J49N71L04k75n52K79K10o5k87n4k2N40P2l25l70K33L58
3326A83k30L2k40k09N04M0l16NK52j33J98m48L6q5M13j49l42K85q7J01J72l38
3348c56N8L5K8L64j98n7K80l19k52L08j99K03O8p5J49r4j0J97Nj57J3J33rj31
3372a6L4K5j20J62m57L46o5j29J51j12j02K20L4k50q4L56k4q6Q5k5N7q6M7l59
3396c98J70m3K11m19K96J66j6J3j62L21k63J2n2j2K79J49k54nj36J56k42m22M75
3419a76J97J39j60r2j49K58L28m87j46p9L44J25q6m67R0N44k53k05j13L3L94J27
$$ plain form
3264 582 -128 -717 -531 168 419 240 -571 -334 400 592 28 -600 -180 286 318 -270 -510 -308 253 383
3284 383 -521 -285 57 470 -186 -440 -581 -51 313 -256 -666 -375 336 19 -498 -662 -243 117 202 -294
3304 -294 -650 -47 114 53 -583 -434 137 441 166 -386 -107 103 38 -249 -303 -325 215 287 -38 -408 -175 183
3326 183 -47 -15 -255 -464 40 80 -236 -231 21 -112 86 -362 -326 -411 2 -147 -489 -204 -291 -190 -18 -356
3348 -356 -298 -263 -235 129 -69 -126 154 -165 -417 -109 -308 -105 -37 -112 37 -57 -67 130 135 -22 -9 124 115 -16
3372 -16 18 43 -77 85 -372 -26 -91 -220 -69 -181 -283 -63 -29 -279 -363 -7 -31 -117 -32 -57 0 -86 -39 -398
3396 -398 -228 -271 -60 -479 -183 -17 -33 -20 -182 139 -124 -112 -164 -176 103 252 -2 -7 -143 13 -229 -651 -176
3419 -176 21 160 0 -92 -241 17 345 -142 -288 -367 -23 102 16 -451 -361 183 -70 -275 -388 -355 39 166
3441A66l37J09K00J20l31n5l6j15Q21m26l62O7J97K36k71pk43L47J29L2m35K6
3463a68M42om06l8J49L21k46l28p4J57L05k03k41K2L01K40j25m37J75L84k01j58
3485a35k58J76M62J4l07k94K55K83K13m30k72K42K54J90k43m11O03j4R3n25k03
3506c07M30J96p4o63K54M53J37o00lq7L63L50n03l25J60N55J02n36l26K66M98
3527C40qm94j35L88M53l05o21J22K86K58J90q23r4O89J47j91n71K85M54n7j86
3548A27p00P34J75m2p17o6N54K94Po80j69M94L17l03m46k36R02J49n14N0o12Q71
3570A89L02m77m22l4O47L26r22K4N59K24p5m66L6Q7K70J18k35m70L82M44j24n31
3592a48j07L49L58m08n15J15O67N3m00k01J01K82q9j47lj88O56l9m89M5n3L72
$$ plain form
3441 166 -171 -62 138 258 -73 -128 -164 -279 542 116 -246 -179 18 254 -17 -24 -267 80 209 241 -194 -168
3463 -168 274 268 -138 -176 -27 294 48 -280 -354 -197 108 -95 -336 -314 -13 227 102 -335 -160 224 23 -135
3485 -135 -393 -217 245 259 -48 -342 -87 196 409 -21 -293 -51 203 393 150 -261 342 328 421 -104 -307
3506 -307 123 319 245 -418 -164 289 426 -174 -177 -264 99 449 -54 -379 -219 336 438 -98 -424 -158 340
3527 340 332 -162 -297 91 544 239 -382 -260 26 284 474 -349 -443 246 393 202 -369 -84 370 313 127
3548 127 -573 161 336 294 -423 -489 65 359 366 -314 -483 11 328 25 -421 -657 245 394 -120 -70 -682 189
3570 189 491 14 -408 -442 205 531 -391 -367 192 416 341 -125 -89 -2 268 386 151 -319 63 507 383 -148
3592 -148 -255 94 452 44 -471 -356 311 364 -36 -237 -136 146 57 -90 -93 -281 375 336 -153 -108 -161 211
3614B11K89p41N4J27L50j03n45J36M33J47k39l15J65L74K51m79k76o8M45M1j90
3635F7m26K06M78R2n01m37P75J58K20j097K15J82K94J84o16k63N58K36j21n71
3655c67P5M24J20J6o03J75K80J94m82j73K02N54r6m15J36k17M03j6n82K23R8J42
3677I1J06k17l04L72K99m89j19j07L11L44p4k97n1O78m01n44J21K34L28K7m88
3698a80n3M6K85Q4m14j97N63K22k77m98K01J69R4J18m46K79N7O9k07j37p5J09
3720a88K73k28J47n1J63kk25n2P8L48k49o4l50M33J46l34Q3J21m3k7Q9k11L0J64
3744E1K03k10Q3k24K77L8l25j86K37K39k36Ll49J02M88l05Q0k64K37O3o2K4l03
3767c39M68k25o9Kk52M92k45K1m6K45n1n3q6J31j02j12K21k11M13j43L4K2p1j3
$$ plain form
3614 211 500 -241 -187 -60 290 187 -358 -222 211 358 119 -196 -31 343 594 115 -161 -229 216 257 67
3635 67 -359 -153 325 417 -84 -521 254 412 632 -465 -250 -68 226 410 -206 -469 89 325 204 -367
3655 -367 -292 132 252 268 -335 -160 120 314 -168 -341 -139 415 319 -96 40 -177 226 210 -372 -149 -51 91
3677 91 197 -20 -324 48 347 -142 -261 -368 -57 287 213 -84 -135 543 142 -402 -281 -47 281 308 -180
3698 -180 -233 -187 98 182 -232 -429 134 356 79 -419 -218 -49 45 163 -283 -4 53 122 -85 -222 -297 -188
3720 -188 85 -143 4 -47 116 114 -111 -163 -85 263 14 -50 -400 33 179 -155 -72 49 6 -21 68 -143 -113 51
3744 51 254 44 127 -97 180 218 -107 -293 -56 183 -53 -50 -399 -297 191 -114 -34 -298 -61 2 -60 -36 -339
3767 -339 129 -96 -165 -163 -415 77 -168 -147 -193 52 1 -52 -138 -7 -109 -221 0 -211 202 59 93 115 44 31
3791C1m6J32j71Om3j1M3P9k18J05p6K03j53K7L3m2Rj3j09N7J57K66l02j69K21
3816A6R2Q9k19l9L4n5P5l86M19k10M3J95j66L24l07j38K53N7l9j34J16l6k61K62
3840a5L7J93O1l22j62N0P4K1kJ2RQ9K18l18J72j03n2J72r4j71J89j43k80J67P2
3865a26P3J19P7j83K28l09r6K76j62J90k08K24J5j37j1%o7Q3J60l90K74j23M46
3888C53l34M3j27K65l02K01L6j64K52j44k46Q0P0J39j61Jj78K56nm1k76J84L26
3911B28k07k31j49L39J52p1r3n1M9Q1O1m43M58J35j59j6k38J98k6O9K18n11J25
3934h2J65n4j55M3N9K86l15j7j02J51l8R6j20j0pK03k46P3P1J53J5P9k55O8k0
3959D1k1J47j79J59j18j57P1n9j24K47K4k29Q1Q3J32n8j40M9J26q2q0M9J5J03
$$ plain form
3791 31 -15 117 -54 -48 -91 -102 -59 20 -198 -93 -169 34 -119 -92 -59 -101 -92 -105 -214 -157 0 266 -36 -205 16
3816 16 108 197 -22 -61 -27 -82 -7 -393 26 -184 -141 54 -112 212 -95 -233 20 77 38 -96 20 -16 -277 -15
3840 -15 22 215 276 -46 -208 -158 -84 -63 -65 -53 -44 45 263 -55 117 14 -38 134 40 -131 58 -85 -365 -198 -126
3865 -126 -53 66 143 -40 188 -121 -217 59 -103 87 -121 103 118 -19 -30 -30 -97 -14 146 -244 30 -93 353
3888 353 19 62 -65 200 -102 99 135 -29 223 79 -167 -87 -17 122 -39 -38 -216 40 35 -6 -282 -98 228
3911 228 21 -210 -359 -20 132 61 -32 -83 -34 47 108 -335 123 258 99 83 -155 43 17 86 304 -207 -82
3934 -82 83 29 -126 -83 -24 262 -53 -70 -172 -21 -59 37 -83 -93 -100 103 -143 -70 1 154 169 248 -7 61 41
3959 41 20 167 -12 147 29 -128 -57 -116 -240 7 31 -198 -117 -34 98 40 -100 -51 75 -7 -87 -38 -23 80
3983H0l7q9O2N8M5J56l10m73M41p4J56J7k94K44N2Mk39L90j49mj12r8J43J16J2
4008I7P9k10p3K04j45Q8r7L08j69j24J49j27K15r8K1j76j04L43P0l72pm2K21J53
4032B04k43n9J08j58K33k60o3L34M17l83l23J30r4J80j18j91L34K8P9k98m8J06
4054h5L72q3k82J06k90J65J10k16K57l26N53k5l63k38K78J71R4o1l29J37q6K2
4076a19P2j35J85J32k10J4j11M70n07J4r3K67K11m2k52m8K58n4j73jJ54k13J81
4099@O7%k03J46R2j71K7J22P9k6p6j60k2KK57j94L16k53P2r6mj46J05K54j88J55
4125A55j47j30J15K16k47j51K83J01j87R0l66K79Q1l04j9L07r1J81l95qM9P1J63
4148D6j73l7q6L17j87P4r7P7j3j4q0RK76p4j17k8L11k77L38l60q1L73k11O5j8
$$ plain form
3983 80 43 -46 16 74 119 275 -35 -508 -67 -141 15 32 -262 -18 34 38 -201 189 40 36 -76 -174 -31 85 97
4008 97 176 -34 -107 97 -48 40 -57 251 82 -42 107 -20 195 97 118 -58 -162 181 251 -121 -128 -170 51 204
4032 204 -39 -98 10 -148 85 -175 -238 96 513 130 -193 -63 -157 23 -95 -286 48 76 155 -143 -191 -85
4054 -85 287 204 -78 28 -262 -97 13 -203 54 -272 281 256 -107 -345 -67 104 198 137 -192 -55 -141 -119
4076 -119 -47 -182 3 135 -75 -61 -172 298 -209 -195 -288 -21 190 148 -104 -152 106 52 -121 -122 32 -181 0
4099 0 67 67 -136 10 102 -69 -42 80 159 133 57 -103 -125 -123 134 -60 256 3 75 -21 -25 -171 -66 188 0 155
4125 155 8 -122 -7 209 -38 -189 94 195 8 98 -268 11 92 -212 -231 76 -15 166 -229 -237 -188 -117 46
4148 46 -127 -164 -250 67 -120 -46 -143 -66 -79 -93 -173 -164 112 38 -79 -107 204 -73 265 -95 -176 197 -14 51 33
4173C3l17K63P6j28j01K1J24J75J7j64j12J13J94l62O3j7K18j8m8j05k74L51R0
4196I2M3q3j63L6M4Ml02J48L24j5j85m2j12L08j06J0j5j1O4K47l42J28J44l35
4220a19L16k01K1J30q9J62k95P3j09K50j52j06J39J31p1J5l14J12J46k6j01J03
4242A5o6K94l86k3K3Q9j43K20J63k31O1k21K38l4J73j45j8M5l61L11n1q4K56j37
4266a2L8Nk3p2R8LMJ72j3l04K75n7j90R3k6LR1j81J94j37m6O6J81k52L98l18k
4293a2K24q2k42K52j51n2P4j03J58k89K08j3j09j14L66l2K13n62K90N6k59QO7
4316a04L6j29K13l8P9k76L45l6j03n4Q2j04j9O0J98k92K84k02J33j87L49k62k2
4339d9j01K82j71M2N6L3j44l0K60j07L2j14K09j10n1j6j20J02K9p3K32n40N24
$$ plain form
4173 33 -284 -21 55 -73 -174 -153 -29 146 163 -1 -113 0 194 -168 -105 -122 96 78 30 -75 -349 2 92
4196 92 135 52 -111 -75 -31 -27 -329 -181 143 128 -57 -99 -211 97 -9 1 -14 -25 39 286 -56 72 216 -119
4220 -119 197 -4 17 147 58 220 -75 -2 -111 139 -13 -119 20 151 80 95 -219 -107 39 13 -88 15
4242 15 -51 243 -143 -166 -143 -54 -197 23 186 -45 16 -205 33 -1 172 27 9 54 -307 4 -47 -131 125 -12
4266 -12 26 31 8 -64 34 37 41 213 200 -104 171 114 -76 17 -9 -6 85 -96 98 -39 -85 -19 162 -90 308 -10 -12
4293 -12 212 130 -112 140 -11 -63 11 -92 66 -223 -15 -28 -137 -251 115 83 296 -266 24 80 -179 -171 -104
4316 -104 -68 -197 16 -22 57 -219 126 90 -13 -67 15 -89 -108 -48 150 -142 142 -60 73 -114 235 -27 -49
4339 -49 -150 132 -39 3 59 92 -52 -82 178 71 103 -11 198 88 37 21 -99 3 32 -41 191 -349 175
4362A75k32J06j57L53j74l5p9k28K10j0J03j72K75M9j16k48J09m6L44j95K13m21
4384a76J12P7p4O6n5j27L34j95P7l14L03J35l02Q7j09J60q9OK08l35J78R8L1k36
4408a40R0R9K72j87k05l4mL3N9L0j29J68k9l28L28l6j67K49l29K83L9J73n8k69
4432i2J15J04m1j70J30q4J85j95Q5k8j12Q9K53k51k94L20J81k15J48k28J56QL7
4455A01J11n05L46J84j52p7j70K97q3j90l1q8M20k90J43k08K90j53J56j25m9J76
4477A03J16j68j31P9o7K6k18O2J44p4K75op8k1K19n4k27j20L62j77n6l2K6k6K54
4502B11M6k98n5J26j3q7L8M7k47L67l27J38J15j62K0n6j25L49j28K42k37j3K0
4525b9K14j36m5j84J78j59J61O2k42m5L46j15j53l0J72o1o7J89r5K87j88j70R7
$$ plain form
4362 175 -57 49 -108 245 71 36 -43 -271 -61 -71 32 -140 135 184 68 -180 -71 -117 227 32 245 -176
4384 -176 -64 13 -61 5 -50 -177 157 -38 39 -275 28 163 -139 -52 -161 -1 -90 -84 124 -211 -33 65 96 -140
4408 -140 -50 49 321 134 -71 -105 -109 -76 -17 13 -116 52 23 -305 23 -13 -180 69 -260 23 62 235 177 -92
4432 -92 23 127 86 -84 46 -38 147 -48 37 9 -103 -14 239 -12 -306 14 195 -20 128 -100 56 64 101
4455 101 212 -293 53 237 85 8 -162 135 52 -138 -169 -257 163 -127 16 -192 98 -55 101 -24 -73 103
4477 103 219 51 -80 -1 -68 -42 -260 -198 -54 -128 147 141 63 42 261 207 -20 -140 222 45 -11 -43 -17 -43 211
4502 211 257 -41 -96 30 17 -70 -32 15 -232 135 -192 -54 61 -101 -81 -137 -262 87 -41 201 -36 -49 -29
4525 -29 185 49 4 -180 -2 -161 0 62 -180 -225 121 6 -147 -177 -5 -66 -133 56 -39 248 60 -110 -13
4548a3Pk22M13K4l89J05M21m27K86l67J98J71j19M7k45J33l4K01l28J22j45J84
4570B3m2K4l57K97J25O0j72j26J9K70K11l75mP0K9k02P7K1M2J23j54o1JJ46j7
4595B8q3j01l3J68L22k80J34k62J11j10p7L19j58R9k7j28j14M20l97J39J21p3
4617A8K61m94M52k80M5J64q3k20J80r9r6K0QL0O5r5K0J89k74J67J02j1k98J60
4641f9O1J12k09J98j49J75p1n3J7j08K62l8p6k78K13N0j26O9M4K4J55n00J38O9
4665i0l8K31k55J29M02M5l02P3l51j7O1K4J21j4J38j13j51J78l5K0J96k34j28
4688a10J35j35Q7l2K2L4J21m2k70Q0J57j65J95k03K93k88n0K56o5MJ02o3j58j11
4712b06J93j91J66Q9k48J80r0J86j07O2n3J69l66K78j66m7N8Mj32J93L09q6k58
$$ plain form
4548 -13 -6 -228 185 209 -180 -75 346 -81 205 -162 36 207 88 135 -110 23 -11 190 -138 -16 -161 23
4570 23 -19 5 -352 -55 70 130 -42 -168 -149 121 332 -43 -47 23 52 -150 -73 -52 -10 113 -41 -102 -101 45 28
4595 28 -55 -156 -189 -21 301 21 155 -107 4 -106 -183 136 -22 77 50 -78 -192 228 -169 -30 91 18
4617 18 279 -215 237 -43 2 166 83 -137 43 -56 -152 -132 -124 -94 -29 -124 -104 85 -189 -22 80 69 -229 -69
4641 -69 -8 104 -105 93 -56 119 48 -5 12 -96 166 128 52 -226 -13 37 -89 -20 24 48 203 -297 -159 -90
4665 -90 -128 103 -152 -23 379 424 122 195 -156 -173 -112 -88 33 19 157 44 -107 71 36 56 252 18 -110
4688 -110 25 -110 -23 -55 -33 1 122 80 -190 -110 47 -118 77 -126 167 -121 -171 85 20 24 126 63 -95 -206
4712 -206 -13 -204 -38 51 -197 -17 -107 79 -28 34 -19 150 -216 62 -104 -151 -93 -89 -221 -28 281 195 -63
4735f3K92l06N%j29O07j33m59R4N9Q3k5J59k28j58M05l24j25L73j17j48j29J83
4758h4K22j91p5n9K2l0K86J84j83q0J36j81P7k2N6K1Q4k12q4m2J84k01K43j19
4782d8K63l98J49N3j6p2K55k40O6J6l57K87J25jq6m6l0K08j73oj43K93k26m2J11
4807e8P7P4p0j58K3J24J82j48r6j71L29m31L32n7j04j4K7R8m8L7p8L14J54l58
4831b0N9N3j03J9j24P9J55k15L8m1K54n2q9J26n4K03k93J7Q7k06K53M3j56j79
4855a46J78QJ03o8k38J52P7O0k30n8J88Q9rk50K4J06n5N3L3j72K93j01Jk54K37
4880B1j23J16j05O1J45j88J83m4q2R2mJ14R9o6j32nq9q7k3J08p9J46J11k31J22
4905F0O8m3k05K9K25J10l47M9J51Nk23J7nJ61o9j28L21k72K52j57k7j55m8K43
$$ plain form
4735 -63 229 -77 -72 -72 -201 406 273 -186 -92 -33 50 25 184 -44 -202 203 -121 -246 127 10 -138 -267 -84
4758 -84 138 -53 -128 -187 -165 -195 91 275 92 12 148 -33 44 22 78 99 183 -29 -113 -155 29 -172 71 -48
4782 -48 215 -183 -34 19 3 -69 186 -54 12 28 -329 -42 83 82 -4 -50 -80 128 -45 -51 -194 99 -127 -169 -58
4807 -58 19 93 23 -135 -112 12 194 46 -50 -221 108 -323 9 -48 -152 -166 -139 -41 -89 -52 -130 184 338 -20
4831 -20 39 92 -11 8 -116 -37 118 -97 -59 -100 154 102 13 139 85 288 -5 12 99 -107 146 189 33 -146
4855 -146 32 40 143 75 -163 -11 66 126 -104 -162 26 115 106 -144 -120 -14 -69 -16 17 -155 138 37 38 -216 21
4880 21 -102 14 -91 -30 115 -73 110 66 -16 76 72 186 285 219 87 82 -7 -94 -117 -9 -88 58 169 -62 60
4905 60 128 85 -120 -91 134 244 -103 -54 97 102 -121 -104 -109 52 -17 -145 176 -96 156 -1 -28 -183 -231 12
4929A2J38o0j79M1M8M1N2k88J03K58r8j78L8L8J13Ql86J27L25k39O4j55J5J24
4953c8K91k87J20l18L03j9j98K08j80J27P5Jl54J61K08p9J2j67l3Q9L20q3P7k3
4977B13j21J76k99n6j54K49J28m33L19j73M71k40k52j44N58k87j51Q9K69J45m35
$$ plain form
4929 12 150 90 -89 -48 0 41 93 -195 -92 166 68 -110 -72 -34 79 87 -299 -172 153 -86 -22 -177 -162 -38
4953 -38 253 -34 86 -232 71 52 -146 62 -118 9 84 85 -269 -108 100 21 33 -134 -167 -78 242 159 236 213
4977 213 92 268 -31 -87 -241 8 136 -297 22 -151 320 80 -172 -316 242 -45 -196 -107 162 307 -128
$$ [...]
8191c
##END NTUPLES=NMR FID
##END=
