##TITLE=1H_SA_slSOH.1
 CDCl3, 8 sc, 
 29.9.2020
##JCAMPDX= 6.0         $$ Bruker NMR JCAMP-DX V2.0
##DATA TYPE= NMR FID
##DATA CLASS= NTUPLES
##ORIGIN= UXNMR, Bruker Analytische Messtechnik GmbH
##OWNER= root
$$ XWIN-NMR		Version 3.5
$$ Tue Sep 29 09:45:59 2020 Russian Standard Time (UT+4h)  she@DPX200
##.OBSERVE FREQUENCY= 200.1315066352
##.OBSERVE NUCLEUS= ^1H
##.DELAY= (6, 6)
##.ACQUISITION MODE= SIMULTANEOUS
##.ACQUISITION SCHEME= undefined
##.AVERAGES= 8
##.DIGITISER RES= 18
##SPECTROMETER/DATA SYSTEM= spect
##.PULSE SEQUENCE= zg30
##.SOLVENT NAME= CDCl3
##.SHIFT REFERENCE= (INTERNAL, CDCl3, 0, 15.7039)
##AUDIT TRAIL= $$ (NUMBER, WHEN, WHO, WHERE, WHAT)
$$ ##TITLE= Audit trail, XWIN-NMR		Version 3.5
$$ ##JCAMPDX= 5.01
$$ ##ORIGIN= Bruker BioSpin GmbH
$$ ##OWNER= she
$$ F:/spectra/data/she/nmr/H-F/1/audita.txt
$$ ##AUDIT TRAIL=  $$ (NUMBER, WHEN, WHO, WHERE, WHAT)
(   1,<2020-09-29 09:44:19.06 +0400>,<she>,<DPX200>,
      <created by zg, POWCHK disabled, PULCHK disabled
       configuration hash MD5:
       00 E9 B6 7A A2 85 ED C7 34 08 36 98 17 FE 4E 26
       data hash MD5: 16K
       4E 5E 08 5F 9B 22 5E EE 29 6E 8D 9D A2 75 40 84>)
$$ ##END=
$$ 
$$ hash MD5
$$ DA 1F F5 CD B4 5A 17 65 FA 8C 0A F4 12 54 F1 09
##$RELAX= 
##$RELAX= 
##$RELAX= 
##$RELAX= 
##$RELAX= 
##$RELAX= 
$$ Bruker specific parameters
$$ --------------------------
##$DU= <F:/spectra>
##$EXPNO= 1
##$NAME= <H-F>
##$PROCNO= 1
##$TYPE= <nmr>
##$USER= <she>
##$AMP= (0..31)
100 100 100 100 100 100 100 100 100 100 100 100 100 100 100 100 100 100 
100 100 100 100 100 100 100 100 100 100 100 100 100 100 
##$AQSEQ= 0
##$AQ_mod= 1
##$AUNM= <au_zg>
##$AUTOPOS= <>
##$BF1= 200.13
##$BF2= 200.13
##$BF3= 200.13
##$BF4= 200.13
##$BF5= 200.13
##$BF6= 200.13
##$BF7= 200.13
##$BF8= 200.13
##$BYTORDA= 1
##$CFDGTYP= 0
##$CFRGTYP= 5
##$CHEMSTR= <none>
##$CNST= (0..31)
1 1 145 1 1 1 1 1 1 1 1 1 1 1 1 1 1 1 1 1 1 1 1 1 1 1 1 1 1 1 1 1 
##$CPDPRG= <>
##$CPDPRG1= <>
##$CPDPRG2= <>
##$CPDPRG3= <>
##$CPDPRG4= <mlev>
##$CPDPRG5= <mlev>
##$CPDPRG6= <mlev>
##$CPDPRG7= <mlev>
##$CPDPRG8= <mlev>
##$CPDPRGB= <>
##$CPDPRGT= <>
##$D= (0..31)
0 1.2 0 0 0 0 0 0 0 0.06 0 0.03 0 0 0 0 0.0002 0 0 0 0 0 0 0 0 0 0 0 0 
0 0 0 
##$DATE= 1601358258
##$DBL= (0..7)
120 120 120 120 120 120 120 120 
##$DBP= (0..7)
150 150 150 150 150 150 150 150 
##$DBP07= 0
##$DBPNAM0= <>
##$DBPNAM1= <>
##$DBPNAM2= <>
##$DBPNAM3= <>
##$DBPNAM4= <>
##$DBPNAM5= <>
##$DBPNAM6= <>
##$DBPNAM7= <>
##$DBPOAL= (0..7)
0.5 0.5 0.5 0.5 0.5 0.5 0.5 0.5 
##$DBPOFFS= (0..7)
0 0 0 0 0 0 0 0 
##$DE= 6
##$DECBNUC= <off>
##$DECIM= 32
##$DECNUC= <off>
##$DECSTAT= 4
##$DIGMOD= 1
##$DIGTYP= 9
##$DL= (0..7)
0 120 120 120 120 120 120 120 
##$DP= (0..7)
150 150 150 150 150 150 150 150 
##$DP07= 0
##$DPNAME0= <>
##$DPNAME1= <>
##$DPNAME2= <>
##$DPNAME3= <>
##$DPNAME4= <>
##$DPNAME5= <>
##$DPNAME6= <>
##$DPNAME7= <>
##$DPOAL= (0..7)
0.5 0.5 0.5 0.5 0.5 0.5 0.5 0.5 
##$DPOFFS= (0..7)
0 0 0 0 0 0 0 0 
##$DQDMODE= 0
##$DR= 18
##$DS= 0
##$DSLIST= <SSSSSSSSSSSSSSS>
$$ [...]
##$SUBNAM2= <"">
##$SUBNAM3= <"">
##$SUBNAM4= <"">
##$SUBNAM5= <"">
##$SUBNAM6= <"">
##$SUBNAM7= <"">
##$SUBNAM8= <"">
##$SUBNAM9= <"">
##$SW= 16.880792210976
##$SWIBOX= (0..15)
0 0 2 0 0 0 0 0 0 0 0 0 0 0 0 0 
##$SW_h= 3378.37837837838
##$TD= 16384
##$TD0= 1
##$TE= 0
##$TE2= 300
##$TE3= 300
##$TEG= 300
##$TL= (0..7)
0 120 120 120 120 120 120 120 
##$TP= (0..7)
150 150 150 150 150 150 150 150 
##$TP07= 0
##$TPNAME0= <>
##$TPNAME1= <>
##$TPNAME2= <>
##$TPNAME3= <>
##$TPNAME4= <>
##$TPNAME5= <>
##$TPNAME6= <>
##$TPNAME7= <>
##$TPOAL= (0..7)
0.5 0.5 0.5 0.5 0.5 0.5 0.5 0.5 
##$TPOFFS= (0..7)
0 0 0 0 0 0 0 0 
##$TUNHIN= 0
##$TUNHOUT= 0
##$TUNXOUT= 0
##$USERA1= <user>
##$USERA2= <user>
##$USERA3= <user>
##$USERA4= <user>
##$USERA5= <user>
##$V9= 5
##$VALIST= <valist>
##$VCLIST= <CCCCCCCCCCCCCCC>
##$VD= 0
##$VDLIST= <DDDDDDDDDDDDDDD>
##$VPLIST= <PPPPPPPPPPPPPPP>
##$VTLIST= <TTTTTTTTTTTTTTT>
##$WBST= 1024
##$WBSW= 4
##$XGAIN= (0..3)
0 0 0 0 
##$XL= 0
##$YL= 0
##$YMAX_a= 485081
##$YMIN_a= -487296
##$ZGOPTNS= <>
##$ZL1= 120
##$ZL2= 120
##$ZL3= 120
##$ZL4= 120
##$ABSF1= 10
##$ABSF2= 0
##$ABSG= 5
##$ABSL= 3
##$ALPHA= 0
##$AQORDER= 0
##$ASSFAC= 0
##$ASSFACI= 0
##$ASSFACX= 0
##$ASSWID= 0
##$AUNMP= <proc_1d>
##$AZFE= 0.1
##$AZFW= 0.1
##$BCFW= 1
##$BC_mod= 2
##$BYTORDP= 1
##$COROFFS= 0
##$CY= 11.3945322036743
##$DATMOD= 1
##$DC= 2
##$DFILT= <>
##$DTYPP= 0
##$F1P= 16.9975609425685
##$F2P= -3.02152046262296
##$FCOR= 0.5
##$FTSIZE= 0
##$FT_mod= 4
##$GAMMA= 1
##$GB= 0.15
##$INTBC= 1
##$INTSCL= 1
##$ISEN= 128
##$LB= 0.24
##$LEV0= 0
##$LPBIN= 0
##$MAXI= 10000
##$MC2= 0
##$MEAN= 0
##$ME_mod= 0
##$MI= 1.114404
##$NCOEF= 0
##$NC_proc= 0
##$NLEV= 6
##$NOISF1= 3.799351
##$NOISF2= 2.8
##$NSP= 1
##$NTH_PI= 0
##$NZP= 0
##$OFFSET= 15.70392
##$PC= 1
##$PHC0= -9970.924
##$PHC1= 15.6009
##$PH_mod= 1
##$PKNL= yes
##$PPARMOD= 0
##$PSCAL= 0
##$PSIGN= 0
##$REVERSE= no
##$SF= 200.130013532006
##$SI= 16384
##$SIGF1= 3
##$SIGF2= 2
##$SINO= 400
##$SIOLD= 16384
##$SREGLST= <1H.CDCl3>
##$SSB= 0
##$STSI= 0
##$STSR= 0
##$SW_p= 3612.71676300578
##$SYMM= 0
##$S_DEV= 0
##$TDeff= 0
##$TDoff= 0
##$TI= <>
##$TILT= no
##$TM1= 0
##$TM2= 0
##$TOPLEV= 0
##$USERP1= <user>
##$USERP2= <user>
##$USERP3= <user>
##$USERP4= <user>
##$USERP5= <user>
##$WDW= 1
##$XDIM= 8192
##$YMAX_p= 0
##$YMIN_p= 0
$$ End of Bruker specific parameters
$$ ---------------------------------
##NTUPLES= NMR FID
##VAR_NAME=  TIME,          FID/REAL,        FID/IMAG
##SYMBOL=    X,             R,               I
##VAR_TYPE=  INDEPENDENT,   DEPENDENT,       DEPENDENT
##VAR_FORM=  AFFN,          ASDF,            ASDF
##VAR_DIM=   8192,          8192,            8192
##UNITS=     SECONDS,       ARBITRARY UNITS, ARBITRARY UNITS
##FACTOR=    0.000296,      1,               1
##FIRST=     0,             0,               0
##LAST=      2.424536,      0,               0
##MIN=       0,             -487296,         0
##MAX=       2.424536,      485081,          0
$$ Real data points
##PAGE= N=1
##DATA TABLE= (X++(R..R)), XYDATA
$$ plain form
0 0 0 0 0 0 0 0 0 0 0 0 8 -8 8 -8 15 -16 24 -28 33 -41 51 -62 73 -89 105 -125 144 -169 198 -229 262 -301
32 -301 347 -393 447 -505 570 -642 721 -805 902 -1004 1116 -1240 1374 -1524 1683 -1858 2049
49 2049 -2258 2487 -2737 3014 -3318 3657 -4032 4452 -4924 5461 -6076 6788 -7621 8614
63 8614 -9814 11292 -13157 15546 -18584 21853 -36960 485081 -308085 -39304 233710 -487296
75 -487296 377601 -35885 -299498 273466 -207674 35003 155486 -281944 153102 2684
85 2684 -113824 112945 -55755 -54336 64884 -23704 -57826 123636 -75967 -100962 214270
96 214270 -125160 21421 92005 -220600 248676 -7201 -197769 224355 -183633 115957
106 115957 111984 -332045 265506 -66253 -98426 219584 -314057 160648 113908 -261124 206850
$$ packed form
0@%%%%%%%%%%Qj6J6j6K3l1M0n2O1p4R2j13J35j62J94k30K69l13L67m27M91n63
32c01O48p40Q40r52J075j212J363j526J707j906K120k356K614k898L207l541L907
49B049m307M745n224N751o332O975p689Q484r376J0385j1537J2864j4409J6235
63H614j8428K1106k4449K8703l4130M0437n8813N22041p93166K68781K73014p21006
75d87296Q64897m13486k63613N72964m81140K42677J20483m37430M35046j50418
85B684j16508K26769j68700J419J19220q8588l4122J81462j99603k4995L15232
96B14270l39430J46581P0584l12605M69276k55877j90568M22124m07988K99590
106A15957l973m44029N97551l31759l2173L18010n33641M74705m6740l75032M67974
$$ plain form
117 206850 -115367 -34026 181235 -220898 91858 32486 -117018 121322 -101490 12347
127 12347 49529 -101175 48622 5708 -31382 -15262 7891 -2765 2838 22883 -105345 63539
139 63539 62469 -134156 72230 -51313 -21589 130513 -188038 41560 58814 -101422 127179
150 127179 -149062 4542 145231 -162790 96828 -29872 -76271 180574 -138184 5425
160 5425 95894 -112439 100957 -37941 -34929 94469 -85232 44879 18815 -34693 56949
171 56949 -58234 25259 54354 -48672 446 1691 16805 8972 -21735 -32281 1202 61577
183 61577 -64798 -29482 34298 -42322 54103 -50874 -53327 84122 -57166 15111 -5542
194 -5542 -66187 103378 -69637 -29272 76666 -97776 65245 -5521 -84219 109218 -59153
$$ packed form
117B06850l22217Q1341K15261m02133L12756n9372j49504K38340k22812J13837
127A2347L7182j50704J49797m2914l7090J6120K3153j0656N603K0045j28228J68884
139F3539j070j96625K06386j23543K9724J52102l18551K29598J7254j60236K28601
150A27179k76241J53604J40689l08021K59618j26700m6399K56845l18758J43609
160E425R0469k08333K13396j38898L012J29398j79701J30111k6064n3508R1642
171E6949j15183Q3493K9095j03026M9118J245J5114p833l0707j0546L3483O0375
183F1577j26375L5316O3780p6620R6425j04977k453J37449j41288P2277k0653
194e542o0645J69565j73015M0365J05938j74442J63021p0766p8698J93437j68371
$$ plain form
205 -59153 -28108 64208 -59534 44379 -9731 -49304 69473 -27712 -9537 12468 -35006
216 -35006 46144 -8895 -48228 25299 12858 -21079 2464 -11847 -12908 45898 -30025 -38925
228 -38925 53162 -15675 -8762 14010 -42615 48616 58 -49793 42938 -31188 23646 13757
240 13757 -69845 65412 -7850 -37183 49214 -47773 16057 38729 -68288 32481 13301
251 13301 -35183 28113 -29449 9415 16523 -39857 12334 2313 -8172 8788 -28022 603
263 603 37208 -33534 -13522 22449 -15514 15693 -4869 -37177 33880 16403 -39590 14378
275 14378 -5308 3089 22776 -44893 14286 13137 -14953 17724 -32313 6486 32142 -43209
287 -43209 9295 12982 -35508 33588 -21033 -22497 38774 -33143 -4805 15998 -17112 4893
$$ packed form
205e9153L1045R2316j23742J03913n4110l9573J18777r7185J8175K2005m7474
216c5006Q1150n5039l9333P3527j2441l3937K3543j4311j061N8806p5923q900
228c8925R2087o8837O913K2772n6625R1231m8558m9851R2731p4126N4834r889
240A3757q3602J35257p3262k9333Q6397r6987O3830K2672j07017J00769j9180
251A3301m8484O3296n7562L8864P108n6380N2191j0021j0485J6960l6810K8625
263F03L6605p0742K0012L5971l7963L1207k0562l2308P1057j7477n5993N3968
275A4378j9686Q397J9687o7669N9179j149k8090L2677n0037L8799K5656p5351
287d3209N2504L687m8490O9096n4621j464O1271p1917K8338K0803l3110K2005
$$ plain form
299 4893 -9719 -10155 22074 -13303 -13931 9367 -8639 23617 -12882 -30470 30995 7246 -14397
312 -14397 5103 -14837 7657 34371 -34596 -8898 23333 -7872 11627 -16228 -9945 21177
324 21177 -6290 -2364 -2475 -14995 20859 -8719 -16629 24762 -28918 1078 20561 -25469 9416
337 9416 -5069 -19403 22362 1542 -22397 895 333 14414 -198 -23501 7840 6388 8177
350 8177 -2638 -25435 9398 25172 -19168 -8638 6073 -14724 23708 -7194 -30956 19714
362 19714 -4035 -7772 7251 -18193 2520 3360 -12413 11250 -18947 -3675 11432 -22508 16561
375 16561 -10038 -24778 26658 -5977 -13390 7484 -12998 8555 14834 -18568 -6152 10307
387 10307 9642 -2994 -10869 -741 8266 5251 -7312 -5937 -5087 14469 1853 -22890 14555 -2241
$$ packed form
299D893j4612m36L2229l5377o28K3298j8006L2256l6499j7588O1465k3749k1643
312a4397J9500j9940K2494K6714o8967K5698L2231l1205J9499k7855O283L1122
324B1177k7467L926j11j2520L5854k9578p910M1391n3680K9996J9483m6030L4885
337I416j4485j4334M1765k0820k3939K3292n62J4081j4612k3303L1341j452J789
350H177j0815k2797L4833J5774m4340J0530J4711k0797L8432l0902k3762N0670
362A9714k3749l737J5023k5444K0713Q40j5773K3663l0197J5272J5107l3940L9069
375A6561k6599j4740N1436l2635p413K0874k0482K1553O279l3402J2416J6459
387A0307o65j2636p875J0128R007l015j2563J375Q50J9556j2616k4743L7445j6796
$$ plain form
401 -2241 -8396 21947 -23772 -3240 22966 -22286 10305 -588 -18522 16951 -10065 4865
413 4865 -991 -20083 21276 -6422 -3231 10527 -25719 17481 14286 -22595 5731 -3641 1019
426 1019 7977 -11459 -10523 -2533 11296 -10745 -14150 1007 -8594 5363 -5173 -16039 359
439 359 -6726 6983 -9295 -15677 12868 -21516 8134 6948 -34252 20403 -7997 -10061 20738
452 20738 -24907 6711 10165 -8282 16534 -17445 8892 17788 -17737 22393 -12747 -4054 27840
465 27840 -20633 6325 1668 -8145 12206 -6869 368 -4850 -878 10462 -14848 4517 1087
478 1087 -14587 14273 -11787 -4205 635 -9695 8604 -18275 6759 -4278 -16230 22903 -23188
491 -23188 -1371 18150 -24945 16260 -727 -14948 20309 -18959 10067 1055 -18146 25480
$$ packed form
401b241o155L0343m5719K0532K6206m5252L2591j0893j7934L5473k7016J4930
413D865n856j9092M1359k7698L191J3758l6246M3200l195l6881K8326r372M660
426A019O958j9436R36P990J3829k2041l405J5157r601J3957j0536j0866J6398
439C59p085J3709j6278o382K8545l4384K9650j186m1200N4655k8400k064L0799
452B0738m5645L1618L454j8447K4816l3979K6337Q896l5525M0130l5140Q693L1894
465B7840m8473K6958m657r813K0351j9075P237n218L972J1340k5310J9365l430
478A087j5674K8860k6060P582M840j0330J8299k6879K5034j1037j1952L9133m6091
491b3188K1817J9521m3095M1205j6987j4221L5257l9268K9026r012j9201M3626
$$ plain form
503 25480 -27835 7433 13980 -33104 23984 -9410 -14008 21308 -18920 2297 6475 -11117 10129
516 10129 -12327 4768 1158 -13991 16064 -15718 2201 6487 -12308 9917 -4809 5390
528 5390 -3367 1180 15733 -16217 12304 7060 -15775 28117 -14434 -8975 27579 -23964 15401
541 15401 -4192 -15723 27912 -24660 10493 2337 -22562 32708 -19094 -10993 23996 -25184
553 -25184 12655 4444 -22981 17682 -9765 85 2754 -10050 9567 -10671 9097 3132 -9313
566 -9313 9698 -2729 8405 2557 -4268 5716 -3299 16345 -3144 -17551 23893 -11145 3954
579 3954 12457 -33028 24996 2747 -15128 13994 -20235 14649 6474 -18892 14524 -15490 5016
592 5016 14869 -28461 14941 -1953 -14441 21209 -15638 -1170 5439 -5740 10168 -4515 1340
$$ packed form
503B5480n3315L5268O547m7084N7088l3394m598L5316m0228K1217M178j7592K1246
516A0129k2456J7095l610j5149L0055l1782J7919M286j8795K2225j4726J0199
528E390q757M547J4553l1950K8521n244k2835M3892m2551N459L6554n1543L9365
541A5401j9593j1531M3635n2572L5153q156k4899N5270n1802Q101L4989m9180
553b5184L7839q211k7425M0663k7447R850K669j2804J9617k0238J9768n965j2445
566i313J9011j2427J1134n848o825R984r015J9644j9489j4407M1444l5038J5099
579C954Q503m5485N8024k2249j7875K9122l4229L4884q175k5366L3416l0014K0506
592E016R853m3330M3402j6894j2488L5650l6847J4468O609j1179J5908j4683N855
$$ plain form
605 1340 -3103 3510 15062 -12595 -364 6702 -748 11963 -10973 -3495 9185 1790 8958 -18968
619 -18968 5918 15904 -12161 13693 -11241 -3611 25331 -14324 92 5037 -7188 13988 -7663
632 -7663 -25 3573 -8833 16341 -8505 -2532 11186 -14541 13973 5485 -12728 6657 -2465
645 -2465 7667 2825 -11844 2318 -1264 11080 -2177 -19858 10776 3499 -1191 -539 -13327
658 -13327 6296 8380 -2524 -8553 -5728 12453 -2003 -4880 1786 -11394 11247 3412 -11213
671 -11213 5822 -5028 4161 4639 -3211 3967 -8682 8307 10817 -10228 6309 -4235 -959
684 -959 21245 -12344 -6667 8227 2023 10483 -9961 -5242 7811 5509 5736 -12589 -2853 15908
698 15908 -1490 -2628 -23 -5819 10565 3562 -6628 -1927 3829 2425 -3058 5769 -5597 -1895
$$ packed form
605A340m443O613J1552k7657J2231P066p450J2711k2936P478J2680p395P168k7926
619a8968K4886R986k8065K5854k4934P630K8942l9655J4416M945j2225K1176k1651
632g663P638L598j2406K5174k4846N973J3718k5727K8514q488j8213J9385r122
645b465J0132m842j4669J4162l582J2344j3257j7681L0634p277m690O52j2788
658a3327J9623K084j0904o029K825J8181j4456k877O666j3180K2641p835j4625
671a1213J7035j0850R189M78p850P178j2649J6989K510k1045J6537j0544L276
684i59K2204l3589N677J4894o204Q460k0444M719J3053k302K27j8325R736J8761
698A5908j7398j138K605n796J6384p003j0190M701N756j404n483Q827j1366L702
$$ plain form
712 -1895 7622 -2776 3103 -1746 -4912 5841 3321 -526 -6129 -4490 14319 -3081 -7679 3861
726 3861 -9025 13829 1033 -17827 6940 3860 417 -556 -8729 2760 6573 -2771 -2053 -5218
740 -5218 6153 3999 -9106 5212 -743 -1210 4279 -998 -1239 3971 1370 -3819 8204 222 -5759
755 -5759 5399 4070 304 870 -3375 2647 8761 -2774 -1971 -2847 9582 5331 -10789 4986 150
770 150 2951 7029 -10307 -714 11926 -2160 -2879 1397 -1159 6728 -1171 -1188 -620 2181 4148 -4807
786 -4807 3542 2379 -3606 617 4957 -1427 -1682 1807 -2923 4824 2660 -7566 -1166 8369 -1368
801 -1368 -3181 -1084 -1694 6997 -1050 -4676 -2894 5571 4793 -8294 937 3822 -723 2907 -980
816 -980 -3485 7299 636 -4315 4311 2311 345 -2103 3490 1482 572 2898 -3634 3854 5600
$$ packed form
712a895R517j0398N879m849l166J0753k520l847n603J639J8809j7400m598J1540
726C861j2886K2854j2796j8860K4767l080l443r73q173J1489L813r344P18l165
740e218J1371k154j3105J4318n955m67N489n277k41N210k601n189J2023p982n981
755e759J1158j329l766N66m245O022O114j1535Q03q76J2429m251j6120J5775m836
770A50K801M078j7336R593J2640j4086p19M276k556P887p899j7N68K801J967q955
786d807Q349j163n985M223M340o384k55L489m730P747k164j0226O400R535r737
801a368j813K097o10Q691q047l626J782Q465p78j3087R231K885m545L630l887
816i80k505J0784o663m951Q626k000j966k448N593k008r10K326o532P488J746
$$ plain form
831 5600 -3286 -1965 5797 2403 -1468 926 344 1557 4031 -1604 -4475 7312 837 -4532 2548
846 2548 1155 1546 -786 -186 528 3008 3097 -5624 836 8879 -2442 -2181 2954 -788 5404 694
862 694 -4372 2253 4851 1160 -4766 2624 3698 -1885 2849 -1563 -1387 5320 -1873 -2492 3566 -375
878 -375 -2364 -1056 3539 -1600 -2974 1624 -2738 3252 2344 -7125 1663 5749 -923 -1372 -1049 3002
894 3002 2899 493 -2098 -2231 8483 612 -5457 3913 1051 2086 1988 -2459 1347 3732 1604 -1742
910 -1742 16 5234 -2328 -290 4916 -4402 2829 946 -2937 4351 -424 -1892 529 4222 1460
925 1460 -4052 2024 3416 -389 3554 -3780 -1051 9941 -1732 -2366 223 3409 3926 -1684 139
940 139 -2042 5073 4931 -6486 381 5084 -2023 2574 -285 -4148 3272 -309 52 -2878 117 -177
$$ packed form
831E600q886J321P762l394l871K394n82J213K474n635k871J1787o475n369P080
846B548j393L91k332O00P14K480Q9q721O460Q043j1321K61N135l742O192m710
862F94n066O625K598l691n926P390J074n583M734m412J76O707p193o19O058l941
878c75j989J308M595n139j374M598m362N990r08r469Q788M086o672m49L23M051
894C002j03k406k591j33J0714p871o069R370k862J035r8m447L806K385k128l346
910a742J758N218p562K038N206r318P231j883l883P288m775j468K421L693k762
925A460n512O076J392l805L943p334K729J0992j1673o34K589L186N17n610J823
940A39k181P115j42j1417O867M703p107M597k859l863P420l581L61k930K995k94
$$ plain form
956 -177 -3508 5787 -3495 -4364 3452 -332 846 150 -4342 707 5205 1426 -4227 -2767 7726 -153
972 -153 163 732 -5362 9336 2687 -3964 1165 1771 4156 1163 -377 617 316 4863 1620 -4682
988 -4682 5470 -1071 -842 6264 -4016 330 1161 2443 1216 -1402 735 -1642 4999 3111 -5652
1003 -5652 361 5091 -371 2423 -2636 -1315 5524 963 -99 -4798 5069 3321 -3525 3753 -3741
1018 -3741 1438 6409 -3869 -1456 2298 -812 2553 -1055 -792 -57 -1514 4957 -4525 -413 2639
1033 2639 -4479 4963 -383 -4552 2032 2172 422 -965 -1620 504 1329 3179 -2662 -4108 6544
1048 6544 -121 428 233 -3117 5187 2151 663 -2441 360 6200 -1727 820 2156 -3897 5778
1063 5778 2271 -5447 3987 -1610 1158 3828 -3137 587 -1418 3749 2088 -4422 2077 -868 1016
$$ packed form
956a77l331R295r282q69P816l784J178o96m492N049M498l779n653J460J0493p879
972a53L16N69o094J4698o649o651N129O06K385k993j540R94l01M547l243o302
988d682J0152o541K29P106j0280M346Q31J282j227k618K137k377O641j888q763
1003e652O013M730n462K794n059J321O839m561j062m699R867j748o846P278p494
1018c741N179M971j0278K413L754l110L365l608K63P35j457O471r482M112L052
1033B639p118R442n346m169O584J40j750j387o55K124Q25J850n841j446J0652
1048F544o665N49j95l350Q304l036j488l104K801N840p927K547J336o053R675
1063E778l507p718R434n597K768K670o965L724k005N167j661o510O499k945J884
$$ plain form
1078 1016 4983 -5041 -1741 4262 267 384 -1958 -940 603 2620 1135 -5829 2542 2017 -1887
1093 -1887 2414 -3174 -576 3192 -740 -135 -2617 922 2186 -3003 3038 -3940 -2474 6826 -4288
1108 -4288 -480 1395 -3793 3561 245 -2445 -242 -1091 3159 -1817 -1276 1593 -3146 3725 191
1123 191 -4552 2879 603 32 429 -609 -602 715 2793 -1999 -1785 3999 -1472 425 2239 -3694 2408
1140 2408 676 -725 120 -970 2879 -2341 1052 1502 -4171 3666 1117 -4198 3566 -1678 -1371 3292
1156 3292 -2792 559 -901 986 1164 -3320 2359 -2295 -361 3579 -3877 -864 2354 -2185 780
1171 780 -256 -2101 391 440 584 -3496 1254 1176 -2859 1845 -2094 -1113 1346 -754 -1044 -712 130
1188 130 -691 -488 1456 -2035 -1983 3396 -3450 909 1334 -4389 2527 15 -254 -759 -695 2033 -587
$$ packed form
1078A016L967j0024L300O003l995J17k342J018J543K017j485o964Q371n25l904
1093a887M301n588K598L768l932O05k482L539J264n189O041o978J466R300j1114
1108d288L808J875n188P354l316k690K203q49M250m976N41K869m739O871l534
1123A91m743P431k276n71L97j038PJ317K078m792K14N784n471J897J814n933O102
1140B408j732j401Q45j090L849n220L393M50n673P837k549n315P764n244L07M663
1156C292o084L351j460J887J78m484N679m654J934L940p456L013L218m539K965
1171G80j036j845K492M9J44m080M750p8m035M704l939R81K459k100k90L32Q42
1188A30q21K03J944l491N2N379o846M359M25n723O916k512k69n05O4K728k620
$$ plain form
1205 -587 527 0 -2087 3257 1196 -3843 3184 -650 -496 2786 -1915 -21 -61 1372 -956 -376
1221 -376 1182 -2251 841 1675 -1695 -620 870 -1521 1200 119 -2269 -520 1366 1162 -3751 1112
1237 1112 -365 -561 2701 -3152 -1069 1993 249 -1518 -938 258 -354 -428 621 -2200 -946 2730
1253 2730 -3464 746 615 -3352 1331 284 -666 -1496 -85 -367 -200 698 -2045 -2660 2616 846 -3593
1270 -3593 632 -692 610 1056 -2341 -1607 1082 2242 -2653 -618 1055 -700 1049 100 -2236 610
1286 610 1955 -1555 -355 599 -425 -777 1845 -220 -2472 1906 -935 -105 1609 -2808 -839 2215
1302 2215 260 -1997 -1117 776 818 43 -499 -3044 1463 3077 -3720 -1042 380 -283 740 -1166
1318 -1166 -2695 48 1821 -1852 -2321 438 -1242 -1002 1074 -2437 -1732 491 -1072 -314 -860 -1423
$$ packed form
1205e87J114n27k087N344k061n039P027l834J54L282m701J894m0J433k328N80
1221c76J558l433L092Q34l370J075J490k391K721j081k388J749J886k04m913M863
1237A112j477j96L262n853K083L062j744j767N80J196o12p4J049k821J254L676
1253B730o194M210j31l967M683j047r50q30J411k82J67Q98k743o15N276j770m439
1270c593M225j324J302M46l397P34K689J160m895K035J673j755J749r49k336K846
1286F10J345l510J200R54j024l52K622k065k252M378k841Q30J714m417J969L054
1302B215j955k257Q80J893M2p75n42k545M507J614o797K678J422o63J023j906
1318a166j529K743J773l673m69K759j680K40K076l511P05K223j563P58n46n63
$$ plain form
1334 -1423 -1785 949 1367 -3406 -1490 1060 -428 1014 -1369 -3495 2324 2024 -1855 -2339 240 1262
1350 1262 75 319 -2660 46 3418 -1475 -2069 956 -263 260 12 -791 -429 17 1467 -1777 254
1367 254 588 -2943 2127 771 -2751 205 -27 -58 1184 -1750 -1764 852 1811 -883 -3155 1261 701
1384 701 -595 -139 -2699 631 1664 -930 -2958 170 1231 -1819 -654 -949 -2168 1215 -356 -3675
1400 -3675 1244 -1221 -1498 718 -1464 -225 -1722 196 260 -1685 455 -2350 -415 3131 -2446 -2323
1416 -2323 1663 -557 968 -799 -2088 1492 1633 649 -3277 803 2289 -1203 236 -1178 -703 1800
1432 1800 -185 -1931 140 602 -834 -1307 982 -1076 -1567 1740 -2708 401 754 -3118 1146 526
1448 526 -636 -1792 -730 1814 -544 -754 111 -1668 2580 756 -3896 2653 -270 -528 726 -2112
$$ packed form
1334a423l62K734M18m773J916K550j488J442k383k126N819l00l879m84K579J022
1350A262j187K44k979K706L372m893n94L025j219N23k48q03L62M46J450l244K031
1367B54L34l531N070j356l522K956k32l1J242k934j4K616R59k694k272M416n60
1384G01j296M56k560L330J033k594k028L128J061l050J165k95j219L383j571l319
1400c675M919k465k77K216k182J239j497J918O4j945K140k805J935L546n577J23
1416b323L986k220J525j767j289L580J41r84l926M080J486l492J439j414M75K503
1432A800j985j746K071M62j436m73K289k058m91L307m448L109L53l872M264o20
1448E26j162j156J062K544k358k10Q65j779M248j824m652O549k923k58J254k838
$$ plain form
1464 -2112 770 16 71 -1446 -708 1543 -1196 -1713 690 -1146 -972 216 -1897 667 -420 -1169 -1561
1481 -1561 532 1062 -3561 665 -684 -1131 1431 -2429 -1078 1708 -935 -358 -346 85 966 -1968 1404
1498 1404 -51 -1111 2525 -3170 812 2143 -2619 -56 491 20 133 -707 -624 584 530 -252 -2557
1515 -2557 1364 1135 -1683 360 -1179 872 530 -786 -1140 -320 1885 -1702 -769 1568 -1478 509
1531 509 931 -2276 1408 235 -1588 818 -321 403 -1656 -198 1479 -2475 512 -505 -1485 2365
1547 2365 -2261 -2549 1955 -438 -868 -1152 -1222 898 -530 -480 -2342 -238 2269 -1966 -1122 258 -559
1564 -559 562 -460 -1205 73 1260 221 -1115 1269 -382 -987 2278 -796 -492 802 -698 1378
1580 1378 196 -986 -755 -119 2319 -1189 -2264 1617 -1096 1253 162 -3675 1809 1366 -1120 -983
$$ packed form
1464b112K882p54N5j517P38K251k739n17K403j836J74J188k113K564j087p49l92
1481a561K093N30m623M226j349m47K562l860J351K786k643N77J2M31Q81k934L372
1498A404j455j060L636n695L982J331m762K563N47m71J13q40Q3J208n4p82k305
1515b557L921k29k818K043j539K051l42j316l54Q20K205l587R33K337l046J987
1531E09M22l207L684j173j823K406j139P24k059J458J677l954K987j017r80L850
1547B365m626k88M504k393m30k84p0K120j428N0j862K104K507m235Q44J380q17
1564e59J121j022p45J278J187j039j336K384j651o05L265l074L04J294j500K076
1580A378j182j182K31O36K438l508j075L881k713K349j091l837N484m43k486J37
$$ plain form
1596 -983 -1065 515 896 -281 -1464 -1229 1679 606 -1487 575 -310 -70 1460 -677 -1057 44 1018
1613 1018 -410 498 -423 -2408 1597 895 -2092 -567 -56 382 813 -1517 -1432 -195 1573 102 -3345
1630 -3345 887 391 -391 1196 -3162 -523 1964 -624 -1020 -493 -115 1050 -167 -208 -792 -64 1893
1647 1893 -1266 373 69 -957 1352 653 -999 -1122 1221 336 169 -256 -1266 392 2432 -839
1663 -839 -1834 877 311 1584 -852 -1099 127 1250 1706 -2480 56 1649 -172 972 -561 -1543
1679 -1543 2023 1118 -1117 150 -716 789 731 -9 -605 -1354 1898 132 -755 -148 -1196 275 1593
1696 1593 -976 -1983 561 760 118 -823 -1205 -955 1730 299 -2717 229 212 273 10 -1117 -651 621
1714 621 1801 -815 -1171 814 226 324 1092 -1770 134 2209 -291 440 -372 360 610 867 290 -1685
$$ packed form
1596i83q2J580L81j177j183K35K908j073k093K062q85K40J530k137l80J101R74
1613A018j428R08r21j985M005p02k987J525N11M38M31k330Q5J237J768j471l447
1630c345M232m96p82J587m358K639K487k588l96N27L78J165j217m1n84P28J957
1647A893l159J639l04j026K309o99j652j23K343q85j67m25j010J658K040l271
1663h39r95K711n66J273k436k47J226J123M56m186K536J593j821J144j533r82
1679a543L566r05k235J267q66J505n8p40n96p49L252j766q87O07j048J471J318
1696A593k569j007K544J99o42r41l82K50K685j431l016K946j7O1k63j127M66J272
1714F21J180k616l56J985n88R8P68k862J904K075k500P31q12P32K50K57n77j975
$$ plain form
1732 -1685 1105 1296 -430 306 78 -609 2229 631 -1260 302 813 774 -205 200 -473 630 1796
1749 1796 -1348 -160 785 82 445 145 -300 111 1055 300 -1156 -61 1107 -851 1113 -381 -1214
1766 -1214 1447 -375 -702 -202 -271 41 50 0 -518 -280 1070 -170 -528 797 -684 671 986 -789
1784 -789 -88 918 517 -500 358 211 -387 1470 -141 -738 1088 -68 68 577 -315 343 469 649
1802 649 -581 -508 1216 -658 264 838 -1197 430 934 -699 388 199 -164 487 418 540 -279 848
1820 848 499 -336 1025 29 -87 971 226 -461 723 763 -95 283 982 -505 216 775 -791 916
1838 916 110 -828 156 -64 329 -599 -58 -68 -695 820 -120 -1746 1239 306 -1066 1159 -815 302
1856 302 924 -349 48 -30 877 21 17 226 -697 315 948 -601 68 822 -521 616 646 -66 -338 1200
$$ packed form
1732a685K790J91j726P36k28o87K838j598j891J562N11l9r79M05o73J103J166
1749A796l144J188R45p03L63l00m45M11R44p55j456J095J168j958J964j494q33
1766a214K661j822l27N00o9L12Rn0n18K38J350j240l58J325j481J355L15j775
1784g89P01J006m01j017Q58j47n98J857j611n97J826j156J36N09q92O58J26J80
1802F49j230P3J724j874R22N74k035J627N04j633J087j89l63O51o9J22q19J127
1820H48l49q35J361r96j16J058p45o87J184M0q58L78O99j487P21N59j566J707
1838I16q06r38R84k20L93r28N41j0o27J515r40j626K985r33j372K225j974J117
1856C02O22j273L97p8R07q56mK09r23J012O33j549O69P54j343J137L0p12k72J538
$$ plain form
1876 1200 227 -831 741 -966 356 1135 -1033 -434 492 359 327 -272 -70 470 504 1490 -1165 223
1894 223 1829 -729 924 -157 -505 926 805 -465 -226 622 531 242 382 -277 -248 1505 157 -597
1912 -597 268 -529 542 178 -387 -1147 62 1429 -1514 -123 -100 -470 1277 -191 -1370 507 680
1929 680 233 -75 -1039 872 76 1116 -604 -965 1735 -94 -391 440 -264 269 1065 38 -368 222
1947 222 599 471 -72 355 -1046 973 807 -1005 -134 -183 141 793 -155 -1096 -89 1751 37 -1021
1965 -1021 436 173 617 1367 -1412 92 1407 219 177 -815 508 550 741 250 -881 542 927 -472
1983 -472 817 127 -1035 1356 325 -258 -593 -623 448 -60 175 -1399 -376 1427 -479 -754 -93
2000 -93 -126 775 151 -1013 -286 620 661 -795 -685 657 -196 1086 -478 -840 1238 466 -68 71 43
$$ packed form
1876A200r73j058J572j707J322P79k168N99R26j33l2n99K02N40L4R86k655J388
1894B23J606k558J653j081l48J431j21j270K39Q48r1k89J40o59K9J753j348p54
1912e97Q65p97J071l64n65p60J209J367k943J391K3l70J747j468j179J877J73
1929F80m47l08r64J911p96J040j720l61K700j829k97Q31p04N33P96j027m06N90
1947B22L77j28n43M27j401K019j66j812Q71m9L24O52r48r41J007J840j714j058
1965a021J457k63M44P50k779J504J315j188m2r92J323M2J91m91j131J423L85j399
1983d72J289o90j162K391j031n83l35l0J071n08K35j574J023J803j906k75O61
2000i3l3R01o24j164P27R06M1j456J10J342q53J282j564l62K078p72n34J39k8
$$ plain form
2019 43 233 249 723 -99 -563 1094 -6 -64 614 -1130 379 942 -432 -453 -282 621 583 -72 -128 -709
2039 -709 1183 916 -1095 301 655 138 717 -478 -398 551 978 -533 -399 852 -441 385 845 -570
2057 -570 330 508 -426 124 -255 -126 -123 192 177 -1277 4 170 -794 649 -544 -1193 1162 187 -985
2076 -985 437 -136 437 82 -165 106 390 1094 -449 -323 599 -52 103 367 -302 42 665 -132 -156 720
2096 720 131 -564 790 -99 -361 415 -642 495 164 -29 -40 -23 857 -441 -331 586 194 -124 678
2115 678 -764 608 948 -751 298 255 115 -60 300 300 242 451 -209 -279 501 726 -550 -26 576 -47
2135 -47 345 -163 -522 381 589 -984 282 582 -460 274 -8 -177 57 294 -407 -35 302 179 -521
2154 -521 469 451 -862 1141 -332 -237 807 -413 -298 789 273 -791 -48 55 81 101 -349 84 348
$$ packed form
2019D3J90J6M74q22m64J657j100n8O78j744J509N63j374k1J71R03l8o55n6n81
2039g09J892k67k011J396L54n17N79j195Q0R49M27j511J34J251j293Q26M60j415
2057e70R00J78r34N50l79J29LL15j5j454J281J66r64J443j193o49K355r75j172
2076i85J422n73N73l55k47K71K84P04j543J26R22o51J55K64o69L44O23p97k4Q76
2096G20n89o95J354q89k62P76j057J137l31j93j1J7Q80j298J10R17l92l18Q02
2115F78j442J372L40j699J049m3j40j75L60%n8K09o60p0P80K25j276N24O02o23
2135d7L92n08l59R03K08j573J266L00j042P34k82j69K34K37p01L72L37j23p00
2154e21R90j8j313K003j473R5J044j220J15J087n16j064P43J03K6K0m50M33K64
$$ plain form
2173 348 581 -750 -19 350 -8 -179 -177 -66 -145 829 -602 -217 1001 17 94 553 27 179 787 105
2193 105 250 217 484 277 359 596 -865 194 659 -284 153 -158 -80 814 559 -1117 -3 850 227 -353
2213 -353 -342 -247 138 540 -864 -473 406 347 -466 -182 52 -18 700 200 -697 97 613 -210 300 5 -307
2234 -307 379 469 78 -689 -34 -20 -23 504 -814 -548 808 361 -431 -18 -160 640 844 -870 -248 255
2254 255 837 -213 -76 128 -90 750 155 -576 -54 722 -13 50 -15 42 377 1193 -555 -252 437 -299
2274 -299 604 251 -791 -196 517 228 -403 -486 370 -84 5 -63 -853 563 422 -937 -64 -138 71 511
2294 511 -203 -588 101 404 -56 -146 7 79 191 635 -501 -201 557 139 27 -73 -42 -295 730 -141
2314 -141 -865 269 -83 -63 354 -602 -506 554 235 -320 -419 98 409 -16 81 -673 -41 1163 -552 -247
$$ packed form
2173C48K33j331P31L69l58j71KJ11p9R74j431L85J218r84P7M59n26J52O08o82
2193A05J45l3K67k07Q2K37j461J059M65r43M37l11P8Q94k55j676J114Q53o23n80
2213c53J1R5L85M02j404L91Q79n9q13K84K34p0P18n00q97P94N16q23N10k95l12
2234c07O86R0l91p67O55J4lN27j318K66J356m47p92M13j42Q00K04j714O22N03
2254B55N82j050J37K04k18Q40n95p31N22P76p35O3o5N7L35Q16j748L03O89p36
2274b99R03l53j042N95P13k89o31q3Q56m54Q9o8p90J416j41j359Q73p4K09M40
2294E11p14l85O89L03m60r0J53P2J12M44j136L00P58m18j12j00L1k53J025q71
2314a41p24J134l52K0M17r56R6J060l19n55r9N17L11m25R7p54O32J204j715L05
$$ plain form
2334 -247 205 -291 731 430 -583 55 540 425 -164 136 133 -388 496 -47 -471 -90 432 168 -290 -82
2354 -82 -604 174 811 -770 -242 163 -122 228 89 -855 38 170 -181 -443 -679 327 -92 -2 -146 -353
2374 -353 622 196 -293 307 -22 -466 360 -175 -359 207 297 -171 -84 345 -349 308 375 -357 -305 -8 32 -72
2396 -72 81 -239 5 454 36 -607 291 3 -358 561 -456 -114 356 -300 -309 -175 614 -321 112 38 -85
2417 -85 289 358 -231 -134 394 -231 17 -181 -376 -161 156 -187 -292 372 -315 -309 129 -296 -393 234 71 -320
2439 -320 -21 -239 -166 -41 178 -541 121 282 -329 29 -197 -336 222 125 -255 20 103 -216 -164 47 -40 -394
2461 -394 425 -279 -69 441 -209 -19 14 109 -109 -2 219 -358 -17 231 -384 -318 94 -385 -108 51 -310
2482 -310 251 150 35 -430 413 89 101 642 -111 -430 567 29 -133 26 -359 135 305 -94 -394 -134
$$ packed form
2334b47M52m96J022l01j013O38M85j15n89L00ln21Q84n43m24L81N22k64m58K08
2354h2n22P78O37j581N28M05k85L50j39r44Q93J32l51k62k36J006m19R0j44k07
2374c53R75m26m89O00l29m44Q26n35j84N66R0m68Q7M29o94O57O7p32N2K97M0j04
2396g2J53l20K44M49m18o43Q98k88l61R19j017L42M70o56rJ34P89r35M33p4j23
2417h5L74O9n89R7N28o25K48j98j95K15L17l43j05O64o87OM38m25r7O27j63l91
2439c20K99k18P3J25K19p19O62J61o11L58k26j39N58r7l80K75Q3l19N2K11q7l54
2461c94Q19p04K10N10o50J90L3R5k18J07K21n77L41K48o15O6M12m79K77J59l61
2482c10N61j01j15m65Q43l24J2N41p53l19R97n38j62J59l85M94J70l99l00K60
$$ plain form
2502 -134 383 -94 -18 -69 -489 346 -199 -524 -34 -38 -260 -67 -337 -303 -158 145 -393 -508 41 -81 173 -227
2524 -227 -448 -402 209 109 -197 -95 -204 -233 169 210 -798 228 -64 39 -3 -266 -88 387 106 -773 -180
2545 -180 344 -13 -475 -15 -198 -45 709 -386 -170 294 -348 437 12 -100 59 526 -50 -428 -31 368
2565 368 62 20 8 -348 -96 223 -3 -581 -227 -220 -72 370 -650 -321 285 28 -171 -498 -330 138 245
2586 245 -347 -341 3 308 -293 -142 -153 -315 173 124 -627 -81 118 -76 185 -47 -386 462 288 -294 -332 130
2608 130 -79 -8 196 -709 -45 229 147 -321 -121 -57 -167 365 -292 -206 271 327 -157 -58 -85 -62 355 -152 -319
2631 -319 -69 269 -7 -263 15 -184 429 271 37 -285 209 30 -19 186 -421 73 205 -52 -541 -208
2651 -208 -78 -165 286 -651 -358 -9 259 -102 -196 -252 2 -31 -177 -179 -49 386 -385 -123 -191 -232 236 -34 -348
$$ packed form
2502a34N17m77P6n1m20Q35n45l25M90mk22J93k70L4J45L03n38j15N49j22K54m00
2524b27k21M6O11j00l06J02j09k9M02M1j008J026k92J03m2k63J78M75k81q79N93
2545a80N24l57m62M60j83J53P54j095K16M64o42P85m25j12J59M67n76l78L97L99
2565C68l06m2j2l56K52L19k26n78L54PJ48M42j020L29O06k57j99l27J68M68J07
2586B45n92OL44L05o01J51j1j62M88m9p51N46J99j94K61k32l39Q48j74n82l8M62
2608A30k09P1K04r05O64K74q2m68K00O4j10N32o57Q6M77N6m84R9k7K3M17n07j67
2631c19K50L38k76k56K78j99O13j58k34l22M94j79m9K05o07M94J32k57m89L33
2651b08J30q7M51r37K93L49K68l61r4n6K54l3j46kJ30M35p71K62o8m1M68k70l14
$$ plain form
2674 -348 -285 464 -179 -210 46 -314 -165 243 103 -341 131 -142 -278 -31 -60 -213 -71 381 -376 -376 -46 -33
2696 -33 285 -62 -265 32 357 -24 -483 127 -29 45 -28 -173 -43 435 13 -96 168 -254 24 258 -99
2717 -99 -221 124 -104 -13 -47 9 -461 179 237 -211 -111 -37 -15 185 -138 -136 -98 161 -127 -500 72 -83 -182 -249
2741 -249 -106 -101 268 -55 -330 123 266 -353 -298 -69 -333 84 360 -304 -171 -146 -168 -20 -192 -256 -270 -40
2763 -40 -133 -456 291 -191 -150 315 -8 21 67 104 66 138 41 234 321 184 -150 -35 177 65 167 102 52 295
2787 295 -164 -75 182 593 -64 -97 141 113 -7 174 -328 130 201 -469 -131 -104 174 -29 -172 -293 -289 291
2809 291 276 -103 149 11 -494 174 109 -232 59 -90 253 -22 -120 -218 -9 383 -191 -105 202 -133 -272 -45
2831 -45 -332 130 130 -211 -146 2 255 -217 274 -256 -232 493 -150 -43 93 185 -119 136 44 -425 -19 188
$$ packed form
2674c48O3P49o43l1K56l60J49M08j40m44M72k73j36K47k9j53J42M52p57%L30J3
2696c3L18l47k03K97L25l81m59O10j56P4p3j45J30M78m22j09K64m22K78K34l57
2717i9j22L45k28R1l4N6m70O40N8m48J00P4K2K00l23KL8K59k88l73N72j55r9o7
2741b49J43NL69l23k75M53J43o19N5K29k64M17K76o64J33K5k2J48j72o4j4K30
2763d0r3l23P47m82M1M65l23K9M6L7l8P2r7J93Q7j37l34J15K12j12J02o5n0K43
2787B95m59Q9K57M11o57l3K38k8j20J81n02M58P1o70L38K7K78k03j43j21MN80
2809B91j5l79K52j38n05O68o5l41K91j49L43k75r8r8K09L92n74Q6L07l35j39K27
2831d5k87M62%l41O5J48K53m72M91n30K4P25o43J07J36R2l04K55r2m69M06K07
$$ plain form
2853 188 86 -87 148 -199 110 88 -112 -12 -83 360 -4 53 -143 78 648 178 -373 -61 171 31 43
2874 43 -475 -271 223 44 -374 -348 327 -121 57 187 -259 65 157 -234 -247 -36 28 -36 185 148 -397 31
2896 31 83 -243 50 -401 -155 370 -266 -475 220 78 -124 -240 -242 -76 200 175 -89 -198 289 24 5 -58
2918 -58 28 173 323 -91 -106 89 73 -34 -13 -116 -123 379 317 -61 -94 -200 149 312 -132 -260 -66 507 -451
2941 -451 -76 102 -101 293 -71 -582 -222 234 -96 -137 -25 39 -79 170 -273 -362 356 -108 -226 -58 -76
2962 -76 -55 367 -62 -251 -114 -49 139 -97 -15 -234 111 163 -195 -151 -289 151 116 116 -429 -189 260 254 -151 46
2986 46 -108 -157 213 -266 -225 36 271 -140 -96 21 -53 -40 116 -196 -122 169 -195 109 106 -228 341 267 -7
3009 -7 85 230 120 82 263 -326 62 337 243 -148 -141 -95 -65 240 -269 -192 0 206 -467 96 240 -14 275
$$ packed form
2853A88j02j73K35l47L09k2k00J00p1M43l64N7j96K21N70m70n51L12K32j40J2
2874D3n18K04M94j79m18K6O75m48J78J30m46L24R2l91j3K11O4o4K21l7n45M28
2896C1N2l26K93m51K46N25o36k09O95j42k02j16kJ66K76k5k64j09M87k65j9o3
2918e8Q6J45J50m14j5J95j6j07K1j03pN02o2l78l3j06L49J63m44j28J94N73r58
2941d51L75J78k03L94l64n11L60M56l30m1J12O4j18K49m43q9P18m64j18J68j8
2962g6K1M22m29j89J37O5J88k36Q2k19L45N2l58M4j38M40l5%n45K40M49om05J97
2986D6j54m9L70m79M1K61K35m11M4J17p4J3J56l12P4K91l64L04ll34N69p4k74
3009gR2J45j10l8J81n89L88K75r4l91PM6L0L05n09P7J92K06o73N63J44k54K89
$$ plain form
3032 275 -242 -301 -1 8 -131 -80 39 101 -31 -40 -233 -115 329 -290 72 27 158 31 -132 221 -176 -113 51
3055 51 78 134 106 -74 318 170 -223 -133 -169 -238 5 -85 -17 24 259 -38 -105 213 24 42 105 135 83 93 78 -57
3081 -57 212 -3 -208 -71 346 -260 161 20 -78 390 -79 -265 351 0 -155 -39 -35 -208 64 76 -94 -22
3103 -22 187 -128 341 285 -84 -276 87 98 -255 117 81 -332 127 -207 -248 -121 58 -96 121 73 -330 33
3125 33 78 67 57 302 -214 62 -25 -58 -277 190 -266 233 -2 115 11 277 -38 -179 270 140 -193 -129
3147 -129 -177 214 242 111 -127 19 99 -67 33 -174 -119 61 253 -353 -7 227 -60 428 173 -343 56
3168 56 249 157 -99 43 26 -254 149 -15 -105 266 -374 -47 100 -237 153 69 -121 -221 111 232 -75 -210
3190 -210 145 -128 225 245 -261 12 173 288 8 16 -150 55 224 -225 -202 47 94 268 -13 -176 -290 439
$$ packed form
3032B75n17n9L00Rj39N1J19O2j32rj93J18M44o19L62m5J31j27j63L53l97O3J64
3055E1K7N6k8j80L92j48l93R0l6o9K43r0O8M1K35k97o7L18j89J8O3L0n2J0j5j35
3081e7K69k15k05J37M17o06M21j41r8M68m69j86O16l51j55J16Mj73K72J2j70P2
3103b2K09l15M69n6l69j92L63J1l53L72l6m13M59l34m1J27J79j54K17m8m03L63
3125C3M5j1j0K45n16K76q7l3k19M67m56M99k35J17j04K66l15j41M49j30l33O4
3147a29m8L91K8j31k38J46Q0j66J00k07N5J80J92o06L46K34k87M88k55n16L99
3168E6J93r2k56J42j7k80M03j64r0L71o40L27J47l37L90q4j90j00L32J21l07j35
3190b10L55k73L53K0n06K73J61J15k80Qj66K05J69m49K3K49M7J74k81j63j14P29
$$ plain form
3212 439 -50 -24 -53 101 -14 310 12 -394 221 174 32 197 -120 3 265 262 -95 101 305 223 -28 112
3234 112 106 -104 315 -204 -32 58 205 187 56 -65 -9 222 200 -292 -41 322 9 205 -93 -143 299 173
3256 173 52 -131 -30 4 97 -108 -251 22 98 157 -189 -46 -172 175 172 -88 -35 -16 654 -135 34 -267 -93
3279 -93 301 167 -243 -1 31 236 15 -92 49 69 243 -55 -102 254 -41 58 -85 -80 -3 152 15 -239 17
3302 17 -134 140 122 103 -133 143 266 -123 100 128 94 479 225 83 -148 107 118 78 100 182 164 328 -133
3325 -133 141 96 69 -11 -51 190 -35 -5 196 -381 205 134 -72 345 -49 -156 -122 187 48 -8 -175 -20 -18
3348 -18 117 -353 180 211 -28 117 -41 243 190 91 -252 -205 96 -160 -4 133 71 -124 289 -147 -49 41 -133
3371 -133 -11 56 349 -42 36 -42 79 96 174 38 112 76 124 175 -141 135 -1 116 182 -91 334 112 -461
$$ packed form
3212D39m89K6k9J54j15L24k98m06O15m7j42J65l17J23K62ll57J96K04q2k51J40
3234A12ok10M19n19J72R0J47j8j31j21N6K31k2m92K51L63l13J96k98n0M42j26
3256A73j21j83J01L4R3k05j43K73P6N9l46J43j26L47lk60N3J9O70p89J69l01J74
3279i3L94j34m10K42L2K05k21j07J41K0J74k98m7L56k95R9j43NP7J55j37k54K56
3302A7j51K74j8j9k36K76J23l89K23K8l4L85k54j42k31K55J1m0K2Q2j8J64m61
3325a33K74m5k7q0m0K41k25L0K01n77N86p1k06M17l94j07L4L09j39n6j67J55K
3348a8J35m70N33L1k39J45j58K84n3r9l43M7L01k56J56J37o2j95M13m36R8R0j74
3371a33J22O7K93l91P8p8J21J7P8j36P4l6M8N1l16K76j36J17O6k73M25k22n73
$$ plain form
3394 -461 267 129 156 343 75 -117 101 119 77 -64 -72 -100 40 53 -214 74 8 -103 195 184 -16 100 -80
3417 -80 -30 -74 -72 143 -316 75 -93 -184 203 -237 -154 -102 16 226 -1 159 -212 86 -57 159 396 -10 -296
3440 -296 11 51 -141 -75 -11 78 207 81 24 0 223 117 -84 172 160 132 444 156 49 152 268 -113 88
3463 88 226 -160 255 172 -66 66 -21 -55 82 44 -69 132 -23 -183 -333 155 51 -219 82 -332 -17 196
3485 196 -12 -53 -128 -15 102 103 -213 -267 131 145 -168 158 276 -266 304 -160 -227 99 -8 -177 -223 -9 43
3508 43 192 251 25 -313 317 35 68 -201 -118 -20 276 11 -8 49 266 13 25 -228 21 380 -24 -209 45
3531 45 376 -58 -126 14 -29 -77 234 -55 -285 136 -28 44 -14 -87 22 200 222 -56 22 -64 -25 295 47 -280
3555 -280 295 108 -37 -61 -152 -81 -32 232 -191 -122 286 80 28 -168 -156 -7 212 -215 -94 86 6 42 -341
$$ packed form
3394d61P28j38K7J87k68j92K18J8m2j41qk8J40J3k67K88o6j11K98j1k00J16j80
3417h0N0m4KK15m59L91j68r1L87m40Q3N2J18K10k27J60l71K98j43K16K37m06k86
3440b96L07M0j92O6O4Q9J29j26n7k4K23j06k01K56j2k8L12k88j07J03J16l81K01
3463H8J38l86M15q3k38J32q7l4J37l8j13K01j55j60j50M88j04k70L01m14L15K13
3485A96k08m1p5J13J17Jl16n4L98J4l13L26J18n42N70m64o7L26j07j69m6K14N2
3508D3J49N9k26l38O30k82L3k69Q3R8K96k65j9N7K17k53J2k53K49L59m04j85K54
3531D5L31m34o8J40m3m8L11k89k30M21j64P2n8p3J09J78K2k78P8q6L9L20k48l27
3555b80N75j87j45k4r1P1M9K64m23O9M08k06n2j96J2J49K19m27J21J80q0L6l83
$$ plain form
3578 -341 -51 -224 178 113 -145 135 24 178 77 149 24 392 85 -6 -96 -28 179 56 -104 -106 -111 334 201
3601 201 156 -16 113 -78 27 -40 -343 180 132 100 -92 -27 -138 424 -95 30 -60 -200 -24 -283 51 -105
3623 -105 106 207 -183 112 22 6 94 -85 -206 76 100 -170 -65 -59 -229 148 -87 -88 -99 37 255 -245 39
3646 39 -101 91 265 32 -60 -195 220 -509 -68 55 -9 -87 237 -145 -5 184 74 -109 -4 53 57 -108
3668 -108 -69 -316 184 -74 230 299 130 -53 -128 74 -41 189 117 -139 207 -66 -203 56 25 -267 -223 -162
3690 -162 161 -22 36 -87 -127 65 64 -196 50 -57 -107 -126 -198 -18 -101 -176 322 -107 2 62 56 -10 -158 120
3714 120 67 -115 176 141 -151 -46 198 -87 115 83 260 189 113 -36 -340 17 -248 -52 -153 104 -374 -174
3736 -174 72 -268 -41 -157 65 19 193 -53 18 74 -337 96 156 -115 100 115 -26 -67 33 -36 255 30
$$ packed form
3578c41K90j73M02o5k58K80j11J54j01P2j25L68l07r1r0O8K07j23j60knM45j33
3601B01m5j72J29j91J05o7l03N23m8l2j92O5j11N62n19J25r0j40J76k59L34j56
3623a05K11J01l90K95r0j6Q8j79j21K82K4k70J05Oj70L77k35jj1J36K18n00K84
3646C9j40J92J74k33r2j35M15p29M41J23o4p8L24l82J40J89j10j83J05N7Mj65
3668a08L9k47N00k58L04O9j69j83p5K02j15K30p2k56L46k73j37K59l1k92M4O1
3690a62L23j83N8j23m0J92jk60K46j07n0j9p2J80q3p5M98m29J09O0oo6j48K78
3714A20n3j82K91l5k92J05K44k85K02l2J77p1p6j49l04L57k65J96j01K57m78K00
3736a74K46l40K27j16K22m6J74k46P1N6m11M33O0k71K15J5j41m1J00o9K91k25
$$ plain form
3758 30 127 -126 127 -61 -32 82 -121 -155 -126 203 -238 -82 18 -240 239 -107 52 307 122 -82 54 22
3780 22 -85 67 176 -333 -336 24 8 9 79 -25 -107 218 -47 137 -25 -36 -319 -203 -53 -134 8 102 -166 -134
3804 -134 -100 -99 97 100 -62 375 34 -220 -258 10 239 -71 381 -74 116 175 -76 17 -101 56 129 183 79
3827 79 -209 79 22 -136 -56 -70 104 426 -95 -497 -147 143 -210 -183 190 -4 29 147 -54 -233 323 113
3849 113 -126 -96 -355 0 182 -154 46 -195 67 -108 116 -199 -152 116 -85 -325 -255 62 -132 -282 22
3870 22 -12 -170 225 -62 -206 -73 -145 -37 96 -225 -130 62 113 -67 -100 -103 30 304 63 -350 -163 154 -65
3893 -65 256 -137 -4 126 52 -17 -42 116 247 47 -58 161 -9 66 -348 -66 39 -79 -20 -62 -200 -18
3915 -18 223 15 -157 -100 -444 -9 -17 -44 -425 166 131 -169 90 -1 104 40 64 -171 -108 118 -122 -258 46
$$ packed form
3758C0R7k53K53j88K9J14k03l4K9L29m41J56J00k58M79l46J59K55j85k04J36l2
3780B2j07J52J09n09lL60j6JP0j04q2L25k65J84j62j1k83J16J50q1J42R4k68L2
3804a34L4JJ96Lj62M37l41k54l8K68K29l10M52m55J90N9k51R3j18J57P3N4j04
3827G9k88K88n7j58Q0j4J74L22n21m02L50K90l53K7L73j94L3J18k01j79N56k10
3849A13k39L0k59L55J82l36K00k41K62j75K24l15M7K68k01k40P0L17j94j50L04
3870B2l4j58L95k87j44J33p2J08J33l21R5J92N1j80l3lJ33K74k41m13J87L17k19
3893f5L21l93J33J30p4o9k5J58J31k00j05K19j70P5m14K82J05j18N9m2j38J82
3915a8K41k08j72N7l44M35qk7l81N91l5l00K59r1J05o4K4k35O3K26k40j36L04
$$ plain form
3938 46 -197 120 131 -336 77 8 54 -175 81 256 154 192 -16 -96 17 72 -7 346 -196 -11 157 217 -132
3961 -132 -60 0 -60 67 222 -131 -63 171 -72 11 241 88 140 -8 23 -151 154 19 36 18 -116 -17 46 -70
3985 -70 -47 -101 94 -107 -325 201 -226 275 -42 -287 -211 97 -72 22 -10 -200 33 -4 69 -144 -80 -35 -15 176
4009 176 -61 -101 12 -98 -99 -147 -107 115 -154 -172 -46 -18 116 -239 15 -216 88 223 91 -200 -123 220 1
4032 1 -76 241 87 -198 301 -101 -102 -9 -38 -217 209 72 -21 104 24 -2 -10 11 -180 188 101 -34 -15 -9 -211 -267
4058 -267 245 -284 140 -28 -72 -25 35 69 -31 147 34 -46 35 -179 176 202 -170 -293 104 246 -64 -87 -11
4081 -11 -172 67 -220 -61 131 -46 -184 -118 -7 38 9 -1 -229 -16 -134 -229 -142 192 -221 -148 1 87 155
4104 155 -148 188 -108 131 -30 -70 43 67 224 -22 229 157 140 90 -26 -39 222 161 -102 48 -279 144
$$ packed form
3938D6k43L17J1m67M13o9M6k29K56J75j02L8k08q0J13N5p9L53n42J85J68O0l49
3961a32P2O0o0J27J55l53O8K34k43Q3K30j53N2j48L1j74L05j35J7j8j34R9O3j16
3985g0K3n4J95k01k18N26m27N01l17k45P6L08j69R4l2j90K33l7P3k13O4M5K0J91
4009A76k37m0J13j10jm8M0K22k69j8J26K8J34l55K54k31L04J35j32k91P7L43k19
4032Ap7L17j54k85M99m02jR3k9j79M26j37r3J25q0k6qK1j91L68q7j35J9Ok02n6
4058b67N12n29M24j68m4M7O0L4j00J78j13q0Q1k14L55K6l72j23L97J42l10k3P6
4081a1j61K39k87J59J92j77j38O6J11M5k9j0k28K13j18r5Q7L34m13P3J49Q6O8
4104A55l03L36k96K39j61m0J13K4J57k46K51p2j7n0j16j3K61o1k63J50l27M23
$$ plain form
4126 144 267 -213 -141 32 -50 468 23 -130 -81 136 -155 -259 -66 189 -5 9 -145 -233 74 63 -55 -219
4148 -219 306 92 -178 -196 35 -151 200 -374 -39 -107 -134 127 -1 74 -163 316 -1 -20 -219 -316 121 -123
4170 -123 58 -168 -83 4 104 22 -237 -56 -46 214 150 -109 52 175 7 2 -52 59 98 0 8 -61 28 147 -153
4195 -153 -7 86 497 108 -275 -132 -34 238 90 99 -398 -196 -123 44 73 -14 17 27 -31 -292 -193 -39 -134 245
4219 245 197 -75 -122 258 70 -48 -240 90 103 -2 -27 -51 134 54 -132 -182 -41 18 103 186 -284 -171 73
4242 73 30 -303 -32 -22 247 120 -344 8 7 10 -50 288 -180 -110 -24 -101 -91 -256 -14 62 108 80 -38 152 -13
4267 -13 -138 35 2 59 35 91 -194 -53 127 -74 64 -3 5 22 -18 -31 117 133 77 -312 -137 -194 78 274 -294
4292 -294 -29 107 -44 -64 47 156 233 -92 181 34 -318 121 -53 112 2 -72 -267 -197 160 -55 -30 -63
$$ packed form
4126A44J23m80P2J73q2N18m45j53M9K17k91j04J93K55j94J4j54q8L07j1j18j64
4148b19N25k14k70j8K31j86L51n74L35o8k7K61j28P5k37M79l17j9j99r7M37k44
4170a23J81k26Q5Q7J00q2k59J81J0K60o4k59J61J23j68nn4J11L9r8Qo9Q9J19l00
4195a53J46R3M11l89l83J43R8K72j48Rm97K02P3J67K9q7L1J0n8k61R9J54r5L79
4219B45m8k72m7L80j88j18j92L30J3j05k5k4J85q0j86n0J41N9Q5Q3m70J13K44
4242G3m3l33K71J0K69j27m64L52jLo0L38m68P0Q6p7J0j65K42P6M6k8j18J90j65
4267a3j25J73l3N7k4N6k85J41J80k01J38o7QJ7m0j3J48J6n6l89J75n7K72J96n68
4292b94K65J36j51k0J11J09P7l25K73j47l52M39j74J65j10p4j95P0L57k15K5l3
$$ plain form
4314 -63 -247 139 62 78 176 84 159 -192 -91 -70 -89 215 -119 80 176 -170 -114 152 -46 69 88 11 178 -127
4338 -127 22 -140 -194 114 81 73 -5 109 289 -15 10 79 0 122 -193 142 -83 226 178 -7 -110 47 -57
4361 -57 -73 -177 -74 221 -227 140 30 72 -162 -299 238 -57 137 126 70 -141 -98 -149 75 130 -190 216 82
4384 82 99 -263 148 -226 15 -135 -283 -87 27 -228 77 74 59 -179 -180 -86 -40 -275 188 -34 -10 142 32
4407 32 12 210 -145 -248 60 213 -4 58 108 -174 162 168 -177 -36 214 112 208 -192 -70 12 266 162 -100
4430 -100 111 142 46 119 -221 46 40 75 -40 -339 123 47 -42 17 -192 62 19 153 -22 90 -76 255 40
4453 40 -37 -53 -174 -105 -231 14 -396 -141 212 -133 -190 -64 117 190 -383 -71 37 364 147 -42 141 226
4475 226 69 56 -53 53 232 46 -9 -137 6 93 209 133 -109 -261 302 -41 -9 51 -58 245 231 122
$$ packed form
4314f3j84L86p7J6R8r2P5l51J01K1j9L04l34J99R6l46N6K66j98J15J9p7J67l05
4338a27J49j62n4L08l3qp8J14J80l04K5O9p9J22l15L35k25L09m8j85j03J57j04
4361e7j6j04J03K95m48L67j10M2k34j37N37k95J94j1n6k11M3n1K24N5l20M06j34
4384H2J7l62M11l74K41j50j48J96J14k55L05lj5k38jR4M6k35M63k22K4J52j10
4407C2k0J98l55j03L08J53k17O2N0k82L36Ol45J41K50j02R6m00J22Q2K54j04k62
4430a00K11L1r6P3l40K67oL5j15k99M62p6q9N9k09K54m3J34j75J12j66L31k15
4453D0p7j6j21O9j26K45m10K55L53l45n7J26J81P3n73L12J08L27k17j89J83Q5
4475B26j57j3j09J06J79j86n5j28J43Q7J16p6k42j52N63l43L2O0j09L03j4j09
$$ plain form
4497 122 -217 -60 -10 -107 70 -4 -11 20 -35 -258 -91 126 -22 43 152 -179 -165 129 117 -7 -69 -185 -77 -174
4521 -174 -51 -7 -147 -109 -138 -56 208 -15 -130 -146 -142 116 7 -69 18 -338 -252 -184 -50 -68 115 245 33 232
4545 232 -113 -172 -3 51 158 -28 -15 62 51 -36 17 -3 147 130 -222 180 29 79 107 361 -121 125 -31 -246
4569 -246 -176 210 210 114 127 -27 -31 -17 -66 304 66 98 360 -56 -35 25 40 -137 -26 -10 15 -74 223 11 -209
4594 -209 -15 -167 -136 -148 -48 -70 -98 -248 -175 -123 80 7 202 -16 8 -7 -42 22 -48 -109 69 77 67 303 16
4619 16 -135 -126 -108 -6 39 -75 231 -197 -15 -168 -59 147 -272 -35 -215 210 -23 -83 161 208 -146 44
4641 44 -71 101 148 218 121 -34 175 -58 62 -26 3 -89 68 172 284 -37 -116 128 158 147 266 5 345
4664 345 47 -18 -54 148 63 -108 103 -8 -91 -7 117 77 -126 -170 239 -73 -95 31 -43 108 -57 6 -83 -153
$$ packed form
4497A22l39J57N0r7J77p4pL1n5k23J67K17j48O5J09l31J4K94j2j24o2j16J08r7
4521a74J23M4j40L8k9Q2K64k23j15j6MK58j09p6Q7l56Q6O8J34j8J83J30k12J99
4545B32l45n9J69N4J07j86J3P7j1q7N3k0J50j7l52M02j51N0K8K54m82K46j56k15
4569b46P0L86%r6J3j54mJ4m9L70k38L2K62m16K1O0J5j77J11J6K5q9K97k12k20
4594b09J94j52L1j2J00k2k8j50P3N2K03p3J95k18K4j5l5O4p0o1J78Qj0K36k87
4619A6j51RJ8J02M5j14L06m28J82j53J09K06m19K37j80M25k33o0K44M7l54J90
4641D4j15J72M7P0r7j55K09k33J20q8K9r2J57J04J12l21p9K44L0j1J19k61L40
4664C45k98o5l6K02q5j71K11j11q3Q4J24m0k03m4M09l12k2J26p4J51j65O3q9p0
$$ plain form
4688 -153 -195 -212 47 77 88 104 138 -26 160 -68 -121 194 -118 -36 -37 16 147 -162 62 -32 -75 73 -266 119
4712 119 242 99 312 266 -129 -157 -64 -96 256 8 -255 -124 265 239 27 84 80 245 61 -127 -193 55 61 70
4736 70 -97 136 11 29 -261 -133 -205 42 -83 101 -37 129 60 84 -193 130 -158 -2 50 -28 -186 -64
4758 -64 82 111 -74 -283 1 -137 -48 -6 32 20 159 -339 52 168 -101 144 -141 -47 -230 41 154 -98
4780 -98 -11 -180 92 323 -194 -162 92 108 -60 38 66 11 88 -268 -157 -18 278 46 94 -82 -169 166 49
4803 49 -114 -73 274 264 -24 -465 -76 71 110 -9 -301 -30 0 -81 136 -88 -72 -24 -35 14 -81 -81 -46 -85 38
4828 38 -237 -230 253 -68 25 -129 20 70 -144 -99 -185 -164 -4 -61 -264 137 175 185 -38 -160 -42 -164 27 -292
4852 -292 227 -18 -89 87 -96 -44 -41 3 16 4 11 18 310 36 45 -149 7 54 384 -62 -64 -75 -9 -19 55 37 -87
$$ packed form
4688a53m2j7K59L0J1J6L4j64J86k28n3L15l12Q2jN3J31l09K24r4m3J48l39L85
4712A19J23j43K13m6l95k8R3l2L52k48k63J31L89k6k12N7mJ65j84j88o6K48OR
4736G0j67K33j25J8k90J28p2K47j25J84j38J66o9K4k77L23k88J56N2p8j58J22
4758f4J46K9j85k09K84j38Q9M2L8j2J39m98L91J16k69K45k85R4j83K71J13k52
4780i8Q7j69K72K31n17L2K54J6j68R8K8n5P7l56J11J39K96k32M8j76q7L35j17
4803D9j63M1L47j0k88m41L89J47L9j19k92K71L0q1K17k24J6M8j1M9r5%L5l9J23
4828C8k75PM83l21R3j54J49N0k14M5q6K1J60n7k03M01L8J0k23j22J18j22J91l19
4852b92N19k45p1J76j83N2LM4J3j2PPK92k74Rj94J56M7L30m46kj1O6j0P4j8j24
$$ plain form
4879 -87 0 185 -173 66 108 -86 77 -223 -335 -63 -150 65 -94 188 127 -36 158 11 -15 116 98 -24
4901 -24 -213 139 -87 40 -178 -20 -52 112 -65 -42 114 -24 -39 -167 15 -42 43 -213 -114 -66 26 274 -152
4924 -152 -33 206 478 -38 -53 183 -141 160 319 139 -131 -120 -62 29 162 157 -40 67 188 -127 158 157 -280
4947 -280 51 -83 -72 -27 23 132 -296 178 -88 -161 266 -64 -127 67 65 -13 -244 -33 -31 -44 87 -189 -208 -50
4971 -50 -177 -113 102 -178 20 -15 -66 -104 9 -1 -71 -160 224 101 103 151 90 -78 -117 -54 -29 -31 -127 311 49 -28
4997 -28 175 -234 -6 -9 115 -276 -62 -45 -323 -75 -158 -145 -36 214 49 -62 -113 21 -5 9 67 -295 85
5020 85 -96 -122 27 123 -150 -51 -25 -101 245 57 -2 16 -4 -176 -8 -36 165 47 -97 146 242 -59 -32 -69
5044 -69 201 -199 -42 -55 -115 -80 100 -37 -29 93 172 -204 -89 43 24 103 -84 -117 -153 -34 -269 140 -64 2
$$ packed form
4879h7Q7J85l58K39M2j94J63l00j12K72q7K15j59K82o1j63J94j47k6J31j8j22
4901b4j89L52k26J27k18J58l2J64j77K3J56j38j5j28J82n7Q5k56R9M8R2K48m26
4924a52J19K39K72n16j5K36l24L01J59j80k70J1N8R1J33nj97J07J21l15K85jm37
4947b80L31j34J1M5N0J09m28M74k66p3M27l30o3J94kp8k31K11Kj3J31k76j9J58
4971e0j27O4K15k80J98l5n1l8J13j0p0q9L84j23KM8o1j68l9O3K5kr6M38k62p7
4997b8K03m09K28lJ24l91K14J7k78K48q3J3J09K50j65j11n1J34k6J4N8l62L80
5020H5j81k6J49R6k73R9K6p6L46j88n9J8k0j72J68k8K01j18j44K43R6l01K7l7
5044f9K70m00J57j3o0L5J80j37QJ22P9l76J15J32j9P9j87l3l6J19k35M09k04O6
$$ plain form
5068 2 -178 -30 181 -238 -309 80 63 -274 -58 -52 -80 -159 -99 176 48 53 22 83 63 110 -34 31 -120 2 -38 156
5094 156 -32 -134 -90 23 262 -109 137 -15 256 73 -60 -99 193 -167 116 -9 -186 102 -174 202 63
5115 63 221 190 -143 -97 -272 -194 -39 -28 171 -241 -49 -96 -68 21 -201 -156 20 -192 43 56 85 196 -110 -55
5139 -55 -5 51 65 -154 -101 -96 -141 -57 170 -94 92 -105 -61 -271 100 -35 33 131 73 61 -69 10 -156 -107 -54 32
5165 32 31 -141 -186 25 -123 165 -226 22 -182 177 141 -65 21 -163 125 44 -33 -133 -90 16 -26 -27 -99 189
5189 189 -138 -229 -393 -181 -46 -256 163 162 -20 -191 -48 -78 -235 -1 -220 9 11 -122 29 162 -58 45
5211 45 -204 -82 -33 -169 224 -4 -72 208 -304 -162 -47 71 20 -144 -159 104 -51 -47 -300 -89 157 -25
5233 -25 122 22 10 61 -11 -37 -40 58 -76 -215 114 119 -88 74 122 -152 -37 142 3 9 20 7 2 33 -13 -51 -111
$$ packed form
5068Bj80J48K11m19p1L89j7l37K16Ok8p9O0K75j28Nl1O1k0M7j44O5j51J22m0J94
5094A56j88j02M4J13K39l71K46j52K71j83j33l9K92l60K83j25j77K88k76L76j39
5115F3J58l1l33M6j75P8J55J1J99m12J92m7K8Q9k22M5J76k12K35J3K9J11l06N5
5139e5N0N6J4k19N3Nm5Q4K27k64J86j97M4k10L71j35O8R8n8j2j30P9j66M9N3Q6
5165C2jj72m5K11j48K88l91K48k04L59l6k06Q6j84K88q1p7j00M3J06m2jp2K88
5189A89l27r1j64K12J35k10M19jj82j71J43l0j57K34k19K29Kj33J51J33k20J03
5211D5k49J22M9j36L93k28o8K80n12J42J15J18n1j64j5K63j55Mk53K11K46j82
5233b5J47j00j2N1p2k6lR8j34j39L29Nk07J62M8k74J15J79j39OJ1j3nL1m6l8o0
$$ plain form
5260 -111 -167 -176 -75 -362 181 -12 -68 39 -80 228 11 247 101 -63 -56 -124 188 40 -261 66 18 46 90
5283 90 -41 -206 -165 -5 -147 -208 -12 282 -158 119 -261 -107 -84 114 -197 -104 46 166 119 81 121 121 -95
5306 -95 26 221 129 -19 114 -32 51 -29 -107 -25 73 72 58 148 -199 -88 -40 80 -188 16 209 -233 -53 -118
5330 -118 83 49 49 147 -80 -87 109 -202 28 44 -196 90 66 64 79 -15 90 -81 -28 -245 -130 77 -29 35 -106
5355 -106 -92 -82 81 -101 -88 69 77 140 197 7 -94 -163 -149 -175 -46 -225 344 66 -68 -59 -72 54 64 -47 27
5380 27 99 -92 -239 15 130 -115 -142 -71 22 11 -123 -42 -62 -164 111 -36 163 -85 -33 -177 251 -110 -119 31
5404 31 128 -111 201 28 -3 139 113 -129 93 -19 -151 34 150 10 155 -75 -34 -267 -182 294 100 165
5426 165 21 -41 11 86 -82 32 -62 113 119 -79 29 50 -76 38 -285 96 50 67 -122 -116 107 94 236 84
$$ packed form
5260a11n6rJ01k87N43j93n6J07j19L08k17K36j46j64Po8L12j48l01L27m8K8M4
5283I0j31j65M1J60j42o1J96K94m40K77l80J54K3J98l11R3J50J20m7l8M0%k16
5306i5J21J95r2j48J33j46Q3q0p8Q2R8jj4R0l47J11M8J20k68K04J93m42J80o5
5330a18K01l4%R8k27pJ96l11K30J6k40K86k4kJ5r4J05j71N3k17J15K07j06O4j41
5355a06J4J0J63j82J3J57QO3N7j90j01o9J4k6J29j79N69k78j34Rj3J26J0j11P4
5380B7P2j91j47K54J15k45k7P1R3j1j34Q1k0j02K75j47J99k48N2j44M28l61rJ50
5404C1R7k39L12j73l1J42k6k42K22j12j32J85J16j40J45k30M1k33Q5M76j94O5
5426A65j44o2N2P5j68J14r4J75Oj98J08K1j26J14l23L81m6J7j89OK23j3J42j52
$$ plain form
5450 84 41 7 -37 -145 -44 -53 82 -68 -331 68 1 19 6 47 -299 43 166 159 -68 124 31 196 -98 -58 -173
5475 -173 58 81 219 134 -129 54 -13 -75 -23 -21 21 166 91 123 -92 -141 -235 -127 126 -47 42 -153 -132 3 -60
5500 -60 -83 -54 22 -80 45 32 -95 154 -110 458 -70 -59 -61 248 190 146 -14 26 -98 74 -43 43 72 -67
5524 -67 224 97 32 -76 -230 -182 86 122 -93 259 56 136 1 120 -247 142 93 -26 -41 -112 124 97 1
5547 1 152 -138 13 65 -176 46 -99 -6 172 -57 22 -44 67 -1 163 -67 133 -37 -96 -75 0 11 97 -7
5571 -7 -114 1 -28 59 223 16 117 213 -105 -39 -28 -70 -81 27 -164 54 -12 -71 80 -5 14 35 -94 -191 193
5596 193 35 5 215 -30 -8 -45 -120 1 182 108 140 -131 29 136 -170 120 -20 -260 -178 -256 -50 -22 -16 -122
5620 -122 -40 -28 -145 -289 79 -145 187 -20 37 35 29 -200 -104 -7 58 1 -100 -48 -194 -69 105 -24 236 9
$$ packed form
5450H4m3l4m4j08J01rJ35j50k63L99o7J8j3M1l46L42J23pk27J92r3J65k94M0j15
5475a73K31K3J38q5k63J83o7o2N2KM2J45p5L2k15m9r4J08K53j73Q9j95K1J35o3
5500f0k3K9P6j02J25j3j27K49k64N68n28J1kL09n8m4j60M0j24J72j17Q6K9j39
5524f7K91j27o5j08j54M8K68L6k15L52k03Q0j35J19l67L89m9j19j5p1K36k7r6
5547AJ51k90J51N2k41K22j45R3J78k29P9o6J11o8J64k30K00j70n9K1P5J1Q6j04
5571gj07J15k9Q7J64k07J01R6l18O6J1m2j1J08j91K18o6n9J51q5J9K1j29r7L84
5596A93j58l0K10k45K2l7p5J21J81p4L2k71J60J07l06K90j40k40Q2p8K06K8Oj06
5620a22Q2J2j17j44L68k24L32k07N7kok29R6R7O5n7j01N2j46J25J74j29K60k27
$$ plain form
5644 9 -1 -99 -151 348 -8 -20 -280 46 28 -30 -37 -29 -80 206 -48 -261 -34 -40 61 -43 -162 21 -198 -230 -111
5669 -111 -307 96 134 -134 2 -11 61 20 150 -7 -42 88 33 -6 88 132 -162 100 160 48 -71 -15 -47 -68
5693 -68 -311 -208 -107 294 82 -101 -190 -200 -154 101 -228 56 59 -113 -70 232 -224 -69 126 -35 -195 -237 272
5716 272 -343 81 -15 -121 207 -180 -2 45 74 115 -118 104 -237 95 322 73 224 37 50 139 -233 36
5738 36 -1 52 92 204 -113 64 -40 -20 35 -49 -254 -4 73 176 -86 33 159 116 -13 -21 71 -57 120 182
5762 182 -119 -55 -120 -143 20 -139 60 463 -99 -53 123 185 255 -19 111 -2 102 -87 -28 -155 -46 103
5784 103 14 -81 -42 -101 -16 142 -284 -151 101 -127 160 66 180 -25 32 86 40 -86 -28 349 164 101 -19 141
5808 141 225 247 -45 -49 37 -117 146 -244 93 165 -51 -22 -187 -37 -25 201 30 -28 104 0 -24 60 81 -140
$$ packed form
5644Ij0r8n2M99l56j2k60L26j8n8pQn1K86k54k13K27oJ01j04j19J83k19l2J19
5669a11j96M03L8k68J36j3P2m1J30j57l5J30n5l9R4M4k94K62O0j12j19N6l2k1
5693f8k43J03J01M01k12j83q9j0M6K55l29K84Lj72M3L02m56J55J95j61j60m2N09
5716B72o15M24r6j06L28l87J78M7K9M1k33K22l41L32K27k49J51j87J3Q9l72K69
5738C6l7N3M0J12l17J77j04K0N5q4k05K50P7J03k62J19J26m3j29qR2j28J77O2
5762A82l01O4o5k3J63j59J99M03n62M6J76O2P0k74J30j13J04j89N9j27J09J49
5784A03q9r5L9n9Q5J58m26J33K52k28K87r4J14k05N7N4m6j26N8L77j85o3j20J60
5808A41Q4K2k92mQ6j54K63l90L37P2k16K9j65J50J2K26j71n8J32j04k4Q4K1k21
$$ plain form
5832 -140 100 241 -277 -46 156 -199 -187 -110 -20 -227 70 13 -6 91 -61 -82 224 -131 -42 -88 -61 3 90 42
5856 42 -67 70 12 -19 141 -171 -29 -112 36 -107 -59 -20 152 -265 23 -30 -287 74 350 85 105 220 -330
5879 -330 -26 41 25 -137 198 92 -65 -262 -117 -49 -16 -270 56 -355 99 46 43 313 41 -334 -31 40 65
5902 65 136 60 127 14 -313 3 6 -195 -163 37 -221 51 -337 -179 111 -23 34 120 -5 -6 199 91 45 -96
5926 -96 -28 27 51 237 123 46 195 21 30 257 -15 -7 -45 74 101 -178 83 -80 -159 170 86 171 10 170 -158
5951 -158 47 -25 16 177 -123 204 -151 52 -9 101 -39 24 -227 29 -271 -273 -19 13 7 228 73 143 290
5974 290 63 97 -22 146 -221 -196 -119 -129 -67 37 167 168 -130 -116 -94 31 -62 -185 137 87 -10 -155 73 -66
5998 -66 66 -23 -69 171 -61 180 40 1 205 35 54 76 67 133 43 -226 -101 224 -77 -100 -132 206 -228 3
$$ packed form
5832a40K40J41n18K31K02l55J2P7R0k07K97n7j9R7j52k1L06l55Q9m6K7O4Q7m8
5856D2j09J37n8l1J60l12J42q3J48j43M8L9J72m17K88n3k57L61K76k65K0J15n50
5879c30L04O7j6j62L35j06j57j97J45O8L3k54L26m11M54n3lK70k72l75L03P1K5
5902F5P1p6O7j13l27L16Lk01L2K00k58K72l88J58K90j34N7Q6j25jK05j08m6j41
5926i6O8N5K4J86j14p7J49j74RK27k72Ql8J19K7k79K61j63p9L29q4Q5j61J60l28
5951a58K05p2M1J61l00L27l55K03o1J10j40O3k51K56l00kK54L2oK21j55P0J47
5974B90k27L4j19J68l67K5P7j0O2J04J30Jk98J4K2J25r3j23L22n0r7j45K28j39
5998f6J32q9m6K40k32K41j40l9K04j70J9K2rO6r0k69J25L25l01k3l2L38m34K31
$$ plain form
6022 3 116 74 -57 -183 -103 150 -34 -166 -186 -81 -78 -66 -99 30 49 184 -23 -86 77 42 -180 -4 -204 -76
6046 -76 289 -19 13 -8 -92 45 211 -331 -112 -12 130 390 -124 52 94 26 -55 136 299 92 -38 47 -16
6069 -16 60 70 17 148 -105 62 9 -40 241 45 -34 -289 122 -49 -111 -59 -57 70 44 12 -18 -370 49 111 -61
6094 -61 -81 193 -124 -158 66 289 -72 -66 97 23 121 109 -164 -32 156 -119 -34 -52 -153 98 -87 -256 46
6117 46 -1 69 30 -117 -146 -181 -67 -135 66 -189 -36 78 150 51 88 43 -66 78 112 110 -80 -14 15 -84 30 70
6143 70 69 -46 287 -258 48 -18 52 62 39 67 -139 -2 -72 108 127 -202 -39 3 -66 199 -50 86 145 -176
6167 -176 90 9 -224 52 -66 133 75 216 -27 -22 54 -148 -56 -98 205 -125 -24 45 -92 19 36 165 24
6190 24 -21 44 183 -51 -11 -151 -58 -145 15 -150 9 -263 -317 -187 129 -14 -17 -46 -1 3 -16 -120 -198 81 117
$$ packed form
6022CJ13m2j31j26Q0K53j84j32k0J05LJ2l3J29J9J35k07o3J63l5k22J76k00J28
6046g6L65l08L2k1q4J37J66n42K19J00J42K60n14J76M2o8q1J91J63k07j30Q5o3
6069a6P6J0n3J31k53J67n3m9K81j96p9k55M11j71o2N2KJ27k6l2l0l52M19O2j72
6094f1k0K74l17l4K24K23l61OJ63p4R8j2k73J32J88k75Q5j8j01K51j85j69L02
6117D6m7P0l9j47k9l5J14o8K01k55J53J14P2r9L7m5j09J44L4kj90O6K9r9J14M0
6143G0jj15L33n45L06o6P0J0k3K8k06J37p0J80J9l29J63M2o9K65k49J36N9l21
6167a76K66q1k33K76j18J99n8J41k43NP6k02R2m2L03l30J01O9j37J11J7J29j41
6190B4m5O5J39k34M0j40R3q7J60j65J59k72n4J30L16j43lk9M5Mj9j04p8K79L6
$$ plain form
6215 117 28 -279 -135 38 -4 112 -38 84 83 -8 -136 -95 -233 -107 99 -272 -43 10 -97 170 57 22 62
6238 62 -83 -97 55 -88 -74 66 56 143 0 -19 40 44 -214 -52 3 217 -147 -87 -119 -240 -85 -237 -227 48
6262 48 -104 -119 176 -206 -157 -198 10 354 -190 -73 -127 -72 100 -38 259 130 108 3 -165 -158 19 -75 -31 165
6286 165 -131 -228 -46 -284 64 -65 255 -62 106 -129 215 178 -31 -44 27 98 111 -120 -238 -67 57 -330
6308 -330 -161 22 151 -103 -68 66 -68 102 -155 106 -149 -113 57 0 -129 -36 30 15 -120 233 4 -76
6330 -76 -165 -88 -18 -112 -121 82 -204 126 51 66 -217 149 65 247 109 -215 -202 -56 35 23 24 18 21 110 19 154 -72
6357 -72 41 22 110 -3 -100 48 -40 -40 -167 78 128 86 60 -64 -8 144 -115 -290 73 -61 234 -103 -73 -79 0
6382 0 -10 60 -11 18 -124 -408 -93 113 89 -118 -235 180 54 -46 68 81 74 -160 -68 100 56 296 153 231
$$ packed form
6215A17q9l07J44J73m2J16j50J22jr1j28M1j38J26K06l71K29N3j07K67j13l5M0
6238F2j45j4J52j43J4J40j0Q7j43j9N9Mk58J62N5K14l64O0l2j21J55j52J0K75
6262D8j52j5K95l82M9m1K08L44n44J17n4N5J72j38K97j29k2j05j68PJ77r4M4J96
6286A65k96r7J82k38L48j29L20l17J68k35L44l7k09j3P1P1J3k31j18J71J24l87
6308c30J69J83J29k54L5J34j34J70k57K61k55L6J70n7j29R3O6j5j35L53k29q0
6330g6q9P7P0r4rK03k86L30p5J5k83L66q4J82j38l24J3J46R1j2JoLQ9r1J35k26
6357g2J13j9Q8j13r7J48q8%j27K45N0m2k6j24N6J52k59j75L63j34K95l37L0oP9
6382@j0P0p1K9j42k84L15K06k4k07j17M15j26j00J14J3pk34R2J68m4K40j43P8
$$ plain form
6406 231 -290 -30 -126 172 214 74 22 127 -105 59 188 -94 112 -109 62 120 33 -96 120 -45 -213 -39
6428 -39 -187 131 -155 -2 -158 -93 -55 136 175 -98 -134 -148 179 293 193 23 -184 -210 -10 -49 56 267 79
6451 79 90 160 -107 -124 -67 54 55 -251 -95 -197 -101 -6 225 -109 -177 79 17 -28 -101 29 -65 -61 -178 -87 -210 -46
6477 -46 281 12 168 151 -65 132 -258 -99 -144 -18 -47 213 145 -41 5 19 -349 -122 97 46 -67 -164 -69
6500 -69 0 36 27 6 -1 206 164 87 11 98 -99 192 186 26 -27 -142 -119 260 -60 -44 -50 128 -322 -68 165 -117
6526 -117 184 -185 -14 199 -14 20 -153 -119 18 -267 173 -184 49 59 6 109 233 -65 -229 35 0 -272
6548 -272 59 96 -34 -62 -182 -153 -92 128 -60 4 142 -36 73 -86 42 10 156 197 -293 -177 63 132 -3
6571 -3 -60 50 -154 -89 -121 32 -111 -9 9 -29 147 157 -48 58 138 14 63 202 -131 48 90 52 61 -71 -14
$$ packed form
6406B31n21K60r6K98M2j40n2J05k32J64J29k82K06k21J71N8q7j29K16j65j68J74
6428c9j48L18k86J53j56O5L8J91L9k73l6j4L27J14j00j70k07k6K00l9J05K11j88
6451G9J1P0k67j7N7J21Jl06J56j02R6R5K31l34o8K56o2m5p3J30r4Mj17R1j23J64
6477d6L27k69J56j7k16J97l90J59m5J26k9K60o8j86M6J4l68K27K19n1j13r7R5
6500f9O9L6rk1pK07m2p7p6Q7j97K91oj60n3j15K3L79l20J6oJ78m50K54K33k82
6526a17L01l69J71K13k13L4j73L4J37k85M40l57K33J0n3J03J24k98j64K64l5k72
6548b72L31L7j30k8j20K9O1K20j88O4J38j78J09j59J28l2J46M1m90J16K40O9j35
6571cn7J10k04O5l2J53j43J02J8l8J76J0k05J06Q0j24M9J39l33J79M2l8Rj32N7
$$ plain form
6596 -14 130 -10 132 35 115 12 -178 170 121 -9 -77 -290 2 -18 30 -123 -78 -216 120 -30 -101 -134 -168 11
6620 11 162 52 -71 -67 4 140 65 -48 -119 42 -369 -60 -382 -114 12 -5 14 -91 -68 99 41 -127 -166 237
6644 237 41 5 80 138 194 119 266 -68 14 109 140 -176 -177 252 -46 58 -94 -37 -72 75 -138 9 -65 -184
6668 -184 192 -37 259 -25 -232 -60 322 -234 -12 -34 -57 -172 165 -31 35 123 -40 -135 -82 -93 43 -24 -162
6691 -162 31 -20 156 317 -138 198 122 -5 -200 -35 105 -178 -136 155 -102 -50 166 -286 11 -25 55 111
6713 111 66 52 127 -132 -208 -188 -112 -129 137 -92 -74 11 44 -1 -192 -4 -29 -255 -56 59 -152 49 -110 46
6737 46 91 80 -116 -154 -198 71 188 -64 109 -6 2 -203 -215 48 -190 132 -40 89 191 -45 170 -77 24
6760 24 -106 17 -61 -69 -43 116 -118 -24 -243 -116 46 337 -73 28 8 99 -46 178 75 -42 12 -42 87
$$ packed form
6596a4J44j40J42r7Q0j03j90L48m9j30o8k13K92k0M8j53M5j38L36j50p1l3l4J79
6620A1J51j10j23MP1J36p5j13p1J61m11L09l22K68J26j7J9j05K3J67n8j68l9M03
6644B37j96l6P5N8N6p5J47l34Q2R5L1l16jM29k98J04j52N7l5J47k13J47p4j19
6668a84L76k29K96k84k07J72L82n56K22k2k3j15L37j96O6Q8j63r5N3j1J36o7j38
6691a62J93n1J76J61m55L36p6j27j95J65J40k83M2K91k57N2K16m52K97l6Q0N6
6713A11m5j4P5k59p6K0P6j7K66k29J8Q5L3m5j91J88k5k26J99J15k11K01j59J56
6737D6M5j1j96l8m4K69J17k52J73j15Qk05j2K63k38L22j72J29J02k36K15k47J01
6760B4j30J23p8qK6J59k34R4k19J27J62K91m10J01k0R1j45K24j03j17N4n4J29
$$ plain form
6783 87 -121 -69 -193 -6 118 159 -54 -253 -107 61 -94 -96 -59 -51 145 -158 79 -72 73 -87 8 -114 0
6806 0 -3 278 -71 124 99 30 80 -320 148 -107 225 102 -89 -130 -4 -199 247 -2 44 88 -176 -48 279
6829 279 -315 -12 246 13 13 31 81 -231 -78 -207 48 65 -48 -41 -53 -96 175 199 5 248 129 -161 -186 13
6853 13 -127 6 -143 103 -79 142 -140 0 47 -8 -160 -223 -39 -106 -26 -168 -49 -69 30 200 -272 -116 155
6876 155 189 114 -23 -51 165 58 -10 143 63 -95 112 -157 -82 -47 9 90 95 19 -76 30 168 242 100 -104 216
6901 216 97 -62 80 -22 -149 -75 434 -165 -34 19 145 -97 81 -5 79 37 -20 -1 -2 155 144 -127 12
6924 12 -112 -25 2 -10 -32 -221 -68 11 -66 2 -53 157 -181 25 -337 60 -164 -4 -87 111 214 -80 142
6947 142 83 -70 -21 0 3 -140 141 61 158 28 -143 140 158 -107 -109 -281 28 28 111 204 -83 2 -196 37 -56
$$ packed form
6783H7k08N2j24J87J24M1k13j99J46J68j55kL7QJ96l03K37j51J45j60R5j22J14
6806@lK81l49J95k5o9N0m00M68k55L32j23j91m1J26j95M46k49M6M4k64J28L27
6829B79n94L03K58k33%J8N0l12J53j29K55J7j13Pj2m3K71K4j94K43j19k90k5J99
6853A3j40J33j49K46j82K21k82J40M7n5j52o3J84o7Q0j42J19k0R9J70m72J56K71
6876A55L4p5j37k8K16j07o8J53q0j58K07k69P5L5N6Q1Np6r5J06J38P4j42k04L20
6901B16j19j59J42j02j27P4N09n99J31N3J26k42J78q6Q4m2n7J9jJ57j1k71J39
6924A2j24Q7K7j2k2j89J53P9p7O8n5K10l38K06l62L97k24J60q3J98J03k94K22
6947A42n9j53M9K1Lj43K81q0R7j30j71K83J8k65kj72L09%Q3R3k87Q5j98K33r3
$$ plain form
6972 -56 14 -118 218 -144 62 -107 90 -133 -186 -17 197 66 145 8 52 100 -161 12 -68 141 -199 -58
6994 -58 -72 -103 18 -236 -36 -189 -213 -117 -9 -102 -3 251 -262 68 -146 -258 -68 -142 187 107 -155 -7 -58
7017 -58 16 -187 -133 -65 -45 -162 -215 13 -8 168 -206 -24 114 -37 -99 -19 48 -34 177 191 -50 -58 -36 -43 -62 16
7043 16 137 -212 -34 -141 -85 -244 -150 -28 -21 11 140 -24 58 6 8 -17 -31 0 -157 -209 -303 1 61 102 -1 -72
7069 -72 30 16 164 42 20 84 98 -168 39 -227 80 79 -139 -193 -78 30 -118 26 15 130 -13 3 -48 132
7093 132 34 195 -117 171 -83 51 61 32 -78 -146 115 16 -157 -88 96 157 14 -16 -19 -12 -201 90 -36 48
7117 48 69 129 -38 -183 105 16 70 -159 -175 -214 30 -162 0 3 -209 -81 44 -251 -364 103 202 2 -71 -209
7141 -209 -129 50 32 20 198 -21 -84 259 -153 -141 -235 -17 17 -23 -239 -34 58 149 -116 62 114 174 -145 5
$$ packed form
6972e6P0j32L36l62K06j69J97k23n3J69K14j31P9j37M4M8k61J73q0K09l40J41
6994e8j4l1J21k54K00j53k4R6J08r3R9K54n13L30k14j12J90p4L29q0k62J48n1
7017e8P4k03N4O8K0j17n3K28k1J76l74J82J38j51o2Q0O7q2K11J4k41qK2pj9P8
7043A6J21l49J78j07N6j59R4J22PL2J29j64Q2n2Kk5j4L1j57n2r4L04O0M1j03p1
7069g2J02j4J48j22k2O4J4k66K07k66L07jk18n4J15J08j48J44j1J15j43J6n1J80
7093A32r8J61l12K88k54J34J0k9j10o8K61r9j73O9J84O1j43l0lPj89K91j26Q4
7117D8K1O0j67j45K88q9N4k29j6l9K44j92J62Lk12J28J25k95j13M67R9k00p3j38
7141b09Q0J79j8j2J78k19o3L43m12J2r4K18L4m0k16K05R2R1k65J78N2O0l19J50
$$ plain form
7165 5 110 -12 191 39 -33 97 64 169 139 -72 -5 19 251 64 9 114 -190 -26 64 -279 26 241 107
7188 107 84 247 -124 -192 8 184 -156 -226 102 67 48 84 -147 121 -23 -13 -104 118 70 -57 55 -46 90
7211 90 -57 -23 194 -69 -229 -169 5 -14 119 9 -92 21 18 61 -181 210 134 -53 -141 5 67 -16 408 17
7235 17 36 -5 22 -168 -15 35 -142 -20 -252 3 265 67 226 306 48 -79 226 -69 -85 22 -169 -247 -112
7258 -112 80 -193 -66 71 7 136 105 220 197 58 66 7 52 40 -156 -68 64 138 75 5 -78 -158 -41 -239 -61
7283 -61 -114 -8 121 -145 -83 65 38 61 17 81 -117 -95 9 194 -80 14 2 76 24 -30 -182 -37 -259 -4
7307 -4 139 -40 70 -45 32 32 -48 111 -70 73 -177 -23 166 228 59 2 127 -10 -221 -197 121 -41 152
7330 152 169 6 -110 -154 -98 -224 -49 -203 -123 -55 104 -163 -28 33 -70 35 -162 247 14 118 122 6 -302
$$ packed form
7165EJ05j22K03j52p2J30l3J05l0k11O7K4K32j87n5J05l04J64R0l43L05K15j34
7188A07k3J63l71o8K00J76l40p0L28l5j9L6k31K68j44J0r1K22m8j27J12j01J36
7211I0j47L4K17k63j60O0J74j9J33j10j01J13lM3k42L91p6j87q8J46O2q3M24l91
7235A7J9m1K7j90J53N0j77J22k32K55K62j98J59Q0k58j27L05k95j6J07j91p8J35
7258a12J92k73J27J37o4J29l1J15k3j39Qn9M5j2j96Q8J32P4o3p0q3q0J17j98J78
7283f1n3J06J29k66O2J48k7K3m4O4j98K2J04J85k74R4j2P4n2n4j52J45k22K55
7307dJ43j79J10j15P7%q0J59j81J43k50J54J89O2j69n7J25j37k11K4L18j62J93
7330A52J7j63j16m4N6j26J75j54Q0O8J59k67J35O1j03J05j97M09k33J04Mj16l08
$$ plain form
7353 -302 124 231 -146 -141 184 145 -174 -59 -2 4 146 -47 62 -35 42 140 -199 20 -4 -1 -76 -94 62 44 55
7378 55 30 158 -1 64 6 115 -108 -79 -79 -51 -33 -33 -207 139 -242 63 -9 238 -6 31 -33 -41 112 -127 41
7403 41 39 -10 -112 -43 131 -69 -177 40 -150 80 17 0 -8 5 -180 47 127 43 50 24 29 245 -83 256 96 -46
7429 -46 -176 113 246 103 82 7 24 17 -52 28 -51 -162 -131 -202 -74 67 -29 160 22 28 74 90 -95 -31 -48 83
7455 83 -181 -97 82 131 -69 8 -61 -28 -224 47 -189 -22 22 -234 83 -50 -105 56 -187 -172 152 -258 -182
7478 -182 5 7 -5 48 -129 106 -36 -45 270 109 160 206 -12 258 -47 -95 53 113 -199 221 -147 -48 -93 -106
7502 -106 -202 -224 162 150 -58 142 -165 105 76 70 88 -270 -30 -51 -62 269 70 -18 121 184 18 -146 -340 0
7526 0 -1 -37 -218 67 59 -57 -35 -134 19 223 -166 112 -89 -96 -141 42 -154 216 273 29 -3 -208 -63 -184 -38
$$ packed form
7353c02M26J07l77NL25l9l19J15N7OJ42j93J09r7P7R8l39K19k4Lp5j8J56j8J1
7378E5k5J28j59O5n8J09k23K9%K8J8%j74L46l81L05p2K47k44L7o4qJ53k39J68
7403D1km9j02O9J74k00j08K17j90K30o3j7qJ3j85K27Q0q4Pk6NK16l28L39j60j42
7429d6j30K89J33j43k1p5J7po9Q0p9j11L1p1J28J41r6J89j38OM6J6j85O4j7J31
7455H3k64Q4J79M9k00P7o9L3j96K71k36J67M4k56L17j33n5J61k43J5L24m10P6
7478a82J87Kj2N3j77K35j42rL15j61N1M6k18K70l05m8J48O0l12M20l68R9m5j3
7502a06r6k2L86j2k08K00l07K70k9oJ8l58K40k1j1L31j99q8J39O3j66j64j94L40
7526@jl6j81K85qj16K2r9J53K04l89K78k01pm5J83j96L70N7k44l2k05J45j21J46
$$ plain form
7551 -38 -92 351 69 -131 136 -110 -43 89 -26 -17 42 112 139 229 -199 116 157 -105 181 -37 121 -20 121
7574 121 -51 -4 -169 -111 286 51 -198 -92 -66 56 -92 274 127 -223 78 31 -78 -77 110 101 -254 -223 104
7597 104 77 258 102 -196 20 125 68 -143 124 -146 -1 -132 -148 37 30 -86 227 -43 -53 45 135 -39 -41
7620 -41 -117 42 66 -65 170 -54 109 -56 173 -65 38 7 -225 -73 -125 -27 -74 229 -85 -236 -45 -47 -8
7643 -8 71 -137 -40 -96 -162 14 95 177 -1 52 -52 -20 161 -78 -37 332 -2 118 -75 -21 35 -116 75 -176
7667 -176 -6 129 -261 7 -187 15 155 -149 -110 -163 210 -37 52 137 -15 -7 -60 -79 -77 155 -156 -98 65 -150
7691 -150 -56 81 -21 79 -33 40 -293 278 409 182 -203 26 47 -311 -98 127 -92 209 39 -2 -211
7712 -211 82 -159 14 -37 60 18 -167 194 -105 124 239 23 120 -29 -240 -187 -66 139 -72 -73 -59 -201 -69
$$ packed form
7551c8n4M43k82k00K67k46O7J32j15RN9P0K7R0m28L15M1k62K86k18J58j41J41
7574A21j72M7j65N8L97k35k49J06K6J22j48L66j47l50L01m7j09JJ87rl55L1L27
7597A04k7J81j56k98K16J05n7k11K67k70J45j31j6J85pj16L13k70j0R8R0j74k
7620d1p6J59K4j31K35k24J63j65K29k38J03l1k32J52n2R8m7L03l14j51J91kL9
7643hP9k08R7n6o6J76Q1Q2j78N3j04L2J81k39M1L69l34J20j93N4N6j51J91k51
7667a76J70J35l90K68j94K02J40l04L9n3L73k47Q9Q5j52Qn3j9KK32l11N8J63k15
7691a50R4J37j02J00j12P3l33N71J31k27l85K29K1l58K13K25k19L01j70m1k09
7712b11K93k41J73n1R7m2j85L61k99K29J15k16R7j49k11N3J21K05k11jJ4j42J32
$$ plain form
7735 -69 30 226 130 -100 253 -308 -50 185 -178 -55 86 7 -205 373 38 -216 34 -270 292 55 -179
7756 -179 -79 180 244 -78 112 41 -30 -114 37 74 -72 172 19 -187 -88 -130 -43 -42 186 233 -149 -69 -140 191
7780 191 -55 36 -38 105 10 228 10 -127 244 -98 -122 -152 -38 -116 -144 63 2 39 5 78 227 -2 -74 315
7804 315 55 -335 -90 -51 -32 -52 -17 -115 18 334 132 3 -28 54 35 -42 -17 -67 -155 27 55 61 -157 -229 112
7829 112 -204 -109 117 132 123 -96 -24 53 -95 -17 129 46 -92 172 -60 -70 87 -133 192 -22 -5 70 175 -110
7853 -110 10 -259 145 45 -130 -106 -177 95 -318 -172 246 96 347 -59 179 345 16 -34 46 183 39
7874 39 -122 -84 137 26 -19 49 26 69 -59 -100 152 97 83 95 -64 -9 42 -47 -150 50 -29 -120 92 -135 -37
7899 -37 8 -81 106 -131 -205 4 227 -241 -70 151 188 82 -156 255 6 -74 -94 -160 57 81 122 -167 148
$$ packed form
7735f9R9J96r6k30L53n61K58K35l63J23J41p9k12N78l35k54K50l04N62k37k34
7756a79J00K59O4l22J90p1p1q4J51L7j46K44j53k06R9m2Q7JK28M7l82Q0p1L31
7780A91k46R1p4J43r5K18k18j37L71l42k4l0J14p8k8K07o1L7l4P3J49k29p2L89
7804C15k60l90K45L9J9k0L5r8J33L16k02j29l1Q2j9p7K5n0q8J82K8Ok18p2L41
7829A12l16R5K26J5rk19P2P7j48P8J46q3j38K64k32j0J57k20L25k14J7P5J05k85
7853a10J20k69M04j00j75K4p1K72m13J46M18j50K51m06K38J66l29n0Q0J37j44
7874C9j61L8K21j11m5O8k3M3j28m1K52n5j4J2j59N5N1q9j03K00p9r1K12k27R8
7899c7M5q9J87k37p4K09K23m68J71K21L7j06k38M11k49q0k0o6K17K4M1k89L15
$$ plain form
7922 148 13 242 161 -115 -403 177 172 59 -37 76 90 61 -157 91 44 210 -42 41 93 -271 33 70 -106
7945 -106 175 -141 50 99 218 -108 123 38 -73 168 -55 -48 159 -34 -78 113 -9 -43 33 40 149 87 36 39
7969 39 67 36 -65 112 -256 -63 12 -48 -137 90 82 113 42 172 14 -113 113 -75 -45 163 20 21 -26 107 -102
7994 -102 -39 -48 49 -87 8 -51 -50 -74 157 27 50 111 12 -45 -46 -192 105 179 -38 73 -167 23 -32 136 -8 267
8020 267 -99 -91 -59 -57 107 -13 -116 -79 -38 0 -20 -369 -165 -73 30 17 115 10 -73 -72 130 -114 -174 97 13 -57
8046 -57 207 -104 -48 157 -53 0 60 40 -28 -127 -50 139 -177 48 60 -52 -14 179 -9 86 46 -114 40 -127
8070 -127 17 76 -103 -36 29 -145 15 -146 79 90 49 -183 -204 103 74 132 55 -183 77 -197 14 158 93
8093 93 130 -96 -80 -134 -66 -95 -207 -92 -57 -157 -106 -1 -21 149 -240 197 96 149 -3 -33 17 103 -112 -225
$$ packed form
7922A48j35K29q1k76k88N80nj13r6J13J4k9k18K48m7J66k52Q3N2l64L04L7j76
7945a06K81l16J91M9J19l26K31q5j11K41k23PK07j93m4J91j22l4P6PJ09o2n1L
7969C9K8l1j01J77l68J93P5o0q9K27qL1p1J30j58j27K26j88L0K08j43Jm7J33k09
7994a02O3rR7j36R5n9Jk4K31j30K3O1r9n7jj46K97P4k17J11k40J90n5J68j44K75
8020B67l66QL2KJ64j20j03L7M1L8k0l49K04R2J03j3R8j05q3JK02k44o0K71q4p0
8046e7K64l11N6K05k10N3O0k0o8r9P7J89l16K25J2j12L8J93j88R5m0j60J54j67
8070a27J44N9j79O7O5j74J60j61K25J1m1k32k1L07k9N8p7k38K60k74K11J44o5
8093I3L7k26J6n4O8k9j12J15L5j00N1J05k0J70l89M37j01N3j52l0N0Q6k15j13
$$ plain form
8117 -225 6 14 -116 -87 48 330 124 5 57 99 53 175 34 21 120 -184 260 -38 -146 150 64 25 142
8140 142 -174 -99 -185 77 -256 -16 28 108 -106 24 190 10 -249 -251 96 -15 9 8 50 126 6 -4 85 -156
8164 -156 -98 -82 66 172 13 -342 -68 46 -54 -169 77 -246 -141 -108 141 -65 260 43 -129 224 -2
8185 -2 153 -67 -17 -135 -67 -90
$$ packed form
8117b25K31Qj30K9J35K82k06j19N2M2m6J22j41j3R9l04M44k98j08K96q6l9J17
8140A42l16P5q6K62l33K40M4Q0k14J30J66j80k59kL47j11K4jM2P6j20j0Q9k41
8164a56N8J6J48J06j59l55K74J14j00j15K46l23J05L3K49k06L25k17j72L53k26
8185bJ55k20N0j18O8k3
8191i0
$$ Imaginary data points
##PAGE= N=2
##DATA TABLE= (X++(I..I)), XYDATA
$$ plain form
0 0 0 0 0 0 0 0 0 8 -8 8 -8 16 -16 24 -32 40 -48 59 -72 88 -104 125 -147 176 -203 236 -275 316 -365 419
30 419 -479 544 -617 697 -786 884 -993 1111 -1239 1382 -1534 1704 -1888 2089 -2310 2549
46 2549 -2811 3095 -3410 3755 -4134 4554 -5021 5540 -6124 6781 -7532 8397 -9405 10599
60 10599 -12034 13799 -16027 18941 -22917 28665 -37721 54014 -92010 344865 77523 -378178
72 -378178 472990 -346979 140262 287894 -425833 240421 39319 -169103 278215 -231603
82 -231603 30940 166480 -172182 95807 20244 -90521 76336 12682 -61327 65858 15411
93 15411 -151696 177963 -12404 -133158 170601 -158785 88681 167304 -286454 190490
103 190490 15517 -86976 250872 -284724 117175 190291 -257244 241935 -141074 -45971
$$ packed form
0@%%%%%%%Qj6J6j6K4l2M0n6P2q8J07j31J60j92K29k72L23l79M39n11N91o81P84
30D19q98J023j161J314j483J670j877K104k350K621k916L238l592L977m399M859
46B549n360N906o505P165p889Q688r575J0561j1664J2905j4313J5929j7802K0004
60A0599k2633K5833k9826L4968m1858N1582o6386R1735j46024M36875k67342m55701
72c78178Q51168q19969M87241J47632p13727O66254k01102k08422M47318n09818
82b31603K62543J35540l38662K67989p5563j10765J66857o3654p4009J27185n0447
93A5411j67107L29659j90367j20754L03759l29386K47466P8623m53758M76944
103A90490j74973j02493L37848n35596M01899P3116m47535M99179l83009R5103
$$ plain form
113 -45971 296846 -287729 96781 91805 -173097 226004 -128701 -39783 178128 -150735 94809
124 94809 7185 -66985 118589 -81326 21779 59447 -45051 5914 15501 22100 -7792 29726
136 29726 -45813 14849 121005 -113821 21897 72892 -75570 138198 -91976 -56923 172850
147 172850 -117462 63015 -17665 -102550 198383 -122997 -23445 97345 -137512 146214
157 146214 -38950 -112317 164047 -95255 20050 55855 -99163 103990 -41028 -23778
167 -23778 75223 -63013 42907 -11949 -18173 79156 -44580 -11153 36323 13187 20070 -16498
179 -16498 -4739 13476 58059 -23878 -55013 69589 -18218 10799 7848 -78777 85382 -11603
191 -11603 -48740 46553 -69209 65036 3003 -94564 100799 -56401 -11958 67034 -109346
$$ packed form
113d5971L42817n84575L84510m976k64902L99101l54705Q8918K17911l28863K45544
124I4809q7624p4170J85574j99915J03105L7668j04498N0965R587O599k9892L7518
136B9726p5539O0662J06156k34826J35718N0995j48462K13768k30174L5053K29773
147A72850k90312J80477q0680q4885L00933l21380R9552J20790k34857K83726
157A46214j85164p3367K76364k59302J15305L5805j55018K03153j45018J7250
167b3778R9001j38236J05920n4856o224R7329j23736L3427M7476k3136O883l6568
179a6498J1759J8215M4583q1937l1135J24602q7807K9017k951q6625J64159r6985
191a1603l7137R5293j15762J34245o2033r7567J95363j57200M4443P8992j76380
$$ plain form
202 -109346 74415 8985 -90984 84763 -35616 -10660 38390 -66293 55891 10654 -46104
213 -46104 38875 -20687 25795 22093 -51234 27604 33079 -21944 -2202 9651 -10855 32088
225 32088 -3317 -50402 50620 12528 -37036 28501 -22416 18114 35116 -62252 35438 10344
237 10344 -19003 42265 -61473 31732 40124 -67570 43695 -9416 -23967 59646 -52619
248 -52619 -706 51613 -47350 19452 1196 -15719 33189 -34797 47 20713 -18449 4357
260 4357 -13473 -11559 32830 -22212 -33989 30912 -9682 -7193 6640 -34212 17941 28832 -44620
273 -44620 -399 19475 -15511 22894 -29931 -6758 37471 -23930 9842 -8197 -10050 41929
285 41929 -27212 -11810 38468 -29209 16016 14761 -37033 42026 -8101 -23386 32279 -12152
$$ packed form
202a09346J83761o5430r9969J75747j20379K4956M9050j04683J22184m5237n6758
213d6104Q4979n9562M6482l702p3327P8838N475n5023J9742J1853k0506M2943
225C2088l5405m7085J01022l8092m9564O5537n0917M0530J7002r7368R7690k5094
237A0344k9347O1268j03738R3205Q392j07694J11265n3111j4551Q3613j12265
248e2619N1913N2319r8963O6802j8256j6915M8908o7986L4844K0666l9162K2806
260D357j7830J914M4389n5042j1777O4901m0594K489J3833m0852N2153J0891p3452
273d4620M4221J9874l4986L8405n2825K3173M4229o1401L3772j8039j853N1979
285D1929o9141J5402N0278o7677M5225j255n1794P9059n0127j5285N5665m4431
$$ plain form
297 -12152 -3044 5265 -10926 17572 -1459 -23065 15926 -1587 5397 1664 -34388 25604 18414
310 18414 -26381 1080 456 -2167 28937 -21874 -25777 36221 -5388 -3209 -2292 -15644 23326
323 23326 -2 -13771 4249 -10209 10272 6077 -26685 19909 -9110 -18837 30295 -22949
335 -22949 -7433 9516 -22712 12607 6446 -29795 -1950 6933 406 -339 -26415 2917 13056
348 13056 -4301 -3468 -19510 5168 27184 -14526 -19194 17412 -5594 9876 8889 -33025 18610
361 18610 14576 -16180 10793 -6839 -2654 15633 -10843 6889 -1174 -12032 21794 -14310 2294
374 2294 9392 -28609 21058 6813 -26164 7912 -4176 -2955 14418 -18684 -11577 13911 5404
387 5404 -6177 -12293 1073 8727 2910 -9560 -6674 293 6542 4774 -24478 3590 10702 -19550
$$ packed form
297a2152R108Q309j6191K8498j9031k1606L8991j7513O984l733l6052N9992p190
310A8414m4795K7461o24k623L1104n0811l903O1998m1609K179R17j3352L8970
323B3326k3328j3769J8020j4458K0481m195l2762M6594k9019r727M9132n3244
335b2949J5516J6949l2228L5319o161l6241K7845Q883o527p45k6076K9332J0139
348A3056j7357Q33j6042K4678K2016m1710m668L6606k3006J5470r87m1914N1635
361A8610m034l0756K6973j7632M185J8287k6476J7732q063j0858L3826l6104J6604
374B294P098l8001M9667j4245l2977L4076j2088J221J7373l3102P107K5488q507
387E404j1581o116J3366P654n817j2470K886O967O249j768k9252K8068P112l0252
$$ plain form
401 -19550 12990 -10450 -19947 27164 -16203 -9846 13227 -24495 10762 75 -13519 6324
413 6324 -22476 10107 4447 -22079 10726 -17837 -359 22773 -27271 -2017 10038 -4686
425 -4686 10571 -7929 -6403 5275 11358 -1865 -15129 8720 704 1034 3148 -15063 3992
438 3992 2645 118 872 -18252 12736 -4996 -9682 18713 -31870 5158 12756 -27503 16395
451 16395 -16651 -14092 18122 -19249 2557 -8706 -11714 22793 -21458 3675 5885 -20500 29198
464 29198 -11960 -10395 16458 -12146 10740 -873 -6248 3188 -4620 10046 -8224 -5493 11158
477 11158 -14694 8821 1484 -14302 10082 -10014 4969 -8160 -7955 8679 -23598 13308 -8960
490 -8960 -23043 22515 -22260 -5490 12995 -26549 13687 -5900 -10515 17080 -24352 17326
$$ packed form
401a9550L2540k3440r497M7111m3367O357K3073l7722L5257j0687j3594J9843
413F324k8800L2583n660k6526L2805k8563J7478K3132n0044K5254J2055j4724
425d686J5257j8500J526J1678O083j3223j3264K3849q016L30K114j8211J9055
438C992j347k527P54j9124L0988j7732m686K8395n0583L7028P598m0259M3898
451A6395l3046K559L2214l7371K1806j1263l008L4507m4251K5133K210k6385M9698
464B9198m1158J565K6853k8604K2886j1613n375R436p808J4666j8270K731J6651
477A1158k5852K3515p337j5786K4384k0096J4983j3129K05J6634l2277L6906k2268
490h960j4083M5558m4775J6770J8485l9544M0236j9587m615K7595m1432M1678
$$ plain form
502 17326 -5671 -16315 29982 -30589 6385 13382 -28088 20514 -7502 -13058 16223 -13355
514 -13355 4062 -1241 -7144 11433 -16432 10009 -2430 -12585 14835 -15306 2438 -380 -6587
527 -6587 2188 -8924 11596 -11679 -4568 16992 -19346 13504 4842 -24409 30832 -10573 -6242
540 -6242 18393 -25429 24667 -7679 -13687 20804 -27071 18726 1621 -30680 27454 -13564
552 -13564 -9452 18859 -28217 8783 3264 -16443 7834 -15626 2073 -6652 -7811 5348 -19537
565 -19537 1683 -2659 -5918 1360 -12536 1932 -2052 2506 3020 -22574 16242 4510 -16258
578 -16258 19305 -25193 6877 22687 -29077 12476 -5878 -1698 19341 -23308 8431 2779
590 2779 -9451 22408 -21648 -248 17279 -22694 16029 -4559 -15554 12880 -9640 3129
$$ packed form
502A7326k2997j0644M6297o0571L6974O997m1470M8602k8016n556K9281k9578
514a3355J7417n303n903J8577k7865K6441j2439j0155K7420l0141J7744k818o207
527f587Q775j1112K0520k3275P111K1560l6338L2850q662k9251N5241m1405M331
540f242K4635m3822N0096l2346o008L4491m7875M5797j7105l2301N8134m1018
552a3564M112K8311m7076L7000n519j9707K4277k3460J7699q725j159J3159k4885
565a9537K1220m342l259P278j3896J4468l984M558N14k5594L8816j1732k0768
578a6258L5563m4498L2070J5810n1764M1553j8354M180K1039m2649L1739n652
590B779j2230L1859m4056K1400J7527l9973L8723k0588j0995K8434k2520J2769
$$ plain form
602 3129 -3544 -7960 1218 -3954 9950 -10741 -10355 11788 -4160 2985 -5959 -11673 12707 -2568
616 -2568 -16 -11859 -7364 20636 -16079 -2238 604 -15938 21507 -9360 -16342 12200 -9713
629 -9713 5261 -1729 -12737 7738 -10904 5602 -1232 -16801 12031 -11520 -1361 10430 -19630
642 -19630 1775 3335 -2437 4547 -13600 883 4750 1926 2307 -19304 7155 12021 -10090 -350
656 -350 -9432 2687 11205 -7145 -7852 -3612 10334 2408 -11802 3481 -5678 3164 8920 -16043
670 -16043 2166 1020 -3601 6026 -8260 -489 -4208 -596 11801 -12710 -2405 5020 -7281
683 -7281 15614 -6737 -16707 13680 1253 2133 -6198 -10602 10576 2582 -1147 -9549 -6703 15228
697 15228 -555 -11097 1864 -4115 4816 4364 -11365 -2542 3043 2177 -5780 270 -2245 -7496
$$ packed form
602C129o673m416R178n172J3904k0691L86K2143j5948P145q944n714K4380j5275
616b568K552j1843M495K8000l6715J3841K842j6542L7445l0867o982K8542k1913
629i713J4974o990j1008K0475j8642J6506o834j5569K8832k3551J0159J1791l0060
642a9630K1405J560n772O984j8147J4483L867k824L81k1611K6459M866k2111R740
656c50r082J2119Q518j8350p07M240J3946p926j4210J5283r159Q842N756k4963
670a6043J8209j146m621R627j4286P771l719L612J2397k4511J0305P425j2301
683g281K2895k2351r970L0387j2427Q80q331m404K1178p994l729q402K846K1931
697A5228j5783j0542J2961n979Q931m52j5729Q823N585q66p957O050k515n251
$$ plain form
711 -7496 7177 -3329 -4007 -154 -6460 3873 3130 -4767 -4427 -3896 10355 1455 -14473 6012 -2918
726 -2918 3860 7441 -20095 4369 10201 -4903 -843 -5817 825 8419 -3747 -4240 -919 2236
740 2236 6407 -9679 1152 4442 -4907 3506 -1229 -2782 1836 1725 -4432 3585 2614 -8210 4022
755 4022 5162 -2771 -867 -814 437 7680 -3332 -5099 917 4204 6595 -12181 679 6019 -2950
770 -2950 4989 -8030 -4701 11921 -1588 -9052 2495 -922 2871 -742 -5569 825 -581 3038
784 3038 -4817 -1097 3588 -4764 -1005 3572 -1167 -4659 2442 -1394 1084 3161 -7034 -2010 8287
799 8287 -37 -6992 1182 -127 4447 173 -6670 -13 3819 5075 -7883 -2579 6521 -1776 -52
814 -52 377 -3813 4346 2907 -6527 3182 3134 -1392 -1333 1810 3202 -1831 2442 -1876 1259 5789 -3462
$$ packed form
711g496J4673j0506o78L853o306J0333p43p897L40N31J4251q900j5928K0485q930
726b918O778L581k7536K4464N832j5104M060m974O642P594j2166m93L321L155
740B236M171j6086J0831L290r349Q413m735j553M618j11o157Q017r71j0824J2232
755D022J140p933J904N3J251P243j1012j767O016L287K391j8776J2860N340q969
770b950P939j3019L329J6622j3509p464J1547l417L793l613m827O394j406L619
784C038p855L720M685q352L759M577m739l492P101l836K478K077j0195N024J0297
799H287q324o955Q174j309M574m274o843O657L832J256j2958N304R100q297J724
814e2M29m190Q159j439r434R709m8m526N9L143J392n033M273m318L135M530r251
$$ plain form
831 -3462 -3158 5472 3350 -3408 611 1761 1417 2612 -392 -4235 5051 3777 -7029 1845 2097 -998
847 -998 -1453 -2272 336 227 748 -5194 -2529 7062 -2613 -6744 3018 -643 251 864 -6080 1086 3830
864 3830 -632 -5055 117 4949 -2902 214 1080 -2412 4735 284 -3961 4266 1274 -1888 409
879 409 3376 1005 -3426 2714 352 644 3613 -6057 70 7201 -1912 -3219 381 2307 3041 -1238
895 -1238 -1315 -1341 6314 2977 -7453 3457 3988 -331 2002 -1863 379 4329 749 -1169 -78 4692
911 4692 408 -2926 5869 -1966 -585 4434 -3989 3044 1115 -3509 573 2263 182 -5104 -295
926 -295 3700 -2205 -208 -1407 -3915 7739 -942 -6912 1828 2032 3109 -3295 -1371 594 2003
941 2003 4680 -5551 -1621 7179 -673 -121 2888 -2977 4248 2609 -342 399 -161 3909 -2216 4383
$$ packed form
831c462L04Q630k122o758M019J150l44J195l004l843R286j274j0806Q874K52l095
847i98m55q19K608j09N21n942K665R591r675m131R762l661Q94O13o944P166K744
864C830m462m423N172M832p851L116Q66l492P147m451m245Q227k992l162K297
879D09K967k371m431O140k362K92K969r670O127P131r113j307L600J926P34m279
895a238p7k6P655l337j0430J0910N31m319K333l865K242L950l580j918J091M770
911D692m284l334Q795p835J381N019q423P033j929m624M082J690k081n286M809
926b95L995n905J997j199k508J1654q681n970Q740K04J077o404J924J965J409
941B003K677j0231L930Q800p852N52L009n865P225j639k951P41n60M070o125O599
$$ plain form
957 4383 855 -5578 5029 2287 -898 858 -2783 550 5566 357 -3995 -2045 6668 2173 -4314
972 -4314 2523 -3847 5242 5532 -7456 1383 3063 2640 657 -1637 1001 1388 3205 2737 -4217 3245
988 3245 4042 -3416 6574 -1833 -2415 4140 430 1560 -2453 366 -102 2072 3167 -5728 -1952 5884
1004 5884 -1090 -1344 -648 -3085 5365 61 -2687 -2782 1447 5398 -5814 1446 157 -1910 6662 -2674
1020 -2674 -3367 4563 359 818 1126 -2061 2549 -308 3815 -213 -3502 6226 -2760 2249 3100 -5611
1036 -5611 2543 3642 -277 -1234 -741 1367 2324 1275 -1046 -4033 5870 2718 -3817 1984 -2761 3704
1052 3704 3032 -2471 -955 -320 5793 -604 -2276 3828 -2410 2748 5230 -6398 2224 2685 -2114
1067 -2114 4724 -2854 -487 1305 1167 3228 -4884 647 2050 -1386 3566 -3161 -3905 5587 506
$$ packed form
957D383l528o433J0607k742l185J756l641L333N016n209m352J950Q713m495o487
972d314O837o370R089K90j2988Q839J680m23j983k294K638L87J817m68o954P462
988C245P97p458R990q407n82O555l710J130m013K819m68K174J095q895L776P836
1004E884o974k54O96k437Q450n304k748r5M229L951j1212P260j289k067Q572r336
1020b674o93P930m204M59L08l187M610k857M123m028l289R728q986N009Q51q711
1036e611Q154J099l919r57M93K108R57j049k321k987R903l152o535N801m745O465
1052C704o72n503J516O35O113o397j672O104o238N158K482j1628Q622M61m799
1067b114O838p578K367J792j38K061q112N531J403l436M952o727p44R492n081
$$ plain form
1082 506 -2017 -1075 -1082 1752 787 912 -5036 316 4861 -3218 767 -932 -1917 4218 -514 -1378 -755
1099 -755 332 3819 -2061 1354 1040 -3766 7079 -982 -3814 5029 -2432 2272 2988 -3253 1248
1114 1248 953 2268 467 -2533 3611 -946 1367 2928 -4736 2759 3005 -1248 1212 15 482 1308
1130 1308 2409 -563 -1996 4107 1114 -1417 3203 -2324 1148 3368 -1667 871 -827 2360 -160
1145 -160 -1118 3141 -3025 1373 3805 -4656 2002 1645 -3407 3460 -1386 -1291 1273 -755 2273 -2856
1161 -2856 944 789 -2048 3445 -1729 -2186 3419 -788 -668 1643 -1585 1404 1315 698 -1232 94
1177 94 3978 -2345 1668 1161 -1532 2845 529 -377 527 1109 682 440 2007 137 -1760 4006 42
1194 42 -1586 4151 -3103 2076 2748 -1649 1041 -472 2516 265 -412 1227 -892 1965 2601 -3534
$$ packed form
1082E06k523R42pK834r65J25n948N352M545q079L985j699r85O135m732q64O23
1099g55J087L487n880L415l14m806J0845q061k832Q843p461M704P16o241M501
1114A248k95J315j801l000O144m557K313J561p664P495K46m253K460j197M67Q26
1130A308J101k972j433O103k993k531M620n527L472K220n035K538j698L187k520
1145a60r58M259o166M398K432q461O658l57n052O867m846R5K564k028L028n129
1161b856L800j55k837N493n174m57N605m207J20K311l228K989q9o17j930J326
1177I4L884o323M013n07k693M377k316r06R04N82m27k42J567j870j897N766l964
1194D2j628N737p254N179O72m397K690j513K988k251o77J639k119K857O36o135
$$ plain form
1210 -3534 1385 2622 -2402 2936 -1073 -659 1742 633 372 -1129 1988 -1096 -158 2522 -1299 -1492
1226 -1492 1599 -23 -32 929 -2450 355 1371 1068 -3175 -251 2208 -2004 2173 -1949 -2275 2959
1242 2959 430 -1765 -429 1041 314 85 334 -323 -975 3459 -1139 -1013 2949 -2701 1460 2263 -611
1259 -611 -154 432 1502 163 738 -624 -1279 2731 2335 -3239 894 2054 -245 2081 -1770 -728
1275 -728 2032 2396 -1746 -1392 2620 -197 160 616 -1498 326 2353 -1260 -842 1322 -312 -359 726
1292 726 807 -2358 1274 663 -1694 1319 -1793 -1351 2454 408 -2527 -921 1111 968 -781 -1031 -1494
1309 -1494 831 3578 -3155 -2241 2320 151 534 -416 -1471 541 2491 -372 -1848 1322 724 -854
1325 -854 1346 -165 -1596 1976 279 -358 284 -603 -438 821 1974 -2418 -1607 2689 244 -273 -226
$$ packed form
1210c534M919J237n024N338m009M14K401j109k61j501L117l084R38K680l821j93
1226a492L091j622rR61l379K805J016l03m243K924K459m212M177m122l26N234
1242B959k529k195J336J470p27k29K49o57o52M434m598J26L962n650M161Q03k874
1259f11M57N86J070j339N75j362o55M010l96n574M133J160k299K326l851J042
1275g28K760L64m142L54M012k817L57M56k114J824K027l613M18K164j634m7J085
1292G26Q1l165L632o11k357L013l112M42L805k046k935J606K032j43j749k50m63
1309a494K325K747o733R14M561k169L83r50j055K012J950k863j476L170n98j578
1325h54K200j511j431L572j697o37O42q87J65J259J153m392Q11M296k445n17M7
$$ plain form
1342 -226 -2493 2182 2832 -2256 -1669 1304 2143 -236 -116 -984 70 3523 -389 -2527 1836 969 -28
1359 -28 544 -671 186 419 1199 -846 -747 1731 -1894 760 2269 -3218 -208 1255 -418 832 -1052
1376 -1052 -2230 1279 1559 -1188 -2898 1028 1874 -1213 -94 -1484 729 2608 -1044 -2081 307
1391 307 2292 -890 -773 594 -834 1223 1200 -2743 1177 1324 -2147 1476 -490 -580 -134 -15 1516
1408 1516 -1794 552 -131 -944 2631 -1142 -2981 3060 745 -621 427 -1969 1672 1810 231 -2070
1424 -2070 238 3724 -957 -39 684 -160 2390 845 -1566 745 1698 -175 -548 829 596 -1913
1440 -1913 2154 -569 -1572 2382 -2613 416 1590 -1246 -1237 -804 1469 -639 -1934 159 -1137 451
1456 451 1655 -4705 887 1777 -2162 910 -1567 494 1065 -609 -498 -584 1951 -371 -1404 1687
$$ packed form
1342b26k267M675O50n088N87K973Q39k379J20q68J054L453l912k138M363q67r97
1359b8N72j215Q57K33P80k045R9K478l625K654J509n487L010J463j673J250j884
1376a052j178L509K80k747j710L926Q46l087J119j390K213J879l652j037K388
1391C07J985l182J17J367j428K057k3l943L920J47l471L623j966r0M46J19J531
1408A516l310K346o83q13L575l773j839O041k315j366J048k396L641J38j579k301
1424b070K308L486m681R18P23q44K550j545k411K311R53j873l73J377k33k509
1440a913M067k723j003L954m995L029J174k836RM33K273k108j295K093j296J588
1456D51J204o360N592Q90l939L072k477K061N71j674J11q6K535k322j033L091
$$ plain form
1472 1687 366 -1129 1217 -735 367 852 -1073 53 382 2065 -2064 -235 1992 -1772 1384
1487 1384 -782 -1858 2271 -453 -1513 420 -37 1074 -1377 -298 1555 -2061 2002 -1188 -1297
1502 -1297 3521 -2044 -464 1761 -158 18 -252 -657 807 481 -183 -1889 539 1990 -2298 -200
1518 -200 -76 -337 984 -1449 -585 -270 1017 -1145 -1880 1438 -1130 -1348 1123 -1916 -188 1370 -2644
1535 -2644 594 141 -640 -175 -792 1904 -1879 -684 1059 -1350 1749 -468 -2927 2400 708 -1524
1551 -1524 -374 -589 842 115 -670 -925 -420 2366 -1312 -1998 1112 -523 75 -256 -1284 -53 764
1568 764 216 -1297 470 692 -1254 1757 76 -1714 1351 -381 469 836 -1410 53 254 1421
1584 1421 -561 -2931 1728 635 -674 932 -3045 862 2615 -1944 -1036 -536 584 697 -1185 -1222
$$ packed form
1472A687j321j495K346j952J102M85j925J126L29J683m129J829K227l764L156
1487A384k166j076M129k724j060J933m57J111k451J079J853l616M063l190j09
1502a297M818n565J580K225j919J76k70m05J464l26o64j706K428J451m288K098
1518b00J24k61J321k433Q64L15J287k162p35L318k568k18K471l039J728J558m014
1535b644L238m53p81M65o17K696l783J195J743k409L099k217k459N327j692k232
1551a524J150k15J431p27p85k55N05K786l678o86L110j635N98l31j028J231Q17
1568G64n48j513J767K22j946L011j681j790L065j732Q50L67k246J463K01J167
1584A421j982k370M659j093j309J606l977L907J753m559R08N00J120J13j882l7
$$ plain form
1600 -1222 -938 713 631 -2780 -472 80 -1272 490 -827 -1552 -306 749 -493 -1029 119 -1765
1616 -1765 546 1613 -2400 -1007 912 125 728 -1259 -1399 936 929 561 -3023 418 2318 -1236 595
1633 595 -1681 -983 2592 -445 -1879 -42 113 760 -48 -934 -461 -390 1836 -986 -1078 927 -969 978
1651 978 861 -1322 -898 1003 512 -696 -387 -1030 274 1825 -833 -2212 805 641 -18 -550 -1936
1668 -1936 689 317 730 -2503 -1510 2122 -763 -430 -514 -1639 1007 1073 -2221 -292 -261 2 784 -632
1686 -632 -311 -1441 1376 472 -1744 190 -330 226 1485 -543 -1957 773 1023 -222 -909 -595 -170
1703 -170 1003 851 -2482 12 1226 -368 -73 -1468 -456 509 1068 -906 -1736 843 585 -890 554
1720 554 -934 -678 2406 -713 -860 229 -271 785 198 156 -1388 609 1527 -783 -618 356 -403 986
$$ packed form
1600a222K84J651q2l411K308N52j352J762j317p25J246J055j242n36J148j884
1616a765K311J067m013J393J919p87O03j987j40K335pl68l584L441J900l554J831
1633E95k276O98L575l037j434J837J55O47q08q86M73P1K226k822r2K005j896J947
1651I78j17k183M24J901m91j208L09o43J304J551k658j379L017j64o59n32j386
1668a936K625l72M13l233R93L632k885L33q4j125K646O6l294J929L1K63P82j416
1686f32L21j130K817r04k216J934n20N56J259k028j414K730K50j245o87L14M25
1703a70J173j52l333K494J214j594K95j395J012R65N59j974q30K579k58j475J444
1720E54j488K56L084l119j47J089n00J056n87m2j544J997R18k310J65R74p59J389
$$ plain form
1738 986 900 -2099 245 918 1 -725 -252 -178 -313 1483 -1427 -1177 1044 -508 -639 -58 -657 -358 588
1757 588 -107 -1184 -465 1024 -920 -29 592 -1844 1030 232 -1026 98 -300 -311 -93 -134 -794 -834 876
1776 876 -120 -1827 747 -400 -493 880 -1144 -569 774 213 -716 -245 192 -343 940 183 -1421 831
1794 831 791 -569 362 -48 -28 465 525 -115 -554 1086 51 -624 1061 -730 -151 1078 -988 -510 196
1813 196 -764 -342 -469 -320 -1088 -250 214 -1238 -6 -317 -771 453 -20 -875 -4 -38 -701 -497 347
1832 347 -740 -506 1043 -985 -419 1038 -1227 95 415 15 -96 -357 207 -503 -2 95 -1483 210
1850 210 816 -1719 601 -340 -718 1073 -643 -652 -232 345 93 -249 299 -500 39 906 -47 -678 966
1869 966 -115 -24 512 -505 -588 851 915 -1315 745 109 -491 1385 -1193 -731 449 14 -159 -774
$$ packed form
1738I86q6k999K344O73r17p26M73P4j35J796k910K50K221j552j31N81n99K99R46
1757E88o95j077P19J489j944Q91O21k436K874p98j258J124l98j1K18m1o60m0J710
1776H76r96j707K574j147r3J373k024N75J343n61r29M71M37n35J283p57j604K252
1794H31m0j360R31m10K0M93O0o40m39J640j035o75J685j791N79J229k066M78P06
1813A96r60M22j27J49p68Q38M64j452J232l11m54J224m73q55Q71l4o63K04Q44
1832C47j087K34J549k028N66J457k265J322L20m00j11k61N64p10N01R7j578J693
1850B10O06k535K320r41l78J791j716rM20N77k52l42N48p99N39Q67r53o31J644
1869I66j081R1N36j017q3J439O4k230K060o36o00J876k578M62J180m35j73o15
$$ plain form
1887 -774 -963 94 -507 209 -956 -1473 1803 -1132 -412 245 -1292 741 156 -956 -612 316 3 -546
1905 -546 -274 -101 -765 375 299 -1207 340 -153 173 255 -285 -673 -292 1301 -898 -845 298 -494 667
1924 667 46 -1835 35 806 -599 -392 -802 552 273 -353 85 -1588 1220 542 -1330 285 -203
1941 -203 7 786 -237 -922 362 394 429 -666 294 -338 229 1535 -1075 -390 320 12 592 -632 -1076
1960 -1076 -608 965 -11 -1757 -84 371 -367 692 -1185 -1229 1450 -393 -464 -839 -62 417 -369 -158
1978 -158 -1309 -218 919 -611 -189 277 -976 681 720 -969 209 -23 565 -21 -338 -372 -795 1265
1996 1265 -383 -1209 102 45 299 262 -999 -524 623 795 -621 -907 1089 -107 293 -132 -1206 917
2014 917 512 -735 -100 94 402 205 166 301 -422 803 664 -595 755 -450 -215 1062 -244 -482
$$ packed form
1887g74j89J057o01P16j165n17L276k935P20O57j537K033n85j112L44R28l13n49
1905e46K72J73o64J140p6j506J547m93L26Q2n40l88L81J593k199N3J143p92J161
1924F67o21j881J870P71j405K07m10J354k79o26M38j673K808o78j872J615m88
1941b03K10P79j023o85J284L2L5j095R60o32N67J306k610O85P10l08N80j224m44
1960a076M68J573r76j746J673M55p38J059j877m4K679j843p1l75P77M79p86K11
1978a58j151J091J137j530M22M66j253J657L9j689J178k32N88n86l17l4m23K060
1996A265j648q26J311n7K54l7j261M75J147J72j416k86J996j196M00m25j074K123
2014I17m05j247O35J94L08j97l9J35p23J225j39j259J350j205K35J277j306k38
$$ plain form
2032 -482 140 232 237 -517 -561 -422 518 997 -1241 -300 871 -122 -189 -394 -539 378 357 -526 -975 1056 96
2053 96 -482 357 -496 83 832 -412 -198 233 -51 184 63 374 -694 -200 986 -721 22 22 -1116
2072 -1116 757 570 -1260 -59 356 149 358 -342 -162 346 846 -259 -448 605 444 -48 131 84
2090 84 -156 707 268 -164 777 446 -247 834 389 -319 920 51 -14 592 -85 265 261 605 -350 -515 623
2111 623 365 -337 381 -467 -224 1078 -1033 -337 585 -188 -236 -330 269 -264 130 -290 -283 479 218 -537 -96
2132 -96 915 -397 -136 305 152 274 567 -835 -320 1175 -498 87 122 -96 638 -90 -355 -126 376
2151 376 -7 -184 205 762 -583 301 621 -508 982 96 -85 898 186 -450 170 729 243 64 -101
2170 -101 293 359 590 -681 -266 1004 293 -364 -267 177 -163 581 -478 -853 1004 -52 -335 273 85
$$ packed form
2032d82O22R2Np54m4J39R40M79k238R41J171r93o7k05j45R17k1q83m49K031r60
2053I6n78Q39q53N79P49j244K14M31k84K35j21L11j068M94J186j707P43%j138
2072a116J873j87j830J201M15k07K09p00J80N08N00j105j89J053j61m92J79m7
2090H4k40Q63m39m32R41l31o93J081m45p08J239q69o5O06o77L50mL44r55j65J138
2111F23k58p02P18q48K43J302k111O96R22p73m8r4N99n33L94m20PP62k61p55M41
2132i6J011j312K61M41j53J22K93j402N15J495j673N85L5k18P34p28k65K29N02
2151C76l83j77L89N57j345Q84L20j129J490q86j81R83p12o36O20N59m86j79j65
2170a01L94O6K31j271M15J270p11o57R7M44l40P44j059l75J857j056k83O08j88
$$ plain form
2189 85 -173 380 -167 -458 -229 40 83 -95 505 -553 -145 1003 -362 -288 186 182 285 513 -684 -361
2209 -361 950 574 -364 -101 405 469 515 -563 -708 517 564 -282 -454 238 -30 365 220 -724 -45 554
2229 554 -78 208 357 -485 387 563 70 36 -35 663 149 578 -10 -464 1138 418 -822 34 28 208 532
2250 532 -567 -573 600 725 -347 -612 302 -55 294 -105 -661 19 562 -120 -494 42 -81 234 593 -142
2270 -142 -412 570 179 81 548 -589 208 451 174 -358 -129 574 559 -315 -117 -645 252 856 -702 -406
2290 -406 327 -347 205 -329 -674 356 633 -394 -600 106 10 136 589 -191 -246 510 18 -119 -11 194
2310 194 20 710 557 -752 116 277 -84 412 -276 -358 823 494 -280 -192 391 818 64 245 -233 -264
2330 -264 1064 -120 -631 200 -105 237 -20 -632 -230 652 215 -68 -192 142 6 137 153 -595 -48 358
$$ packed form
2189H5k58N53n47k91K29K69M3j78O00j058M08J148j365P4M74mJ03K28j197L23
2209c61J311l76r38K63N06O4M6j078j45J225M7q46j72O92k68L95j45r44O79N99
2229E54o32K86J49q42Q72J76m93l4p1O98n14M29n88m54J602p20j240Q56oJ80L24
2250E32j099oJ173J25j072k65R14l57L49l99n56O80N43o82l74N36j23L15L59p35
2270a42k70R82l91r8M67j137P97K43k77n32K29P03j5q74J98n28Q97O04j558K96
2290d06P33o74N52n34l45J030K77j027k06P06r6J26M53p80n5P56m92j37J08K05
2310A94j74O90j53j309Q68J61l61M96o88q2J181l29p74Q8N83M27p54J81m78l1
2330b64J328j184n11Q31l05L42k57o12M02Q82m37k83j24L34j36J31J6p48N47M06
$$ plain form
2350 358 210 -254 101 -211 190 443 -578 -341 476 5 -158 20 -715 143 257 -377 -22 -310 483 -44
2370 -44 -291 198 -678 103 70 -571 215 375 -248 275 173 15 361 311 223 183 377 181 369 895 -469
2391 -469 -112 348 151 10 56 258 180 409 108 -250 438 604 -234 184 -72 -368 273 -145 -407 -240 571
2412 571 -264 -40 65 -360 132 277 -87 -69 511 -261 134 51 -192 80 87 125 -319 178 427 -13 390 66
2434 66 -342 297 110 -217 389 -134 -47 194 238 -295 -71 424 -257 179 286 -229 413 159 -2 238 220
2455 220 150 -10 284 448 186 386 154 -238 713 -104 -180 376 222 124 161 201 253 249 514 -247 -51 496 -166
2478 -166 -45 172 -436 139 -70 -131 -357 -143 419 -146 463 31 -171 278 -108 -249 380 140 -181 438
2498 438 109 -397 -59 512 36 14 374 -431 438 291 -399 78 489 89 43 -224 14 -156 321 -153 -300
$$ packed form
2350C58j48m64L55l12M01K53j021K37Q17m71j63J78p35Q58J14o34L55k88P93n27
2370d4k47M89q76P81l3o41P86J60o23N23j02j58L46n0q8m0J94j96J88N26j364
2391d69L57M60j97j41M6K02p8K29l01l58O88J66q38M18k56k96O41m18k62J67Q11
2412E71q35K24J05m25M92J45l64J8N80p72L95q3k43K72PL8m44M97K49m40M03l24
2434F6m08O39j87l27O06n23Q7K41M4n33K24M95o81M36J07n15O42k54j61K40j8
2455B20p0j60K94J64k62K00k32l92R51q17p6N56j54r8L7M0N2mK65p61J96N47o62
2478a66J21K17o08N75k09o1k26K14N62n65O09m32k02M49l86j41O29k40l21O19
2498D38l29n06L38N71m76k2L60q05Q69j47o90M77M11m00m6k67K38j70M77m74j47
$$ plain form
2519 -300 362 0 36 -15 -193 -147 333 380 -209 58 293 224 320 422 -295 54 497 -5 -63 -4 -52 661 10
2542 10 -64 110 302 227 -101 109 20 -413 582 302 -386 332 193 -16 -25 -107 -12 193 261 -541 -111 161 60
2565 60 245 147 -298 134 341 -101 -164 -30 317 32 140 -385 -276 723 75 -255 -246 -332 213 187 -385 -468 197
2588 197 125 -90 -502 192 -157 359 4 -907 79 162 -6 11 135 -240 170 663 -204 -72 144 380 389 165
2610 165 -609 46 687 213 -273 -238 316 71 386 97 -469 468 571 -174 -198 186 221 586 -9 -533 -37
2631 -37 333 141 -235 44 -98 39 404 -623 -320 -51 10 -115 -233 -565 -387 176 49 -252 -261 30 -249
2652 -249 293 -365 -533 75 366 -395 -435 141 215 -11 182 -647 97 445 134 -201 324 -140 275 333 -364
2673 -364 141 67 85 -156 176 -134 -103 482 14 -163 -2 184 -21 206 -172 -114 153 448 -15 -220 256
$$ packed form
2519c00O62l62L6n1j78M6M80M7n89K67K35o9R6J02p17L49M43n02n8N9m8P13o51
2542A0p4J74J92p5l28K10q9m33R95k80o88P18j39k09rq2R5K05O8q02M30K72j01
2565F0J85r8m45M32K07m42o3J34L47k85J08n25J09R99o48l30Rq6N45k6n72q3O65
2588A97p2k15m12O94l49N16l55r11R86Q3j68J7J24l75M10M93q67J32K16K36Rk24
2610A65p74O55O41m74m86L5N54k45L15k89n66R37J03p45k4L84L5L65n95n24M96
2631c7L70j92l76K79j42J37L65j027L03K69O1j25j18l32J78N63j27l01rK91k79
2652b49N42o58j68O08K91p61m0N76P4k26J93q29P44L48l11l35N25m64M15N8o97
2673c64N05p4J8k41L32l10L1N85m68j77J61J86k05K27l78N8K67K95m63k05M76
$$ plain form
2694 256 -24 -40 125 -340 -279 200 -125 -203 103 -142 20 2 -148 -258 136 109 -361 -55 212 -210 201 94
2716 94 48 -98 307 -361 49 65 -466 -199 370 -171 -90 -131 -335 18 136 -163 -257 69 83 -455 13 231
2738 231 -362 94 -216 -91 80 76 -290 142 196 -66 -25 274 -340 58 230 -398 148 439 -31 -151 340
2759 340 100 16 19 125 -52 287 -89 -140 328 -231 -219 87 -112 -65 -108 -229 -80 110 203 -130 -42 37 -394
$$ packed form
2694B56k80j6J65m65O1M79l25p8L06k45J62j8j50j10L94k7m70L06K67m22M11j07
2716I4m6j46M05o68M10J6n31K67N69n41Q1m1k04L53J18k99r4L26J4n38M68K18
2738B31n93M56l10J25J71ml66M32N4k62M1K99o14L98J72o28N46K91m70j20M91
2759C40k40q4LJ06j77L39l76n1M68n59J2L06j99M7m3j21J49J90R3l33Q8P9m31
$$ [...]
8191b17
##END NTUPLES=NMR FID
##END=
