##TITLE=1H_SA_slBFeOH2
 CDCl3, 8 sc, 
 23.11.2020
##JCAMPDX= 6.0         $$ Bruker NMR JCAMP-DX V2.0
##DATA TYPE= NMR FID
##DATA CLASS= NTUPLES
##ORIGIN= UXNMR, Bruker Analytische Messtechnik GmbH
##OWNER= root
$$ XWIN-NMR		Version 3.5
$$ Mon Nov 23 13:38:30 2020 Russian Standard Time (UT+4h)  she@DPX200
##.OBSERVE FREQUENCY= 200.1315066352
##.OBSERVE NUCLEUS= ^1H
##.DELAY= (6, 6)
##.ACQUISITION MODE= SIMULTANEOUS
##.ACQUISITION SCHEME= undefined
##.AVERAGES= 8
##.DIGITISER RES= 18
##SPECTROMETER/DATA SYSTEM= spect
##.PULSE SEQUENCE= zg30
##.SOLVENT NAME= CDCl3
##.SHIFT REFERENCE= (INTERNAL, CDCl3, 0, 15.7039)
##AUDIT TRAIL= $$ (NUMBER, WHEN, WHO, WHERE, WHAT)
$$ ##TITLE= Audit trail, XWIN-NMR		Version 3.5
$$ ##JCAMPDX= 5.01
$$ ##ORIGIN= Bruker BioSpin GmbH
$$ ##OWNER= she
$$ F:/spectra/data/she/nmr/H-F/1/audita.txt
$$ ##AUDIT TRAIL=  $$ (NUMBER, WHEN, WHO, WHERE, WHAT)
(   1,<2020-11-23 13:36:55.35 +0400>,<she>,<DPX200>,
      <created by zg, POWCHK disabled, PULCHK disabled
       configuration hash MD5:
       00 E9 B6 7A A2 85 ED C7 34 08 36 98 17 FE 4E 26
       data hash MD5: 16K
       DD 7B 7D 72 A6 B1 9D A7 CE A9 F9 23 16 0F AB 9F>)
$$ ##END=
$$ 
$$ hash MD5
$$ EB D9 85 C9 73 44 5B 04 6D 3B 97 C4 65 09 FD 1A
##$RELAX= 
##$RELAX= 
##$RELAX= 
##$RELAX= 
##$RELAX= 
##$RELAX= 
$$ Bruker specific parameters
$$ --------------------------
##$DU= <F:/spectra>
##$EXPNO= 1
##$NAME= <H-F>
##$PROCNO= 1
##$TYPE= <nmr>
##$USER= <she>
##$AMP= (0..31)
100 100 100 100 100 100 100 100 100 100 100 100 100 100 100 100 100 100 
100 100 100 100 100 100 100 100 100 100 100 100 100 100 
##$AQSEQ= 0
##$AQ_mod= 1
##$AUNM= <au_zg>
##$AUTOPOS= <>
##$BF1= 200.13
##$BF2= 200.13
##$BF3= 200.13
##$BF4= 200.13
##$BF5= 200.13
##$BF6= 200.13
##$BF7= 200.13
##$BF8= 200.13
##$BYTORDA= 1
##$CFDGTYP= 0
##$CFRGTYP= 5
##$CHEMSTR= <none>
##$CNST= (0..31)
1 1 145 1 1 1 1 1 1 1 1 1 1 1 1 1 1 1 1 1 1 1 1 1 1 1 1 1 1 1 1 1 
##$CPDPRG= <>
##$CPDPRG1= <>
##$CPDPRG2= <>
##$CPDPRG3= <>
##$CPDPRG4= <mlev>
##$CPDPRG5= <mlev>
##$CPDPRG6= <mlev>
##$CPDPRG7= <mlev>
##$CPDPRG8= <mlev>
##$CPDPRGB= <>
##$CPDPRGT= <>
##$D= (0..31)
0 1.2 0 0 0 0 0 0 0 0.06 0 0.03 0 0 0 0 0.0002 0 0 0 0 0 0 0 0 0 0 0 0 
0 0 0 
##$DATE= 1606124214
##$DBL= (0..7)
120 120 120 120 120 120 120 120 
##$DBP= (0..7)
150 150 150 150 150 150 150 150 
##$DBP07= 0
##$DBPNAM0= <>
##$DBPNAM1= <>
##$DBPNAM2= <>
##$DBPNAM3= <>
##$DBPNAM4= <>
##$DBPNAM5= <>
##$DBPNAM6= <>
##$DBPNAM7= <>
##$DBPOAL= (0..7)
0.5 0.5 0.5 0.5 0.5 0.5 0.5 0.5 
##$DBPOFFS= (0..7)
0 0 0 0 0 0 0 0 
##$DE= 6
##$DECBNUC= <off>
##$DECIM= 32
##$DECNUC= <off>
##$DECSTAT= 4
##$DIGMOD= 1
##$DIGTYP= 9
##$DL= (0..7)
0 120 120 120 120 120 120 120 
##$DP= (0..7)
150 150 150 150 150 150 150 150 
##$DP07= 0
##$DPNAME0= <>
##$DPNAME1= <>
##$DPNAME2= <>
##$DPNAME3= <>
##$DPNAME4= <>
##$DPNAME5= <>
##$DPNAME6= <>
##$DPNAME7= <>
##$DPOAL= (0..7)
0.5 0.5 0.5 0.5 0.5 0.5 0.5 0.5 
##$DPOFFS= (0..7)
0 0 0 0 0 0 0 0 
##$DQDMODE= 0
##$DR= 18
##$DS= 0
##$DSLIST= <SSSSSSSSSSSSSSS>
$$ [...]
##$SUBNAM2= <"">
##$SUBNAM3= <"">
##$SUBNAM4= <"">
##$SUBNAM5= <"">
##$SUBNAM6= <"">
##$SUBNAM7= <"">
##$SUBNAM8= <"">
##$SUBNAM9= <"">
##$SW= 16.9725356469052
##$SWIBOX= (0..15)
0 0 2 0 0 0 0 0 0 0 0 0 0 0 0 0 
##$SW_h= 3396.73913043478
##$TD= 16384
##$TD0= 1
##$TE= 0
##$TE2= 300
##$TE3= 300
##$TEG= 300
##$TL= (0..7)
0 120 120 120 120 120 120 120 
##$TP= (0..7)
150 150 150 150 150 150 150 150 
##$TP07= 0
##$TPNAME0= <>
##$TPNAME1= <>
##$TPNAME2= <>
##$TPNAME3= <>
##$TPNAME4= <>
##$TPNAME5= <>
##$TPNAME6= <>
##$TPNAME7= <>
##$TPOAL= (0..7)
0.5 0.5 0.5 0.5 0.5 0.5 0.5 0.5 
##$TPOFFS= (0..7)
0 0 0 0 0 0 0 0 
##$TUNHIN= 0
##$TUNHOUT= 0
##$TUNXOUT= 0
##$USERA1= <user>
##$USERA2= <user>
##$USERA3= <user>
##$USERA4= <user>
##$USERA5= <user>
##$V9= 5
##$VALIST= <valist>
##$VCLIST= <CCCCCCCCCCCCCCC>
##$VD= 0
##$VDLIST= <DDDDDDDDDDDDDDD>
##$VPLIST= <PPPPPPPPPPPPPPP>
##$VTLIST= <TTTTTTTTTTTTTTT>
##$WBST= 1024
##$WBSW= 4
##$XGAIN= (0..3)
0 0 0 0 
##$XL= 0
##$YL= 0
##$YMAX_a= 170465
##$YMIN_a= -98637
##$ZGOPTNS= <>
##$ZL1= 120
##$ZL2= 120
##$ZL3= 120
##$ZL4= 120
##$ABSF1= 10
##$ABSF2= 0
##$ABSG= 5
##$ABSL= 3
##$ALPHA= 0
##$AQORDER= 0
##$ASSFAC= 0
##$ASSFACI= 0
##$ASSFACX= 0
##$ASSWID= 0
##$AUNMP= <proc_1d>
##$AZFE= 0.1
##$AZFW= 0.1
##$BCFW= 1
##$BC_mod= 2
##$BYTORDP= 1
##$COROFFS= 0
##$CY= 11.3945322036743
##$DATMOD= 1
##$DC= 2
##$DFILT= <>
##$DTYPP= 0
##$F1P= 15.9154993809931
##$F2P= -4.1035820241983
##$FCOR= 0.5
##$FTSIZE= 0
##$FT_mod= 4
##$GAMMA= 1
##$GB= 0.15
##$INTBC= 1
##$INTSCL= 1
##$ISEN= 128
##$LB= 0.24
##$LEV0= 0
##$LPBIN= 0
##$MAXI= 10000
##$MC2= 0
##$MEAN= 0
##$ME_mod= 0
##$MI= 1.114404
##$NCOEF= 0
##$NC_proc= 0
##$NLEV= 6
##$NOISF1= 3.799351
##$NOISF2= 2.8
##$NSP= 1
##$NTH_PI= 0
##$NZP= 0
##$OFFSET= 15.70392
##$PC= 1
##$PHC0= -11047.81
##$PHC1= 10.60089
##$PH_mod= 1
##$PKNL= yes
##$PPARMOD= 0
##$PSCAL= 0
##$PSIGN= 0
##$REVERSE= no
##$SF= 200.130013532006
##$SI= 16384
##$SIGF1= 3
##$SIGF2= 2
##$SINO= 400
##$SIOLD= 16384
##$SREGLST= <1H.CDCl3>
##$SSB= 0
##$STSI= 0
##$STSR= 0
##$SW_p= 3612.71676300578
##$SYMM= 0
##$S_DEV= 0
##$TDeff= 0
##$TDoff= 0
##$TI= <>
##$TILT= no
##$TM1= 0
##$TM2= 0
##$TOPLEV= 0
##$USERP1= <user>
##$USERP2= <user>
##$USERP3= <user>
##$USERP4= <user>
##$USERP5= <user>
##$WDW= 1
##$XDIM= 8192
##$YMAX_p= 0
##$YMIN_p= 0
$$ End of Bruker specific parameters
$$ ---------------------------------
##NTUPLES= NMR FID
##VAR_NAME=  TIME,          FID/REAL,        FID/IMAG
##SYMBOL=    X,             R,               I
##VAR_TYPE=  INDEPENDENT,   DEPENDENT,       DEPENDENT
##VAR_FORM=  AFFN,          ASDF,            ASDF
##VAR_DIM=   8192,          8192,            8192
##UNITS=     SECONDS,       ARBITRARY UNITS, ARBITRARY UNITS
##FACTOR=    0.0002944,     1,               1
##FIRST=     0,             0,               0
##LAST=      2.4114304,     0,               0
##MIN=       0,             -98637,          0
##MAX=       2.4114304,     170465,          0
$$ Real data points
##PAGE= N=1
##DATA TABLE= (X++(R..R)), XYDATA
$$ [...]
2065H73p78Jm02M84O38r15J98l50P17n43q1L73k07m4o67P11M84M07j427J61J024
2086F57L37Qj675J26J244Q02j029j718N09J366P08j875o60O27K222l19k315l66
2104a351J435J747j036j912n71K141J334j975k002K12K950m5j435j894J067K382
2120A047M5k329j197K128J935p14k989j03K333J134q94k674O73J977Q51j889j449
2137b115J118J848K17j765k06P03J117J16j831m45J267Q52j282k84j23J068K61
2154E16o80m76R5J116n09J75j9P4K60m77K2K84M9r13M37J53N79l60r27O96O55
2175G50L55p12m25M32J348l53j741k5P85J517j140j515j45J853P85j514j417O01
2193e61K620q8j445j610J226K330o78j860j255J874J321n17k454k67K187O68r35
$$ y = [873, 95, 96, -306, 178, 816, -99, 99, -251, 466, -77, -158, 215, 8, -36, -703, 8, 492, 899, -528, -367, 657, 994, 1002, -673, -547, 697, 1499, 470, -1248, -739, 627, 1335, -540, -1200, -573, 1649, 1330, -985, -1351, 84, 1831, 795, -1117, -1688, 453, 1787, -188, -2190, -1978, 972, 927, -508, -2402, -1335, 1047, 1092, -1237, -2434, -306, 1629, 915, -2074, -2177, 156, 1290, 396, -2278, -1605, 372, 1223, -666, -2115, -997, 851, 1068, -697, -903, -200, 917, 1033, -798, -1243, 24, 876, -406, -690, -813, 255, 516, -164, -640, -545, 571, 62, 237, 218, 292, 552, 75, 97, 381, 430, -483, -46, 107, 686, 326, -601, 95, 750, 1105, 393, -32, 400, 1748, 1395, -346, -371, 414, 1931, 791, -724, -869, 984, 1769, 255, -1162, -561, 2059, 1971, 526, -1084, 142, 2472, 1794, -66, -1321, 553, 1874, 1357, -1097, -1364, 823, 1491, 556]
2210E56k159Q00K001P82j808j753J636J665o2k465m34R61J599n74k366J60J391
2227g0J121j119j226L5J621P61j337r33N7J652j36j205m12O07R96o64p30k58J130
2246a10K6j27k50q7P86k79J38j43M27m41O6j38K82P30j236R4L81P57j50j054M11
2267H3O99J067j534o9q3J570p8j654l61L40J981p65j549m88J295J448j011j537
2285f46l74K310O81j303j793K14K372k94j365j269J068J899m95j780j063K151
2301C13R22n10k286K67J950Q90j158k221J176J310O57j820r17P38J394K70j855
2318h80l28N41J870q41r60r6J039R89j014k71l91J188k29n06k92P3J118n84l80
2337D6r3M60R3p7j91O3N93q80K58%K64l32n75J30K94O47j162p9K09R22j28j514
$$ y = [556, -1603, -803, 1198, 1980, 172, -1581, 55, 1720, 1658, -807, -1241, -280, 1319, 745, -1621, -1461, -70, 1051, -68, -1294, -1259, 362, 1123, -214, -1147, -1090, 562, 426, -779, -1191, -584, 412, -252, -982, -1240, -110, -84, -211, -461, -548, 238, -41, 97, -46, 381, -60, 6, -132, 150, 880, -356, -262, 119, 876, 726, -328, 83, 782, 1849, 315, 246, 163, 1733, 1655, 1, -360, -20, 1961, 1196, -353, -841, 454, 1902, 891, -646, -1020, 1290, 1971, 668, -1125, -911, 1461, 1167, -198, -1467, -399, 1500, 1005, -775, -1838, 313, 1235, 725, -1561, -1294, 656, 1546, 388, -1833, -657, 653, 1310, -510, -1427, -689, 705, 975, -880, -1208, -667, 1203, 362, -598, -694, 345, 1334, 320, 49, -342, 846, 617, 111, -181, -108, 1010, 426, 46, -47, 413, 506, 429, 238, 301, 894, 14, 272, 272, 536, 204, -371, -241, 53, 700, -462, -541, -332, 590, 462, -1052]
2359a052K20P81Q48p29r42k32J800O05j758j130N20K039m07j199q03R64J634m37
2377G22j732o21J958Q38m94j983K58J797N45j327j453N02J736O77j937j095J166
2394d43J613J0j796n14J157J282j061j494M48J257M34p20j010qJ828k44j046n91
2412h98O69J193n00p14j87M23Q13p95m42L38O17k11K4n06J72O2j68m8K01L42l22
2433F3k21K0M28N0o44L12m30J261p35o25J7P91O94j190n91L94J208l25j050m50
2453a023N97J425m00j269m30J246Q04n73j406j35J911K14q67j597Q41J557K06
2470A101j596j286J597J491l17j870k19J132J319m72j973M86J015J039j167j589
2486a309P11J635J58j658l32L65J609k52j321l76P08J405r79q76j53J309L36o94
$$ y = [-1052, -832, -51, 797, 68, -874, -1106, 694, 1299, -459, -1589, -1069, 970, 563, -636, -1439, -475, 1159, 722, -1010, -1631, 327, 1165, 671, -1312, -1054, 743, 1288, -39, -1492, -990, 746, 1423, -514, -1609, -443, 1170, 1180, -616, -1130, 27, 1309, 248, -1246, -798, 459, 893, 173, -837, -845, 983, 739, -307, -898, -229, 964, 464, -250, -437, -14, 799, 4, -438, -100, 517, 306, 330, -176, -4, 58, -110, -158, 43, 385, 63, -158, -138, 290, 340, -304, 8, -422, 839, 104, -521, -504, 287, 981, -209, -800, -406, 802, 477, -573, -1023, -426, 999, 599, -670, -1100, 146, 950, 377, -1029, -1164, 747, 961, 94, -1503, -662, 895, 1101, -495, -1781, -184, 1307, 990, -880, -1099, 33, 1352, 880, -1093, -607, 408, 1447, 280, -1309, -598, 1037, 1195, -463, -795, -430, 1179, 927, -394, -770, -62, 1343, 364, -512, -665, 644, 980, 286]
2504B86r34j13J401k22o10o11L08O95k03j59m48O94o90L62j89L9L37l43j34K7
2524e07K52l12j96m6R54j45r95J52L22J120n92n35j69O86Q74r94n07n1J570l3
2544H48j005p84N30J689m08j107m54J251Q59l19j267o06J734L74l40j653R8J617
2562A057K57r26j635J248J227L76j761p89J069J191j69j922J36R96P90r18j188
2579i61Q9J198L55p96p68o2J324L04r26o33L58J240m77o77m52R79L69n51n65j97
2599h49J033k26j36j97J84L28o05N44k83L63n5n2k2R9L51n70j04M3O98k76m31
2620a63Q5N12ln55m7q9J210k04r03l10O27R93p39q91k37J119O90q21j379N36J077
2641E08K28o99j057Q90Q33K04j398q18J197J218m45j526Q4R45P53o02j399L73
$$ y = [286, -648, -761, 640, 418, -192, -803, -495, 200, -3, -162, -610, 84, -606, -244, -433, -394, -57, -400, -534, -507, -255, -567, -763, -809, 145, 0, -995, -843, -521, 599, 7, -528, -697, -11, 863, -131, -638, -689, 881, 848, -157, -941, -411, 1278, 870, -237, -691, 560, 1419, 1100, -167, -773, 961, 1335, 995, -658, -560, 1057, 1314, 388, -1247, 1, 1228, 1604, -157, -946, 123, 1314, 1145, -777, -641, 355, 1145, 227, -961, -872, 326, 681, -115, -883, -945, 379, 683, -243, -876, -518, 722, 245, -432, -884, 95, 464, -87, -652, -849, 184, -42, -178, -375, -191, 137, -468, 76, -207, 156, 101, 49, 27, 126, 477, -93, -197, -154, 544, 268, -163, -78, 434, 431, -124, -171, -260, 950, 746, -157, -467, 160, 1153, 414, -477, -714, 405, 1095, 274, -1105, -569, 508, 736, 37, -1020, -130, 703, 907, -491, -1309, -112, 1106, 661, -865, -781, 164, 917, 315, -1084, -711]
2659g11J033P48j249o44J14J564J02j684o1L08J215m14r43k18N96Q77m45p84n21
2678a117J305K96m08q84N35N94j82k19o33Q54K09m2m82j00L35J42n8n27L14L44
2698B76j80Rp7N65n81J29l86O27j03l54n02L69R71n01l24k95P48K63n04n48K38
2719a60R88m9o40n91M50Q49l88o82n97J089N14k75j281o1J031N70o47j274O60
2738d94J162Jr25q34N64J090L03j681o7N57R92j26j364N1Q87Q36p38j100J66J179
2758D59L89r31o20J36J494n74q39p7K29P93m59k01n07O87R8n8k79n9K87M1J55
2779A64n92J56Q0P3j22J10K6k41J41p1K65k3l85J56K34K97m33J54j07M36j0n39
2801b31mn1O83R8n85m18M97Q02o36m86l18J168J62l66j401O74J089n7p50q31O43
$$ y = [-711, 322, 1070, -179, -823, -709, 855, 957, -727, -788, -480, 735, 321, -622, -840, -244, 633, 188, -596, -1117, 188, 484, 76, -808, -273, 321, 139, -80, -713, 141, 350, 308, -174, -274, 61, 203, 145, -382, -68, 276, 96, 105, 28, 593, 12, 141, -245, 382, 279, -75, -577, -208, 763, 262, -62, -357, 391, 654, 150, -398, -160, 828, 779, 139, -452, -2, 847, 459, -223, -820, 269, 783, 508, -773, -834, 197, 767, 120, -1154, -494, 668, 669, -256, -1090, -526, 564, 867, -814, -881, -324, 668, 542, -822, -771, 116, 952, 214, -886, -720, 459, 848, -83, -703, -567, 927, 353, -486, -563, -334, 459, 0, -201, -708, -21, 77, 19, -260, -319, -32, 9, 164, -428, -272, -192, -119, -241, -131, -105, -346, -205, -276, -11, -34, -419, -263, -29, 268, -165, -11, -118, 318, 308, -231, -235, -286, 397, 495, -90, -508, -11, 791, 155, -331, -649, 519, 681, 315, -1086, -412, 677, 620, -130, -961, -318]
2822c18O80K94j138k39M38J332n51j288J29R30N20q11j191P72N21O49j132l26
2840g29K71J134j7j165m07O58J269n42n94m28R25K82l98p08J16Q64K20n77o73
2859d99O08L00j3m04k87M30M93k45l77RQ0M4%o08K85M35j50j20k27L37k23l8J5
2882a55L04j61m23L6J25L78l67k54j30R10p7m20n33M34R07k25n53o56N38P45l35
2903H8o40Q0O81M71l92j119L43Q01N88q70j088Q54P11M62j381j78M38Q63j44j210
2923f42J8N50J198q91p82k77J001O92p10o40j83J094mo23k68P6J122n86k83n77
2943g15O35M98k72m29k80J006k29J1n50J84L05R0k01m02M51J2L33o32K32LJ15
2964A65r4m34L30J41n2Rk23P69n21j4k18N84k47l96k38J51Q09j73o53k00O21M43
$$ y = [-318, 362, 656, -482, -721, -283, 1049, 498, -790, -661, 269, 789, -22, -1213, -441, 80, 729, -403, -729, -458, 676, 659, -506, -913, -255, 1014, 472, -122, -550, 375, 657, 259, -449, -333, 531, 751, 174, -499, 109, 409, 396, -8, -295, 135, 628, 383, 6, 15, 95, 139, 139, -469, -184, 251, 101, -19, -246, 91, -132, -170, -155, 149, -12, -435, -399, -274, 104, -263, -517, -647, 263, 186, -234, -767, -333, 574, 349, -204, -860, -322, 423, 88, -552, -472, 209, 680, 288, -831, -488, 313, 901, 31, -1057, -203, 508, 970, -411, -589, -151, 712, 568, -642, -624, -74, 1124, 233, -549, -826, 175, 867, 157, -483, -666, 428, 424, -199, -467, -391, 731, 145, -138, -715, -80, 418, 146, -283, -563, 443, 214, 225, -325, -141, 164, 254, 53, -349, 102, 114, 447, -185, 47, 50, 165, 71, -363, -33, 108, 56, 65, -158, 611, 90, 76, -142, 442, 195, -201, -439, -288, 521, 348, -305, -505, 116, 559]
2986E59j94q57K6N54N18m16j019O52N05L07o55r94J072N62n2j129j51P15Q35n86
3006B52j145O77O08L92q65l49L11O69J24q92m40N70J207m04p54l37O72P61q42
3025B15n92j23R05L22n51k27m89J110k13n05l46M60K87J89p13k22M56P6J11o57
3045e07J35K10J35j16m98L84K62m69l1Q6M9R2j88L90J35j90R4l72L88K33n36j26
3067d40p0O02k15L07k56K48J01K48n55l63M34M48J15q11k06R63J37k80o25N2Q31
3088F65L43o14p92O95M40L34j125m16N92Q76m74q36j84O80N87o92l02j86Q85K09
3108F85n26r16J61J113j74o51PJ76N31k93l77m49N73M13l05o51q8Q26K52n82l42
3129f17M33K38O5k19j23K05K81k36j36j40J33J94j04j87L30k75J71J4J85j92p2
$$ y = [559, 365, -492, -466, 88, 606, 190, -829, -177, 328, 635, -20, -1014, 58, 620, 568, -561, -712, 3, 838, 252, -893, -216, 392, 784, -81, -430, -119, 550, 674, -218, -658, -88, 1119, 715, -39, -376, 296, 1057, 215, -377, -500, 405, 727, 176, -51, -540, 570, 357, -148, -494, -34, 253, 442, -271, -493, -37, 39, 150, -507, -372, -162, -27, -143, -641, -257, 5, -464, -495, -409, -360, -268, -456, -66, 69, -121, -27, -399, -11, 222, -314, -440, -510, 92, -123, 184, -72, 176, 277, 525, -30, -393, 41, 489, 604, -207, -413, 550, 687, 407, -218, -166, 665, 1008, 394, -398, 297, 737, 1071, -54, -470, 122, 998, 524, -312, -496, 184, 771, 79, -223, -409, 476, 685, 159, -757, -596, 517, 343, -308, -301, -125, 406, 113, -264, -713, -140, 273, -32, -683, -771, 55, 307, -275, -617, -184, 54, 119, -100, -223, -18, 263, 27, -109, -249, -116, 78, -26, -213, 117, -158, 13, 27, 212, 20, -52]
3150e2J23j27L01m69J10m09N95J58o2k02m19N66K11m03k63J43M75K26n10m44N75
3171A23L81O9p53m57R61J89j41r55J12L17N34l82m76R2O10L50r13l16L59Q42k67
3192B79n03m85M41J211o52q97j06O84P09n60m51j62P81J67m74o29L08O49r7m14
3212b01J13l3M93J16r66Q7K06N35n9n92K95K26k2j22Rl2k8J22q0J3L6n4r9l9M39
3237C63j51j79mL53j30J0k58l8L77j06k86l16L97M52n2n78m69O20M89k45p56J59
3259c48J96N35m16o29K49O23J64r31k44N39P36l8j023j31O48O94o58l86j10M92
3279c8O55n35n97P0O45L29p44l09J83Q12Qn90l97N50L18rl57n39O53M09j42o42
3301b67Q3M41J17p2p12L55K93K63p33J03P6J27K26m70J58J14K43l53R8l8l09L05
$$ y = [-52, 71, -56, 245, -224, -114, -523, 72, 230, 168, -34, -453, 113, 324, -79, -342, -199, 276, 502, -8, -452, 123, 504, 573, -180, -637, 324, 513, 372, -583, -471, -154, 380, -2, -478, -386, 224, 574, -339, -655, -296, 546, 279, -224, -709, -268, 943, 291, -606, -712, -28, 681, 121, -330, -492, 289, 456, -18, -647, -339, 310, 213, -201, -88, -121, 372, 488, -478, -391, -185, 350, 291, -301, -6, 220, 198, 76, 85, 53, 25, 147, 67, 80, 116, 62, -37, -76, 363, 212, 33, 29, 382, 252, 262, 4, -34, 343, 237, -49, -365, 32, 484, 432, -146, -615, 5, 494, 249, -507, -348, -152, 383, -33, -662, -413, 210, 374, -557, -801, -262, 474, 436, -587, -718, -70, 624, -34, -420, -530, -38, 617, 82, -515, -445, 200, 529, -215, -524, -341, 471, 479, -111, -508, 42, 360, 351, -6, -545, 108, 517, 375, -267, -184, 257, 374, 302, -410, -55, 238, 501, -232, -129, -53, 74, 300, -170, -12, 102, 345, -8, 90, 52, -257, 48]
3323D8O0j68R2J11k88q5L64j07O3n84O74R5P5n43j69O32Kj07r54O54K58L15n79
3346a41j82L31K49J50o02k28M29O81n30o38J31L74P16j021k73J09O69L67p37j93
3366c39Q8N44K16p39j29K38O15j63l71m18N95M36l59o27J44Q36J16l83p97O42
3386A45L13p4k70l22M60N20n38m74K06L94o6j25m80J92n8M46k69l38N27j62K49
3407B76k14k29K28l35K52k83L1Q2R5k91K82J3k14%K12L47l11L8m22L44K56k6n85
3430d54R6O51k12J63m15m0K70M22m91l24J88P79K01r17k11L58O75o26l61O5M96
3451C13P88r74l74K73L63P73q49r96J269l39M02o96m22J44Q20o2p07n39Q24M65
3471D76n96k48l58R50n0j38o12K67N79k18j76m25O79k04K20j20p75O39K20N8k62
$$ y = [48, 108, -60, 32, 143, -145, -230, 134, 27, 90, -494, 180, 275, 350, -193, -362, 270, 272, 165, -789, -135, 123, 438, -141, -323, 8, 257, 407, -195, -423, 6, 687, 157, -481, -350, 24, 740, -281, -554, -445, 224, 591, -146, -339, -251, 293, 509, -230, -359, -121, 494, 331, -40, -458, 137, 573, 214, -413, -269, 567, 683, 300, -497, 145, 458, 384, 114, -208, 252, 772, 234, -240, -34, 360, 294, 169, -311, -119, -177, 269, 0, -338, 189, 27, 276, 62, -167, 61, -274, -22, -305, -274, -192, -97, -388, -106, -93, -307, -307, -95, 252, -59, -21, -443, -99, 157, 131, -454, -358, 293, 81, 244, -171, -211, 59, 481, -10, -334, -146, 633, 834, -83, -294, 64, 739, 113, -248, -183, 313, 1101, 127, -247, 26, 389, 1162, 313, -683, 586, 247, 649, -47, -469, -325, 495, 433, -274, -813, 11, 476, -120, -368, -726, 224, 174, 36, -576, -309, 270, 52, -124, -549, 130, -74, 146, 26, -749, -110, 110, 168, -94]
3492i4j35L89q6k04N2K44j16NP4r8l8J05k18K55n6J28l71j9K72Ko5j05k72M68
3516A17N2l50j35L01K82K24q30lK29K60P4p74J09L86L21k51o34n7P61L79k56l85
3538a80k07O67K01k76n92K97P11l36n69Q8L91R5k85j76m7N89j1m58j74J48M51
3559C27j2j51n58L21K82J65o40k17K91M93k86l43J57O9L6p6k34Q7K69K83n90J8
3581c09q8L31J08j80j15J65j55j03O1J58N6j31J47j30l1M5j56L08Q2k1P4l69M40
3604A87j91J13k23J26Q0L18k55l74J22J59M90o95k77M54L24K79r56p6L88N98l11
3625B80p03J73L56L65j65m68j33L42L38l70m23m0Q55k52q2m93L85M60l29n09l8
3646d51M84K30nn90K20N18j3k54o28M43M08k48j07l26M52J29j53k21p5J28KJ37
$$ y = [-94, -229, 160, 74, -130, -78, 166, 50, 55, 129, 31, -7, 98, -120, 135, 79, 207, -164, -183, 89, 91, 26, -79, -351, 117, 169, -181, -316, -15, 267, 491, -339, -342, -113, 147, 221, -553, -444, -58, 263, 12, -622, -679, 82, 461, 205, -180, -387, 280, 481, 205, -387, -90, 621, 285, -284, -196, 195, 290, 5, -171, -218, 371, 360, -98, -272, -124, 327, 315, 164, -394, -73, 209, 374, -266, -483, -192, 301, 15, -328, -171, -102, -66, -142, -376, -289, -20, 263, -327, -309, -397, -66, 42, -138, -253, -88, -243, -346, -285, -127, -71, -202, -55, -185, -216, -171, -327, -19, 63, 42, 116, -253, 187, -4, 109, -114, 12, 92, 410, 155, -219, -97, 62, 552, -143, -420, 34, 358, 637, -319, -395, -7, 591, 280, -423, -250, 106, 471, 306, -162, -295, 47, 385, 15, -408, -448, 407, 155, 73, -420, -35, 425, 96, -413, -451, 33, 263, 258, -332, -112, 406, 393, 139, -489, -46, 362, 114, 7, -319, 133, 262, 109, -112, -187, -59, -57, 80]
3668H0k96J26j57P24n15l37M05J31l70L62j62K8j16J59j3k87K92q0j92K48j08
3689g8J55k10L80m51K04J35n45K33L70K24o07j08K40J85J15n09J14q9N40k18o89
3710f09O94L7M97o36k48j00N83J17p11Q2Q8M28k07m85ON11K54k4p70J5R11K3k25
3733B31m51n9L55K13m00l27M57K42j01l03p1K39K68q2l04J23q5M11m56K10l50
3754b40K94P0k02L91m35M74m52J91r1k0L83k61K22l08J21J96l18K43j77M2l24
3775b01M78j66L8j82J51q5L46n5p27N80q2J50l64k14K20k6M28o51j25K28M51Q7
3797B79p53P6K73M55j97j78l44M73K22m13j68j08M36P3l00k98J79O69q6n02k09
3818d21L55L61j20l95k38P81l89J45m38P7L66J63l88k47J48M16M17p98K02J37
$$ y = [80, -216, -90, -247, 477, -38, -375, 30, 161, -209, 153, -9, 19, -97, 62, 49, -238, 54, -26, -218, 30, -78, 77, -133, 247, -204, 0, 135, -410, -177, 193, 417, -190, -298, -58, 127, 242, -267, -153, -242, 298, 80, -609, 85, 122, 619, -17, -265, -365, 218, 335, -376, -294, -206, 222, 15, -470, -464, 47, 301, 277, -493, -478, 433, 456, 231, -220, -279, 76, 289, -111, -438, 19, 261, 160, -143, -214, 25, 293, 211, -93, 30, -55, 356, -100, 110, -240, 54, 124, -78, 313, -122, 352, -100, 91, 0, -20, 363, 102, 324, 16, 137, 333, 15, 258, 81, 123, -201, 277, 111, 149, -33, 118, 33, 379, 324, -403, 177, 95, 245, -119, -333, -113, -139, 289, -362, -487, -259, 192, 279, -474, -398, -125, 330, 133, -45, -389, 84, 306, -107, -275, -383, 53, 126, -174, -472, -293, 376, 290, -212, -421, -66, 295, 175, -220, -458, 323, -66, 79, -359, -282, 84, 247, -141, -388, -240, 176, 593, -205, -3, 134]
3838A34K81k91k12m2J58M5m62L98j53L15j35k11O6j58N91k37J21m06L28j81K37
3859A86o2k46m7K06q8O5j14L09m01m3o3L96j87q2n6J88K52m21J70k27L46J02o97
3882e14L99J74L41k67n78J68L77M4l29k04K68M93N9o33o6N49J42l22k45p0K89
3903G5O35l65m37l9M85m4r0j44R6q3J38k52j57L6K26J53k83l3J20P8k04j95J15
3926a69K63J64k84k91K65L95k64M4l41J11L6l5l17o5J70J73K32l51o3L22k79K16
3948f8M0j10J71l03J76p5N05p08j3K33J61O0l68j04M21J47k83n1L1K65K11m93
3970a55k83M92K47l2k97l77M07P5J01j50k17K43L34k70l59K89J43J83k97m81M08
3991DL29q2l26k74N06l5j08j93o2M94n8j3l20l0L23J00l32k46J06K70lr5J9K4
$$ y = [134, 415, 124, -88, -130, 28, 73, -389, 9, -144, 171, 36, -175, -109, -267, 324, 87, 208, -198, 130, -51, 186, 124, -122, -169, 37, -51, 14, -100, 209, -192, -235, -298, 98, -89, -171, -227, -39, 213, -208, -38, -265, 81, 183, -514, -115, 59, 400, 133, -445, -277, 100, 144, -185, -389, -121, 372, 431, -202, -268, 281, 423, 101, -144, -214, 75, 710, 345, -92, -131, 354, 310, 220, 76, 172, 89, 227, -25, -182, -146, 80, 233, -50, -83, 37, 115, -89, -284, -169, 94, 258, -26, -317, -52, 343, 79, 123, -218, -107, -71, -106, -423, -488, -318, -145, 87, -264, -327, -5, -284, -68, -28, -138, 33, -270, -94, -169, 336, -372, -385, -152, 9, 69, -299, -403, 18, 165, -118, -169, -138, 127, 338, -155, -438, 54, 301, 269, -28, -405, 2, 77, 178, 28, -189, 54, 388, 118, -241, 48, 191, 374, 77, -404, 4, 333, 251, -75, -349, 157, 122, 14, -179, -241, 253, 195, 182, -138, -168, 155, 255, -77, -323, -217, 53, 50, -45, -26, -2]
4015bK25k48k61J52K95M0m6j89j68L53j2j85j06K1J76Q9j95j10J80K16k27J03
4037A01q1p5q5P1M41j01j72r2J6l64O45l41j39K9K87k8o4j30K41J27k16j8l31
4060b79O04J16l28l50J8O36j56k96N1j29L68k70L7l74O65n9j62k07p9K13O5j06
4082b2m76M11K14q2j0n47M62O8P9k52k8J78J55r8m58K61K57L64o43J84j14M2L35
4105B80m02K46j19J12n7K1l30L47R4j76m3J25J37k12LJ04N8K8j62j24K30j26j15
4128h1P9J41J69j34k23k7J2L02k90RK10k8J10j91rK1j6K86l42k01O3J27N1j8r1
4153g1J21L23k51m68J43M12J8k6n22J00K95l2p1m88M55J49L6l14J1K29J18J40
4175C07n89j30O14k96q6r8K71RK41l56k67L33L77j23m47j70N03j24J65o24K9N14
$$ y = [-2, 223, -25, -286, -134, 161, 201, 155, -34, -202, 151, 139, -46, -152, -131, 45, 134, -61, -171, 9, 225, -2, 101, 20, -55, -140, -69, 372, 271, 99, 7, 23, -341, 304, -37, -176, -147, 140, 112, 48, -82, 159, 286, 70, 52, -279, 325, 441, 113, -237, -219, 417, 261, -35, 16, -113, 255, -15, 22, -352, 313, 254, 92, -115, -194, 19, 84, -22, -498, -87, 127, 45, 35, -512, -50, 18, 97, -155, -183, -5, 150, 52, -406, -145, 112, 476, -167, 17, -97, -55, 280, -122, 124, 5, 117, 60, 81, -249, 98, 192, 16, -27, 98, 235, 23, 26, 130, 188, 216, 54, -70, 160, 34, -81, -2, 139, 308, 174, -49, -76, -64, 238, -52, -43, 167, 139, 249, 58, 49, 70, 54, 340, -2, -203, -140, -13, 38, 20, -71, 50, 373, 122, -346, -203, 209, 227, 201, -321, -221, 74, 42, -29, -517, -62, 87, 123, -191, -180, 49, 167, 307, -282, -412, 202, -94, -180, -278, -7, 2, 243, -113, -380, -47, 330, 207, -240, -410, 93, -31, 134, -490, -461, 53]
4197E3p9N7J21k72K9M39k43j03j54K07m1K8j5j1k00L91j54Q6J2n36L75j47J4K7
4221a16j7L2j5K73m23J56L8K43p5L2k90R8K89m05J79l69L51Nj24j86Q6L13k96
4244b21O8k10K58R2J71j48k02K60K07k44l13M66O8k40J28l13J97J72K33n49j36
4265b56K2O53j81k69M8M1r9L95o08N2K4O08l14j91M4L4M59m07k69R9M00j62q3
4288D0k54N8M64k22N5o6mJ0k55OL09MJ1p5rK14m86M79j67l98N08j80ok03N8l7
4314a46pK53JR0m39K46m4J44O8k86M1j70M15j11n71K83K99l4J01m52M9J45k3K85
4338A37p28M30N29J34n19j58R7LqL8l17M34J5j81q8J05j7M75l43j21k0L03J72
4361C72m33j26L01J88M7n50K93r1K67l48J98m4l9L89j20l96K74L32m16P7j31l4
$$ y = [53, -26, 31, 152, -120, -91, 348, 105, 2, -152, 55, 14, 42, 27, 16, -184, 207, 53, 139, 151, -385, -10, -157, -143, -116, -133, -101, -116, 157, -266, -110, -72, 171, 96, 128, -162, -64, 225, -180, -1, -370, -19, -14, -138, -324, -238, 75, -221, -153, -363, -105, -13, 158, 10, -192, 68, 275, 31, -282, 184, 252, 12, 140, -173, 24, 196, 429, -120, -256, -234, 419, 238, -31, 17, 58, -41, 354, -254, -202, -178, 430, 116, -75, -31, 3, 462, 55, -214, -115, 285, 123, 40, -214, -156, 308, 86, 141, 75, 71, 81, -174, -168, 141, 145, 156, 81, 72, 286, -200, 279, 112, -286, 222, 42, 36, -167, -109, -146, -153, 100, 101, 191, -248, -2, -46, 98, 166, -120, -79, -249, 166, 55, -516, -233, 66, 32, 133, -319, -270, -125, -148, 137, -591, -161, 368, 502, -17, -175, -78, -75, -83, -45, -362, 72, 87, -94, -182, -77, -94, 381, 38, -83, -103, 200, 372, -61, -187, 114, 302, 349, -201, 92, 1, 268, -80, 118, 74, 35, 424, 304, -92, 182, 514, 98, 175, 44, 10]
4383A0J63J17k48J07m7k09K40P6o1j94n5J86k61K93k81J69m5Lj22N7L6l01J99
4406a68J33m7o7L01L20j15m86J75Q0LL5k6o7j29KP3k98L73J99j2m35K79l1J7J93
4431C02l36n2K15R5k65r8R3K21q7Nk02J2M36j08k85R9l1lQ9k16K3K03m3P4j80
4456c9k75M32J20k11l71M19J06j29k38K3K08o3J18N4m08K51o0j6p5r5K31J68J6
4479A66m93L83k49K09rj42l9m1J17j08R6J4J08n21O68l27J42o1K87J21k66k40
4501a85r3K49Q6n3m3j92K80L9j25l2p8L38N8k00j90K09l6J92j98j55L25N3j2o57
4525d20J10O42J13j29k25j88K71M7j06l6j39J56L59n78j47J54Q8M4p2N8Q1K32
4547C15m89o2K35k4J46j41l05R8K28J37k05P0j48O2m6R9K5L7l2J78j44j08K70
$$ y = [10, 173, 290, 42, 149, 102, -107, 133, 209, 148, -46, -101, 85, -176, 117, -164, 5, -40, -37, -159, -102, -66, -367, -168, -35, -82, -149, 152, 472, 357, -129, 46, 126, 129, 164, 138, 71, -58, -56, 17, -281, 92, 291, 279, -156, 123, 92, 109, 302, -34, -86, 129, 224, -41, -139, -46, 175, 88, 93, -109, -97, 339, 231, -54, 45, 14, 11, 100, -116, -93, 110, 67, 141, -39, -314, 118, 238, 27, -344, 75, 181, 52, -186, -163, 45, -18, 100, 154, -254, -3, -63, -79, -154, -249, -18, 150, 166, -327, 56, -193, 16, 7, -135, -174, -215, -98, -206, -110, -96, 12, -509, 159, -168, -26, -87, 200, 321, 55, -185, -278, -29, 57, 4, -39, -231, 49, 88, -37, -69, -147, 191, 249, 49, -141, 68, 32, 224, 26, -129, 196, 249, 237, -420, -310, 332, 445, 316, 91, -97, 174, 221, 115, 79, -60, 96, 455, -123, -270, -116, -28, 16, -56, 2, 83, 315, -174, -236, -1, -25, 121, -20, -325, -227, 1, 138, -67, 3, -145, -83, -129, -30, -5, 32, 0, 178, 34, -74, 196]
4570A96%j91q7J80j50J05k75J92j5p2j55L28RK1j11J12j8M5j12j33JK53k36L09
4594A96k59L8K10O9l10k33L22k2K1m20J4N28J71m32j76K83N3N0j44k20J75K41
4616A55j04k11l00M55R9K9l56j37M00M55k68n32K1K09%pk09K98L70m01L5j76J91
4639A6J37r6J11m80L29k32K13o2J69nJ05l4k28J12L5R0j50j67L49j19L85m21j1
4662D6J45n4k73J82j02m4K88m06L00m0n0K46k01N8o4m7j37kJ16J73m31L21N7J45
4686B26l57J29l6J19Q5rn83L16M46j62j73l71L50J07J70n47L08j91M74q9m24r8
4708c10L28K65m63Q9L5K89J26j36l91J39K39j63k36j43M62p5j48k5j35L38N7K57
4730C99k98JkP5L1j78J11q5J52l89n2J50j4K59j50j21OL58k16j51J08k53L69J37
$$ y = [196, 196, 5, -82, 98, -52, 53, -222, -30, -45, -117, -272, 56, 65, 86, -25, 87, 69, 114, 2, -131, -130, 123, -113, 196, -63, -25, 185, 254, -56, -289, 33, 11, 32, -388, -374, 154, 325, -107, -283, 0, 53, 103, -41, -261, -86, 155, 51, -160, -460, -5, 94, 123, -233, -370, 30, 485, 217, -315, -294, -85, -85, -92, -301, -3, 367, -34, 1, -175, 16, 153, 57, 168, -312, 17, -215, -2, -64, 105, 100, 205, 171, -57, 55, 90, 180, 30, -137, 212, 93, 478, 57, 46, 191, 137, -136, 46, -56, -100, 188, -218, 82, 42, -8, 238, 37, 95, 31, -16, -153, -155, -39, 134, -297, 24, 81, 226, -131, -2, -38, 81, 166, 157, -426, -110, 336, 174, 1, -370, -20, 87, 257, -290, 18, -173, 301, 212, -212, -310, 18, 283, -180, -91, -56, 233, 359, 223, -168, -29, 210, 47, -189, -332, 130, 55, -93, -118, -253, 85, 142, 399, 101, 102, 100, 175, 206, 28, 139, 54, 206, -183, -235, -85, -99, 160, 10, -111, -105, 253, 37, -114, -6, -259, 110, 247]
4754B47j75n3Q3k05K45j31r9R0j13J43Q9r8l69L48K27l02J91m54K17L03k73J44
4776E5k90J96K85j01j63o8K26k7k52k00M33p6J17j15j69M24j52J12j92j35J43
4797E1K30q8l60k89L87M50m03j27R8M07k2k99k79K61K76l62P2j24MK39j1n8J64
4820B17n7K8j3k6l14J82J7j14q2l6K30j89J09k24J0J42K17k80J00J9j01O6n2P5
4844g6R5l01M1J48L7R8j6j66l2N7N3j6K25k4j75j34n6L09q9J00l91K73K16n1j82
4869e7j8M9K41K06n88o3K25J86Nl14jK75j52K2l78L55O7N74j086K20M46l13J58
4892E9Q4j29K1N0m6m7k59L22n3J31l17L93l81L09j19j08J39J20j52Nqk31J78m9
4916h8j13M0q8K72k69J59K3p5K97k00m1L6k09K31j72K79j54m4R2mJ90l55J41p4
$$ y = [247, 72, 19, 102, -103, 142, 11, -88, 2, -111, 32, 121, 23, -346, 2, 229, -73, 118, -336, -119, 184, -89, 55, -235, -39, 246, 145, -18, -86, 140, 113, -139, -339, 94, 18, 135, 20, -149, 275, 123, 235, 43, -92, 51, 281, 193, -167, -456, -69, 381, -22, -149, -51, 356, 334, 35, -244, 17, 293, -69, 3, -121, -117, 122, 111, 53, 217, 160, 188, 175, 149, -165, 17, 34, -80, -162, -198, 32, -157, -48, -272, -262, -120, 97, -183, -83, -64, -165, -99, -151, -76, 19, -282, -241, -93, -56, 42, 26, -140, -172, -115, -62, -78, 147, 123, -52, -186, -242, 67, -22, 78, -313, -40, 176, 125, -57, -75, -26, 215, 421, -167, -230, -5, 181, 186, -128, -129, 146, -6, 16, -362, -7, 60, 634, -452, -232, 214, -99, 59, 143, 14, 35, 85, 39, -8, -267, 55, 2, 133, -184, 209, -172, 137, 18, -90, 49, 169, 17, 22, 14, -217, -39, -88, -201, -161, -249, 23, -246, -87, -64, -139, 158, -42, -83, -47, -256, -25, -197, 82, -72, -116, -24, -28, 162, -193, -52, -126]
4940a26L09l9j26j14J70j13J6J19k48n9M34p1l36m2J77K24j00j02k27N26n3k42
4962b3k7k49K87J41k88l0q7L76J23k78l38L79K99m11j08m3J62N28l84l07K85J07
4984A14p0o3k00J77N6j95K35j30J35j16J33j99o1l6N56j99l45K9K41N1l6l00J55
5007f8r3j9j64J62K65k0j4m4J82l38K05q8M4j21j40J68J66J61m09K43l20N6K36
5030E0mj83Q7L27l09L61n43L06O9q9k03j53J70J31K22l19M1p5K36J69k96r5J3
5053h7L02j54p0l59N56r9j00K7J08N6P6j87l57J99N50k54j21l76M14K99l09j62
5075d8l6K83k29j67J26k64J65m8J50qJ25q2J29k16k0J36p5L21n37J88l1k2M13
5098B53l00Q6N7M6r7k6KJ66k45J72j36K11j63J19o5M1r8l3k56J44pJ04j2j9K21
$$ y = [-126, 183, 144, 18, -96, 74, -39, -23, 96, -152, -211, 223, 152, -184, -226, -49, 175, 75, -27, -254, 272, 219, -23, -50, -299, -12, 129, -159, -189, -276, 100, 223, -55, -393, -14, 285, -126, -234, -277, -115, 413, 29, -278, 7, 114, 44, -19, -219, -42, 14, -181, 54, -76, 59, -57, 76, -123, -184, -220, 336, 137, -208, -179, 62, 113, 77, -223, -68, -161, -180, -344, -182, 83, 63, 49, 5, 187, -151, 54, -34, 10, -111, -251, -83, 83, 244, -165, 78, -242, -186, 50, 46, -137, -50, 277, -32, 329, -214, 92, 161, 72, -131, -284, -114, 17, 239, -80, -39, -114, 122, 291, -5, -100, -87, 215, 61, -9, -368, 188, 89, -11, 16, 124, 180, 256, 69, -288, -89, 461, 207, 86, -290, 124, 423, 114, -48, -84, 199, -30, -197, -71, -335, -170, -218, -68, -76, 49, -33, 96, -120, -140, -4, -79, 242, -295, -107, -138, -160, 253, -47, 39, 96, 142, 45, 19, 21, 187, -58, 114, -22, 189, 26, 145, 80, 121, 23, -10, -266, -122, -129, -25, -37, -56, 165]
5123A65pl97J76J13jO7j53M3J14j31j72o7J85Q3M4j42k37J84J90J95k90k69K38
5146f9J41j11j45J40O5N0k34j58K36J0q9K31l6k43K57Rj99j20L72M5rm5k64L36
5170A70m1J12l51q6m3K71J25k90J01j38O37m81k03J59J37K27j37j15K69m06J00
5191A7j47K78J45j56o4J62k87p5J93j16J04p7J16j60J01l2J52l53J20K18l13J64
5213a0k31J73J09m2p4q9L33j88o8L2k88Q5L17l6l45K0K83J75j10k59R0K93qj15
5237D7l27Q4J49n7K02j52k62L67J87j89j00J51J18J12k93j68N7K15j16k71N3L93
5259B00J6j07k83N1K65J74m94M4J09J12j3m4L0o6J95j35j40l8j02J88O6J14k83
5282a41K49k54J63q1K48r1l11M57k63L9l56L01n7P5J83k95J88j0k3N8l03K79L2
$$ y = [165, 158, -239, -63, 50, 49, 116, -37, 6, 120, -11, -183, -250, -65, 18, 62, -80, -317, -133, 57, 252, -38, -307, -69, 72, -39, -184, -44, 21, 71, -163, -321, -85, -75, -164, 67, 31, -212, 45, 54, -145, -265, 107, 152, 143, 98, -166, 170, 129, 241, -110, -196, -239, 32, 157, -133, -32, -170, 467, -14, -217, -58, 79, 306, 169, 54, 323, -83, 17, -130, 148, 293, 137, 73, 235, -52, -127, 66, -50, 54, -23, 93, -67, 34, 2, 154, -199, -79, 139, -174, -10, -241, -68, 41, -1, -75, -164, 169, -19, -87, -55, -343, -258, 59, 23, -322, -302, -19, 156, 46, -213, -123, 170, 162, 47, -280, -196, -47, -104, 98, -54, -316, 51, 238, 49, -51, 100, 218, 330, 37, -131, -74, 141, 25, -246, -193, 200, 216, 109, -174, -123, 142, 316, -178, -134, -25, 87, 74, 30, 60, -6, 189, 54, -86, -124, -226, -38, 28, 142, -141, 108, -146, 17, -64, 184, 93, -218, 239, -24, 15, -341, -40, -97, -22, 161, -134, 54, 44, 21, 79, -224, 55, 87]
5305H7L66n52J57k44K84j41KkJ04J53m10M8P7L19N9j87n75L88M23l66j62Q9L20
5328B37M6j82l21OK39K30K7m38J67K53Nj55j3r5M00l18n5m7J17L9Nk95J67j08
5352h9K38j52j03J55J5J92j84Kp0J95k65j90M62k91K69k03J32j65J84J65k24l1
5374D2j28n5l1Q0q2O7Q5J10j60J21m7K7M0R8j6k14q1L70j13n4j10j56J80J13J42
5399B28k70l07K78P2k9o6O6J51J07m77N7K66l3j2L3k19J60K90p9k63k54M27m0
5422H6l6l31J4M56l3n7mk67J13K68k4n47M03J09l13M7ko8J97m6J20j50J66O9k42
5447g2r4J94K78l33p1J25n9J35K15n57L9j47N43m01Q4Q3K44k61L36k69k40K30
5469Bk05J51n7J43J2k26J44J79Q2m91L37p3K97k86N9P1K41o2l40r6J27j53J34
$$ y = [87, 453, -99, 58, -186, 98, -43, -41, -43, 61, 214, -196, -148, -71, 248, 307, 120, -455, -67, 356, -10, -172, -83, 237, 283, 101, -220, -214, 25, 255, 282, -156, 11, 264, 269, 114, 101, 6, 406, 88, 33, -14, 103, 142, 147, -148, 19, -89, 149, -3, -106, 49, 64, 256, 72, 74, 4, 199, -66, -256, 206, -85, 184, -19, 113, -52, 132, 297, 73, 42, -86, -141, -172, -92, -174, -107, -22, 88, -72, 49, 2, 29, 69, 167, 151, -63, -144, 226, 113, 59, -51, -207, -27, 86, 228, -42, -349, -71, 1, -28, -94, -28, 123, 230, -247, -190, 76, 43, 31, 64, -155, 5, 295, 216, -47, -301, 126, 86, 50, -281, -267, 189, 156, 99, 95, -172, -59, 209, 185, -362, 41, 150, -163, -116, -118, -186, 11, -35, 85, -65, 101, 170, -72, -166, 28, 306, -27, -98, 27, -32, 103, 318, -239, -200, -347, 196, -205, -121, -38, 206, -55, 281, 12, -228, 2, -203, -52, -109, 34, 46, -180, -36, 143, 225, -266, 71, -2, 295, 9, 68, 139, 380, 318, -22, -118, 9, -144, -10]
5492a0j27m4K34K9J59l52k5J21Q6n3J7q9J64j07p9j67K00R3nk26q2K08K04Q1l53
5517a23j05J86J46J40o73K53J50L52l37m9J1j98N54m56L5k0K13j23QJ6j8K23k05
5540b0j06K24K3k38J08N8n1J66k4O7j58k1p3K4J55l7J37j17r7J55j07k4j47R8
5564eK34k31n5J10O5m3j38k03K05M00j74j23k96j79N46k6j9Pj92J48Q6l42R4J27
5588dJ47kk77j57J93K65M6j04j94J07M4K26n89K54J22j89K11J33m63L51K18j92
5610A46l74J31J93j03j8R8j50R4l0j89L63j79pJ2l32J65J44K20j09M2k21J70L5
5633A01q1M7R9Pl98M01j82j42K21k96M17K5k48K08j90O3q1Q1j74L6L15j34k41
5656a46O7KK09j98j40L31j19K93l02k08J0K51p2J33k01j59O96m97Mr8P8J82n7
$$ y = [-10, -137, -181, 53, 82, 241, -111, -136, -15, 71, 18, 35, -54, 110, 3, -76, -243, -43, 50, 45, -181, -263, -55, 149, 230, -123, -228, -42, 104, 244, -429, -176, -26, 326, -11, -60, -49, -247, 307, -149, -114, -134, 79, -44, -36, -20, -38, 185, -20, -126, 98, 121, -117, -9, 49, -2, 164, 140, 207, 49, 28, -45, -21, 134, 97, 234, 117, 20, 175, 68, 44, -103, -5, 229, -2, -57, 53, 118, 75, -63, -266, -61, 339, 165, 42, -254, -433, 113, 87, 68, 75, -117, 31, 117, -225, -131, -4, 143, 141, -136, -293, -100, 165, 211, 107, -87, 20, 64, 290, -299, -45, 77, -112, 99, 232, -231, 120, 338, 146, -228, -97, 96, -7, -25, 73, -77, 17, -13, -202, 161, -18, -25, -13, -345, -180, -36, 184, 75, 117, -104, 66, 101, 20, 67, 166, 173, -225, 176, -6, -148, 73, -223, 194, 219, -29, 179, -11, 52, -29, 52, -122, -86, 229, 95, -146, -79, -77, 132, -66, -206, 125, 6, 299, -3, -211, -201, 50, -22, 111, -90, -249, 447, -50, -46, -144, -66, 116, 59]
5679E9Ol9n0J63j80m2p3M40k84O1j46K07M2k44j04K4K36J53N4j82k01K36J24j19
5703A41j74j19M36K2k64j09M6J23K25j06J25k39N1p8L5j67J76j96N5jK83k65J78
5726A78j45j16J43l26J9K07p0M32k11p8J13j67J53k38K39o1K1o2j44j70K63K08
5748A88m30K94k6K57l45k57J50P3K25k63j99L5M23L8j1l15O3P2j6Q9j92R8K0J29
5772A00k50O9J81p7l47K24j29L04PJ6r9J61l7k6k46q8o7K81J34j66k15J86J32
5795D8J43l10K01l1J32k51j82O9J51J50r5J05k51L8J03L2m23L40k4K05j88K71
5817B33k07n0mJ50k33J50J81k88J0J74j05j02K41j97K44l80O0J00J04k39K43k49
5839a64K76P2l75K72j22L93j82k78k3M59l63n5P4j17K29J39k84L8p8J86J14j40
$$ y = [59, 65, 26, -24, 139, -41, -83, -156, 284, 0, 61, -85, 122, 164, -80, -184, -160, 76, 229, 283, 101, -100, 136, 260, 141, -33, -152, 284, 306, 42, -67, -21, 102, 327, 221, 346, 107, 158, 80, 115, -52, 124, -72, -17, -18, 265, 0, 178, 33, -83, 60, -266, -247, -40, -110, 322, 111, 33, 146, -21, 132, -106, 133, 72, 93, 31, -113, -283, -20, 188, -242, 52, 26, 283, -62, -319, -169, -96, 129, -134, -333, -298, 125, 163, 152, -163, -100, -28, -44, 45, -147, -49, -29, 100, -150, -81, 100, 23, -324, -100, -229, 75, 82, 98, -1, 160, 123, 97, -149, -237, -304, -23, 111, -55, -270, -84, 48, 191, -119, 82, 51, 183, -68, -250, -181, -30, 120, 25, 130, -121, -83, 20, 52, -371, -31, -55, 150, -38, 233, 26, -24, -28, 122, -111, 39, 220, -68, -58, 116, 11, -91, 150, -47, 197, -183, -123, -23, 81, -158, 85, -164, 112, 184, -191, 81, -41, 352, 170, -108, -131, 328, -35, -90, -16, -133, 96, 235, -49, -11, -89, 97, 211, 71]
5861G1m04K19M37M9m40m3K56M3j69k5k35J93K17M0j05l23K05j16K25k55J28k38
5883b70M22n98N34l10J66R9J48j34j12J13k20K96m23K45k16J51J62L0l5Q6l61
5904b27Q7q7L16p3l64M83N1k74J3J63J06K6l71J46j60L66l6l06K09M5l13M0J00
5927f0j0K02n6k00K41o9L89l74k87K26M6j1j5n8J53N3j43q4o6M8J41l6J21l54
5951b03rM99n16m3J41K57M2k63j19L25k2j50L7pK96k26L6q7j39K36J11k55J21
5974F2k13J68k17J57j07J26JP3o8j24K85J29l06P2r9J89r3M3k65J25J10M4%J5
5998A07j39j65Q5M36l94J33K00k96L81l66J57j55m2j00J37J68j45j18J30J04j43
6019b5K21m72K97J61j98j48j15M89j15j70QL29l20k6q4Q6K45l17Jj24K96L14k01
$$ y = [71, -333, -114, 323, 372, -68, -111, 145, 188, 19, -6, -241, -48, 169, 209, 104, -219, -14, -130, 95, -160, -32, -270, 152, -446, 88, -222, -56, 43, 191, 57, -55, 58, -162, 134, -289, -44, -260, -109, 53, 83, 48, 134, -227, -140, -227, 89, 16, -348, 135, 186, -88, -75, 88, 194, 220, -151, -5, -165, 201, 165, -141, 68, 113, -200, -160, -60, -70, 132, 76, -124, 117, 48, 437, 63, -224, 2, 48, 37, 22, -36, 117, 170, 27, -57, -123, -75, 66, 30, 151, -203, -212, 287, -229, -272, -131, 126, 168, -95, -214, 111, 89, -61, -24, -31, 265, 39, 75, -12, -151, 85, 196, -59, 62, -151, 17, -200, -43, -150, -24, -23, 50, -18, -142, 143, 272, -34, 38, -61, 128, 35, 78, -187, -62, 48, 92, 92, 107, -32, -197, -112, 324, -70, 63, 263, -33, 348, -18, 139, -16, -58, -158, -21, 147, 2, -116, 14, 118, -25, 196, -276, 21, 182, -16, -164, -279, 210, 95, -75, -67, 262, -58, -84, -168, -82, 163, -154, -153, -277, 19, 333, 132]
6042A32j51r2J75l06J98o4J25j51J54k17j58j7K36K12l21J24J40j83K9K34m45
6063c46L93J96p9M0l52R9J25J63k74r7J82Q1L2r3qK5l40L73j12j13J09M9n9j97
6087b03L80l1j36J97k10O7Qm86K67K44l64L70j85J14K36l73j13M2L27k17P2n2
6109d6j7J54J12k96O3P4j7l37P9L44p8o3j5k92K42J49n8k6j76K18O4J60l05R7
6133C0j36L54m05J26n4J89j10j49r2L61j24m2m6j77Q8L90k16q9j01K90k42M01
6155B46j76k04K40n1J75k32L5O9j00j78J25J22j86L42k42J07J19l17N6K6J31j20
6177a3P5n9N3n7j79J91l6P7j42J79J2l78J01n5J22l7K42k20j68J97m6N3L43k48
6201Gj86L99l98K0O4O3L71k00O8m16K95j00k04M22k39j3J65J10n04K21oK67l9
$$ y = [132, -19, -111, 64, -242, -44, -108, 17, -134, 20, -197, -355, -372, -136, 76, -245, -121, 19, -164, -135, 99, -346, 47, 243, 164, 204, -148, -49, 76, 239, -35, -132, 50, 131, 163, 70, 62, 87, -253, 120, 8, -105, 4, 53, -6, -203, 177, 146, 10, 207, -3, 64, 72, -414, -147, 97, -267, 103, -82, 32, 268, -105, -218, -176, 151, -66, 6, -46, -63, 91, 203, -93, -30, 44, 27, -310, -231, 113, 35, -28, -43, -335, -93, 56, -2, -28, -204, 14, 78, 238, -67, 30, -106, 248, -157, -31, -85, 104, -6, -155, -247, 114, -10, -52, -98, -275, -187, 203, -13, -102, -203, 87, -155, 246, 70, -134, 106, 55, 230, -2, 33, 102, 2, -176, -51, 71, -115, 227, -15, 92, 211, -106, -50, -24, 107, -13, 62, 3, 56, -1, -180, 11, -25, 52, -90, 89, 101, -277, -176, -231, -109, -146, 96, -124, -292, -95, -141, -88, 255, 7, -179, 220, -178, -158, -94, -31, 340, 140, 208, -208, 87, -13, -217, 205, -34, -47, 118, 228, -276, -55, -61, 206, 167]
6224A67n55K61J80L08m44O4j28K25K74j34j50l44M45Q7k20j15J32R0n3l22K30
6245bO3J65m20N9P3J66J8l50L78k70J65k73K62Nmj13L32l07mK2j77M50j98l3m
6270CL48p17L39J80n0r6J20Q5l31j47J28J51K82k33k39L4K73k04j2j25J66O5J
6293B1j62L9K61j61j80J05O9L6K25l71P9l3J84j71J80k17N9K7K48k05L4j02Q6
6316E1O3j32j83J23M37k52P7j5j0k08J41k32O3K07k72L69k60jj73P9K18l41L78
6339A27N7k59J24j31P7L16q4k26Rj00J53j78K05n7R1k26m9J5O6J42j65J04K37
6362B48m69J35P4P0J08r2j15q4L20R8m77J26R4K49k33K10k80L0J04j88J39J27
6384A94r4M3j46k04J78k4K47m41J44J61m2K68l54R5l4J11l38J60N3MJ41j79N7
$$ y = [167, -388, -127, 53, 361, -83, -19, -147, 78, 352, 218, 68, -276, 169, 256, 36, -79, 53, 143, 90, -232, -2, 61, 226, -194, -135, -62, 104, 122, -228, 150, -120, 45, -228, 34, 39, 35, -78, 254, -53, -57, -35, -212, 238, 40, 7, 3, 351, -366, -27, 153, 103, 7, 127, 212, -119, -266, -138, 13, 295, 62, -177, -143, 130, -74, -86, -211, -45, 20, 21, -141, -102, 159, -2, -182, -77, -8, 28, 253, -118, -39, -72, 112, -59, 121, -96, -37, -10, 238, 33, 67, -35, 51, 114, -18, -201, -78, 359, 107, 184, 169, 159, -49, 92, -140, -77, 130, -142, 227, -33, -34, -207, -128, 90, -251, 127, 184, -75, 49, -82, -5, 311, 227, 1, 10, -90, 63, -115, 90, 33, 124, -102, -151, -136, -70, 72, -93, 11, 248, -221, -86, -12, 58, 166, 74, -41, -125, 195, 293, -184, -58, 36, 285, 52, 262, -18, 12, 116, -72, 67, 194, 100, 143, -3, -207, -29, -53, 194, -247, -103, 58, 16, 284, -70, 25, -9, 102, -236, -76, -23, -19, 122, -57, 0]
6407@q4K04qk85R1j9P1K16l27N2O3N0J11n16L34RJ35l39L21k55K79k08k42K02
6431a45L01l8j63m9k5m2J60ML4K4O7m92L50J5Qj39k8Q3K7J63m53K07k31M71j56
6456d7K56l10K67J29k22j7j71l3k7KK3O2J70k72J04M2K03jj84O9K22j97j6J08
6480A60l72K96k55L81m04p8J83K9J32l0r1K81m20L66m91L02o8J87M1k96j85K70
6502f2%j13J77m89P62k38r8m4J64M3q2P7q4j70L67l12P9m0K34j46j08K41j6k06
6526f4O0K60m65K28qj71J35L08k74k16M19j11j36j74J90R1k63K00q0m2L11j98
6548@J04p8k5J8k04K15n4l44N02m5l91L49l05N12m10o1N3J48j14K80p9k77K67
6571F1j55J83j98p9J89J47k28p9L0R1K28j84j29L73j93MJ9k55L7L42k05j81M12
$$ y = [0, -84, 120, 112, -173, -82, -101, -30, 186, -141, -89, -26, 24, 135, -381, -47, -38, 97, -242, 79, -176, 103, -105, -347, -145, 156, 118, -45, -94, -119, -161, -1, 3, 37, 61, 128, -364, -14, 1, 9, -130, -158, -75, -48, 115, -338, -131, -362, 109, -47, 209, -101, 166, 295, 73, 56, -115, -148, -175, -173, -150, -88, 82, -190, -86, -44, 159, 158, -26, 43, 265, 68, 52, 160, -212, 84, -171, 210, -194, -272, -89, -60, 72, 42, -49, 232, -188, 178, -313, -11, -79, 108, 149, -147, -332, -62, -62, -175, 2, -487, 275, 37, -61, -105, 59, 102, 20, 97, 13, -157, 210, -102, -23, -63, 171, 25, -83, 158, 142, -64, -4, 256, -209, 19, 11, -160, -25, 283, 9, -207, 212, 101, -35, -209, -19, 72, -191, 9, -71, -113, 198, 0, 104, 26, 1, 19, -185, 30, -24, -368, 134, 89, -302, 47, -258, 254, -156, -217, -164, -16, -130, 150, 71, -206, 61, -94, 89, -109, -188, 1, 148, -80, -159, -129, -38, 190, 6, -123, 250, 57, 61, 80, -175, -138, 204, -1, -182, 230]
6594B30j8j83J27p2l06M77K87m06k07P6J48p3M5k39J19j32K67k15J93o3K3j35
6616e7J1j10L4J00j3K29j20l1r3j26J83q1K42j24j39R9K91l01k1O3q4p9K18pL18
6641D02n12N7o9J59KP9M4k30O2q8K81p2k69J99P7p6l49P5M01mj48k24O8L14q7
6666I2R3l26j75L53Jl8k67L34P1j16k4k14K10j0rj21J41K6q7M19l54l03J20L34
6690A50j75K7J63K54r9o41N04j12L6k44J98k03J28J80k39j3N05n69L09k66j01
6711b08o2J73J42n6j32K96j73j36L17j83j87K14L9j51MK7r7n5J46J76l2j35J61
6734H8j39P6o5j63J64M16l02m33M44L4j94J08k05J86K17j28j27j15L1J83L1q9
6756A8k84M88J62l38J59k55L9J5K30k35rJ41j37j85Q8N7K29n00K06K9K46L7k94
$$ y = [230, 212, 29, 156, 84, -222, 255, 542, 136, -71, 5, 153, 80, 125, -114, 5, -127, 140, -75, 118, 55, 78, -57, -46, -156, -122, -22, -35, 194, 74, 43, -50, -176, 7, -74, 168, 44, -95, 4, 295, -6, -27, 36, -48, -127, 91, 84, 402, -110, -53, -122, 37, 39, 118, 162, -68, -6, -94, 187, 115, -154, 45, 122, 46, -303, -228, 173, 169, 21, -203, -135, 179, 92, 185, -141, -316, 37, 38, 0, -267, 67, 138, 22, -2, -216, -6, -16, -25, -146, -5, 21, -66, 353, -1, -304, -184, 150, -25, 2, 165, 419, 320, -321, 183, 71, 107, -137, 61, -142, -14, 166, -73, -86, 419, -150, 159, -107, -208, -270, -97, 45, -11, -143, 153, -20, -156, 161, -22, -209, 5, 44, -107, -103, -76, -173, -228, -82, 94, 62, -73, 88, -51, 25, -40, -203, -39, 377, 75, -358, 86, 120, -74, 34, -171, 15, 232, 104, -23, -138, -107, 76, 107, 18, -266, 222, 384, 46, 205, -50, -11, 4, 234, -1, -10, 131, -6, -191, -103, -46, 183, -317, -111, -82, 164, 201, -93]
6779i3K77j49N0k04K74k80K64l92K98j02j22J88j93M62m13j41K31j31K19k39J27
6800f9J20k82J33P9L8J27l13Q2M6k3P2j00K67J5k52l6J71j64R7j3l27L08J57k34
6824a01KJ90M0P0o3j32J22o4Q0k80j82L14RL37l81M2j73L94k59j35J62J47j1l6
6848I2j40P1k05K16J3j53nP3J45m00M1J58K6Q7K1K2o0NJ8j50M3J47j14K31j06
6873G6k62K37q2K29j05k5K6M4j32J33k20Kl5J2K19j24pK07k63P5j2mj52M30k04
6898F3k2J93j90o1J86j75j58K62k4j39K8j3J59m4J45j74Kr1K64j86j93L72j11
6921I3mo4k84K40J91j54n7M6k7M29k14m89J6K03K08j95M0J10n9J95q3k60K7j6
6945a08r0Q9j84L11K25m09J56R5m49L01Pm2O2K89j89q8l1j03J37J09l50K7N5J69
$$ y = [-93, 184, 35, 85, -119, 155, -125, 139, -253, 45, -57, -179, 9, -184, 278, -135, -276, -45, -176, 43, -196, -69, 51, -231, -98, -19, 19, 146, -167, -85, -39, -62, 10, -90, 177, 192, -60, -96, 75, -89, 8, -5, -332, -24, 133, -101, -99, 91, 131, 201, 138, 6, 128, 64, 144, -136, -318, -4, 5, 342, -39, 3, -170, 224, -35, -170, -8, 139, 128, 92, -48, 23, -182, 34, 47, -106, -111, -38, 107, -293, -252, -94, -68, 19, 40, 62, 2, 7, 25, -125, -82, 65, -49, 182, 76, -186, 51, -31, 198, 93, 68, 94, 138, 6, 139, -81, -79, -114, -102, 117, -7, -14, 193, -70, 5, -7, -11, -163, 267, 63, 41, 234, 44, -17, 169, -6, -164, 98, 74, -65, -37, -50, 109, 65, 210, 36, 38, -53, 211, 25, -168, 204, 93, 89, 25, -259, -19, 172, 18, -39, 7, -20, 409, 195, -294, -278, -75, 133, -62, -22, 88, 29, 224, 141, -119, -92, -108, -198, -109, -293, 18, 243, -166, -10, 85, -364, -63, -56, -98, -36, 253, 64, -24, -55, -158, -21, 88, -262, -235, -180, -11]
6969a1Q9K4p3o5kM8L2J5j68J72N5o1j7O2j82J71j41p8J46J16j85L8K96j79l48
6994b46K94l5k14N11l62J63j29K1j41J90K25m87K43j9J08J28k49l8P9j96K51m4
7016E3m8k5J10j41M2k4M3J31k03n0j07M4J73J56l46K31O4O4j27r2J90Q0j87J09
7040A40j34J88m17L02j93m7K07J38R9k86L8j00J9N5l4j1j7N2K19k50j30K19K2
7063G9m20J15K02r5J27J55n01M26nJ81j84j68q5o0J56J1M7M1q4M4K9J46j63j10
7087a16L00l1l75n4R8N18j58k28jR7j31J96l54J43M5L2j83J86j26J06O5q8j15
7110a74J35J75k36K15q0q8K60k08q8N9l4Q3R2k9k3j89J70p4K00m07K71K49k49
7133C0mj14R6J59j40l4Q0j31K05m54L76q5J18N3m8j71Q3J39j84qJ6R9q7K4J13
$$ y = [-11, 78, 102, 29, -36, -38, 10, 42, 57, -111, 61, 116, 55, 38, 100, -82, 89, -52, -130, 16, 132, -53, -15, 281, 102, -246, 48, 13, -201, 310, -52, 111, -18, 3, -138, 52, 277, -210, 33, 14, 122, 250, 1, -37, 42, -154, 97, 53, 5, -20, 90, -51, -9, -33, 10, 141, -62, -112, -219, -175, -2, 154, -192, 39, 103, 167, 40, -52, 138, 218, 31, 140, 6, 194, -223, 79, -114, -161, 46, 184, 283, -3, 35, -65, -46, 9, -25, -36, -53, -1, 218, -32, -162, 57, 79, -341, -226, -24, -119, 8, 163, -338, 88, 83, 264, 80, -88, -173, -233, -77, -66, -19, 22, -62, -18, 11, 157, -6, -116, 184, 153, -222, -276, -178, 340, 182, -46, -47, 50, -81, 115, -239, -96, -51, -19, -202, -16, -142, -36, 29, -59, -174, -39, 136, -100, 115, 35, -53, 207, -1, -89, -30, -64, 19, 111, 82, 59, -130, 40, -34, 166, -241, 30, 279, 30, 26, -88, 8, 167, 27, -7, 73, -58, 147, -307, 69, -16, 102, 155, 107, -64, 19, 158, -26, -34, -18, 81, -6, 18, 131]
7158A31k80K54k0q2j62O2j11O7J06K0O0j09P0L6o5R5k56oJ90k04%jK68j04j73
7183b14n2K00pK17j28j51K14k42L15l71J93l5l7J5R7k36K30L03m82J34m3r9J20
7206e9O3qo8J03P8k61K66j5q7j98j82M08j68P9J9l5j30L17J14l23j26L43J30l66
7230a06K71k47j87K28n8qj96K93n3M9J6j90K8J19P5p5j48J11l6r7J63N8k92K47
7254c5J03l21M73k23K47l8j13J8k2p8K6J88m7j54p9M0q2j50J56k76L50J99k15
7277c3J5o3L08k03R9j75o7N5O5n1jK46Mj61p6Q9J93l43j02rK42P6j44k33K55p4
7303h8K71q8l73J18K20J27j24J54j57K10k15j94J11OJ0j88l6J47j78M68j55l32
7325b86J51J0p7K54j84L16L5j32m4j7j33J36O6R3r2N0M6k43L57l29O4j24M2O6
$$ y = [131, -149, 105, 85, 3, -159, -97, -208, -141, -35, -15, 45, -64, 6, 42, -23, 72, -184, -190, 0, -204, -204, -205, 63, -41, -214, -266, -66, -73, 144, 16, -135, 79, -163, 152, -219, -26, -61, -98, -83, 14, -222, 8, 311, -171, -37, -80, -179, -59, 4, -4, -72, 31, 109, -152, 114, 99, 12, -186, -368, 40, -128, -49, -30, -65, -195, 122, 236, -87, -213, 130, 260, -106, 165, -82, -269, -41, -99, -107, -303, -10, -63, -14, 2, -188, -160, -41, 34, -41, -189, -78, -114, -211, -48, 10, -282, -35, 68, -253, 220, -3, 244, 206, 93, 111, 89, 11, 37, 225, 178, 24, -55, -15, -97, -247, -91, -367, -17, 182, -33, -18, -81, 227, 24, 123, -52, -119, -64, 1, -50, -51, 195, 199, 38, -38, 51, 244, -99, -201, -210, 32, 108, -36, -269, -14, -88, 183, 95, -278, -160, 60, 187, 63, 217, 60, 270, 55, -139, -28, -22, -12, -200, -236, -89, -267, 201, 46, -286, -135, -125, -202, 52, -132, 184, 219, 87, 43, 26, -107, 29, 95, 188, 96, 146, 192, -51, 306, -23, 41, -83, -41, 25]
7349B5J27j45j49K09j95J31L2L64m74J11j68J46o7l0Q4J04l76L54j42j4k9J16
7371A4QJ14k19k09L16R6Q9l14L15m14L24J36k14k6L9%R7rm30K41K2K57k13r3L6
7396c7K78m27j7M3J3J96J8K2j14j28K33j04j1M4K07P2l41L14m79K74J56j38j88
7419a14L63n9l68K39j62j20J23L2o8M28k88O2J65j74j48J76J2j27j42o7J79N6
7441bJ7j81K85J23k95J29Mk47R6L8P3J86l99L5J42J05m49K93M2j26M93l85l7n8
7465a18J39N2M1l55J37K94q3l62j05M85k83q2K29J1k9p1J03j65J59j15J27k29
7487b20M8K28K83l75ln7J31P1j69p2k21K51M27j47l09L8R5O6q2R0j95Q4R3j31
7511g6J81k51K93l44J81O9o2L6k32L80k6k17J13J5M8m0k79K83j0q8J15n7j77K53
$$ y = [25, 152, 7, -142, 67, -128, 3, 35, 399, -75, 36, -132, 14, -53, -83, 1, 105, -271, 83, -59, -73, -102, 14, 22, 136, -83, -292, 24, 120, 209, -105, 210, -204, 120, 256, 42, 16, 55, 55, 152, 143, -287, -46, -24, 233, 20, -73, -37, 241, -186, -203, -160, -147, 49, 67, 89, -25, -153, 80, -24, -35, 9, 216, 288, -53, 261, -218, 56, 212, 74, -114, 249, 190, -178, 61, -101, -221, -98, -66, -134, 294, 6, 68, 233, 59, -89, 87, 99, -28, -170, -237, -58, -2, 15, -166, 119, 242, -53, 76, 80, -167, -71, -33, 40, 226, -173, -138, 4, 109, -340, -47, -5, -131, 362, -23, -60, -118, 21, 73, 114, -241, -104, 190, 107, -255, -360, 125, -158, -240, -11, 0, -29, -100, 3, -162, -3, -118, 9, -220, -172, 56, 339, -36, -39, -96, 35, 106, -63, -135, -356, -105, 322, 175, -134, -96, -1, 65, -17, 73, -122, -38, 55, -76, 105, -146, 147, -197, -16, 53, -9, 27, -205, 175, 149, -68, 45, 60, 108, 68, -211, 72, 62, -26, 89, 32, -145, 108]
7535A08k14P2J83k13J31q0j42Q6%L09r0j91j43M66l34J2N0qj47K21Q1j61M1j15
7559g8P1r6k33N74j44k21J25j0J49j5r8K56j74j04J70j78P4q5N3p7J10Q1l90J52
7583h8Q6%L1q4L4M7l0l7j2n4R4L7Mj32J02J55k76J26O8j89j4j74M65q4k25L09
7609A59m7j36k22K61J1l2m2j5o4J30J84k63M0Q1K5J70m60K79j37L8M3K49k17p5
7633d0J30k7P6p9j69q3R0L5k56L15Pl0MK17K2j77r1O7j64J48M4qm1J4J65k60j27
7660b18K82j70N7O1r2J36J06O8l07K16O0j27J42j69N2P0R8m03O8j8K98n54K42
7683a02N4J0K85l33K01j61L14m62M79m68J13L1K2J18k26K17j9Km66M38j81Q6k
7706e0n0K93k40K41M8k07J01j50r4Q4J03K9j21k46J33K81m3k72J32j4J64J21m68
$$ y = [108, -106, -34, 149, -64, 67, -13, -155, -69, -69, 240, 150, -41, -184, 282, -52, -40, 10, 2, -145, 76, 157, -4, 37, -78, -7, -103, -336, 238, 94, -127, -2, -12, 137, 122, 24, 280, 106, 2, 172, -6, 68, -17, 36, -41, 69, 150, -240, -88, -2, -2, 29, -55, -21, 26, -4, -41, -53, -107, -13, 24, 28, -104, -2, 153, -123, 3, 71, -118, -132, -306, 159, 75, -150, 159, 112, -24, -246, 15, 26, -6, -48, -63, -127, 3, 187, -76, -36, 45, 70, 240, -220, 59, -78, -40, 3, 252, 35, -40, 90, 63, 139, 60, -109, -192, -102, -67, -323, -8, -1, -31, -27, 190, 212, 35, -56, 11, -153, -5, 39, 31, -10, 4, 169, -91, -218, 64, -106, -49, 12, -80, 56, 162, 230, -77, 139, 199, 72, 214, 45, 97, 167, 265, -138, -70, -88, 210, -344, -102, -48, -38, 247, -86, 115, -46, 268, -194, 285, -183, -70, -39, -17, 101, -125, 92, 73, 75, -391, 47, -134, -48, -50, -100, 193, -47, 194, 242, 35, 136, -14, -108, -24, 79, 108, -13, -259, -126, 155, 112, -160, -28, -42, 122, 243, -225]
7729b25K15N6r6K12j70r6J55L1l90L6L81k12K24J06j97K12j40k74O3j47L58m9
7751E3o5J49j62J1J85r5L3J78m92K81L22k40j60J17R0k64j05L21k20J0J01j40
7773i2L24k36J92l43Q1J03N9j58l0J94j38j74L07k25j30K19J03k30L45j56R2m7
7795F0k5j33O6O3j03J01j85K81l5Q7Q1m50J04M8j40L79l39K08n6q9J49o8k31J85
7819d2O0J24k36L63k96J59Pk12k55J64j01K90j81J41R1J91l43l00K78j21K71m0
7841A2l8n8Q1J09k57J1J49J19j56J01k8p0k50K02N4j65L58l94K5J64j14K35k76
7864a86J05m3M45l41Q0k65L01k38J81J76k32K88l02q2o7J93j88K23k12R2K33l50
7886a89K17j60N8q7L32j73k21K11lR7l02K51p6J1k27L35p2J01k18J2k6K51J55
$$ y = [-225, -10, 46, -50, 162, -8, -104, 51, 82, -308, -272, 109, -103, 121, 227, 30, 242, 102, -172, -109, -256, 102, 53, -12, 137, -25, -14, 171, 76, 109, 287, -205, 76, 398, 158, -2, 115, 205, -59, -164, 157, -63, -53, 48, -92, 232, -4, 188, -155, -74, 29, 88, -70, -100, 94, -44, -218, 89, -136, -266, -47, 56, -174, 171, 15, 107, 60, 35, -98, -32, 31, -72, 29, -156, 125, 90, 177, 258, -192, -88, -40, -180, 199, -140, 68, 12, -77, 72, 4, -227, -42, 18, 142, -94, 269, -27, 132, 139, -73, -328, -164, -265, 25, -156, -15, 76, 267, -76, -376, -98, -219, 52, 12, -26, -84, -3, 106, -151, -140, 9, 128, -28, 73, 45, -25, -275, -73, -19, -184, 174, -220, -195, -31, -145, 90, -186, -81, -124, 321, -20, 60, -205, 96, -142, 39, 215, -17, 271, -31, -113, -180, 13, -175, 48, -164, -72, 161, -189, 28, -132, -74, -161, 171, -2, -223, -12, -15, 82, -220, 31, -45, -34, -261, 74, 2, 103, -115, -103, -129, 122, 277]
7909B77k61j96L0K38j93J04M2R9j38J77k00k42K43J91J39m44K74k51L12m4j34
7930B3J90j15j48j69J4L10Q3j38P2j78J02J9k6j82j03K28k55K95j13K73k30N5
7952GJ80m55M17k70J67j46L53l1j70j51o4J64o4J18r2J06j58Q7r6Q4l0J38j54
7975f0J52J52j95k01J57M5L2L8k17l7J51j0P5J9m3k82L91k03j66J21L45k87k51
7998b74L08j95J58L1k6k05K21o7K40m34J36n6K94j69q7J13o2P9L2QJ93k98K98
8021B38k47q0k49L68J61l70J97Q6J94k85Q6j52K42j51L5m7j23j24L94n8q5k7p6
8044g3K02n4l18K08M1j45J97k92R6P0O3p6J84k61J59K9M0m8j48k07J89K09K5n1
8068C9K4j60L78m02J33k69M20j58Q6j95K03l53K90N0k65M3O0J03L3J93k89m9J62
$$ y = [277, 16, -180, -150, 88, -105, -1, 41, 140, 2, 179, -21, -263, -20, 171, 310, -134, 140, -111, 201, 157, 23, 213, 98, -50, -219, -205, 105, 188, 50, 122, -56, 46, 65, 39, -143, -246, -18, -273, 22, -91, 182, -48, 7, 187, -268, 149, -121, 46, -100, 253, 222, 52, -99, -163, 1, -63, 55, -37, 69, -89, -2, -98, -14, -44, 94, -60, 92, 244, 49, -152, 5, 50, 82, 120, -97, -134, 17, 7, 82, 101, 58, -224, 167, -36, -202, -81, 264, -23, -274, 34, -161, -3, 28, 2, -203, 18, -49, 191, -243, -107, -163, 131, -38, -125, -12, -74, 5, 37, 45, 238, -60, 238, -9, -89, -338, 30, 191, -179, 18, 104, 298, 13, 99, -53, 189, 38, 73, 26, -97, -221, 173, 115, 30, 3, -73, 129, 75, -243, -35, 6, -139, 58, -234, -138, -68, -5, -81, 103, -158, 1, 30, 70, 22, -126, -333, -144, 65, 90, 39, 63, -97, 281, -121, 12, -257, 163, 5, 91, -104, 99, -254, 36, 86, -179, -136, -76, 27, 60, 253, -36, -85, 77]
8091G7P6Pj27l0M4l18K39K18R3l26P8K01l23J00J58l70L10Nj41j36K31k13M17
8114B70l94J34J8M3K5j24j39K46M9l51J25j23K16J54l38K48q4k53J08n3L95o6
8136A06l60M17l02O0l6j28N6oK22Q5j06l57K63J21K5j23RO5j70K72j78J89k78
8159a54K85j49R6j19J37k22m0J89j18K51k7O4j22P9k34L87n14J95o5K16l74L49
8181A10k20J87K40k90kj46Q4j1j57L42
$$ y = [77, 153, 160, 33, 3, 47, -271, -32, 186, 279, -47, 31, 232, -91, 9, 167, -203, 107, 112, -29, -165, 66, -147, 270, -124, 10, 28, 71, 96, -28, -167, 79, 128, -223, -98, -221, -5, 149, -189, 59, -25, -278, -170, -223, 172, 106, -254, 163, -139, -79, -115, -243, -187, -193, 29, 114, 8, -349, -86, 35, 60, -63, -54, 11, -159, 113, -65, 124, -154, 131, -18, 78, -41, 96, -126, -166, 23, -95, 156, 129, 193, 71, 150, -84, 303, -211, -16, -81, 135, -239, 110, -110, 77, 317, 27, 25, -121, -37, -48, -205, 137]
8191A37
$$ Imaginary data points
##PAGE= N=2
##DATA TABLE= (X++(I..I)), XYDATA
0@%%%%%%%%%%%%qJ6j6J6k4L2l2M0m8N6p2Q1q9J04j26J50j69J93k24K56k89L29
34A76l74M21m72N29n93O60p34Q17r05J002j110J227j355J495j648J813j994K199
52A154k423K673k953L264l621M031m503N056n717O522p529Q827j0571J3056j6894
67i628K3662l9103J38366N7168j59862N2792k0229J07631j6168j40957J4830Q2644
79I1146J2987m262j10564J1402J01715j0957m0868o3355M489P9619j4593p1827
91a5068l3203K4831L2621N756p6846n322M3372J1351P687m5860l659N3487q83
104a736j3649j802k3977M0288O527m2028L3921k5003P873K6904l1530K9290K731
117G809k1286L0954O873j971J2812l5638K0637L1932k6565p668k9783J5535L8377
$$ y = [0, 0, 0, 0, 0, 0, 0, 0, 0, 0, 0, 0, 0, -8, 8, -8, 8, -16, 16, -16, 24, -24, 32, -40, 41, -48, 56, -70, 80, -89, 104, -120, 136, -153, 176, -198, 223, -249, 280, -313, 347, -387, 430, -475, 527, -583, 644, -711, 784, -864, 949, -1045, 1154, -1269, 1404, -1549, 1715, -1906, 2125, -2378, 2678, -3039, 3483, -4046, 4781, -5790, 7266, -9628, 14034, -25069, 113297, 170465, 10603, 63395, 43166, 150797, 134629, -6328, 8502, 91146, 104133, 99871, -10693, 709, 102424, 91467, 50599, -12756, -8267, 71352, 56759, -15068, -48271, -23440, 9181, 14937, -61909, -67231, -23859, -12508, -4821, -50681, -54340, -853, -1736, -15385, -17187, -41164, -876, 5651, -36377, -2456, -27459, -19586, 7318, -24212, 5078, 7809, -13477, 17477, 24350, 22379, 35191, -447, 20190, 52122, 25557, 17889, -11894, 3641, 42018]
130D2018k8062l8918k030K5325K9449j6930n9786J8590M3675J0528k6558n6332
142e9031J9851N8043r040n0464l0949J6656O8330j6717p0264L711L0165N7231
154A7522j3042p4762J8005N9227K4807k0284o1369J2328P7776k308l7690l8138
166c7928J6340P2420q477n1240j3161L1180N0337n202n7748J109M4152J9854j1204
179E0432n0264J311M4597K960k8097k6725N23L5245K337l8362k530N441J9766
192A6634M121l4225M279J1813o11J297j6913o407J6180j3490j850O570j3893J0148
206a6347q913R98J9334j0304q250M886Q419J6112o796k7160J5846J7301M492j1003
220a385l1040J9989L0863n830k4315j3865J7679L9763j1857m0872M524K1970L2611
$$ y = [42018, 13956, -24962, -26992, -1667, 27782, 10852, -48934, -30344, 13331, 23859, -2699, -59031, -39180, 18863, 9823, -40641, -71590, -54934, 13396, -3321, -73585, -69874, -39709, 17522, 4480, -70282, -52277, 6950, 31757, 11473, -49896, -37568, 40208, 37900, 210, -37928, -21588, 50832, 42355, -8885, -22046, 9134, 59471, 54269, -3479, -2370, 41782, 61636, 50432, 168, 1479, 46076, 49036, 20939, -5786, -5263, 29982, 32319, -6043, -8573, -3132, 16634, 20755, -13470, -9191, 2622, 2011, 3308, -13605, -20012, -3832, -17322, -19172, -12602, -26495, -16347, -25260, -24262, -4928, -15232, -23482, -18596, -10177, 5935, -861, -28021, -12175, 5126, 9618, -1385, -32425, -12436, 18427, 12597, -11718, -25583, -7904, 31859, 20002, -20870, -16346, 5624, 38235]
233C8235k0227m6559J1220L4606J4040k6962m1144J1673N2026o394l4215k5196
245c8897J5194N4272j4744m3971j0849K9553L5500j5560m8592L5M1381J4785j6152
258A955m5392J0393M6321J317k3286k6959J4853L8708J224l5938o537J8497K4465
271A9621P81l7628M688J9325J3645n360k5388M317K1421K874j1935m476m688J9959
285A7156j800j4791O907m813P875j128o493M041O82p792L558M247l533K228j8251
300a1907R273J3588r423o744j1915J1048J8722r287k3148M495J3862J7103j0655
313E012l3087J4902K1596R103j9043k8199J5796L2767k924k8734j3248J5326L9006
326B8273j2755l5745Q45K2885L0866j7823l7641N985L5989J1435k2049l2503Q792
$$ y = [38235, 18008, -28551, -17331, 17275, 31315, 4353, -36791, -25118, 26908, 20514, -13701, -38897, -23703, 30569, 15825, -28146, -38995, -9442, 26058, 10498, -38094, -38059, 3322, 18107, 1955, -43437, -33044, 13277, 14594, -8692, -35651, -20798, 17910, 19134, -16804, -23341, -4844, 19621, 20402, -17226, -12538, 6787, 20432, 15072, -10316, -5999, 15422, 18296, 6361, 1885, -2803, 17156, 15356, 565, 7472, 2659, 10534, 9406, 2913, 6954, 7636, -156, 3402, 7649, 4116, 6344, -11907, -2634, 10954, 1531, -5213, -17128, -6080, 12642, 3355, -19793, -15298, -1436, 15667, 5012, -28075, -13173, 8423, 17526, -1517, -29716, -13920, 18847, 15923, -12811, -26059, -10733, 28273, 15518, -20227, -19382, 3503, 34369, 16546, -21095, -15110, 20879, 32314, 10265, -22238, -13446]
339a3446M3131m546k6218k1536J5605L8872q495l2997p067K3218K3761o666l7473
352a3857J742K7621Q119j0854l0218N014K6619J530j7521j4496O548K2845O32
365A3724k1292K47N613J4109M66j9327K126Q069J800k358q259k635R603m315k174
380d603L977n091O545l090J401R510n549n104L243L273O500n650j7746R209R126
395E951M78q596j6760J2242J9223n066j5490o376J3554K3211j1350k3754K131
408a0602J5646J7850j7140k8671P445K3611N731j8265k3672J1719L3951m777k2164
421i338j3119J6635L1791j0371k9301m404K1511J9455j3377l3547M671K6981P088
434A4675j3266k7625J1741L0842O11j9208j2899J2828K4835k511k5835l214J2086
$$ y = [-13446, 29685, 25139, -1079, -22615, -7010, 31862, 23367, -9630, -16697, 6521, 30282, 23616, -13857, -12115, 15506, 23625, 12771, -17447, -12433, 14186, 15716, -1805, -16301, -9753, 13092, 13724, -7568, -7321, -1708, 12401, 12867, -6460, -4334, 3735, 5535, 3177, -5082, -7717, 1886, -2429, -4603, -626, -5717, 828, -2262, -861, 8649, 3100, -2004, 1239, 4512, 11012, 5362, -12384, -3175, 5951, 6429, -2167, -18927, -6685, 12538, 7472, -8018, -14394, -840, 22371, 11021, -12733, -10602, 5044, 22894, 5754, -22917, -15472, 8139, 13870, -4395, -28067, -16348, 17603, 12826, -9338, -22457, -5822, 25969, 15598, -13703, -18107, 3404, 22859, 9482, -24065, -19394, 7587, 14675, 1409, -26216, -14475, 16367, 16978, -2230, -15129, -2301, 22534, 20023, -5812, -9026, 3060]
447C060J6051p888k4311L575J2777P765q007j3844L244J8111M55r115j980m27
461e34J3666l360q997Q3o12L028l239n735J117J814o322N338J81l13M071j0085
477i899Q938O854m133n505m560N765R461q076j5376L356O134J1232j1813j6884
491b4506J1585J3248O117j3474j3336J2151K2267o222j8401o926J0057K2738j4151
504A147k2211j049J7024J5623j4786k1742O100K6054M577j2948k0471J1877K7897
517A7092n966j7432j4730J3996K1918q192k4453l301J7300J4680o985k5121Q035
530a3159J8973Q510r274j9290J0041J8089Q44j4915r053M934J6085m109j6970
543i294R92M327J1679m207j1389L151P871L762l204n579m59Q382n376j910l98
$$ y = [3060, 19111, 11223, -13088, -9513, 3264, 11029, 3022, -10822, -7578, 10533, 10988, 1873, -107, -534, 13132, 9772, 775, 858, 246, 3274, 35, -5700, -4583, -2769, -9091, -3753, -3572, -3885, 186, -9899, -961, 5893, 1760, -3745, -8305, -2540, 6921, -1155, -16531, -13175, -7041, 4191, -7622, -24506, -12921, 327, 6444, -7030, -20366, -8215, 14052, 7830, -10571, -17497, -7440, 15298, 1147, -21064, -22113, -5089, 10534, -4252, -25994, -19894, 6160, 10737, -2211, -22682, -10805, 17092, 11126, -6306, -21036, -7040, 14878, 6686, -17767, -21068, -3768, 10912, 3927, -21194, -13159, 5814, 14324, 5050, -14240, -4199, 13890, 14734, -181, -9234, -4300, 11785, 7676, -9294, -8302, -3975, 7704, 3497, -7892, -4741, 3130, 6892, 3688, -1891, -2350, 6032, 656, -1254, -1652]
558a652m443M021n818o34M362l016m541K925K237N149k331j0472Q639N419R90
573H35o463j1417R691J0186m875j1861l966R268J5163r212j4840N018J2554J2887
587A2968j2085j5400Q380J7987K411j4394j3788R261K1112o278j6781p878J3091
600a394J8986r070j8793l58J7075J2122j0072k1387O204J8846K493j2586j7904
613a5838Q171J8365k725j6110r676J0007J6030m861j7031k14J0546J2181p520
626A325j5566M557J0401M205p606j0125L241J1500j068p193l293L029R799k796
640D10m491J360K615M053m23m054K234K650l903L321j591L31R90n659M085M036
656E964k162l575j536M105P616o467p694L241M372P331j0070j0492O621R264J009
$$ y = [-1652, -6095, -2074, -7892, -8526, -4164, -7180, -11721, -8796, -6559, -1410, -3741, -14213, -5574, -155, 835, -5628, -17045, -7354, 2832, -2043, -13904, -17870, -8602, 6561, -2651, -17491, -12473, 81, 12968, 883, -14517, -6137, 11850, 14261, -133, -13921, -4660, 16452, 10174, -6607, -14485, -1394, 17592, 8522, -10271, -10629, 6446, 18568, 8496, -12891, -6687, 12159, 14652, 2066, -15838, -7667, 10698, 7973, -8137, -17813, -7806, 8224, 3363, -13668, -13882, -3336, 8845, 1325, -14241, -9684, 717, 4922, -2684, -12809, -9568, 1932, 864, -6329, -9622, -6593, 3206, 410, -4081, -2721, -106, 3947, 3524, -530, 1704, 4354, 451, 3772, 2181, 2512, 3502, -2157, 1928, 5964, 3802, 227, -1309, 2796, 10412, 3945, -3749, -508, 3864, 11195, 1125, -9367, -2746, 6518, 7527]
671G527j1152q768P710J5133o736j2097m780J1826J3479j0345j3726rJ5781P710
685A1553j1126j5588O588J7083J209j1389j4176J1437J7203l870j4408o960J3334
698H90J3674n939j7474J369J2631R834q630j6842P106J1238N065j0763j1694P482
712b053J2133j205j1678m204M703J1946n069r975j82M964P726o026o291O76O545
727B010O39k902m306N15O649m296q7j392K44K846k219L61K198K7l105K827Q35
744H44L706k787o064N757J945K304o276n064N957O937l182p906r42N888J0372
759A1489q441q972K320R255O804j1199r528M843J2153j45j1667r584Q604J3796
773I728n946j1138n732J1775J2345q064j3288K14J3546O487q712j5060N964J2621
$$ y = [7527, -3625, -12393, -4683, 10450, 3714, -8383, -13163, -1337, 12142, 1797, -11929, -11938, 3843, 11553, 427, -15161, -8573, 8510, 9719, -1670, -15846, -4409, 12794, 8924, -5484, -12444, 890, 14564, 8625, -8849, -7480, 5151, 14985, 6355, -10487, -3381, 7857, 12922, 2159, -9535, -2053, 10080, 8875, -2803, -7007, -2304, 9642, 4573, -5402, -5584, -620, 7106, 1080, -5211, -4535, 2010, 2649, -253, -4559, -4044, 2605, -1691, -1778, -3170, -2926, -80, -2299, -1938, 260, 287, -2818, 9, 844, 4550, 1763, -4301, 1456, 3401, 5705, -571, -5635, 322, 7259, 4077, -3829, -4771, 1117, 11489, 3048, -5924, -3604, 5651, 12455, 1256, -8272, -3429, 8724, 8579, -3088, -12672, -4068, 9728, 3782, -7356, -13088, -1313, 11032, 2968, -10320, -10106, 3440, 9927, 1215, -13845, -7881, 4740]
787D740J719r998j2740R516J2636j853j1885n243R765J2333m887j2713J974P792
801A156Q169o846j1312L823P937K793p616o749L827R330j682n469j658L266P587
816F556l643l673J223J769K068j633l966J595J329l314J133j059R68j39l070L287
832e69K377r35k635q39K940M685n154n674K234K759L692p427p028M730P456p62
848a50p805m424P294J0151m748q022k942R807Q605q481j0145J500J0302M295q909
863c672j1046O431J2126O70q938q089J0139J1983k161j0861l638J0096R674o073
877F641j3076J544Q650O882q529j1160N173R684L022q621o756N918J0736k165
891G943q208l073M314Q472o043p507j200M935L924n221n683J450N897m22j204
$$ y = [4740, 6459, -3539, -16279, -6763, 5873, 4020, -7865, -13108, -3343, 8990, 4103, -8610, -6636, 1156, 9325, 2479, -8833, -5010, 2927, 5720, -1896, -8645, -4818, 4512, 2830, -2639, -4297, -1031, 6556, 2913, -760, 463, 2232, 4300, 2667, -1299, 296, 1625, -1689, -556, -1615, -647, -786, -3856, -569, 1808, 873, -1762, -2601, 339, 5024, -130, -5804, -3570, -811, 2881, -4546, -11574, -6844, 612, -150, -7955, -12379, -5085, 5066, 318, -7704, -10646, -839, 7766, -715, -10860, -9360, 942, 5237, -3672, -14718, -8287, 3839, 4509, -4429, -12518, -2379, 9604, 7443, -3418, -7056, 3040, 12714, 6641, -6435, -4891, 3759, 10641, 2112, -9048, -3875, 5809, 8831, 210, -6546, -628, 10108, 7943, -265, -3338, 976, 9448, 3405, -4102, -5302, -367, 3557, -1664, -7347, -5897, 0, -422, -1626]
906a626l940K710M812k625m34j487J346L85j573j100J207m29k182J415m09L853
922g7l029j906M119K522J834m070k029L512N826l831n384j186M504O172p601n212
938e836Q30P857L779p607n726N198R875j583p116p012Q207Q959n515q967m436
953i093J0060N990o521j0402K014J0227M015o517r798O989Q957J705q656o980
967h010P657Q034k101j0157k556O673Q260n732q432J951O175O982o534n924L600
982a14P174J718n747m661L085O763l449m001l138L241N054m276k012l61L274J281
998C831p51k910J694K115j806O13k320J410o25k226J165L80o80k031n07J434M018
1015B804l449k813K204K702L410n212l449K925N475r05o084l861N781O096m220
$$ y = [-1626, -5566, -2856, 1956, -669, -1103, -2590, -1244, -859, -2432, -3532, -2325, -2754, -4936, -3521, -3930, -77, -3106, -5012, -893, 1629, 3463, -607, -2636, 876, 6702, 2871, -2513, -3699, 805, 6977, -624, -5836, -5006, 2851, 6630, -977, -6703, -1505, 8370, 6787, -329, -7341, 866, 9825, 4310, -4657, -9093, 967, 6957, 436, -9966, -7952, 2275, 6290, -227, -10025, -3036, 5921, 7626, -1030, -8010, -353, 7681, 5580, -4577, -7133, -460, 7800, 2068, -6364, -4413, 1762, 8744, 2210, -3714, -114, 7060, 8778, 3031, -1630, 1455, 8218, 4769, 768, -2370, 871, 5925, 1649, -363, -724, 2550, 3831, 3080, 170, 1864, 3979, 2173, 2786, 466, 1876, 1251, -975, 190, 570, -110, -2141, -2648, -1214, 2804, -645, -3458, -1254, 1448, 4858, -354, -3803, -878, 4597, 3692, -2392, -6253, -472, 5624, 1404]
1030A404n697j889Q228N675o494o070J657R185K764p378p554N473Q494o04q552
1045a358n818P755P374l005r122j631Q217O917n768q867K749P057M764p318p884
1060e938M542P483K36p517m661M570P661k759o316j886N199O186m744m625L15
1075b254M698K734l304m689J991M161j043j720l185K491K805j566j115p58J753
1090I99L24l14q04J373p61o29N09m62K331k539j991J963J887o27k777j305K638
1107a85L903l054l082j184M916L622n250l552R92O262J216n443m797M672O096
1122E132j544n496m503P486N446l358p350r80Q188M078m969q026L042P107L199
1137G452p314o730N815O327M40q226l826N707O984k921p917q89N467O400n752
$$ y = [1404, -4293, -6182, 2046, 7721, 1227, -4843, -3186, 5999, 8763, 1385, -6169, -696, 7798, 7194, -1358, -7176, 579, 7953, 4948, -4174, -5805, 2412, 9329, 3561, -5306, -2557, 4500, 9264, 1946, -5938, -1396, 6087, 6323, -1194, -5855, -1285, 6376, 3617, -2699, -4585, 614, 6800, 2056, -2569, -2254, 2444, 5178, 1874, -2815, -824, 3337, 2294, 574, -2611, -120, 2685, 1119, 4, -754, 999, 1323, 1009, 205, 1578, 817, 188, 697, 235, 2566, 27, -1964, -1, 1886, 1259, -1518, -2823, -185, 3718, 664, -2418, -3602, 1314, 4936, -314, -3866, -2874, 3388, 4604, -839, -5636, -964, 5132, 3588, -1908, -6411, 1075, 6521, 3163, -4187, -5167, 3021, 7099, 2130, -5896, -2854, 4253, 7452, 138, -6592, -777, 5550, 5990, -2236, -6062, -355, 6629, 3708, -4209, -5098, 369, 6769, 1017]
1152A017n830J125N866L815o213m405K380O029o06m555l657L435N365k984k868
1167b086k136M119K618k492k220M48L427j68q63k606K327N32q58K1j435J698r64
1184f38n92J28K025j067j131J79J189K932l464j155O16K764J174m621j801K120
1200a342M309j897m012k673N569L935m029l371j371P177K602m518n457K116O905
1215C943N12n106n948M690N764p23o674l409O439N495k475o072j346O942N028
1230G060n726n458K423M929L031p052m596L753N247L70o223l011M424N876k663
1245B384m306j039M472M708m200l779J36M312J444l863l299J799L169m10j752
1260b24k662L216K100j076r98l38J834P28r02j320J392j027j87m06q3J369k049
$$ y = [1017, -4813, -3688, 2178, 5993, -220, -4625, -2245, 3784, 3178, -1377, -5034, -1599, 3766, 782, -2086, -4222, -103, 2515, 23, -2197, -1749, 1678, 1510, 647, -1959, 368, 900, 42, 63, -1372, 326, -638, -1230, -1102, 923, -144, -1275, -1096, 93, 3025, -439, -1594, -978, 1786, 2960, -1661, -3462, -1342, 2967, 1070, -2942, -5615, -46, 3889, -140, -3511, -4882, 2295, 4897, 379, -5078, -2962, 3943, 4455, -651, -6599, -1909, 3855, 3132, -3542, -6951, -512, 4983, 2508, -3564, -4910, 2032, 7060, 1334, -4124, -1701, 3228, 6259, -793, -5389, -1636, 3611, 3981, -2242, -5253, -829, 5047, 2384, -1922, -2961, 1511, 6219, 2019, -1760, -1624, 2688, 4132, 269, -3030, -1231, 1938, 1528, -224, -2886, 330, 2430, 1354, 356, 18, 1852, 2580, 1678, 358, 1750, 723, 536, 130, 47, 1416, -633]
1277f33o28R32J645p3j460r57K580K582j918k107j199L835J842m252l191Q94M389
1294B281L95m200l638M651M080r03m797k106O071L601k993n532j31N700K548n344
1310c17n549K592N174K039o272m207M902N413l83o132j919N401N316l296n756
1325b994o10M881M196n320m068Q66N030K183m495l366L175N363q67k591k991M013
1341B405L605j939l148r66L152J401j688l041Q25J952Q78j337j705K469N48r4
1357C317n20o21J086k15o94n82R03j659l88j034R99J124k802k66l9K776K24k480
1375h71j431K165L005j737k842k245M139K026l023l541o04N264J156l057l868
1390e464K405N025J159m637l248M829L839l99o086j518N344L217k433o153J085
$$ y = [-633, -1261, -329, 1316, 1243, -217, -1174, 1406, 3988, 2070, -37, -1236, 2599, 4441, 189, -3002, -2108, 2281, 2676, -1524, -5162, -511, 3569, 2666, -2131, -4237, 1834, 5435, 2442, -3090, -3221, 2479, 5027, -317, -5866, -3274, 1900, 3939, -2333, -6540, -1638, 3775, 3392, -2740, -4659, 742, 6058, 2762, -2994, -3604, 1277, 5473, 153, -3915, -3049, 1981, 4164, -331, -3697, -522, 4841, 3974, 1383, -1608, 2405, 6010, 4071, 923, -43, 3109, 4510, 2822, -219, 606, 2558, 3436, 2099, 394, 2863, 3411, 3317, 2797, 2176, 3262, 3047, 2353, 1771, 2674, 1015, 627, -407, 592, 1716, -1086, -1352, -1391, 1385, 1609, -871, -2302, -137, 2868, 1131, -1711, -3956, 183, 2209, -814, -4355, -4959, 305, 1461, -1596, -5464, -3059, 1966, 3125, -1512, -4760, 69, 3908, 3509, -2577, -4095, 1249, 4466, 2033, -4120, -3035]
1405c035M890L492m490m519K689M934K176n837k343L135M920j219n160k064L722
1420A291L819l038l648j226M479K383l560k536N92M473L56k453k872K263K309
1435B632q91j818k225K508R12j178j381k75J674L12k75j122J536j00m5j36J66
1452B94J073j371J23j58J239q16j326p84K094J225j714j209j69L099R48k668j776
1469a896J150L639o39l384k046L036K607j253l571j787M808J835j975m300Q83
1484b893M491J835m055l703K614M095P04n222k750L527M129j029n503j015M426
1499c49L816l168l973M8M542L007m631l080J251M684O19l846k772K694M090j459
1515A473l130k047L796K391j725k302n35L083J267j961k249J302J795J50j313
$$ y = [-3035, 1855, 5347, 857, -3662, -973, 3961, 6137, 300, -2043, 1092, 6012, 4793, -367, -2431, 1291, 5110, 2072, -1576, -2802, 1677, 4060, 500, -2036, -1444, 3029, 3385, 932, -1940, 323, 2632, 1741, -77, -2302, 206, 1118, -60, -1441, -1716, -42, 270, -5, -1127, 409, 309, 264, 128, 294, 1367, -4, 119, -39, 1200, 384, -942, -1726, 368, 1593, -121, -1330, -1499, 1600, 2548, -120, -1896, -746, 2893, 2254, -1130, -3176, -140, 2467, 1214, -2357, -4144, 664, 2499, 524, -3776, -2893, 1598, 3433, -622, -4325, -1711, 2384, 3088, -2134, -4884, -1357, 2772, 1743, -3760, -4775, -349, 3467, 299, -3674, -3626, 916, 3923, -708, -3788, -2537, 2147, 2766, -1080, -3852, -1158, 2932, 1473, -1657, -3704, 92, 2483, 758, -1544, -2079, 1004, 2271, 310, -1939, -637, 1158, 1308, -5]
1530ej525J520L71L15j238K08L79J46m12J64Q06n40q5o45J165R47j711n67L03
1549d04J566J30j623j658K157K046j360k060j119L600R52j793l242P76L720J117
1565B805l300k675K420L189L71m516j980L840K769q88n233j44M026K691k748m111
1581c484Q81L666K583m496k567J462M579K63m451j789K419M195j876l398j707
1596c720L693K794k998k392p42M262J273k600k502J191L029L6k078k358K347J573
1612H08j66k264r26K456M26k94j742O09J220N66p31n86J316m30L10p24O18L79
1630H45m83l94q1J490p08k89j073J797J211j427p81j31K992q3j849j903J656K296
1648C085o48k780j899L364J436q02l664k56M073J208k349l409J311L789J069m165
$$ y = [-5, -1530, -10, 361, 676, -562, -354, 25, 171, -241, -77, 729, 189, 104, -541, 624, 1571, -140, -707, -404, 1162, 1292, -331, -1989, 168, 2214, 854, -1206, -2325, 1275, 2227, 434, -2808, -2032, 1688, 2805, -495, -3170, -750, 2439, 2810, -1706, -3686, 154, 2923, 2035, -3198, -3342, 684, 3375, 627, -3484, -2603, 1063, 3646, -850, -3417, -1955, 2624, 2887, -1564, -3353, -934, 3261, 1385, -2013, -3720, -27, 2767, -231, -2623, -3365, 897, 2170, -430, -2932, -1741, 1288, 1324, -754, -3112, -765, 808, 642, -1622, -2548, -92, 334, 40, -1702, -1093, 127, 693, -38, -624, 692, 262, 572, -152, 466, 845, 362, -32, -113, 1377, 669, 380, -693, 1104, 2315, 888, 107, -24, 2968, 2885, 1036, -867, 789, 3085, 2437, -343, -2242, 1122, 2558, 1756, -1908, -2164, 1909, 3117, 768, -2641, -1330, 2459, 3528, -637]
1664f37k665K408K768O11m898j530L152L218j375m078l97L704K734k932k650J67
1680b400L819J980l962k121R96L969k27l234j791K503K968j291k225r65L442J549
1696C010j161k227k90K813O97k057j900J240J060M62j925q41J482K20M11j244
1712b50l10J144M37n79l67N86l54m5q87P36o5j053k93q8J659p46q19o34J834P22
1732F28r3j613o43K688L74j252k212N74K290Q89l224j626K051K612J35l815l56
1749b593K912K320p18l836k38L547J994l028k660L99L354J296m126j825J565L710
1765B073j59l610j118K829K968j424l253o08L555J226k255k632J08L606K72k484
1781i06k243K057K250J01j926j520K619J178k52k241j38J718O44p08j991Q29P79
$$ y = [-637, -3302, -894, 1874, 2485, -2413, -3943, -791, 2427, 1052, -3026, -3423, 281, 3015, 83, -2567, -2400, 1419, 3399, -563, -2684, -1688, 2281, 2054, -1180, -2971, -468, 2500, 1209, -1016, -1981, 1461, 3010, 1849, -378, -668, 2145, 2842, 785, -1115, 125, 1185, 1647, -278, -1119, 363, 583, 994, -250, -560, 584, 1021, 442, 75, 661, 307, 262, -625, 111, 46, -1007, -1300, -1388, 271, -475, -1294, -1928, -94, 628, 535, -1078, -1721, 967, 1341, 89, -2123, -1549, 741, 1630, -1594, -3220, -1169, 1443, 1578, -2237, -2593, 319, 2639, 1921, -1915, -2153, 1394, 3388, 360, -2300, -1901, 1453, 2749, -1377, -3202, -1637, 2073, 1914, -1696, -2814, 15, 2983, 1559, -1694, -2302, 1253, 2479, 224, -2408, -2300, 1306, 1578, -906, -3149, -1092, 1158, 1259, -667, -2187, 432, 1610, 1358, -883, -1021, 697, 1341, 633, -1358, -529, 250]
1798B50Q15j730l9R43L82K59r23P15K89O3o75N17N12p54l83r61J435J78r30r80
1818a017q7K120m29j173j149J541J606n9k503p94K145Q57j080k807P78J920R16
1835G85j951k695J500K475P31l005j467J860K734K84l761q01K432K444j742k969
1851c146l71L133J863k740k205O22L517O78k294k039J383L701r07k402j386K341
1867b52K079j440k050j072L257O31j069j964P46K068J24r98j435R48J618L41j946
1884d14n06J035N78j37j124J73N66J87o51j79O07j04L30n41O84nk77n11J82R26
1904H19k79j039o55J326P17q67j438Q4K015O70j336k004J209K200J69k201j062
1921a672J353J918k24l271P6J713J954j190l012P43K879J148k617j782J083K646
$$ y = [250, 1065, -665, -704, 239, 621, 880, -43, 672, 961, 1024, 349, 866, 1378, 624, 241, -720, 715, 893, -37, -1017, -1104, 1016, 587, -586, -1735, -194, 1412, 1353, -1150, -1944, 201, 1058, -22, -2829, -2051, -131, 785, -1166, -3861, -2361, 114, 845, -2160, -3627, -1767, 967, 1251, -2510, -3311, -879, 1565, -177, -3146, -3517, -384, 1479, -1261, -3466, -2844, 673, 1351, -943, -2982, -1599, 2102, 1195, -1207, -2593, -252, 1827, 387, -1663, -2735, 522, 1153, 84, -1880, -1134, 934, 1058, 60, -1375, -427, 1191, 1532, -414, -920, 115, 693, 556, -568, -395, 171, 358, -293, -472, 135, 31, 361, -180, 504, 499, 222, -289, -107, 819, 540, -499, -1154, 172, 889, 22, -1416, -1332, 683, 1353, 17, -1987, -778, 1422, 1591, -610, -1672, -319, 1599, 1375, -1896, -1820, -107, 1847, 657, -2355, -1612, 1267, 2415, -202, -1984, -901, 1745]
1937A745P11l165j377J490K805o69k748j095K733J942j699k158o95L039J067j663
1953B63k261M34K902K75k157j501J332J828k33k091q19J528J345k85k158O9J494
1970c5Q45j157j031J50J196N09j414J60n0Q61l43o15M69K3N83n91M9RM06o13O5
1991e24P27r9J32j213N12J208L18j348q72J580N33L46k078l02J557J038q18k191
2009a494O86K006J049k365j310Q35K555M28l044o19J352K778j083k798m13K121
2025F84K255j962k194l15L154J039k516j737O99L483m84k042k055J938K388o63
2041A672k142j274K493P74o61k400K70K006P58j149k097J248J340L86j510j006
2057a292J479N83L75k212K32P58O10p50q48N06M21P74j112K06RK04J23m34N53
$$ y = [1745, 2456, -709, -2086, -596, 2209, 1540, -1208, -2303, 430, 2372, 673, -1485, -2180, 859, 1926, 263, -1998, -1564, 1338, 1613, -544, -2045, -713, 1115, 882, -1209, -2028, -500, 845, 560, -1598, -1529, -35, 810, -347, -1378, -1228, -32, 477, -937, -777, -827, 34, -309, -924, -455, -432, 151, -440, -391, -382, 24, -589, -524, 203, 104, 236, -977, -465, 743, 1061, -287, -1159, 421, 954, 1300, -778, -1080, 477, 1515, 697, -1494, -808, 1198, 2247, -118, -1428, -593, 1962, 2390, -654, -1273, 79, 2857, 1774, -1024, -1437, 684, 2939, 977, -1217, -1532, 1622, 2661, 145, -1592, -893, 2590, 2106, 64, -1991, -53, 2335, 1672, -470, -1744, 749, 1523, 862, -1538, -1268, 738, 1496, 347, -1750, -502, 838, 1224, -286, -1292, 187, 770, 1145, -1067, -835, -77, 533, -217, -1065, -559, -138, 636, -476, -270, -261, -57, 66, -368, 185]
2076A85m40K15n47J78N35m78l44o47J290L14l14j358K88J911q9p20j464J025J437
2095I77l32j805m21J286J047j78k456J92J848J239j190j940N71K072J292k262
2111f0j516Q99K346R3k663j220J545K338j030k111o71K204J669j552j968j20K924
2128A107M25j632j635O16K221J10k040j591J494J752j81k272m9J330R29m03j457
2145a276M93J126P34j014o16L60N07K74r60j11K78R27j52o16O56J60K20m82M73
2164I81J11J50k85p20J288m11m2j185N81P32K64j205o19R85O73k69j588J38J339
2183I18O09j160j561N30J172M02k116r85O21J923l1k348l86J151K194j137k088
2200b292l05K192J410j473k020%K784M2j575j568P71K656l30j233j296J715J772
$$ y = [185, -255, -40, -587, -409, 126, -352, -696, -1343, -53, 261, -53, -1411, -1123, 788, 699, -21, -1485, -460, 977, 645, -1160, -1581, -295, 752, 574, -1882, -1690, 158, 1397, 207, -1733, -1162, 910, 2202, -60, -1576, -677, 1669, 1762, -901, -2121, -576, 1762, 732, -1379, -2050, 154, 1823, 271, -1697, -1817, 1107, 1532, -100, -1735, -1119, 1102, 1212, -828, -2419, -925, 827, 646, -1626, -1675, -345, 584, 181, -1276, -783, 343, 1077, 63, -553, -193, 314, 588, -372, -483, -205, 722, 570, -46, 610, 770, 990, 508, 981, 1092, 1242, 957, 237, 1525, 1114, 1072, -113, 468, 1200, 1464, 259, -360, 625, 1298, 1029, -559, -421, 918, 1527, 367, -1194, -664, 508, 910, -1206, -2191, -1570, 353, 322, -2026, -2412, -1261, 933, -204, -2292, -2597, -405, 1005, -468, -2488, -2488, 296, 338, -1237, -2805, -2034, 622, 292, -941, -2237, -522, 1250]
2217A250m02j736m08J962J031q88j802J38J834M92j002j589Q98J156L74j779m9
2234e20Q94Q15J08j653J01P67P72j118l87R7L15J91p90j5k57J325q06k85L06K27
2254H7N9l90J33K29J69o07j88O87K93k56j306M24J154K65r44q00R78J283J47k104
2274f87K20R59J199q93j810L70J480Q00j552j106N01J672M93k040j042R02K204
2291A670n94j899n85J456K068j406j687p70K170R47j647j302L26J941L92j251
2307a71j616J249J450J93j470j080J582Q47j50j768MJ217P64n64j538M25R76Q22
2325A172j046p51M47Q45J60r64M8L64N96n02l68m2K66L05o11K12j68M75n35j89
2345b86M94K50k78p48M54J35M25o94m32M80M44N7j424K45J105O44p24j280M17
$$ y = [1250, 848, -888, -1296, 666, 1697, 809, -993, -855, 979, 1471, 469, -1120, -222, 934, 1308, -471, -520, 374, 1189, 1297, -356, -255, 512, 1284, 166, -221, -124, 191, 382, -408, -423, -680, 645, -161, -446, -140, 87, 146, -244, -111, 118, 287, -320, -508, 179, 472, 216, -1090, -666, 488, 753, -191, -991, -13, 1270, 1417, -687, -467, 492, 1691, 798, -1012, -642, 838, 1638, 86, -1020, -519, 1153, 1646, -394, -1436, -534, 1670, 1076, -823, -1408, 48, 2116, 710, -977, -1747, 423, 1370, -277, -1579, -1253, 688, 1080, -171, -1787, -538, 912, 1105, -365, -1445, 137, 984, 834, -934, -930, 287, 1051, 487, -1051, -626, 350, 1172, 126, -625, -178, 667, 827, -137, -89, 275, 871, 369, 1, -41, 225, 530, -81, 131, -37, 438, -97, -286, 208, 458, 180, -568, -114, 21, 446, -248, -680, -200, 244, 301, -1123, -878, 227, 871, 147, -1133, -716]
2364g16J275N34j629n66M78J762k64j554l15R45J446r29j456K51J607P20j520
2381F9j006j2K438j05j272j402R70J926m12j656r96J849R52l30j796k32J702Q00
2399A487r63j518N72J391L53j325r84N98J305n1j226k12L34J128n25q93K67J81
2417h1Q17m39o14k00Q92Lk26o3m36R09o77R1J75M2Mj40K90j78J20o03K76J4M55
2440D31q7j022R62j44M82q83k93M49L98M96j644J57P52J076r32j294L92R52J312
2459A560j657p86J11J950j54j297r09R08J666n14j264r12J332J260o39j550l69
2476a264J813N29o22k055P31J844Q7j097j354J285Q93L41j919l44J010Q33k40
2493D71k010N61N88J113o97j338Q04P70K63j056q3n5J103l01r95M58l7O56p8n61
$$ y = [-716, 559, 1093, -536, -1102, -624, 1138, 874, -680, -995, -50, 1396, 467, -989, -738, 869, 1589, 69, -937, -949, 1489, 1384, 112, -1290, -320, 1606, 1194, -462, -1458, 391, 1343, 1013, -783, -1015, 687, 1487, 524, -994, -422, 969, 1322, -3, -987, -389, 916, 865, -361, -573, -239, 889, 364, -529, -262, -81, 736, 297, -317, -517, 375, 378, 152, 89, -347, 562, -115, -24, 151, 193, 197, 57, 347, 169, 289, -314, -38, -24, 431, 344, -678, 284, 140, 622, -261, -554, -105, 293, 789, -855, -698, 54, 1130, 198, -1096, -704, 248, 1560, -97, -883, -772, 1178, 1024, -273, -1182, -274, 1392, 878, -386, -1298, 34, 1294, 655, -895, -1264, 549, 1078, 456, -1599, -868, 976, 1063, -34, -1388, -103, 790, 1131, -788, -1132, -122, 711, 471, -1539, -978, -390, 723, 26, -1312, -508, 262, 525, -531, -614, -669, 434, 133, -862, -404, -441, 215, 137, -424]
2513d24o9O46j70j58J59k7N17n99M19%K7q6l75L80J92J93o55Q6L67M4L19j372
2535e86M43O74O41r66p82M79Q52L18r96m92K59J397p32j278q5Q06J176q56j092
2554h20k03J649N45j305p63J01J733P3j301j436J426J239m44j170p16J497R19
2571A024l75j739q8J947K21o90j394Q28R51L50j187o09M77R85m1j279J5O69P05
2590G70n77o39m7O03M36n59m81K46N17J7n22Lk48O55n47j65MK29J79l59J30M86
2612A31r6l45J08m6M54k06m50L51L95K88q78r5N38N72k46p73l8P04R51r73o90
2633c44J37J113N03j057q30J40J594l09j127q00J132J210p11r50o78J253Q73o74
2651D75j492K74J099N43j148j021M21J226K94j550m77O77R56j92j088l2Q10Q30
$$ y = [-424, -493, 153, -17, -175, -16, -43, 474, -125, 294, 294, 321, 235, -140, 240, 432, 625, -30, 56, 423, 467, 786, -586, -143, 531, 1172, 206, -576, -97, 755, 1073, 77, -415, -156, 1241, 509, -769, -854, -48, 1128, 272, -820, -1023, 626, 1171, -134, -897, -796, 937, 1010, -291, -1727, -301, 938, 494, -676, -1392, 105, 1024, 649, -1090, -1178, 769, 990, 300, -1094, -266, 685, 1035, -152, -761, -284, 701, 660, -619, -604, 65, 770, 193, -446, -493, 110, 546, -13, -494, -248, 269, 286, -236, -233, -481, 174, -373, -538, -534, -305, -126, -485, -355, 131, 35, -310, -202, -248, 206, 0, -450, -99, 296, 584, -294, -389, 149, 721, 475, -298, -336, 368, 1319, 346, -344, -207, 906, 1409, 352, -478, -338, 1256, 947, -180, -980, 152, 1362, 651, -299, -977, 276, 1149, 475, -1017, -743, 356, 899, -249, -1270, -849, 377, 671, -879, -1356, -679, 277, 85, -1003, -1035, -225, 605]
2669F05m78j029J67O20M82o21m20m5J021K05p33j68K79J064l21m08n7PP27l98
2689D99N3m56Q95k47m33J01K90M4k93J22j65M4J05l27L29OJ0o76M89j35N23o34
2711A44o78K99K44O32j013m08qQ71rr20K46M10J102j283n83j67J036J029j166
2730b22r14J00J552r7o08q78L33J506k9r44q43Q78J247o04j119l26J380P11o12
2749E11j275J36J199M95j078q89O40J033L76j436n17R07P99r2j505K09M73P98
2767G84p15o50R3O37M47q30q1K3O63R4n20k74J30M87m29M29l43KO3o3J39j4K72
2790C44l86Q0K8M45l75n18L16M42J76p36R7J01N54k66m91k70O51M94p24m40j81
2811f59J242P7q50n44L36J222l99r29o67J155N61k26r00l59J052J011q38j280
$$ y = [605, 127, -902, -735, -115, 367, -254, -674, -719, 302, 507, -226, -394, -115, 949, 628, 220, 163, 170, 897, 499, 552, 96, 991, 744, 311, 412, 702, 746, 453, 575, 410, 454, 559, 232, 561, 567, 577, -99, 390, 255, 778, 144, -534, -235, 9, 641, -372, -780, -788, 83, 74, -846, -600, -190, 912, -371, -954, -1121, -85, 944, -222, -1136, -1036, 516, 419, -189, -1067, -734, 772, 743, -201, -1044, -166, 1081, 477, -642, -968, 412, 1123, 511, -764, -628, 571, 1066, -12, -901, -261, 772, 1148, -288, -805, 102, 901, 809, -696, -487, -14, 784, 69, -581, -488, 149, 596, -234, -315, -292, 371, 465, -55, -329, -199, 288, -141, 288, -55, -53, 10, -53, 86, 72, 344, -42, 38, 66, 511, 136, -382, -66, 376, 552, -184, -87, 14, 568, 302, -189, -459, 192, 686, -38, -478, -659, 583, 660, -190, -734, -398, 824, 425, -504, -1171, -16, 545, 319, -581, -940, 112, 1123, 285, -995]
2829i95L96R40O32q67j212Q77Q74K01j084n20Q68P72j41r81j19O05J090r22r68
2848e54L69O61M94q44n93R1R77N7o31l86N0Q90m45l61k08L39K01l14m42J15M97
2869c7j22l7l64L07K52n08K48n9P9j16J72l25M47J07n68M9M73M26n71m50R3N68
2891F4L07m93j47M9Q97l96l43m30O72O02o16l28l35Q13M56o30q13L88J126j83
2911F60q72p42P88J019l53p00m87Q90N24k09j079j19J011O42o80j107K23Q05N83
2930G97r37m89K23Q28J15q08l52K92J250n45p36j84M23P70o40m23j7R28j76l28
2950im67Q4J002o78k39l27M81L16Mm37q0L61l8Q7m29K68q0j94M24k95M96k57j94
2973b01j58P18k25l73K93l22Q02k11o78Q1O62M85q06j78k87J064r9j94q32K89
$$ y = [-995, -599, 341, 973, 106, -1106, -229, 645, 846, -238, -758, 110, 882, 741, -240, -359, 246, 1336, 414, -554, -185, 476, 970, 126, -467, -376, 601, 658, 27, -359, -309, 581, 136, -225, -433, -94, 107, -207, -649, -534, -37, -159, -196, -560, -253, -1, -509, -261, -320, -241, -357, -185, -510, -63, 44, -524, -475, -2, 424, -147, -597, -504, 64, 371, -122, -269, -220, 677, 281, -62, -492, 180, 782, 166, -162, -497, 316, 772, 142, -671, -283, 843, 660, -212, -954, -166, 853, 500, -200, -687, 203, 727, 518, -561, -680, 331, 973, 293, -814, -591, 214, 797, -140, -629, -406, 422, 537, -271, -623, -331, 919, 374, -362, -546, -123, 647, 7, -416, -433, 495, 319, -9, -476, -392, 610, -68, -307, -634, -153, 163, 167, -270, -350, 11, -27, 60, -369, -101, -181, -375, 49, -246, 250, -7, -201, -359, 359, 134, -239, 54, -268, 534, 323, -355, -274, 388, 873, 67, -111, -398, 666, 567, 373, -459, -170]
2993a70J211l47q14n86R49M94l19r13j5P69O61o57j054M98R50k0n90r19N83O77
3013C88k8j038k67P49O49k59j121L4Q70O05q03o14K36P36K88r23m05M12Q71k77
3033A03n05k50L46N55j79m54LO43q0P0m93O3O13k81R0k86L27N6k39P9m9L72l10
3056A94j5m9q7L09m38Q0L18J68m10L3j98L82j97j39m4o3O10k45l62m99P73N92
3078G13o44l46j96R30K3m07p51J58Q88M35r50n74P46M67q9p42k59O38Q12l29j314
3099g91L97O58P52j015o08J25R43M84j064n19M13R49k95p74j13M14O71m39n18
3118c30j52O24M68r45k29M9J009k57l05n64N35L25l40j56j24O89j59j72l13L8
3138c09K81k42K73l25K58k19K03K91m21L91k72J93l98O55l12j00J15O4L82o24
$$ y = [-170, 1041, 694, -120, -706, 243, 737, 418, -495, -510, 259, 920, 263, -791, -293, 657, 637, 47, -872, -289, 388, 360, -678, -945, -196, 453, 194, -927, -893, -23, 582, -221, -835, -599, 137, 425, -498, -903, -491, 380, 103, -402, -652, -306, 249, 70, -384, -381, 262, 182, 252, -241, -178, 435, 154, 244, -42, 285, 341, 102, 181, 132, 504, 194, 179, 130, 43, 352, -86, -6, 312, 480, 70, 103, -95, 287, 90, -49, -93, -156, 454, 209, -153, -652, 121, 713, 69, -277, -473, 457, 480, 73, -678, -520, 368, 803, -147, -721, 25, 492, 403, -339, -598, 40, 852, 523, -791, -394, 264, 1016, 1, -607, -482, 461, 945, -119, -638, -225, 724, 429, -345, -458, -44, 627, 188, -330, -482, 142, 610, -335, -564, -515, 494, 237, -68, -632, -97, 228, -112, -268, -392, 297, 138, -34, -347, -309, -28, -270, 3, -322, -64, -283, -80, 211, -210, 181, -91, 102, -296, 359, 47, -53, 62, 126, 508, -116]
3158a16L59n00N97r7n8l86o0P58k29l22l88P68M53m63m20k33P67J10m49o92L11
3179b90N18J37k81r10O98M06K45o94l02M10N11R4j001p2L80J003q63o80L79M17
3199A05O82j107k20L52L67L99o92l50L17Q47m60l00k28J50N68j51m95j39Q81k88
3219B38j91l73L18K71%j22k89N49j91J52j94j0M5k22q6j04L38k0l74J48L04j11
3241G6k84p6J35M01j32k09j13J56N31n06k01l84M48K32k19m07J90M75o2l15m42
3262g06L23P80k16n14l63N67M58o3r36K65K99Q08n23r89N14P52K62q91k36K63
3282a46O77j36m11n02N85N25k46n34k98M82P43o13l49J16J85K11r5n59nQ17k6
3303D21n73m21N05K28j24m43j31P25Rk08n6j16J35K44m08J96J66m16L38j56J61
$$ y = [-116, 243, -257, 340, 243, 185, -201, -261, 497, 268, -54, -442, 326, 779, 316, -104, -337, 430, 540, 91, -601, -290, 228, 365, 84, -826, -128, 278, 523, -171, -473, -63, 448, 542, -459, -531, -151, 852, -11, -691, -312, 105, 787, -320, -540, -188, 179, 578, -114, -464, -147, 700, 240, -60, -288, -138, 430, 279, -216, -355, 526, 238, 47, -326, -8, 263, 263, 141, -148, 401, 210, 362, 168, 158, 203, -19, -105, -209, 129, 109, -265, -117, 187, 76, -208, -284, -149, 252, 120, -89, -202, -46, 485, -21, -222, -606, -158, 74, -145, -552, -362, 113, 51, -264, -706, -383, 397, 181, -333, -696, -129, 329, 266, -670, -405, -106, 702, 179, -810, -296, 456, 718, -173, -409, -146, 531, 395, -16, -518, 67, 592, 346, -188, -486, -4, 739, 126, -223, -107, 78, 289, 194, -365, -370, 447, 421, -152, -573, -68, 160, 36, -407, -538, 187, 196, -12, -68, -184, -49, 195, -213, -17, 149, -267, 71, -85, 76]
3324G6N0q6n3O1K26m68Lr3L1J73K22k52KJ31M64n61l33J02O05k58l91k47M99K57
3348A60J64o52j26Q98k9k72p76J95P33L48l14q45K44N81L73j172k4M28O76j80
3368D10p76j68O34M59n47j16j47M93L58o64m11L62M05k6l61n34N71N70l00m04
3388a92m4K86M55j79n34r4N98o5j70m45J07K97oJ4m70L47k38P9j93M06j93L0P5
3411a29NR8O1j37J54l0K96m71o4K24J28j14l24q4K89K33J44l55k85P09r5j53k15
3434a15J60L53j12j49n08L93M62j41m66l12M07O32m00j84M13l36Q64r09p72J203
3454D83l08J162j404n80K09J054Pq47n7L81O50m56o49k2M86M02m43l66O3M14K58
3475D37m93n15L22M77q6m64K1Q4K88J45k73n47P74j43j1n35L93j61J66j38K4L92
$$ y = [76, 126, 40, -13, 48, 274, -194, -191, -284, -253, -80, 142, -110, -108, 23, 487, -74, -407, -305, 300, 42, -349, -596, -97, 160, 324, -328, -454, 444, 415, 143, -633, -438, 295, 643, 329, -516, -272, 309, 682, -490, -514, -86, 590, 410, -366, -534, 100, 559, 12, -104, -251, 242, 600, -64, -475, -113, 292, 266, -95, -629, -58, 512, 212, -192, -236, 50, 505, 326, -208, -302, 296, 231, 61, -384, -277, 20, 14, 28, -442, -95, -333, -254, -447, -41, -234, -204, -129, -124, -26, 35, -102, 52, 22, 318, -153, -217, 7, 135, 21, -303, -387, -98, 135, 279, -76, -361, 348, 253, 100, -115, 45, 398, 286, 137, -371, 22, 484, 343, -123, -435, -28, 604, 204, 20, 433, 97, 961, 52, -720, 483, 175, 1337, -67, -647, -438, 616, 623, -224, -281, 100, 750, 294, -355, -377, 109, 511, 68, -298, -235, 179, 437, -56, -571, -249, 228, 142, -322, -301, -217, 71, 216, -57, -604, 170, 27, 16, -519, -126, -287, -121, -259, -235, 157]
3497A57p4j1O8j9k03R4J07J7p0k8J6l39N03r7M19n40j23L50J65l27l47M63M9K40
3521D70m74k63M85K47k99l28J01K28J40M5p72M8M97M67r70K9l3N39L20q41J25
3542b39K19K22k04l89j78P82J36n05l31L0P03K13p08l61K81P75m40j82n03P05
3562B6P3j77m78mP63J10l99j53O2M03k06O6m15M11J40n4n37J95K63j7n2k89J97
3585g2K17lP7l50J78P7k75K04J56MK2k34j21K18J19k98j84K99oJ79m43J48K82
3608A94L17k06m31p3M81N3n66l1K63K97K2n73Q8q1N33r6o21O8M58K94n40l77R0
3631d37M78O03r69J9p7P31k55l30k66M75N43l47n06j99Q38j14r1n87K83J63K75
3652B30P5o60L05M49j88l62j20J34M38L8m83j44J37J97J06l67L4J52J23j08p5
$$ y = [157, 83, 72, 140, 121, -82, 12, 119, 136, 66, 38, 54, -285, 218, 121, 540, 0, -123, 227, 392, 65, -282, 181, 230, 470, -4, -267, 218, 465, 166, -162, -61, 167, 307, 352, -420, -372, 125, 592, -378, -349, -382, 157, 477, -364, -239, -20, 202, -2, -391, -569, 213, 349, -156, -487, -457, 246, 459, -249, -610, -329, 446, 6, -176, -679, 26, 99, -78, -556, -560, 203, 313, -86, -239, -177, 226, 20, 86, -329, 82, 222, 168, -369, -174, 89, 72, 20, -269, -72, 145, 142, 219, -131, 47, 124, -151, 53, 209, 213, 235, 1, -120, 98, 217, -81, -265, 34, 28, 207, -236, -88, 194, 511, 305, -126, -199, 282, 335, -231, -262, 1, 298, 320, -253, -165, -246, 287, 191, -430, -362, 96, 390, -150, -527, -437, 41, 644, -325, -306, -383, 348, 93, -237, -503, -28, 515, 168, -338, -537, 301, 187, 96, -491, -208, -45, 230, 305, -355, -50, 399, 211, -151, -271, -137, 301, 339, -144, -288, -151, 46, 152, -215, -181, -29, 94, -14, -89]
3673h9k7J22O7j79N6n0%j43R9jk29K55j87K93kj59l4j6M34j20j73n14N49M08l10
3698E0r2k43M62O8r7n24k50Q38M3k02n50K74M70L9o50oO35q8J05m42o2N04J42
3721D24k74m04j35O44K28q2p31J78O52K5n08l59L42K18m5k64o5L9N26j3o41J55
3743i0J64K75k29m26M05K77J52m33j97L74P6J9n88P2K60o6j0Lm3l9L00k96J87
3766A47k09K7K89k16K6N2k79r7K8O5n5p6n7K34J00m3Ml67M60K10l23k26K83K69
3790B46J24o20k37K64L86j67kk97K14N26k73m62J25K36N30p05Q6J32K20j5n12
3811b01qm7P28l14k71k62L02L17j51k81J89L40K3k46l08J59K56J9k63k8m4M41
3833C50k26n58R3L13J08O2k21R7M9J07j50l63M32j31k7K6J79j39J33j59j9L02
$$ y = [-89, -116, 6, 73, -106, -50, -100, -100, -243, -144, -145, -374, -119, -306, -13, -15, -174, -208, -224, 210, 90, -83, -597, -48, 360, 50, -42, -285, 177, 245, 148, -376, -626, 212, 255, 53, -497, -223, 247, 286, -364, -370, 265, 177, 282, -160, -222, 282, 424, 150, -254, -389, 255, 483, 401, -330, -152, 500, 525, 17, -342, 0, 218, 173, -91, -156, -117, 409, 396, -245, -90, 74, 349, 120, -306, 99, 376, 528, 95, -102, 272, 348, 367, -221, -149, 111, 45, 35, 38, -5, -44, 256, -40, 147, -62, -35, 254, 38, 64, 116, -163, -260, -232, -167, -222, -298, -355, -121, -21, -64, -60, -427, 33, 243, -80, -306, -23, 246, 370, -250, -487, -223, 163, -4, -6, -303, -89, 437, 164, -298, -173, 63, 593, -112, -26, 106, 326, 311, -201, -209, -256, 472, 158, -113, -375, -73, 244, 93, -188, 1, 341, 364, 118, -190, -31, 225, 244, -19, -47, -91, 350, 124, -434, -341, -28, 80, 142, -79, 18, 67, 174, 24, -339, 93, -38, -65, -39, 140, 1, 134, -25, -44, 258]
3855B58j87K19l97L39j3j12J27l47L63l27K41k50l7J12K61j93j69N0N33l53j91
3876g3r2L83K90k19l66Q1L4K91j51n43L49q6L87n49j7J66L37mk94j52L84j44K13
3899B25m14LM47L1j81l01j63O21m10l6l69M71M41k60m8n70N54L05m12j25k93O58
3921A74k17K79p99o1O05k2q0k79K23L11J02m91K7K24K08k75Nj77N4K0J60j44J10
3944d3k97L31j74P5k00O0N5K91j21j9p7J00M1J54j85j39j66M60K6Km93K70K75
3967B26L9l45j12K4N69j00j47j78P9L27k25l85J28K94J2k10O8j02K24K77m47k39
3989b23J84N48k38n15j91N92M8j20k95k39O08l6k43k64K64K39K4m15kJ71M13l91
4011h1j51o8j2J87L47n67l2K12L71l61j84m9K69M65n09K0j06K52j15O7j98j55
$$ y = [258, 71, 290, -107, 232, 219, 107, 234, -113, 250, -77, 164, -86, -123, -11, 250, 57, -112, -62, 471, 118, -73, -165, 218, 508, 289, -77, 4, 38, 329, 178, -365, -16, -102, 285, -264, -281, -115, 222, 218, -76, -228, 156, 12, 225, -189, -186, 261, 292, 111, -190, -353, 268, -142, -178, -547, -76, 365, 105, 57, -513, 41, 346, -66, -191, -484, 174, -43, 236, -563, -624, -19, -41, -121, -400, -177, 134, 236, -255, -228, -4, 204, -71, -66, -243, -189, -169, -9, -153, -43, -340, -9, -183, -108, -308, -248, -193, 98, -23, -42, -119, -19, 22, 176, -9, -148, -314, 146, 172, 174, -319, -49, 226, 265, -80, -192, -168, 401, 301, 154, -24, 55, 382, 157, -228, -100, 194, 206, -4, 64, -38, 186, 463, 16, -223, -39, 509, 271, -244, -435, 157, 205, 85, -210, -449, 159, 123, -120, -384, -120, 119, 143, -272, -274, -103, 310, -81, -232, -300, -312, -125, 222, -345, -377, -165, 206, -155, -339, -388, -119, 346, -163, -143, -249, 3, -112, -45, -243, -398]
4033c98N41j95J45r4po2k7M9J44K4j78J91q1p4L4j77M23l69J89j26j24K31J02
4056A61l69q3n3M62r1j84l5o3M58j24k97j33K63N43l51l94J35j17O58n60l5m7
4078b56L05L18m36j08j1L31o2j93o9O7L61l52J78j75K81J59n10l8j18L80J04k11
4100e5k97L34L06k7k11j27J97J58j17l50J17K17k61J19K02j65M7L41o13L41l44
4121a88J63L09j25J8K24m42K5j69L12p0k04J84K0O0J07j26n2N5j4K0l90K8L81
4144A26L08o46K1J82K45j72n37J22K11L59k27p1k63L51J84m53J95l30O88j90k69
4165a66k24L14K99k85J94p24L90N35o3p63N60J16q6J03k84l6L69m3m04k29L58
4186f9K16K0j76l3j14M52l64JQ2O3p7J96k66l1J57j82J27l9O6O2M3k63K33J71
$$ y = [-398, 143, -52, 93, -1, -8, -70, -97, -48, 96, 120, -58, 133, 52, -22, 12, -165, 258, -111, 78, -48, -172, 59, 161, -208, -291, -344, 118, 27, -157, -192, -255, 203, 79, -218, -351, -88, 455, 104, -290, -155, -272, 386, -174, -209, -256, 49, 367, -69, -177, -188, 143, 81, -112, -181, -114, 247, -105, 73, -102, 179, 338, -172, -210, -328, 52, 156, -55, -352, -18, 288, 261, 50, -77, 120, 278, 161, -189, -72, 145, -116, 3, 205, 40, 87, 428, -185, 156, -188, -25, 284, 159, 177, 401, -41, -16, -185, 127, 57, -147, 37, 57, 117, 224, 98, 46, 101, 87, 107, -283, -255, 126, 434, -212, -191, -9, 236, 64, -473, -351, -140, 219, -8, -79, -342, 9, 193, -260, -65, -395, 293, 103, -166, -390, -76, 223, -62, 132, -592, -202, 333, 270, -493, 67, 183, 97, 200, -84, -120, 249, 206, -198, -427, -69, 147, 167, -9, -42, -156, 296, -68, -67, 15, 78, 1, 197, -69, -100, 57, -125, 2, -37, 29, 91, 134, -129, 104, 275]
4210B75k84J07J43l51M90m83L66m82K90N2l83K65J41j73l40J43J45O1m9k48J12
4231b03P7J63j98p3L76N7k12j77m7L1N78l14k31M9j71O41k33j92j84K86j7J46
4253A52l36J25J73K31l57j11K05J56N4k59l41M32J4jo8k88N02q8p3l97j0L26J64
4276B05k9l31K15R4J93o22L6J79R6K10l86j93K51N15l67r2j86P4K8j49q2L22K9
4299A0j92K09m62L33p5K46l90K16j19j47K93j27K32p3k65K08p4K67%M9o07M13
4321e5M08n76K8J25K45J63l40p8M07L9m46Q7j72N62q7j19m07J1M92k5m30M3L07
4344A82K48j58k25J37K44J5k95j08l50L56L22m69j81K07K42k2m15l9K38L41m0
4365B30m43J86r3J42n5k95J08J68N4k27K15P9j85K33l8kr9k41L58N0j97k10L51
$$ y = [275, -9, 98, 241, -110, 380, -103, 263, -219, 71, 123, -260, 5, 146, -27, -367, -224, -79, -18, -67, -315, -203, -126, 37, -161, -234, 142, 199, -13, -190, -237, -206, 372, 58, -173, -124, -295, 346, 113, -79, -263, 23, 6, 152, -184, -59, 114, 345, -12, -123, 82, 238, 292, 33, -308, 124, 138, 137, 69, -219, 283, 195, 122, -275, -285, 41, 205, 176, -155, 60, 154, 347, -275, -239, -60, 36, 246, -140, -333, -82, 433, 66, -26, -212, -138, -110, -259, -341, -19, 10, -182, 27, -435, -102, -177, 69, -321, -105, -224, -371, -78, -205, 27, -46, -311, -103, -177, 90, 90, 139, -468, -55, 353, -223, -195, -70, 175, 338, -2, -80, 327, 366, -80, 7, -165, 397, 310, 191, -216, -205, 287, 262, -168, -125, 182, 430, 272, 47, 184, 428, 443, 148, 40, -310, 46, 368, -101, -282, -75, 167, 145, -270, -309, -71, 270, 230, -213, -27, -120, 22, -33, -328, -220, -52, 2, -225, -10, 69, -116, 117, 79, 77, -22, -263, 95, 145, -52, -262, 89]
4388H9k21J69r0J48o4L5j06L27l21k12M25j85L9RM7R6j29P3l07oP6K49k43j64
4412b66jM73j49j16k55K24J05K20k02m48K72L97l59l0K0K40j09J83l56k15N47
4433A75j58L5l76Q6M42p2k55k49M90K04k69l50K64l7K24l64j9J02J14J54l68j29
4455c56K79j9M09l64j71J71K00M7k89P6R7L19o57K22k10L99r6J72m37Q1M47l07
4477A3m1Q2K73k23K4k65J7K30j11J51j33J68j59K2OK6L2j6l3M3J05K72n00L18
4501C01o6n5l90L6p5N06Q7n39J4r4O07j28p5l24K59M33k07l04j98N84k42r9k39
4524b08o9L67l4J0k82K47R9J10m08J09j52N00l9m05k01M08K02p4o40L44j27L08
4546F5o3k75K62j03L01m48Q4M1N4M12l76j23J46J38Jk40k50L86J27k01K8J6Q7
$$ y = [89, -132, 37, -53, 95, 31, 66, -40, 287, -34, -246, 179, -6, 33, 42, 89, 185, 56, 129, -178, -184, -108, 141, -102, -266, -267, 206, 57, -59, -314, -90, 15, 235, 33, -415, -143, 254, -105, -135, -115, 125, 16, 199, -157, -372, 175, 17, 52, -324, -238, 204, 132, -123, -372, 118, 322, 53, -297, -33, -70, 154, -210, -229, -127, -13, 141, -227, -356, -77, -96, 313, -51, -222, -51, 149, 196, -93, -17, 80, 399, -258, -36, -246, 153, 57, 229, -208, -127, 320, 13, -28, 54, 327, 104, 128, -137, -120, 110, -1, 150, 17, 185, 26, 48, 54, 80, 112, 96, 63, 106, 211, 483, -17, 301, 235, 180, -210, -174, -249, 257, 344, -195, -181, -275, 332, 204, 129, -195, 64, 497, 290, -14, -212, 372, 130, 31, -208, -277, 90, 56, 66, -216, 31, 130, 240, -168, -59, -211, 289, 250, -155, -356, 52, 254, 180, -460, -116, -243, 65, 2, -273, -11, -114, 187, -261, -177, -136, -82, 330, -46, -169, -23, 115, 116, -124, -374, 12, 139, -62, -34, -18, 69]
4569F9k27M81m39M4R6J4R1k0k65K79m92J49J50L63l55J41K5k8j21k7M8J06J00
4592A82k46l4Q0J99k17j02J23N0lmn0l15M26k5k89Q6J11L03l85P3j11K16K22p5
4616B15l76o8K67N3l21n0J67j8K73j45o4k2L65O2m64j3K32K63m05J39l13Q2L95
4639B54r5k29m8N14l89l4N1j56K85J57k91r0NK70k89M1o0K86l43J03M4K3R8j09
4663bM2O5J81n68K99r2O5rQ0j03k58K92L08n40K17k52M35Qj03j37j23M15m71M9
4687b02J89K15o6m74r6M49K44l5j70l83K67N4Pk40K86lL15n92q4L10oJ24j95k2
4711a08k31M82q9k16K36P3J19k87K13j99k2J79j53j90m3L61J82k44q9L25j76j16
4733GO9L7j64J21r4L99m73K11Kj88M5N2J59k46J76l02K54r0R2P8j92m6l4O5J87
$$ y = [69, -158, 323, -116, -72, 24, 38, 129, 109, -156, 123, -369, -220, -70, 293, -62, 79, 104, 76, -45, -72, -24, 82, 182, -64, -98, -18, 181, -36, -138, -15, 35, 32, 28, -22, -337, 89, 64, -225, -139, -28, 275, -110, -37, -148, 68, 290, 215, -161, -229, 38, 91, -230, -280, -113, -131, 142, -3, -67, -89, 276, 338, -126, -139, 93, 356, -49, 90, -223, -141, 254, 159, -70, -118, 396, 7, -27, 24, -132, 153, 310, 19, -71, -66, 204, -85, -44, -104, 182, -161, -58, -14, 9, 107, -2, 40, 105, 286, -282, 17, -75, -10, -19, 61, -42, -300, -8, 300, -240, -23, -275, 160, 168, 65, -72, -195, 220, -251, -202, -13, 202, 136, -338, -434, 15, 259, 224, 54, -329, -62, -8, -1, -241, 45, 42, 357, -235, -319, -9, -15, 109, -86, -108, -339, 143, 54, -162, 74, 147, 266, -21, 192, -7, -29, 150, -3, -193, -236, 125, 307, 63, -26, 299, 123, 7, 76, 113, -51, 70, -24, 375, -98, 113, 115, -73, -28, 24, 183, -63, 113, -189, 65, -25, 67, 145, -47, -93, -127, -62, 125]
4758A25J86m61K58m2j49L55m03J7J15K23o5l68K67P8j0N5l36O3O7L00l60NnO4
4782b1K06p8l99L68M3M6P7m21K13M12k16m32J47K82L67m24k80J74J6K55k54l56
4804b75J52L41J39j41l02Q8K36j53j62j09M23l80K34k03k57L73J17k90R3N2J05
4825H1k31L56m21J74n9J37J66k90K0O7oL8k20N1J14k9j45K48k17J64j1K9j73K18
4849F1j0O1p7jO7r4J88m13K14p1J20ln2K36m36J46L17l5j75l35M53P6O8m38P7
4874e6J31K63j69q9J1P0K65k90m03J61P1R2j97j26N44J78k43k47j89O7M13n3j55
4897D9l22K51M0j83Q8J20jR5o8l3j39M06k76Q5l4j59J86k40k03J20K46j51K84
4920A61j87R1q5Q2n2J29o6n4Q8j49K87k42Ml76J72L56k42J49m8q4K46K7l07j24
$$ y = [125, 311, -150, 108, 66, -83, 272, -131, -114, 1, 224, 159, -209, 58, 136, 126, 181, -155, -92, -25, 275, -85, -80, -85, -21, 185, 107, -292, 76, 119, 165, 242, -179, 34, 446, 230, -202, -55, 227, 594, 170, -110, 64, 80, 335, 81, -275, -123, 218, 357, 216, -86, 2, 238, 85, -77, -186, 237, -143, 91, -112, -369, 4, 121, -169, -76, -24, 81, -150, 206, -215, -41, -100, 37, 203, -87, -67, 0, -6, 32, -188, -137, -23, -52, -197, 51, -166, -2, -13, 16, -157, 61, 51, 112, 35, 34, 101, 7, 195, -218, -4, -75, 45, 42, -10, 226, -210, -64, 253, 218, 43, -292, 161, 237, 305, -133, -56, 75, 338, 169, 80, 91, 161, 426, 136, -267, -106, -35, 57, -140, -266, 278, 456, 213, -34, -223, -156, 257, 204, 49, -273, -22, 18, -165, -77, 43, 42, 137, 69, 36, -103, 303, 27, 112, 78, -81, 105, -135, -338, -218, 28, -123, 161, -26, 65, -20, 62, 10, 139, 73, 19, 107, -42, 245, 3, 7, -369, -197, 159, -83, 66, 18, -66, 180, 207, -100, -224]
4944b24L94o2m2j72n2J90j0P1k72N5L1k6j83J03O47l44r6m10N50j12m2k11l0K78
4968C1J05M5n85R4M08l0j12P4j46o7K27k24k48L04K41j2k23K2o9J48M6k06OJ26
4992d5j5J3j20J46j4n2J52q8K49k11K18n7l36K80J72k74p1J4M8k7J27j92J92L2
5016A41k31K03J04j47j84K29L3j80K49k70O7RO3P1n22J00M50j31J7o9K6Rk81L18
5040G4k67R4J39r5J58j59ro8R3j2J4J18kN6n77L00K54j72l6r7j1N31Q0m76l1L3
5066f8LK85k73R3j39K59l08k2M3K13J66l53N4n3M39k54l95M74k37j45M95l25j31
5089a79J19L23k59L7O2k16K56l9l41L35k3p9J2l8K81l49Q9J6P2k22J14j68L30
5112A33k68K52q6q5k4J4L62l31J2j54K55j24n8J12R3k44k02K48k8L50j88j61J46
$$ y = [-224, 170, 108, 66, -106, -158, 32, 22, 93, -179, -124, -93, -119, -302, -199, 448, 104, 8, -402, 148, 36, -6, -217, -247, 31, 136, 181, -404, -310, 98, 68, -44, 30, -116, -183, 44, -180, -428, -124, 117, 105, -118, -96, -165, -17, 29, -177, -171, -45, -60, -47, -167, -21, -35, -87, 65, -23, 226, 15, 233, 176, -160, 120, 292, 18, -53, -39, 9, -18, 109, -83, 109, 141, -90, 113, 217, 70, -114, 115, 148, -32, 217, -53, 14, 23, 86, 157, -365, -265, 185, 54, 71, 2, 28, 37, -244, 74, -193, -99, 40, -55, 103, -56, -65, -133, -40, -52, -38, 80, 78, 134, -443, -143, 111, -61, -97, -194, -205, 326, 406, -70, -101, -68, -65, 220, -53, 40, -99, 160, -148, -170, -127, 86, 252, -101, -47, -100, 339, 85, -310, 164, -73, -218, 277, -48, -179, -60, 263, 4, 41, 103, -113, 143, 104, -237, 98, 75, -4, 8, -30, 251, -98, -9, 7, 79, -143, -29, -197, 133, -135, 117, 31, -54, -78, -64, 298, -33, -21, -175, 80, -44, -102, 10, 103, -141, -343, -95, -123, 227, 39, -122, 24]
5135B4j12K94j70q7M9K17j36j7m82N15j0Jl53J68J57M76n00KL4J15O0k78K38m89
5159b84N46q1k45j0q1L23J8l53J22j7L0J62K3j15p1j9K4m5n5K23L8j25k65M31
5183A74l44k5L37k06m3K86j44l71K69j24r3M13k33Q0M8j22J42M1j41j19R7p1J13
5206c6j05J18j88L70K0m2k35j89J77K29m5m02J48K08o3j1k16L81j02J84k64o8
5228a31J16K00m27K43m3k1J50j89j32J92J28m0O8k47N8L08k21K9j35L59r5k29
5250e9L56l97R1J14j59j36J92K27j77o0l6R2J36j01l47J25P4K58j13k16P3Q3j76
5273a56J60j74K00n3R8l13J77J64J4l42J26K81l96J58J65l9k49M43m26R7P2k0
5295a3j15J09N3J43M9j54l62L10O3O9k15N9J33j05m7j92J92K38j42j23jJ19l1
$$ y = [24, -88, 206, 36, -51, -2, 215, 79, 62, -420, 95, 85, 86, -267, -99, 58, 534, 34, 36, 70, 185, 245, -33, 205, -284, 262, 181, -64, -74, -155, 168, 186, -167, -45, -62, -32, 130, 153, 38, -33, -52, -28, -73, -128, 95, 133, 8, -257, 174, -170, -195, 142, -64, -107, 179, 35, -336, -67, -191, -284, 129, -104, -24, 24, -98, 44, 85, -56, -175, -78, -149, -36, -141, -23, -211, 159, 179, 137, -98, -287, -110, 119, 74, -328, -180, 28, -35, -46, -262, 119, 17, 201, -63, -131, -15, 185, -242, 1, -42, -63, 87, -102, -234, -42, 86, 46, 114, -133, -75, 233, 12, 41, -94, 265, 170, -59, 297, -100, -9, 105, -54, -190, 2, 229, 52, -8, -44, 48, 184, 83, -264, -139, -65, 193, 80, -136, -63, 20, -156, 4, -170, 30, -23, 75, -238, -61, 103, 117, -225, -99, 182, -214, -56, 109, 70, -179, 264, -162, -65, 7, -13, -128, -19, 34, 177, 226, 72, -290, 20, 83, 152, -63, -4, 129, 24, -23, -215, -23, 215, 73, -50, -51, 68, 37]
5318C7k7k73n4L52L56k38l90K22N7j78J48J86l35J71N8l25j05K99K56j24j68m0
5340a15M7K14l5j06j31R5l6K4j30K7M2K02j13k75Q6J75O3k7j59K08j69K82l25
$$ y = [37, 10, -263, -317, 35, 391, 153, -237, -15, 42, -136, 12, 198, -137, 34, 92, -233, -338, -39, 217, 93, -75, -115, -68, 146, 111, 5, -126, -31, -67, -43, -173, -146, -104, 98, -15, -290, -204, -29, 34, 7, -152, 56, -113, 169, -156]
$$ [...]
8191a2
##END NTUPLES=NMR FID
##END=
