##TITLE=1H_SA_sl 45/4-2
 CDCl3
 40 sc, 
 16.02.2022
##JCAMPDX= 6.0         $$ Bruker NMR JCAMP-DX V2.0
##DATA TYPE= NMR FID
##DATA CLASS= NTUPLES
##ORIGIN= UXNMR, Bruker Analytische Messtechnik GmbH
##OWNER= root
$$ XWIN-NMR		Version 3.5
$$ Wed Feb 16 08:48:30 2022 Russian Standard Time (UT+4h)  she@DPX200
##.OBSERVE FREQUENCY= 200.131346
##.OBSERVE NUCLEUS= ^1H
##.DELAY= (6, 6)
##.ACQUISITION MODE= SIMULTANEOUS
##.ACQUISITION SCHEME= undefined
##.AVERAGES= 40
##.DIGITISER RES= 18
##SPECTROMETER/DATA SYSTEM= spect
##.PULSE SEQUENCE= zg30
##.SOLVENT NAME= CDCl3
##.SHIFT REFERENCE= (INTERNAL, CDCl3, 0, 15.7039)
##AUDIT TRAIL= $$ (NUMBER, WHEN, WHO, WHERE, WHAT)
$$ ##TITLE= Audit trail, XWIN-NMR		Version 3.5
$$ ##JCAMPDX= 5.01
$$ ##ORIGIN= Bruker BioSpin GmbH
$$ ##OWNER= she
$$ F:/spectra/data/she/nmr/H-F/1/audita.txt
$$ ##AUDIT TRAIL=  $$ (NUMBER, WHEN, WHO, WHERE, WHAT)
(   1,<2022-02-16 08:46:55.87 +0400>,<she>,<DPX200>,
      <continue with go, POWCHK disabled, PULCHK disabled
       configuration hash MD5:
       00 E9 B6 7A A2 85 ED C7 34 08 36 98 17 FE 4E 26
       data hash MD5: 16K
       DC 2D 42 67 B0 FB B0 3C 20 0D E9 F5 87 57 4D 40>)
$$ ##END=
$$ 
$$ hash MD5
$$ 31 D2 2D FC 7F D9 BE 7D A8 73 35 85 C8 AE 46 73
##$RELAX= 
##$RELAX= 
##$RELAX= 
##$RELAX= 
##$RELAX= 
##$RELAX= 
$$ Bruker specific parameters
$$ --------------------------
##$DU= <F:/spectra>
##$EXPNO= 1
##$NAME= <H-F>
##$PROCNO= 1
##$TYPE= <nmr>
##$USER= <she>
##$AMP= (0..31)
100 100 100 100 100 100 100 100 100 100 100 100 100 100 100 100 100 100 
100 100 100 100 100 100 100 100 100 100 100 100 100 100 
##$AQSEQ= 0
##$AQ_mod= 1
##$AUNM= <au_zg>
##$AUTOPOS= <>
##$BF1= 200.13
##$BF2= 200.13
##$BF3= 200.13
##$BF4= 200.13
##$BF5= 200.13
##$BF6= 200.13
##$BF7= 200.13
##$BF8= 200.13
##$BYTORDA= 1
##$CFDGTYP= 0
##$CFRGTYP= 5
##$CHEMSTR= <none>
##$CNST= (0..31)
1 1 145 1 1 1 1 1 1 1 1 1 1 1 1 1 1 1 1 1 1 1 1 1 1 1 1 1 1 1 1 1 
##$CPDPRG= <>
##$CPDPRG1= <>
##$CPDPRG2= <>
##$CPDPRG3= <>
##$CPDPRG4= <mlev>
##$CPDPRG5= <mlev>
##$CPDPRG6= <mlev>
##$CPDPRG7= <mlev>
##$CPDPRG8= <mlev>
##$CPDPRGB= <>
##$CPDPRGT= <>
##$D= (0..31)
0 1.2 0 0 0 0 0 0 0 0.06 0 0.03 0 0 0 0 0.0002 0 0 0 0 0 0 0 0 0 0 0 0 
0 0 0 
##$DATE= 1644986656
##$DBL= (0..7)
120 120 120 120 120 120 120 120 
##$DBP= (0..7)
150 150 150 150 150 150 150 150 
##$DBP07= 0
##$DBPNAM0= <>
##$DBPNAM1= <>
##$DBPNAM2= <>
##$DBPNAM3= <>
##$DBPNAM4= <>
##$DBPNAM5= <>
##$DBPNAM6= <>
##$DBPNAM7= <>
##$DBPOAL= (0..7)
0.5 0.5 0.5 0.5 0.5 0.5 0.5 0.5 
##$DBPOFFS= (0..7)
0 0 0 0 0 0 0 0 
##$DE= 6
##$DECBNUC= <off>
##$DECIM= 32
##$DECNUC= <off>
##$DECSTAT= 4
##$DIGMOD= 1
##$DIGTYP= 9
##$DL= (0..7)
0 120 120 120 120 120 120 120 
##$DP= (0..7)
150 150 150 150 150 150 150 150 
##$DP07= 0
##$DPNAME0= <>
##$DPNAME1= <>
##$DPNAME2= <>
##$DPNAME3= <>
##$DPNAME4= <>
##$DPNAME5= <>
##$DPNAME6= <>
##$DPNAME7= <>
##$DPOAL= (0..7)
0.5 0.5 0.5 0.5 0.5 0.5 0.5 0.5 
##$DPOFFS= (0..7)
0 0 0 0 0 0 0 0 
##$DQDMODE= 0
##$DR= 18
##$DS= 0
$$ [...]
##$SUBNAM2= <"">
##$SUBNAM3= <"">
##$SUBNAM4= <"">
##$SUBNAM5= <"">
##$SUBNAM6= <"">
##$SUBNAM7= <"">
##$SUBNAM8= <"">
##$SUBNAM9= <"">
##$SW= 18.0517287032376
##$SWIBOX= (0..15)
0 0 2 0 0 0 0 0 0 0 0 0 0 0 0 0 
##$SW_h= 3612.71676300578
##$TD= 16384
##$TD0= 1
##$TE= 0
##$TE2= 300
##$TE3= 300
##$TEG= 300
##$TL= (0..7)
0 120 120 120 120 120 120 120 
##$TP= (0..7)
150 150 150 150 150 150 150 150 
##$TP07= 0
##$TPNAME0= <>
##$TPNAME1= <>
##$TPNAME2= <>
##$TPNAME3= <>
##$TPNAME4= <>
##$TPNAME5= <>
##$TPNAME6= <>
##$TPNAME7= <>
##$TPOAL= (0..7)
0.5 0.5 0.5 0.5 0.5 0.5 0.5 0.5 
##$TPOFFS= (0..7)
0 0 0 0 0 0 0 0 
##$TUNHIN= 0
##$TUNHOUT= 0
##$TUNXOUT= 0
##$USERA1= <user>
##$USERA2= <user>
##$USERA3= <user>
##$USERA4= <user>
##$USERA5= <user>
##$V9= 5
##$VALIST= <valist>
##$VCLIST= <CCCCCCCCCCCCCCC>
##$VD= 0
##$VDLIST= <DDDDDDDDDDDDDDD>
##$VPLIST= <PPPPPPPPPPPPPPP>
##$VTLIST= <TTTTTTTTTTTTTTT>
##$WBST= 1024
##$WBSW= 4
##$XGAIN= (0..3)
0 0 0 0 
##$XL= 0
##$YL= 0
##$YMAX_a= 197031
##$YMIN_a= -232353
##$ZGOPTNS= <>
##$ZL1= 120
##$ZL2= 120
##$ZL3= 120
##$ZL4= 120
##$ABSF1= 10
##$ABSF2= 0
##$ABSG= 5
##$ABSL= 3
##$ALPHA= 0
##$AQORDER= 0
##$ASSFAC= 0
##$ASSFACI= 0
##$ASSFACX= 0
##$ASSWID= 0
##$AUNMP= <proc_1d>
##$AZFE= 0.1
##$AZFW= 0.1
##$BCFW= 1
##$BC_mod= 2
##$BYTORDP= 1
##$COROFFS= 0
##$CY= 11.3945322036743
##$DATMOD= 1
##$DC= 2
##$DFILT= <>
##$DTYPP= 0
##$F1P= 2.36226072786647
##$F2P= -0.459571619588291
##$FCOR= 0.5
##$FTSIZE= 0
##$FT_mod= 4
##$GAMMA= 1
##$GB= 0.15
##$INTBC= 1
##$INTSCL= 1
##$ISEN= 128
##$LB= 0.24
##$LEV0= 0
##$LPBIN= 0
##$MAXI= 10000
##$MC2= 0
##$MEAN= 0
##$ME_mod= 0
##$MI= 1.114404
##$NCOEF= 0
##$NC_proc= 0
##$NLEV= 6
##$NOISF1= 3.799351
##$NOISF2= 2.8
##$NSP= 1
##$NTH_PI= 0
##$NZP= 0
##$OFFSET= 15.70392
##$PC= 1
##$PHC0= -16230.43
##$PHC1= 12.00078
##$PH_mod= 1
##$PKNL= yes
##$PPARMOD= 0
##$PSCAL= 0
##$PSIGN= 0
##$REVERSE= no
##$SF= 200.130013532006
##$SI= 16384
##$SIGF1= 3
##$SIGF2= 2
##$SINO= 400
##$SIOLD= 16384
##$SREGLST= <1H.CDCl3>
##$SSB= 0
##$STSI= 0
##$STSR= 0
##$SW_p= 3612.71676300578
##$SYMM= 0
##$S_DEV= 0
##$TDeff= 0
##$TDoff= 0
##$TI= <>
##$TILT= no
##$TM1= 0
##$TM2= 0
##$TOPLEV= 0
##$USERP1= <user>
##$USERP2= <user>
##$USERP3= <user>
##$USERP4= <user>
##$USERP5= <user>
##$WDW= 1
##$XDIM= 8192
##$YMAX_p= 0
##$YMIN_p= 0
$$ End of Bruker specific parameters
$$ ---------------------------------
##NTUPLES= NMR FID
##VAR_NAME=  TIME,          FID/REAL,        FID/IMAG
##SYMBOL=    X,             R,               I
##VAR_TYPE=  INDEPENDENT,   DEPENDENT,       DEPENDENT
##VAR_FORM=  AFFN,          ASDF,            ASDF
##VAR_DIM=   8192,          8192,            8192
##UNITS=     SECONDS,       ARBITRARY UNITS, ARBITRARY UNITS
##FACTOR=    0.0002768,     1,               1
##FIRST=     0,             0,               0
##LAST=      2.2672688,     0,               0
##MIN=       0,             -232353,         0
##MAX=       2.2672688,     197031,          0
$$ Real data points
##PAGE= N=1
##DATA TABLE= (X++(R..R)), XYDATA
$$ [...]
2339a246P45l27M90R44j300Kr14l25K520j47q37Q66j301N32J053j91N98r7l30
2358G35R4j053Q71N71k18J69j031j621R23P56J80K62j627N31o89o2J054l95l66
2377i16L50q46K54N60M19O91j55j099Q01j9J322j29r48O97o20m21J114m58n68
2396B9Q43j273J10P14p10M66m5o42K21j411P97M30o32O49N24k37L42n83M45P38
2416G75j235J073l77K26Q59r70J19L27p11N51N83j504L14m1m34J164j087N40J66
2435C38j124P61j55k20J180j401K6Q75j002J105L81m09k21j59Q09K11k96l6L30
2454I93m36N28q92K29L18n74k46j74J8N55p53k01O02r89K14N96o45P60k85m53
2474h35J006l49O51K76q91J073q59k20J247o44k19P02o92L86n0m77L6j257J057
$$ y = [-1246, -501, -828, -338, 606, -694, -692, -1606, -1931, 589, 442, -395, 471, -830, -298, 755, 564, 1162, 1065, 735, 829, -224, 647, 1218, 1000, 1169, 138, -1483, -560, 196, 376, 638, -989, -458, -1147, -1209, -155, -550, -916, -566, -1412, -1158, -598, -179, 512, 357, -742, 59, 40, 1362, 1233, 285, 982, 362, -59, 1055, 597, 29, 872, -401, -291, 423, -287, 179, 134, -508, -287, -1698, -901, -471, -1103, -454, 70, -167, 175, -408, 37, 775, -460, 613, 236, 462, 1321, 351, 470, 797, 86, 637, 1220, -284, 30, -11, -445, 719, -368, 172, 338, -786, -25, -180, -400, 780, -621, -595, 280, -722, 383, 764, 355, 134, -25, 784, 995, 699, 663, 993, 557, 1085, 193, 422, 740, 166, -80, -254, -236, 319, -434, -635, -33, -1022, -808, -212, -857, -97, -382, -835, 171, -178, 473, 749, -142, 931, 72, -148, 1099, 455, 236, 938, 246, 632, 582, 105, 141, -1116, -59]
2493e9l10n0j41K16p88J244p97k13M00j6l01R97o17O61j38k11M00n99Q79K99j015
2514a59J090r7p98n1M05K06J61j268J43N84O2M15p02q55J028n02j98N60p59P05
2534c0m44J92N65j095Q48N91q34P85j64k63L43n4j63Q45j176Q06J88m33J57j282
2554f18K88J096j306L14L01j219P36k41k31J355j396M64K54l09M69j84m47Q21
2572A47K93l08R33r21M19k2o6Q93j312K33O63o46k20j59j2j12O40q89R28q95j37
2593e50Q15r89N12j96j96N80o47K02R48o45K56O88q62O95j05KM89n27k74P15l21
2614E90Q61j151n59K97j38j71O12j422Q80O48j107m2k54J58P33lj40M44k33N27
2634E30j47n69J149q33L85J13k80J125j049K58L93q52K0R9j088P52M11j022O91
$$ y = [-59, -369, -419, -560, -344, -1132, 112, -685, -898, -498, -514, -815, 182, -435, 226, 88, -123, 277, -322, 557, 856, -159, 931, 834, 36, -15, 390, 596, 757, -511, -368, 216, 278, 693, -9, -864, 164, -338, -536, 24, -735, -30, -474, -282, 283, -812, 36, 627, -207, 578, 414, 151, 494, 440, 277, 1122, -54, 752, 940, 507, 664, -618, -330, 766, -540, -226, 75, -1144, -408, -649, -880, 475, -921, -457, -203, -512, -43, -227, -674, 147, 440, 132, 1065, 144, 563, 541, 475, 1368, 56, 289, 952, 306, 86, -73, -85, -197, 443, -446, 482, -413, -550, 265, -724, -212, -408, -604, -24, -671, -469, 479, -166, 90, 778, -84, 611, 506, 508, 997, 470, 196, 911, 590, 1451, 300, -259, 38, -100, -271, 341, -1081, -201, 447, -660, -702, -956, -798, -65, -68, -208, 236, 3, 530, 383, -186, 963, 130, 515, 628, 348, 1473, 424, 682, 1075, 223, 243, 342, -746, 6, 417, -605, 86]
2653H6l51l31J16q9L18K74j209J702r30K67J042l95m90J70O7o0M76k00J36m49
2673A50K06R92r61K49n34o89J262n77k72M15o21o50N63j06J64n64O76k53k15Q00
2693C5n8n14Q45r16L69R33n98O48j51q78J167n02o07J030m56j44J65o50K73O07
2713E98o47K24o20j01O60o4k40k12o24R38J9K0L23l19n45O38R5M89n06m12J067
2734G81n08L14o1k28K78j27m49M88l62l81M44p22j48K65m03Q37j15o11M31q02
2754a079L31Q48q53J272l33j88r7Q5O58l09m39L92M81r75P58l31l4M67n24l13
2774a83N43o63L02n47j86N57o46P45N53j147L66m0m44J087m20k32M54J05k76K77
2794B05Q6N88l27n23Q90o57M04n9l30j8k19n67P16k93k87L06n72M57m06OJ46K38
$$ y = [86, -265, -596, -480, -569, -251, 23, -1186, 516, -414, -147, 895, 500, 10, 180, 247, 187, 663, 463, 599, 150, 356, 1348, 387, 636, 102, -587, 675, 98, -174, 241, -380, -1030, -467, -573, -409, -973, -297, -550, -765, 35, -23, -537, 308, -608, -239, 694, 96, 744, 593, -285, 882, 380, -227, 803, 347, 203, 368, -282, -9, 598, -49, 175, -445, -546, 114, 50, -190, -402, -1026, -88, -69, -49, 274, -45, -590, 48, 143, 632, 126, -286, 781, 273, 587, 526, 298, 576, 449, 0, 488, 126, -255, 189, -533, -681, -416, -819, 18, -97, -708, -277, -1079, -748, 100, -753, 519, 186, -2, -99, -14, 644, 335, -104, 288, 769, -206, 552, 221, 187, 654, 130, -183, 360, -303, -1, -548, -734, -177, -823, -78, 475, -672, -306, -346, -790, 297, -123, -355, 99, 204, -72, 205, 291, 879, 552, 29, 919, 262, 666, 607, 277, 259, 40, -527, 189, -104, -391, -85, -657, -200, -606, -600, -454, -216]
2816b16o12K63J32M72k81k01O64j59P25m85R4P8m37j24M92j02j45K56m31k65P6
2837b06j66N63J24o14M52p28N98J15m44j06L36m99M94J53J0N47p61M83J6o65J090
2858G92j053K38N39N1n34P99r77M60L20p08R5p19O82J85m41J83q12p4L88K2j5
2879e79P79q71P4O36k03J014m37l30p9P8m4R53o17k2R0p30L34M83r8l2q79L50
2901a30l49j28N25j79K87o29P1p6Q65r9R5j56o52O04l84M58L23m02J68O33q12
2922C3P87K43r42M18n70Q76q21j60N92p55n0J69J33p9k11l95O91j81k93O52r29
2943g92M77l09l54O02j4J90L14M94k81j90O2k8M68L06j24j289O70N7m45p5N71
2964C10n19j03r6o63J224n76j49o1K68M66k71j47R84p16o78N13q8O86k50m44Q31
$$ y = [-216, -828, -565, -433, 39, -242, -443, 221, 62, 787, 302, 396, 474, 37, -87, 405, 303, 158, 414, -17, -282, -206, -372, 191, 315, -299, 153, -575, 23, 138, -306, -412, -76, -575, -81, 72, 82, 629, -132, 351, 367, -298, 792, -261, -23, 516, 567, 33, 832, -145, 315, 635, -73, 22, -697, -15, 170, -271, -88, -900, -974, -586, -564, -579, 200, -671, -597, 39, -164, 850, 413, 83, 4, 82, 38, 991, 374, 352, 442, -288, 46, 529, 431, 399, -480, -130, -479, -607, -82, -261, 26, -603, -532, -608, 257, 158, 253, 97, -555, 49, -335, 123, 446, 44, 212, 845, 33, 820, 1063, 121, 539, -31, 845, 24, -136, 456, -299, -349, -180, -47, -126, -337, -732, -41, -222, -515, 137, -792, -315, -624, -978, -376, -390, -200, 114, 608, 327, 137, 199, 171, 639, 945, 821, -468, 202, 259, -186, -261, 310, -209, -312, -408, -1071, 153, -423, -572, -633, -365, 101, -170, -317, 667, -49, -727, -214, -302, 384, 134, -310, 521]
2985E21o0p8K95m37O58l79m89j44M3K16L65j185J45R90j146R01L14j303M81Q2
3005b10k75P71j004Q62l56l21J390p59L11n1n23J30K37L19J51m61Q6J20l44m71
3025c98P62r83R25q02l13M81J48k08J87K4J5k48k04J129p32R1Q12k8n68K34k82
3046D2K57q21Q80j01p07Q70J86n92p7M13n57J36RL3K65j171J345r52l31M90o44
3067a027N21L06J43K19l36L30k72N72k45L27J89j79K90o38N08o04O7O13j46p06
3087f8M13k79m39P93r52P04n17k67j15K65K61l77K43L50k73l43O47l56J096r7
3107F89l74q1l66o3O79p89Q23m05J5L58l47k20L76k72r49M92j81j64O82o65O85
3128g7k76l71J80Q0J11M12l91O03j70p0P23p19M24j40o88O99j02J67k21K48n25
$$ y = [521, 461, 383, 678, 241, 899, 520, 31, -113, -70, 146, 511, -674, -529, 461, -685, 216, 530, -773, -292, -210, -485, 286, -718, 144, -212, -533, 857, 98, 409, 358, -165, -35, 202, 521, 672, 211, 297, 417, 73, -398, 364, -619, 306, -496, -809, -328, -180, -388, -201, -177, -162, -410, -614, 515, -217, -126, 686, 658, 90, 324, 42, 299, -522, 358, 257, -450, 420, 606, 14, -63, 350, -207, -71, -62, -29, 236, -935, 410, -542, -873, -383, -1027, -506, -200, -57, 162, -174, 156, -116, 456, 211, 538, 727, 548, 838, 200, 708, 104, 171, 784, 638, -68, 345, 66, -373, 420, -532, 172, -345, -612, -727, -462, -201, -578, -335, 15, -258, -601, 46, -310, 786, 689, 315, 234, -132, -195, 484, -305, 518, 113, 128, 486, 139, -81, 295, 23, -926, -434, -615, -779, -97, -762, -77, -353, -724, -544, -464, -353, 59, -332, 271, 101, 31, 754, 35, 459, 319, -369, 330, 228, 395, 174, 422, -103]
3149a03Q12j044J4R4l38L89l89j49M91l98M23P4l65O29q46M17j08N4M48O86p07
3170H4P17l50j029J035l97m00J066n37l47N42n42L50m12K82P4q57O51K73k78J5
3190f0l49n07M89m02M59P58n86J10j36L30L23l34N85K10k71l60J45km1l45M04
3211D20n19n23Q48L83p15O6l77k12Q43o89J43K66L51r00J44K17M60k81K93L67
3231E85o68L64N83m80P93q27L89l02k24j81O04n2m37J20q45M26j52J5k03NO08
3252A21l49o06J155m04K2j61j91j52P63m94M92m78M31N54q95Q9O32m66K44N6k28
3273A35P67j391N29l41o89J218o44m26R53o34L73j4k59P46n49j30J87L60j65M92
3293E18l94n2N1k86O87m13J49Nn38N90k3l67Q05p50J62J68l52m4P39k12n19j13
$$ y = [-103, 709, -335, -321, -227, -565, -176, -565, -714, -223, -621, -198, -124, -489, 140, -706, -289, -397, -343, 105, 791, 84, 801, 451, -578, 457, 60, -340, 726, 189, -158, 384, -158, 192, -220, 62, 136, -721, -70, 203, -75, -60, -409, -916, -427, -829, -370, 388, -198, -88, -224, 106, 429, 95, 680, 890, 619, 259, 404, 402, 361, 16, 420, -99, -622, 226, 609, -106, -40, -417, -629, 214, -475, -332, -66, 285, -615, -471, -254, 206, -75, 218, 585, -83, 281, 864, 384, 1177, 350, 739, 437, 213, 32, 636, 584, 147, 267, -578, -152, -304, -289, -492, -487, 121, -228, -834, 321, -83, -61, -222, -413, -565, 198, -296, 196, -282, 149, 703, -192, -103, 529, 63, 307, 363, 135, 902, -489, 40, -301, -990, 228, -416, -842, 111, -523, -150, -164, -423, 323, -226, -356, -169, 191, 26, 518, 124, 72, 123, -163, 524, 111, 260, 265, -273, 317, 294, -73, 732, -18, 144, 312, -40, -84, 655, 443, -76, -189]
3315a89j155J335n85r1O14j52L55l44N53j88m74J348m78o14R2N33n18K49M66q29
3335g2L52J8l94J116j113m9K26o48K79M50l48K46n03k89Q79p78P94j73j07L73
3355B59l34j9L77K21m2k79j57L00j39m47J274j399J222j071K59N46p02j22N49
3374B96q33M19j48q09R76m40N59n22L33l35k05P53k09R62j023Q33j22m81J263
3393A267j129J68R54j315Q2k69R5p5j5O3K06Q0p39O47j84K14q99P76q27L60L96
3414a44k2k69N2O52k48N71j158Q22K31l00k2n90K45O08l97J49N3j03kk56k05L97
3436F4l71m94J238j099N01J14m54P73J86r09J89J12L04l73J77O58n92lK27J58
3456D06K16k51m45N62o82M19P0l57N07r37K56N76l58o59R41j096K45M90k03j47
$$ y = [-189, -1344, -9, -594, -685, -71, -223, 132, -212, 341, 153, -321, 1027, 549, -65, 27, 560, 42, 291, 757, -72, 280, 298, -96, 1020, -93, -142, 84, -564, -285, 165, -183, 63, -440, -729, 150, -628, 166, -7, -114, 259, -75, -94, 283, 504, 462, 183, 26, 326, 187, -260, 1014, -385, 837, -234, 25, 571, -131, -253, 296, -537, -118, -266, -1075, -99, -539, 20, -502, -169, -504, -709, 44, -165, 797, -226, 607, 485, 4, 1267, 138, 306, 1260, -55, 27, -242, -147, -222, -237, -174, 32, 112, -627, 20, -164, 50, -849, -73, -900, -540, -144, -166, -435, -383, 269, 21, 592, -566, 256, 487, 187, 165, -425, -180, 428, 31, 180, 233, 130, 128, -128, -333, 64, -307, -801, 437, -662, -161, -47, -501, 272, 458, -451, -262, -150, 154, -219, -42, 616, 24, 21, 248, 406, 622, 371, -74, 488, -194, 225, 295, -62, 445, -492, -236, 340, -18, -677, 264, -832, -587, -97, -300, -447]
3476d47j12J68O99k26p5k7q0L25J04M1k85K79n29M08k99L04L69n83Q0j06m73J90
3498b75k71K37k5j12N59l31J97M1j77m9l61K51Q08N2o09L59m84J89Q04o79n47
3519d23J252p91oL38n11R89o16m16L10l06M0M39j18r99K45J30L20k57K91P1j67
3540a85J23l64M65O93p10O35j79l04J82k29o8O64p09O51k23p72J37J19J45J70
3560B41J55n71L07J80k54n33m9M67k17J81k36q2Q71l77P8N86j80r40R04o06O73
3581E98j21p42O25M2l13M72k21o62Q40r06k08m59M92Q70m42m5k07p09J042L16
3601B62n80r7p13K82P74K59l04mN69o09P2n5O09m17l52N41n65K54L18m31L40n59
3623d06j53L52q6J51L65j045P49k37j33J47K40k97J9j99M20j40P80m23K34K58
$$ y = [-447, -559, -391, 308, 82, 7, -20, -100, 225, 329, 370, 85, 364, -165, 243, -56, 248, 617, 34, 114, 8, -465, -275, -546, -309, -334, -446, 113, -218, -21, 20, -157, -206, -567, -316, 492, 544, -65, 294, -190, -1, 803, 124, -423, 829, 38, 32, 370, -141, 848, 232, -184, 126, -180, -140, 299, 181, -818, -573, -443, -123, -380, -89, -18, -185, -62, -426, 39, 732, 22, 657, 478, 174, 356, 127, 59, 723, 14, 665, 442, -330, -193, -74, 71, 241, 396, -175, 132, 312, 58, -475, -524, -57, -274, -93, -329, -411, 460, 83, 161, 747, 567, -373, 531, -75, 598, 477, -265, 360, 402, 89, 561, 340, -322, 518, -388, -596, -1055, -563, 307, -135, -180, -387, -1096, -54, 262, -318, -415, -1128, -846, -72, 187, -117, -121, 448, -161, -89, -144, 465, 48, -304, 237, -328, -74, 244, -187, 153, -406, -559, -207, -293, -142, 223, -822, -73, -310, -443, -296, -56, -353, -334, -533, -113, -253, 527, 104, 338, 596]
3643E96L9m85nJ16n37L30L07n89K41j59N4Jn92M65j49K74J38R9k30J88o11L73
3665a36n70J27R48j17q78J026o57O41L9l12K77J52j13j81l72L69j28k51K89o03
3685d50J28M15o4O1o09M29n2j67j92M65P1j32m30L52j66O8m75J689r70M56l26
3706A01M7K88L80n18l27J79K5L8l22P93p39m75P82n16jJ92m24J86J02k0l3L57
3728I5l84L64K47n09N94J25l84K63r29O33n44P73L40o81J035k56n38k79R8k95
3748b32O51o11r4L25m34K38L9m70J74P37p77R81l47l66L15L20O7n82k22O21o46
3769c13M82J02j24n8L43k89J62n11M88O8j063J005r00N40l38j27J80N59o0l31
3789a85P52j085O66k38l43J001l83M25l36l05M49J8o82Q30q53O49j23n35K62K22
$$ y = [596, 635, 150, 145, 261, -276, 54, 361, -228, 13, -146, -92, -91, -683, -218, -367, -93, 45, 144, -86, 102, -509, -136, -706, -579, 369, 252, -626, 400, -257, 384, 423, 111, 388, 540, 427, 246, -126, 243, 115, -136, 153, -450, -322, 93, 29, 90, -519, -90, -142, -309, -501, -36, 35, -97, -527, -175, -341, -273, -748, 941, -29, 427, 101, 148, 436, 816, 298, -29, 150, 175, 213, -109, 684, -55, -530, 252, -264, -265, -73, -497, -311, -209, -229, -262, 95, -289, 75, 322, -187, 407, 532, 148, 411, -518, 115, -429, 344, 684, 3, 1038, 782, 244, -35, 63, -232, 419, -192, -286, 39, -395, -157, -118, -588, -414, 323, -454, 527, 180, -186, 129, 449, 516, -66, -288, 333, -313, 169, 271, 147, 89, 432, 143, 305, -206, 282, 350, -713, 292, -608, -68, -406, -533, -353, 206, 146, -185, 567, -518, 148, -90, -433, 568, 185, 610, 274, -31, 418, 436, -246, 584, -269, 380, 257, -278, -16, 206]
3809B06l11k0J24k70N75p16K82JJ17l04l37M03N56n37n21N05n96J426n16j43L22
3830B46j75K77j46j77K94l97L9Nk6L86k65N52m44O3k51j95j10j71L42J73Q1J20
3852B21k36l59l12J004M25q60N5j26L11J32k71l5Q37n05j9O4j66k92O98n33K70
3873C03l17l95M33n76J78j55N2P5J59l91O92p69L91M16l44L62M70l76j73o2K6
3894aN60q32M96L99r24N38q2J3m1j10j78J97k49k50P87o6K02m31k34O8m72P69
3916A59k70k08L20j49P19n56m87N87j7K13K35l06O55m93K44P1r60l59P54j95m09
3937d52O17l52N0m24J105o93J73n21Q74n50j23j70K91l9L52K61k88K27k44L57
3957D51n16K49M48r23J36P69q23M15l56N1M56j38r49O80l75M32l67K63k21L22
$$ y = [206, -105, -125, -1, -271, 304, -412, -130, -129, -12, -316, -653, -250, 306, -231, -752, -247, -843, 583, 67, -76, 246, 71, 348, 202, 25, 319, -78, -39, -34, -60, 326, 61, 613, 169, 232, -19, -214, -324, -495, -153, 20, 101, 221, -15, -374, -686, 318, 743, -117, -62, -188, 123, 255, -16, -51, 786, 281, 262, 326, 160, -132, 566, 33, 303, -14, -409, 24, -552, -374, -529, -477, -402, -243, -634, 58, -711, -320, 96, -248, 114, 584, 208, 35, -27, -1, 559, -273, 223, 622, -302, 236, 154, 167, 126, 16, -162, 35, -214, -464, 323, 257, 459, 28, -206, -138, -610, 159, -111, -319, 1, -148, 571, 15, -472, 115, 98, 311, 546, 240, 895, 402, 646, 717, -243, -602, 152, -43, -452, 165, -187, -137, -561, 544, -149, 24, -497, 377, -173, -296, -466, -175, -214, 138, 399, 111, 338, 94, 451, -65, 184, 632, -291, -155, 614, -209, 206, -150, -99, 357, 219, -730, -50, -425, 7, -360, -97, -318, 4]
3977DK83j12m14k03L23k37K64j6P30j8o8o3m41J97j48l7L2k5N1m73M79O20k50
4000D78p00j25K16m37P64o99N29l86J96M55r00O20J74l45P6N3N93J2L6m40M52
4021F22n46J38J42K49l98J042j232J11ll66M89l94R2j48m16O19m5l35M97k61q
4042a51k67M7j87M82J00j41O64m38J55j33j58J82R7j32M19o77Q99o66l27K49l45
4063c28J76M11n75O5L58o55O84p39L07K73J77m32O8j5L41k9J03K92k62K02J19
4084E41p58K05K90K17k14m72j07K41J26J67n7m20n5L25l73l0l57Q53r12K03O8
4105e19O83M3l49L12m16M20q1l85J005p51K7N56n76L52n91J19K02M25o11k01P47
4126D11j58n23K66L1n83J056o35o4M9l80N07O73p66L0M00k01K09j07mk2l50n2
$$ y = [4, 287, 175, -239, -442, -119, -356, -92, -108, 622, 604, 536, 473, 32, 229, 81, 44, 76, 51, 102, -371, 108, 728, 478, -222, -347, -131, -568, 196, -503, 26, -360, -164, 291, -609, 11, 185, -160, -84, -31, 562, 574, 610, 170, 622, 76, 214, 356, 605, 207, 1249, 17, 128, 125, -241, 248, -146, -54, -202, -618, 1, -44, -379, 118, -143, -151, -418, -371, -558, -76, 24, -117, 547, 109, 264, 131, -27, 155, 252, 120, 539, -138, 761, 95, -232, 17, -328, -152, 259, -316, -251, 107, -548, 136, -603, -296, -23, 154, -278, -210, -225, 116, 87, 190, 482, 220, 422, 541, -217, -12, 278, 495, 281, -191, -298, -57, 69, 236, 179, -241, -296, 29, -344, -374, -731, 122, -790, -587, -519, 164, 207, -142, 170, -246, 174, 93, -292, 713, -38, -11, 545, -31, 321, -270, -151, 51, 476, -135, -336, 411, 253, -270, -4, 27, -556, 500, -135, -199, -150, -530, -23, 650, -116, -86, 314, 113, 322, 215, 211, 189, -161, -213]
4148b13O6J0M70j34L9n51K20o33J146p86K35j61j1L71l31L16l64M95n87N09j68
4169f2n25L60L38l8n23J025o85K87l07P22j74p14K70l31P08l87o8q2k33K14P33
4190E28n53j29p3N57n26o2l67K45K15L32m70J67n2k20N15J291j388M21K67p19
4210b1L22l38O49L29j309Q07o44O08n72n40R24n94j58O84p09O19M32k35k82m64
4230d92M35K30n09L54K61J28L61j78q37O08l06J36K30n03J09L03m61L63l95l23
4250d86L27mk54j74J97M08j9m74J79K61l22O27l5k11j92j81O76m94L95M1k68P4
4272G1O4l19P10m17n3L72l58k04K24n80M76j54L45p09N01J45pM7m77L13k05L92
4294A77O0l38J21k31j83M24p13O65o4J57k62J96K01j0M5l02J80J58J00m37m35
$$ y = [-213, -147, -137, 333, 199, 238, -313, -93, -726, 420, -366, -131, -292, -303, 68, -263, 53, -311, 184, -403, 106, -62, -587, -227, 111, 73, -450, 575, -110, 177, -130, 592, 418, -296, -26, -357, 351, -36, -104, -186, -419, -205, 528, -25, -154, -227, 330, -196, -258, -625, -380, -165, 167, -303, -136, -188, -408, 107, 1398, 10, 431, 698, -21, 301, -37, 612, 941, -368, 439, -205, 403, -169, -709, 215, -379, -537, 147, -562, 57, 489, 254, -28, -492, -57, 173, -336, 18, 279, 407, 768, 590, -247, 361, 55, 191, 421, -82, 27, 330, -131, 232, -163, -486, -159, -163, -417, -591, -394, 14, -5, -479, -300, -39, -361, 266, 231, 20, -172, -353, 323, -171, 224, 265, -3, 71, 135, -184, 526, 109, 56, 428, 70, -134, 90, -490, -14, -168, 177, -532, -31, 114, 107, 154, -323, -10, -215, 177, 237, -101, 20, -211, -394, 30, -683, -18, -82, 75, -187, 9, 210, 200, 245, -57, 123, 281, 381, -56, -491]
4315d91K75k78L23K76n85J044n04l86N04k96K60j03o0N58l64q7j59k49M54K5m30
4336b73QJ83k25o6j18J27N13l80K53J80n30M49j03j82K87m72K84M77n05K18k79
4357a54j49N52j86k60K16M18p3r1n14L10l45P05J11o71Q2l55q2M84n49P86l08
4378g3J47n80M68j91L22l09K27J02n7o68Q84j67j12j24O48p60L24M9j22J00m99
4399c91P33j6M7J94q99K24J66l14K31N0j42j09j97N84m91k73o0J61J058o22K5
4420d1J69L70m93L54o23K28N76n29K00l40l7O01o1l96O08l17p79Q15n93N08j55
4441F5l80K11J48k25Q0m28R3O10r8l91J21J55N05l28J36J83l95l23r2M88r4k21
4463a80O46J26j221J071q97K67M33k49j53K70P7k9j96J47j48kk81K42m21R01p38
$$ y = [-491, -216, -494, -171, 105, -480, 564, 60, -326, 178, -118, 142, 39, -21, 537, 173, 86, -73, -322, 132, 157, -273, -265, -82, -307, -373, -491, -364, 149, -231, 22, 202, -328, 121, 18, -164, 123, -349, -65, 412, -93, 125, -154, -303, 249, 63, -197, 19, 437, 364, 273, -241, 69, -276, 429, 540, -131, -49, -404, -486, -2, -551, 235, -73, 74, -506, -38, -229, 93, -216, 11, 113, 56, -612, 272, 105, -7, -131, 517, -243, 81, 130, 8, 108, -391, 342, 326, 373, 567, -332, -108, 58, -256, -25, 25, -117, -226, -423, 161, -330, -603, -663, -502, 556, -66, -41, 128, 498, 5, 359, -264, -36, 540, 11, 211, -129, -166, 435, 374, -22, 586, 269, -510, 305, -288, 220, 65, -315, -104, 44, -181, -101, -529, -436, 174, 76, -315, -194, -39, 466, 138, 274, 457, 62, -261, -353, 135, 41, -180, 466, 592, -629, 442, -455, -188, 245, -4, -157, 113, 190, 161, -35, 112, -36, -38, -319, -77, -498, 403, -335]
4484c35J60N13M54r82Q66l44r3n25O09K28p83M82Q1k84j94o72Q70l23k78N72J8
4505D0k6l91r9K48j71J044j321J011q00M84j07j34Q85o22J1J99J30k81m9j13j39
4526b01N34l60L37q6k68j39k58o2K6K42j92L73k09J9R8M04k36l25J51K26K0P7
4548A71p62M15M73O9k37n70N18n5p9J76k97O05l17MP05p86N3q9j32J0L21q3k12
4571i9M00l75J57N7m10M83j34k2J71o14K4M86j22k74k91O23J57l54J41l0m6J3
4593e9M59n08J00l35j01O08k16n39P34m78O31n76j44P55q87N83K42l44j74M54
4613B05m27P19j64j57p42L90M90L59p58L63k06l15K0J94j04q5l98N27n03J64J43
4634b85l68O55L06m76L9M01k85n5J53l42P90L26p40M28q91M80L57m40L06R8k48
$$ y = [-335, -175, 338, 792, -190, 676, 332, 239, -286, 323, 551, -232, 250, 331, 47, -147, -819, 51, -272, -550, 22, 40, 14, -377, -476, -228, -399, 645, -676, 335, -465, 19, -88, -222, 663, 41, 52, 251, 381, 100, 51, -62, -201, 333, -27, 310, 224, -44, -183, -441, -503, -477, -235, -427, -54, -263, -244, -146, 258, 22, -303, -152, 74, 94, 171, -591, -176, 297, 366, 129, -441, 77, 22, -57, 119, -178, 427, 110, 114, 819, 33, 86, -3, -135, -125, 196, 113, -99, 301, -74, 83, 140, -270, 213, 79, 57, 228, -386, -362, 124, 2, -272, -563, 60, 217, -137, 4, -26, -72, -59, 400, -108, -8, -343, -444, 164, -52, -591, 143, -335, 296, -280, -424, 331, -556, 27, 269, -75, -249, 205, -222, 497, 333, 176, -566, -176, 314, 673, -85, 278, 72, -243, -223, -29, -133, -218, -616, -89, -592, -428, -285, -653, 2, 308, -168, -129, 272, -13, -68, 85, -257, 533, 859, 119, 547, -344, 136, 493, 53, 359, 457, 209]
4655B09l53Q1p7K64n24M67J2J40m89K23l6M14o33J59M65m10J51N8k54L90m73m2
4677b58P03q81N78L4L20o79j72N16k88k13L90J69o84P5L90j78j48k85L84K89k66
4698b04K78J53m48N21j91N9K3j4m47N17n14L10Q1K90l8m69m49N86m1L69l92M66
4720D46l69n27P99n65P29k27j56m02j89N92l69L43M13K45r72J95N74o2j48j64
4740A86lm1k76N10o8n11Q78q34P4L0j99N4M86r5n05k6K06k36m93M90M60m13L41
4763A5J37k25k69Q21m20N1k64L99L44n59J33j40K19O8J82p57O78p43K82j2j46
4784b06N29K7o39O81l41O4l17K10j97K8L36L08j065N81K29r2k48P14j036N20K70
4805C56p2q2o99L18m2qN83K02m01M09j181M09L47k05m18J144q49K94K77r7o9q64
$$ y = [209, -144, -63, -140, 124, -400, 67, 79, 219, -270, -47, -83, 331, -302, -143, 322, -88, 63, 121, -133, 257, -216, -258, 445, -436, 142, 176, 496, -183, -355, 161, -127, -340, 50, 219, -465, -390, 0, -178, -326, -611, -227, 62, -204, 74, 227, -221, 300, 109, 168, 191, 177, -270, 247, -267, 43, 124, 414, 376, -93, -542, 44, 3, 372, -20, 446, 77, -450, 349, -216, 513, 286, 130, -272, -461, 131, -238, 105, 518, 763, -209, -14, 560, 498, 350, 186, 183, 142, -134, 376, 308, -203, 675, -159, -85, -55, -254, -200, 286, 191, -314, -340, -134, -370, -863, -373, 87, -326, 15, 152, -73, -342, 479, 59, 110, -154, 245, 589, 30, 163, 23, 242, 310, 492, -265, 413, -330, -48, -60, -206, 323, 350, -289, 392, 51, 115, -202, 8, -189, -161, 175, 483, -582, -1, 228, 136, -112, 602, -434, 86, 356, 284, 202, -497, -179, -221, -229, 354, 556, 155, 564, -617, -208, 139, -66, -484, 660, -189, 105, 382, 285, 216, -648]
4827f48Q81p42K25J71l6K66nK8j32o7L52J17k41Ll18K35l56O11l93J9L80p10J218
4850H58j615J350o83lM0M49q36N95K27m37J06k14J57J8J33J97m61J49K81j71J92
4871C32l38J5l9n03J79J44k78K80N95o10j68L20j61K2N21p58M05M93n68l91K88
4892b20l00K79M02L29m29%R0o1mL55k27k58N75q90J034q50j48N49k93j68j09O17
4914B73n8q06R46q7m06k04K16p4M61Q9k13r9m45K69N22p4m38O6P8%L12k16o19
4937e07M12m83O87o74N07k77K52l53M08P23j008K71k45L51n8N9K52n43M80K5l83
4958a04N44p23M25q8j12R3L19J18j64l79M00o55J14P33q73j05K20M8J47l69m23
4979h34J040n71Q77K56q24L19l34L08m36J26N6N01n35K06l62N62m33m57J208n30
$$ y = [-648, 233, -509, -284, -113, -149, 117, 112, 140, 8, -59, 293, 410, 169, 172, -146, 89, -267, 344, -49, -30, 350, -360, 858, -757, 593, -90, -93, -53, 396, -440, 155, 382, -55, 51, -163, -6, 12, 145, 342, -119, 30, 311, 140, 332, -6, 9, -30, -533, -354, -210, -488, -208, 387, -223, -391, -71, -232, -210, 311, -447, -42, 451, -117, -508, -220, -520, -241, 161, 490, 61, 61, 151, 90, 86, 441, 214, -44, 531, -359, 675, -175, -323, 226, -67, -235, -344, 273, 215, -591, 355, 268, -138, -342, -126, -200, 261, 350, 137, 38, -407, -138, 384, 310, -128, -62, 16, 16, 328, 112, -507, -95, -578, 109, -565, -58, -335, -83, -436, -28, 695, -313, -42, -287, 64, 6, 65, 317, -226, 254, 279, -104, 440, -283, 142, 54, -58, 35, 354, 472, 308, -71, 329, -326, -212, 521, -352, -457, -237, -189, -42, -411, -834, 206, -365, 512, 768, -56, 263, -71, 237, -199, -73, -17, 484, -51, 155, -207, 355, -78, -535, 673, 143]
4999A43N90m86l10l14j15N78j40n82M11K02j99L81j14K2p71O25o4O0K37r65R41
5020A30N7l41N05k76k26O28o08N93j219N55LN24k63O03l05P4m95O7o8l20P9N29
5042B26n13n6J43m61O00K52n82K15M54nl93M33k40L41k7m76K67Q0pq5m57j76M43
5065b4N72o11J09j71L94j94n75M37l3m9J57K70k14j98k11P38m53Q8N88p25L46
5086B41k30j40k98L74P3j94qj88Q33j35l66k63P09k85j94l47M53o16M86K51J12
5107B68k69J29q3j22J96L34m37j95o1O67n8qK08N5n4p87M01m96Q32r66P19k17
5129E6k22O09n99J83n18P56n98K28N87l80m40J05K50N8k99K32j80M68q96R22j016
5150f94O45n0L63o95O88j08n00Q68j57o8q42Q24L71o25J00J15k89M38l3o81J84
$$ y = [143, 733, 247, -63, -377, -492, 86, -54, -636, -225, -23, -222, 159, 45, 67, -704, -79, -143, -83, 154, -811, 130, 187, -154, 351, 75, -151, 477, -131, 462, -757, -202, -199, 325, 62, 665, 360, 434, -61, 6, -62, -382, -303, 226, -287, -343, -200, -661, -61, 191, -391, -176, 278, 273, -120, 313, 73, 414, 387, -89, 178, 258, 251, 166, -291, -467, -24, 548, -63, 46, -125, 269, 75, -500, -63, -96, -145, 12, 282, 68, -130, -341, 397, -56, 32, 620, -105, 241, 11, -129, -427, -53, 20, -174, -182, -370, 463, 328, -38, -301, 408, 123, -71, -418, 35, -581, -95, 156, 268, -1, 128, 45, -77, 119, 453, 16, -179, -240, 427, 369, 361, 569, 624, 570, -217, 184, -312, 520, -446, 273, 56, -166, 443, -156, 27, -491, 265, -333, -105, 482, 102, -338, -233, 17, 75, -224, 8, -172, 296, -600, 322, -694, -49, -99, 264, -431, 257, 149, -351, 517, 360, 292, -550, 274, 645, 20, 120, 235, -54, 384, 351, -330, -146]
5171a46L38o9j010J337p61K35J47j08O26r23Q56k92m99J13J36J6j91o2j09J74
5191a92k9M20r27J284o11K86n57J45Q5Pk20K65O3n16L84J60l56P6NM04k22l59
5213d05N09K18k15p2J8J68K02o54O42o01k59Q0O06j86L58j65k10k48j88K90M2
5234g0p9N9k01q7J87m0O21j37p13O70k08J80n75R89n79r4L56k93k82J10L17n07
5256c76L61L07nk07K23k6J51m80O0j71j45M60q6m08J144j048N55l4k11L84Qq71
5278d15L14P05j72n80N7M47n73M69o82R3k5K78k32J15r3L20j64J50J64n31O02
5299B47j93L55q33P88m43R2lK98o77Q15m01J15j85l40M88l94J06L83Q7n63O28
5320C70l14n43M80R5M6j03J02M0j32k60L5R2M89r5n63j36K92L04l16K68J72l46
$$ y = [-146, 192, 123, -887, 450, -311, -76, 71, -37, 589, -334, 522, 230, -269, -156, -20, -4, -195, -257, -366, -192, -221, 199, -728, 556, -55, 231, -326, -181, -96, -89, -309, -44, 19, -497, -113, 47, -309, -233, -228, 176, -46, -405, 104, 322, 107, 35, 53, 221, 423, -231, 411, -190, -449, -369, 237, 51, 409, 244, 34, -214, -402, -112, -70, -149, -90, -291, -378, -191, -231, 390, 253, -460, 210, 2, 182, -393, 596, 17, -77, 279, -14, -296, -186, 131, -376, -15, 292, 287, 80, 303, 277, 428, -52, 8, -163, -308, 152, 66, -342, 802, -246, 309, 275, 64, 448, 456, -415, -101, 604, 432, -148, -91, 356, -217, 252, -430, -337, -362, -84, -316, -201, -294, 26, -138, 12, 176, -355, 247, 54, 409, -424, 364, -79, 13, 10, 308, -369, 446, 45, 160, -25, -365, 123, -271, -165, 218, 305, -258, 370, 56, -487, -7, 88, 134, 31, 133, 173, 41, -219, -184, -92, 397, 302, -261, -397, -105, 199, -117, 151, 323, -23]
5342b3N7L42l60L22l31L47n51k84O54l73M44K54l03J20j75j21k41K05L77j94M1
5363B07L6J81N4n0p74L33J4O8k16K38q5l04K13j54L14k11KJ12j30L40k78kk53
5386c45n8J89m0N59l99K04o86N19J19j3j10P24r53N45k32Rm9k4K47K86k47l5l39
5409a29L49O9Or7j02j90l26O14j72M92k13j51L19l48k79L83p00N20k20k51K89
5430a37L97j27Qj97N2J42J9o8L1j59R7l95J13j84M52K76j84p5K41k67R9m85M61
5453A10r7k66N71p3kk90L13q9n85M64n55L48K25j47K0K32M11m71J7k75K73m1k84
5476a91P6R5o4J02K25p38M79J75r41Q61n45M38L3J92n1m82J54J25K94l20N58j054
5498e79O35k12q4J111o15l86J48J72k72R6j09P49o87l66M91L20q20L0K56K99M7
$$ y = [-23, 34, 376, 16, 338, 7, 354, -197, -481, 173, -200, 244, 498, 195, 315, 140, 19, -222, -17, 360, 166, 207, 243, 424, 478, 428, -346, -13, 1, 69, -147, 91, 6, -298, -85, -239, 75, -136, -134, -22, -152, 188, -90, -92, -345, -403, -214, -254, 305, -94, 110, -576, -57, 62, 49, -61, 663, -290, 255, 23, 32, -17, -41, 206, 492, 245, 210, -129, 220, 289, 295, 198, 96, -94, -420, 194, 22, 514, 301, 150, 469, 121, -158, 225, -475, 45, -175, -426, -137, 260, 133, 141, -56, -4, 138, 157, 89, 120, -39, 58, -337, -224, -408, 44, 320, 136, 61, 302, 35, 134, -351, 110, 13, -253, 318, 245, 243, -47, 266, 177, -408, 56, -499, -151, 74, -73, -53, 179, 590, 119, 136, -139, 134, 93, -191, -115, -20, -84, 18, 243, -495, -16, 159, -782, 79, -466, -28, 5, 197, 146, -336, -182, -57, 237, -83, 475, -579, 56, -156, -240, 871, 256, -130, 18, 190, -82, 14, -95, 654, -33, -399, 92, 412, -408, -378, -122, 177, 224]
5519B24K46k14J9Qp61O05k60L98j73l9j79J83K95m87o7J48N73k63q6J09k31m4
5541Dj27K99j63m79J117p92K76r8M76l57m05J91N2O09p75L74m87K21K76o44Q4
5562c48j7O6L22L13k44o4J63n42L76J20n8o71L69J39O4J35O5J54o62P23l52p19
5584f68P10l13L57J92j5k50k27Q4R07r43k22P42q29Q60o22J31r3k85N72L73j041
5605e80K72L88L45n4m89K11l73M83p4n36O50L58o57k91N50m20Q21q2o25J47K08
5626B52J18p34M35j72N73m25k60N62j06L1r2l4K34n50J25p2k62K25k22M25K27
5647B78l04k69k0k45N80M64l30m61N03N2J75p37J093o37J66j56%j05L54p02j2
5668c13O11l02O6l45L0L48q0K8l72K99o62N58K50r4M19l66n40M2R89q41m9j24
$$ y = [224, 470, 256, 275, 283, -478, 127, -133, 265, 92, 53, -126, 57, 352, -135, -202, -54, 519, 256, 170, 279, 48, 4, -123, 176, 13, -466, 651, -141, 135, 37, 513, 156, -249, -58, -6, 603, -172, 202, -285, -64, 212, -432, -348, -365, -299, 23, 336, 92, 28, 191, -351, 25, 145, 87, -584, -215, -76, -12, 123, 188, 342, -320, 403, 51, -668, 42, -271, 86, 278, 263, 13, -214, -130, 777, -166, -388, 354, -475, 385, -237, -106, -199, -484, 88, 461, -580, -308, 80, 425, 371, -118, 93, -280, 203, 129, -407, 243, 601, -56, -347, 203, -217, 604, 522, -103, 44, 252, 370, -364, 71, -101, 472, 47, -213, 349, 243, 274, 182, 148, 382, -168, -43, -115, -377, -152, -374, 51, 278, -26, -295, -315, -560, 20, 484, 154, -307, 196, 248, 423, -314, 779, 142, 308, 152, 152, 47, 401, -301, -313, 298, -4, 62, -283, -253, 95, 15, 43, -329, -30, -692, -134, 116, 22, 441, 75, -465, -423, 566, -275, -324, -448]
5690d48P2K77m3P%j61R6O11p77L70l93L99L10l71j59N18j88j35R4k28M70p77J51
5713c05O36j41l29M77l45l20R48o49K42j10k82J68l16J73j32q56J003j90j21K87
5733a62K2J5j05N00r67M45k23j98L13O92m26l28O57n18N17j64m70o3M54j34k34
5754c77J125q83M17o86L0J47J39j50K15k83L49n3l5j20J59j65L37j00j39J33l19
5775b59m57P44k14l94O76J72L30m62k44k23K61m6m1J9R29j205J79j71L73L46p22
5796d09K71L62k24M58q48Q89k41n57M53O5l0l50m1M60k51J37o28K12OL57L21m74
5818f2K01K34r91R34m0n74j07M39m09O22k00j11P4n9k04K85J46J0o07O75j87j50
5840h1K84p08M06J94j47J16k58l47L54k1R4N05O9p26L85L5J18k1n20M16r07J128
$$ y = [-448, -376, -99, -142, -135, -135, -296, -200, 411, -366, 4, -389, 10, 320, -51, -210, 308, 120, -15, 79, -149, 321, -456, -305, 331, 190, -139, 338, -7, -327, 621, -28, 214, 104, -178, -10, -326, -153, -285, -1141, -138, -328, -449, -162, -140, -125, -230, 270, -697, -252, -475, -673, -360, 332, -94, -422, 235, -283, 234, 70, -400, -463, -9, -143, -377, 748, -135, 282, -404, -374, -227, -88, -238, -23, -306, 43, -10, -45, -165, -6, -171, 166, 66, -73, 60, -259, -716, 28, -186, -580, 96, 268, 598, 136, -108, -331, -70, -116, -157, -138, 791, -414, -235, -406, -33, 313, -409, -138, 224, 0, 458, -390, 499, 258, -299, 154, 219, 189, -161, -202, 258, 7, 144, -484, -272, -266, 91, 412, -62, 139, 373, -618, 316, 276, -298, -405, 34, -375, 247, 47, -64, 10, -49, -253, 32, 178, 188, -419, 256, 69, -81, 203, -505, -99, 95, -52, 64, -194, -541, -187, -208, -114, 391, 460, -266, 119, 154, 272, 251, -269, 147, -760, 368]
5862C68k3n40K59j03k01K61o32N34k65M24K84j35J66j22k10k35j59K03k68K40
5882a54L4L75j60l49j84M35L97p84M19M59r02P90j330O36R8O85l84J5K33m00K33
5903A62m81M79n81O17l01N14o77k83L10P10o88j69P25q46O00K24J59n13j99K35
5923cQ9n0p3k65O80k02k67j30Q07j89l92R1j071J165m20N50p04R05k00P2o15j36
5945c58L27J07m9m89J85N73k27j25N79p98k0J89Q7M91m51o20N32j74K48l74M99
5966A32j49J98k07k02P79o24L05q54J36L57j70P27k47l61L37K70k22j1l61j35
5986c02L63k46K78k15k78M91Q8m26J55J60L55k5j43Q0r74R5O39J92j18k77J92
6007H4n04m79J074L45o77l53P12j11j3L07j63n85O67m54m16O59n72P18P37j078
$$ y = [368, 345, -195, 64, -39, -240, 21, -611, -77, -342, 82, 366, 231, 397, 275, 65, -170, -329, -126, -394, -154, -120, 255, 95, -254, -438, -3, 394, -390, 29, 488, -414, 376, -954, -318, -220, 465, 81, 96, 329, -71, 162, -319, 160, -421, 196, -105, 409, -268, -551, -241, 469, -219, -388, 337, -509, 91, 315, 474, -39, -238, -3, 86, 36, -37, -302, 378, 176, -91, -221, 586, 397, 5, 96, -975, 190, -230, 320, -384, 521, 321, 393, -222, -358, -31, 76, 27, -462, -277, 296, 69, -56, 523, -275, -295, -106, -19, 472, 21, -599, -67, -241, 7, -367, 132, -17, 181, -26, -228, 551, -73, 232, -622, -486, -129, -299, 428, 181, -180, 157, 427, 205, 194, -167, -302, 61, -185, 93, -122, -400, 91, 179, -247, -92, 68, 423, 398, 255, 335, -639, -544, 95, 287, 169, -108, 84, -420, -899, 175, 520, -157, -510, 202, 91, 78, 385, 222, -363, 304, -150, -566, 93, -479, 239, 976, -102]
6027a02l76O93m34J27O70l95j48m72q1J101n58K76j99PJ68m48L40M3n45P23o68
6048b78q7O79o47N9J63Q3O14m06j28l17N30m07j22J207r05lK83n31R9L06j99k78
6070b85M86J62l46K32n57L09k37N55l50j63M93j05K64j35p0k50N33l6l66k65P25
6091E94k76m4J35j95k86L95o38p6P66m72k66K68N0J8k74J76m20R56m21L72l72
6112a0P9k09o9K45J74k20J89n98J09P31k44K72j092R18j72K27Rj04o73O91m62
6133b09Q0N45l90L81k35m60M02n68M45m91O1J095p09K1J86n59M93M47m66j47L90
6154C12n82N72o84O41L32q90L10N11p6m84K33o84P76k50m12m7J91M55j26l0P7
6175A45j91k56L35j19L41k77o1N1K47j59o8j89J30K62J21j65j59m19K36N07n38
$$ y = [-102, -478, 215, -219, -92, 578, 183, 35, -437, -518, 583, 25, 301, 102, 109, 277, -171, 169, 212, -333, 390, -278, -365, 314, -333, -274, -111, -28, 586, 180, 52, -265, 265, -142, -264, 943, 38, 35, 318, -213, -114, 192, -7, -285, 201, 363, 17, 249, -308, 1, -236, 319, -31, -194, 299, 194, 458, 323, 253, 3, 536, 500, 134, -131, 594, 318, 274, 409, 214, -72, 323, -315, -391, 375, -97, -363, -95, -45, -27, -301, -125, -545, 411, -10, 362, -10, 69, -140, -209, 36, 210, -10, 179, -419, -310, 421, 177, 449, -643, 275, 103, 330, 339, 235, -438, 253, -209, -129, 416, 26, 407, 172, -288, 114, -454, -9, -500, -439, 656, -53, -32, 154, -405, 88, 535, 69, -78, 312, -270, 302, -382, 259, 591, -299, 11, 522, 446, -38, 195, -489, 287, 37, -375, -422, -231, 224, 98, 68, 145, -46, -302, 33, -86, 255, -22, -83, -32, 215, 56, -12, -201, -71, 191, 312, 147, -12, -431, -195, 312, -226]
6196b26N97p19P49n26J29j92N6L7j06j7K06O6l26q9P14q07L79M14l80R62r97K72
6218A96o39N76J57J22K00l34l75M94n97m9Q9M75j60R7N3l15J1r4j66M16m35K40
6240c8m82K75J21k86Q24l49N6m64J41R8K02l20M51N37o79R8K58m5j72j18M48o09
6262e3L14j56Q9j30p44K70J014k11N3o09Q7K25L27o02j10N50p94N35O6n13N18
6283A26q1m16M57qK7L58q90N16J04o04K65k85L30M29m57j55O89p34L5L05j095
6304a084J413l43Q1M38k88L80m47k83M03l71L31l48o32P25J29J95J93r45L56L61
6324B64j98n0L32n93k67N82k83N91q44M37n9N98pj86k97J47J3l91K01J12J31M2
6346B75m65j26J35j58Q5K84k43J19j73J44K11J56m21oK72K38j04K07l19k79M55
$$ y = [-226, 371, -348, 401, -125, 4, -188, -132, -95, -201, -218, -12, 54, -272, -361, 353, -454, -75, 339, -41, 921, -76, 196, -443, 133, 290, 412, 612, 278, -97, 397, -200, -249, -160, 315, 155, 252, 305, -10, 1, -93, -259, 157, -278, -38, -520, -245, -124, -410, 414, 65, 121, -343, -202, -104, 98, -222, 229, 766, 87, 185, 443, 398, 226, 108, 556, -53, 261, 105, 194, 64, -680, -410, 604, 393, 446, -163, -76, 149, 476, -126, -236, 314, -480, 55, 121, -392, 126, 45, -371, 86, 78, 105, 463, -427, 89, 193, -411, -146, -431, -101, 328, -129, -284, 405, -329, -294, 11, -1084, 329, -14, 67, 505, 217, 597, 150, -133, 270, -101, 230, -118, -750, -25, 104, 299, 492, -453, -97, 264, 66, 16, 348, -245, -512, 70, -213, 378, -466, -29, -88, 510, 503, 317, 20, 167, 180, -211, -10, 102, 233, 275, -190, -316, -181, -339, -254, 30, -213, -94, -267, -123, 88, 244, -177, -183, 89, 327, 223, 430, 111, -168, 287]
6367B87j84m53R33p74N98l72K02j78j63J57J14R1j62l22n14J129q38L91q7j16
6387b61J92j88M41j58K79K78q04J82r3K06m17k63L82j43M42l84j5j78N20M53k97
6408A74o00R08p04M33J9n40M4K19R50n53m01L6m39K30L65l16j03J08J7K45m62
6429c70L92k90M47L35r48M23m21O26k41k67l4J42L15L68l08j36n76O71O8j0k2
6450A64m04Kp0jM3J65M19n32Q3K14k45k65l66J260k98k41J91k64O26m54M32l95
6472F4j66K12n41N65l8m39K33M37o79K48p4j64l81L19L81J66k00Q00o90k02L4
6493a15j72M19j33J94p32J156q10Q06q02j45Q75m02j16m6j0l02L06M85k9k54J85
6514C58p17K23N44p54J82K33j66M20J53r85N05j89L33R3j75J0o07N64l96J086
$$ y = [287, 103, -350, 583, -191, 407, 35, 237, 59, -104, 53, 167, 258, 96, -226, -740, 389, -449, -58, -145, -261, -69, -257, 184, 26, 305, 583, -221, -39, -132, 74, -343, -606, -224, -367, 75, -309, -324, -502, 18, 471, 174, -426, 482, -222, 211, 230, -310, -266, -47, 903, 350, -51, -15, -454, -224, 141, -175, -278, -170, -153, 92, -370, 22, -268, 179, 514, -434, -11, -432, 194, -47, -314, -348, -206, 109, 477, 169, 33, -543, 128, 196, 186, 164, -240, -238, -308, -309, -266, -101, 318, -214, -131, 83, -162, -427, -793, 467, 169, -72, 119, -145, 481, 27, 459, 64, -102, 110, -431, 134, 96, -343, -110, 327, -352, -104, -178, -342, -723, -404, -23, 143, -57, 743, 53, -149, -115, -287, 132, -1, 193, -539, 617, -193, 613, -189, -334, 541, 139, 23, -23, -33, -335, -29, 456, 427, 173, 358, -359, -136, 408, -346, -164, 69, -97, 323, 476, -509, -4, -193, 140, 233, 58, 68, -539, 25, -371, 715]
6534G15q25J04N82k90j336J156M80l81k85K07p19N69K28l37K19l87O85m83L91
6553B93J91j86j28q7L3o35J069j02j85n03l10N83k01L29k22N38l16K24J32n71
6573e4K52l02J14N56j304K77K69K77J02m52rK02m81K44P73q42O39q10O30J80n76
6594c15q8P70l07j0o53O43L8J44L13p04JN91k26r2k47KP09q99qJ81K06M57j82
6617C24K44l95o65KQ00l46j70K52k48K45L00p58J44N79o85K42o5k95M31m24O22
6638A34n68R81m17K88n97N70j83l99K99o08J206p36k16OJ80k15k94J84N92r6n0
6659F1N69o68L7k28L41pn44Q32k57k50P6O7j81m48J081q06rM28m21M46N3k17K44
6682A99k79M21k92n55P25qj69N8JM8n32j01O26l26K14k3N02n21k05J68J23k29
$$ y = [715, -110, -6, 576, 286, -1050, 106, 586, 205, -80, 127, -592, -23, 205, -132, 87, -300, 385, -98, 293, 484, 298, 170, 83, 116, -519, 550, 448, 263, -240, -550, 33, -168, 161, -61, 477, 161, 385, 517, -54, 198, -104, 10, 566, -738, -461, -192, 85, 187, -265, -274, -72, -553, -309, 464, -378, 261, -549, 81, 261, -315, -403, 367, 60, 50, -603, 40, 78, 222, 535, -169, -168, 423, 197, 105, -142, -140, 569, -330, -338, -157, 49, 506, 324, 568, 173, -492, -490, 310, -36, -206, 46, -202, 43, 343, -415, -271, 308, -377, -135, -200, -495, -64, -488, 134, -434, 547, 130, 418, -179, 391, 208, -191, 108, -500, 706, -30, -246, -240, -60, -275, -569, -385, 207, 111, 61, 630, -38, -1, -229, 112, 105, -439, 393, 136, -114, -38, 29, -152, -600, 481, -325, -334, 94, -327, 119, 172, -45, 199, -80, 341, 49, -506, 219, 211, 42, 100, 101, 149, -383, -484, 142, -184, 30, 7, 509, -12, -217, -49, 74, -155]
6704a55j12M6J18l83M76l91J86P94l67l6j74n05N8P49j10k99O39n60K28j90n76
6725e64J56N04m94M14j90M12o77j38K89NK39j60J00M7R0j39k74O0J4N50q80N18
6747a18L20o84N37r7p7J93M24l58J22J90n10M3m03P79n04L82k45K72l84J74o89
6768f33N72p6K3m6M42k7R1j82l9O08n27j84K60j93n06N05M82m16j04n1p7L50o40
6791c68L76L69m08L22j34O3K70k00o30j17O44n56L93m31L16j30l1N72K54ko51
6812g9Q5q5l35K44k56O87J35J1n5J44j18n22k78N78l8k00J71K05M7m93O5K33l82
6835b36k08O37N22l54m7k43l74O60m45O7M4k65J57K32m34M48n41O59j258J344
6855C65n91%k6J11K84L76p09RM76j95j23m34K15K59K6M36l98l28M22N20p87Q6
$$ y = [-155, -267, -221, -103, -486, -10, -401, -215, 579, 212, 176, 2, -503, -445, 304, 194, -105, 534, -26, 202, 12, -564, -408, 96, -398, 16, -174, 238, -439, -577, -288, -283, -44, -204, -104, -57, 33, -106, -380, -320, -306, 244, -636, -118, 202, -482, 55, -42, -119, 74, 498, 140, 262, 452, -58, -15, -418, 361, -143, 239, -6, 266, -118, 56, -633, -61, -137, -114, -160, 282, 255, 346, 164, 125, 733, 206, 22, 282, 89, -417, 88, 570, 154, 50, -1, -78, 272, -368, 8, 377, -31, 291, 157, 220, 490, 290, -340, -457, 187, -369, 24, -407, -91, -221, -252, 320, 574, 572, -79, 6, -79, -414, -170, -426, 261, 396, 407, 352, 496, 378, -144, -422, 156, 118, -82, 89, 294, 341, -152, -87, 146, -236, -444, 193, 715, 361, 314, 71, -303, 357, -88, -21, 23, -242, -85, 147, -287, 161, -380, 279, -979, 365, -226, -226, -252, -141, 143, 519, -190, -181, 295, 100, -23, -457, -242, 17, 43, 479, 81, -247, 175, 695, -92, -6]
6877fJ35j09K09k75L83Q0m41L5n01J37k68Q96K54r04N22l62l19N93m58Q07o60
6898b52N15j58n23J013q38j4k8Q2o9K05M68o90M49J71o51P2L88K22Po57Q55k91
6920B76L70j325J129k30N5m87M14J28p47N07j14K06j59L25o08K23J92q44R59l26
6940e6k47l0J14Q0l70P53m54J14k01M18l05K5P46m50m68O43j52J02n52N91k37
6961F4l48K3Q71q49P0J67j04P23l56m93K4M19m21J04K61o16L91J57m27K33j68
6982b75M11l02Kk7k6J2M21j2n20Q34l81l30O60n2m60n9K97m71P67q60N15l73M92
7005B63m49J80K23r4K66l29J33L02l30l8j26M25k40M14q96j09Q2j57N92l12M59
7026B59o65J87P8K40O6q1p2L64J24l59j85Q56q06l20R8L30Jm37O39k07n48R19
$$ y = [-6, 129, 20, 229, -46, 337, 417, -24, 11, -490, -353, -621, 275, 529, -375, 147, -215, -534, 59, -399, 408, -252, 263, 105, -418, 595, -243, -257, -285, -203, -272, -67, 401, -289, 160, 331, -320, -248, 140, 362, 369, -288, 567, 276, 646, -679, 450, 220, 275, -212, 202, 330, -417, 90, -24, 182, 23, 348, -260, -37, 155, -689, 270, -56, -303, -333, -219, -139, -509, 244, -210, -96, -297, 121, -184, -159, 587, 137, -331, 312, 160, 262, -290, 301, 64, -284, -261, 610, -239, -169, -2, -106, 617, 261, -232, -208, 211, -210, -106, 155, -461, -70, 87, -340, -107, -275, 136, -166, -164, -191, -217, -205, 216, 204, -316, 518, 137, -193, 467, 415, -45, -104, 193, -278, 489, -371, 144, -229, 263, -186, -6, 217, 123, 389, 60, 193, 495, 165, 127, 1, 426, 186, 600, -296, -405, -323, -480, 112, -200, 259, -406, -219, -141, 99, 165, 84, 12, 376, 500, 141, -44, 812, 6, -314, -216, 114, 115, -322, 317, 110, -438, 481]
7048D81m58K49n6q15J029p61r4M47j68M25m11O19p51R57p08L14k89L78o6J95m24
7069I3K90j55l47j1j3Q1m92L31j97L08p9L92n81L76Q1o01O80N25n16L95n05m18
7091c63O82r64P36J28P2J21o84R80j184L67L83l86j93N48J21l54p1j36O24o05
7111a78K36k75J39J9R6J28l20L94m05k74P00n2j13kr8M1k8L8N24j52j24q7q61
7134f54N18k34K70J88n24M37k04P01j98l39m26M93l34k21N81r9n89P06K81p92
7154d39O56k56J57l31O41n20K08n1P8k16m99N79m88Q36q6q05P58l01j8j39k78
7175e14J19J99m50m3J150m51O4k15k81M46j35J75L36p90J72O67m15J99j94j11
7195g2j59O91n28J04M55m10n15m81Q98K07k54J06k55K89j019J036K10N2l89j32
$$ y = [481, 23, 272, 216, -599, 430, -331, -425, 22, -146, 279, -132, 487, -264, 693, -15, 299, 10, 388, 322, 517, 93, 383, 228, -119, -130, -143, -62, -554, -223, -420, -112, -191, 201, -380, -4, 77, -524, 156, 681, 165, 560, 55, -363, 319, -645, 91, 219, 291, 412, -272, 708, -476, -109, 274, -112, -305, 243, 364, 10, -61, -197, 427, -178, 58, -217, -78, -59, 37, 165, -155, 239, -166, -440, 260, 208, 95, 93, -5, 36, 8, 46, 570, 418, 294, 207, -654, -136, -370, -100, 88, -436, 1, -203, 498, 300, -39, -465, 28, -306, -527, 54, -45, -634, 72, 353, -439, 217, -39, 118, -213, 428, -92, 116, 65, 143, -73, -572, 7, -481, 355, 269, -536, 222, -79, -97, -236, -514, -395, -196, -646, -689, 461, 10, 74, -141, -422, 24, -111, 64, 400, -390, -218, 449, 34, 233, 39, -72, -231, 460, -68, 36, 491, 81, -434, -915, -17, 190, -64, 42, -213, 76, -943, 93, 303, 355, -34, -166]
7215a66j23N76J74p76j63P88l66n7K1M10j81m84P4l4L32J33r6j59L29o93R13p40
7237b88M73M30l9o51L89j62qQ4j38M81m96J50L1j53N24n60k93K0L79o64K90k72
7259d73P44l70p7k95M50l39L69p6P2q8j7N79l30P2o69O27l28M02L04m13K21M3
7281D08j009O80R5j35j5j04R92r35J79k37o31M26O06O9m74QN26k62o15N23k34
7302a39k74L44j62K09m23K97J01j83N96n08P8J45K72j28L39j057J426p76O9L90
7322F16m30J75n07L28j76K94k38nk59M67l66K65o42M7N35j009P59p3O08k08j49
7343C2k16R5r9J35j19P3k7J34O89n17o1k53N14m15L40m05l4m12PL81k22N50J36
7366C06n77k67k00J169n59Q7N70o97J50L56k93O16n58m02N6M25O32r19J19l90
$$ y = [-166, -289, 287, 461, -315, -478, 310, -56, -113, -92, 318, 137, -347, -273, -307, 25, 158, 62, -97, 232, -461, 452, -288, 185, 615, 576, -75, 314, 152, 144, 228, 90, 571, 75, 225, 256, 103, 627, 67, -226, -206, 173, -491, -201, -473, 271, -99, -176, -471, -21, -360, 9, -67, 5, -83, -100, 479, 149, 221, -448, 179, -149, 253, 557, 144, 365, 408, -601, 79, 174, 39, 24, -80, 912, -23, 156, -81, -712, -286, 320, 389, -85, -77, 449, 187, -428, 95, -139, -413, -69, -231, -22, -445, -148, -47, -230, 366, -142, -64, 81, 353, 225, 564, -493, 933, 157, 226, 616, 186, 361, -146, 182, 6, 300, 62, 57, -202, 265, -101, 164, -478, -431, 104, -905, -146, -219, 389, 181, 32, -184, -89, -188, -53, -172, -99, -126, 8, 697, 180, 119, -134, 380, -35, 305, -100, -134, -546, -539, -158, -380, 170, 306, -271, -538, -738, 431, -128, -41, 529, -168, -18, 338, 45, 661, 103, -299, -243, 182, 814, -105, 14, -376]
7386c76k36N23MP2J7j67L60l03l68J16O96j22j13J6j60k42N25p91M70J37o5K79
7408B72o54M31k14Q7N30o66J43k81K44J58R0P4n5l75J84j34l55P36m01n88Q26
7429E2K12l9Q2L91Mm70n90j49M83J52l34j21M58L87j93o08J25m16M34l93Q37K99
7451F03n77K40o39M60l22l52P19p31K00P10l84R1k20M6L27n75K38J09K22l62j16
7472c13L9PN51o02L56j50J14j3N02j210P43M21j09m26k39M21l94j20R07q68J37
7493b46K36J87L77m20k80J86L56o09K78L30n11R42r85J01K67J1%k83o1L89m33
7514a68N43m68j7N50l83PPL06l39k63j80O09k52O4J18J83r0n6l74K4M0q9M61r26
7538f93R57l60n90Q23K32k12M68j155M34M82m48o5l08K66M57k69m4M6k94P77n06
$$ y = [-376, -612, -89, -85, -13, 4, -163, 197, -106, -474, -358, 338, 216, 103, 119, -41, -283, 242, -549, -79, 58, -7, 272, -382, 49, -165, -78, 452, -214, -71, -352, -108, 50, 140, 214, 159, -216, -32, -166, -521, 215, -186, -774, 52, 264, 225, 307, 698, 702, 232, -358, -507, -24, 128, -206, -327, 131, 518, 325, -283, -158, -574, -140, -533, 304, 603, 26, 266, -373, 87, -235, -587, 132, -599, -399, 311, -73, 18, -202, -156, 171, -404, -166, -57, 165, -197, -313, -274, -267, 284, -318, 38, -112, 2, -11, 491, -719, 24, 445, 336, -90, -329, 92, -302, -422, 485, -383, -246, -10, 177, 554, 134, -146, 40, 396, -213, 65, 395, -116, 826, -159, -58, 209, 220, 220, -63, -124, 265, -168, 375, -93, -110, 440, 57, 64, 71, 377, 38, -225, -405, 204, -48, 16, 134, 317, 227, 171, -203, -179, -139, -228, 233, -693, 264, -96, -686, 137, 369, 157, 625, -530, -96, 386, -62, -127, -435, -169, 288, 19, -25, 21, -273, 504, -2]
7559bj6J12j24R9k32L24J29l32K80k60K44k01M2l59L55m7l28J08Q82j149L08O6
7581a01n8j14M32l26M73n49O5K68L08m79r1M81l23P39r40L33n98P27J21q3q60
7602e75L29M02M8q9j0n59K98K85J72O6q04O11j25J63l95L41j31j95N06m27L67
7623B78j62K2l55K10o1K44l4J69n05N46l06J39m35J81m94L37M34n87P16o39J60
7644a42o20O96n03p2J076m34K51n48M56n70K20M64l43L22j94k57P01n74j25L92
7664A96m82N72l18j33j76P09m79k1k99M47MRk89J39J29k8j13N91q66J89j25m9
7686c93L22n5L84J43o05J34K53J44k7q03j7P74l22M92p39J17k21L40N71p57j44
7707d09K25K3L21L2l19k06k9M88k23m2n3M82l23j47K30O87m31n05O45l79k47O53
$$ y = [-2, -18, 94, -30, 69, -163, 161, 290, -42, 238, -22, 222, 21, 63, -296, 59, 12, -316, -208, 674, -475, -167, -101, -159, -273, 159, -167, 306, -243, -178, 90, 398, -81, -172, 309, -14, 725, -215, 118, -480, 247, 368, 285, -575, -246, 156, 204, 115, 105, -454, -156, 129, 301, 367, -437, 174, 49, 212, -183, 158, 27, -168, 338, -89, 278, 116, 138, -217, -7, -68, 176, 142, 311, -194, 352, 46, 185, -250, -69, -563, -226, 208, -379, 337, -302, -142, -762, -66, -569, -641, 435, 1, 252, -296, 160, -410, -190, 274, -69, 253, 59, -198, 503, -71, -196, 196, -286, 286, -32, -165, -341, 368, -111, -132, -431, 16, 20, 29, -260, -121, 8, -20, -133, 458, -408, -219, -344, -393, -71, -126, 258, 401, -204, -70, 183, 327, 300, -503, -520, 254, -68, 424, -315, -198, -419, -79, 492, -265, -409, -184, -161, 160, 192, -127, -333, -362, 126, -97, -139, -192, 290, -33, -180, 50, 737, 306, -199, 446, 67, -180, 473]
7729D73n60q1K9N46l81l33P14o09N0j86O47o42j51N67J46p07O65J37M2o40N92
7750C18L37o71N3L59l54m87Q78o65L54L34k17j46k77L75J97m75O78q11M33n3n20
7771c60O53O9l87M55n84K85j87J31K59M96o69j36nl59J39M20K67r84Q63j71J76
7792C71Q7m04l16Q85q51J20l87O07J51l18Q14n11k5L3N2r36J21Q7N27r3m12L36
7814f2K17K95l55l32P5L47L82q09J87p5M7N10k53o1RJ18j73N7k24J008n24j103
7836g19O99k68P14J29q74O0k21L40n9n0j01M08j60K1k18q5K19K02J40k86L29K81
7858E01m36o15M01O95m48r40J380q39M23m76K81k86N37j2m02p9k21Q49l0r1Q5
7879B77k14k85ML49j2l49O71n35N57n09m2L82q9n4K78p02K69k06N53p85M25j25
$$ y = [473, -87, -168, -139, 407, 26, -307, 407, -202, -152, -338, 309, -333, -484, 83, 229, -478, 187, 324, 366, -274, 318, 655, -16, 37, 396, 42, -445, 433, -232, 122, 456, 239, 93, -184, 191, 388, -87, 591, -220, 213, 160, -360, 293, 362, -25, 430, -154, 131, -56, 75, 334, 830, 161, 25, 20, -339, -200, 220, 487, -497, 366, 195, 371, 458, 54, -262, 623, -228, -108, -495, 112, 263, -55, 759, 248, 223, 256, 308, -628, -507, -420, 107, 14, -398, -62, 155, 450, 95, -237, -162, 185, 567, -242, -55, -130, -83, 427, 174, 113, 122, 240, 67, 124, -100, 908, 384, -719, -20, -288, 426, 555, -319, -259, -480, -140, -199, -249, -350, 58, -102, -81, -299, -384, -165, 37, 177, -109, 220, 501, 65, -550, -149, 546, 98, -842, 538, -301, 122, -354, -73, -359, 178, 166, -236, -315, -536, 313, 283, 192, 277, 63, -222, -218, 131, 119, -230, 441, -94, 463, -46, -88, 294, 205, 151, 429, -273, -4, -210, 343, -442, -17, -142]
7901a42J54L86l30k38L24k28q2p4L98q6j28J82k42M54n85O90m22N15j89o08J29
7922a22K37o40O09k15J00l84M49M37r69r9N73J02J35q7l7J77j95K69O6r29R19
7943C96j95o17QJ0J30N23m38k62P9M22pj32k60P57m74r0K11mom57qL20K93J58
7967C57l57k40L56l00L59l3l58P77m31r2J20n28L67m12Q81m11l31J40K36m95O18
7988B23L04k71n46J052o84L21o41N29k14r5J07o8kj10L13m12K92l63K20J06k24
8009a63Q89o93m41L78J3j15K27m04n1k77L13j14O67k38k60L35K0K8k44K59j19
8030A0L62k92j03M52j46o34K34P77l18r5p15K16J59J22q8R2k72N36k40j43m24
8051e10L34L09j94m01M63J61j30j39M68m93J05%J89k80J66j50M77n43L91n74N26
$$ y = [-142, 12, 398, 68, -170, 154, -74, -156, -230, 168, 82, -46, 136, -106, 348, -237, 453, 31, 546, 357, -251, -122, 115, -525, 84, -131, -31, -415, 34, 471, -498, -597, -24, 78, 213, 126, 89, 266, 71, 340, 406, -523, 396, 201, -416, -408, -398, -268, 255, -183, -445, -366, 56, 49, -83, -343, 414, -60, -150, 61, 57, 51, -406, -414, -94, 199, 357, 0, -240, 116, -184, 175, 142, -216, 561, 130, 38, 158, -370, -3, -415, 466, 55, -276, -136, 100, -395, 223, 527, 256, -290, 762, 78, 399, -242, 287, 73, -22, 85, 17, 15, -95, 218, -194, 98, -265, -45, 61, -163, 726, 33, -408, -30, -17, -132, 95, -309, -360, -637, -324, -438, 229, -9, -269, 66, 86, 114, -130, 129, 10, 372, 80, -23, 429, 283, -351, -117, 660, 342, 247, -468, -252, -93, 29, -59, 33, -239, 297, 57, -86, -510, -176, 133, -61, -462, 1, 162, 32, -107, 361, -132, -27, -27, 162, -118, 48, -102, 375, -168, 223, -351, 175]
8072A75p87N64k33N70m92J47k21K24K05L76m5o80J68M82ml10m19J28k22K66K45
8093A37l97j98M15K42l87k7K65q1J24m4O9J02J54o55pJ25M30L70q00k16O49q37
8115e67P15j93k82Q63n01m36N84k02J53n01P13m49J84J64p0N46o85k07k49N26
8135A06J88p8j64J36k50j67L16M1m43R20m15q2k84J72J21k82N5L12ml30K25j02
8157ij23L1K65m26M88J10l41m2j06j24P8N69j90j54p5j8L26l32J14N1M4Ol39J41
8181e6O8L5K64l54K72m92R3L66k14l90
$$ y = [175, -612, -48, -281, 289, -203, -56, -277, -53, 152, 528, 483, -197, -29, 453, 449, 139, -280, -152, -374, -108, 137, -260, -458, -43, 199, -188, -215, 50, -31, 93, 49, 118, 220, 374, -281, -288, -163, 267, 637, -163, -379, 270, -567, 148, -45, -327, 536, 35, -401, 183, -19, 134, -367, 346, -103, 81, 245, 175, 721, 36, -171, -420, 106, 294, 216, 52, 188, -62, -229, 87, 128, -315, 605, 190, 108, -176, -4, 117, -165, -110, 202, 198, -132, 93, -9, -132, -101, 164, -262, 226, 336, -5, -47, -153, -277, -199, 370, 180, 26, -49, -67, 259, -73, 41, 92, 136, 142, -197, -56, 12, 47, 311, -43, 229, -263, -170, 196, -18, -408]
8191d08
$$ Imaginary data points
##PAGE= N=2
##DATA TABLE= (X++(I..I)), XYDATA
0@%%%%%%%%%%%%%%%%%%%%%%K8o8Q0q0Q0q0Q0r4J32j58J60j74K11k37K56k93L27
39A70l64M07m51N00n52O12o79P52q29R11j002J105j216J338j478J632j804K004
57A056k240K505k816L201l673M264n035O096p649J0124j4710K5920r3685j55711
71b32353K04400R1328J6073O2669j8041j36990m3050Q8446O9728k795J0272o6409
83D3278q9034K7298M9844K0903L1835m8760p2890j7166J7857L8090K6793J731
95B9779l0746p0147Q130N8732K971J9980K4952l7268j8348K3038J7990j0225k435
108A6403K6388k8288l2261M6422l777l4691L5369M949k7149P154q45r240L331
121C765J9785P473k0734O759r186m1701K3261K5554j5001J9844n345l8121L334
$$ y = [0, 0, 0, 0, 0, 0, 0, 0, 0, 0, 0, 0, 0, 0, 0, 0, 0, 0, 0, 0, 0, 0, 0, 28, -40, 40, -40, 40, -40, 40, -54, 78, -80, 80, -94, 117, -120, 136, -157, 170, -194, 213, -238, 262, -290, 322, -357, 395, -434, 477, -525, 580, -636, 702, -776, 856, -948, 1056, -1184, 1321, -1495, 1706, -1967, 2297, -2738, 3358, -4291, 5833, -8877, 17043, -76642, -232353, -27953, 63375, 79448, 142117, 124076, -12914, -55964, 32482, 102210, 99415, 109687, 43278, -45756, -18458, 31386, 52289, 84124, 35364, -37526, -54692, -36835, 1255, 28048, 29779, -967, -71114, -62984, -4252, -1281, 18699, 43651, 6383, -11965, 11073, 29063, 18838, 16403, 42791, 14503, -17758, 28664, 24887, -9804, 25565, 30514, 3365, 10519, 9674, 434, 3765, 23550, 31023, 10289, 17048, 7862, -33839, -10578, 14976, -25, 19819, 14474, -23647, -20313]
134b0313K4420K2712k312j7155q219l0530j826M2436N695j078l905l8258p450
147c5783J9610J8398J5699r349j0941k3484k5957L4887L2183o378M043k4315k9978
160d1365J8598K7318J6452K212j6681j6668k1066J5324L6295o005j051m255l6310
173b7202L558K5636R647J2343n757j6545j5196r289K3973J3403o591K661k3159
186a2518j1014K2148M645M163O052j2729n772p095O385J5482r277M115M427k0305
200a1293N382N778o074J6556M146o087n377r875Q389M634J441J2027j4646r316
214d315P242j4288M481J8366n777n279r716o623P678L982J4821K680j8857M15
228e190k833n5K5893K582j1783l855p382R545Q797K275P863j4469j1245N208p956
$$ y = [-20313, 4107, 26819, 24507, 7352, -867, -31397, -33223, 9213, 14908, 13830, 9925, -28333, -35783, -16173, 2225, 17924, 8575, -2366, -25850, -51807, -16920, 15263, 8885, 12928, -11387, -41365, -22767, 4551, 21003, 23215, 6534, -10134, -31200, -15876, 20419, 14414, 13363, 9108, -27202, -23644, 1992, 11639, 23982, 18225, 1680, -13516, -22805, 1168, 14571, 7980, 10641, -12518, -23532, -1384, 3261, 7424, 13476, 747, -5025, -12120, -5735, 9747, 470, 4585, 9012, -11293, -5911, -133, -6207, 10349, 14495, 8408, 3031, -6844, 1545, 6179, 7620, 19647, 5001, -4315, 2927, -11361, -6880, 11486, 5709, 430, -9286, -15909, -8231, -4249, 10572, 13252, -5605, -5190, -8023, -8078, 17815, 20397, 8614, 4759, -2623, 6922, 15719, 17994, 25857, 11388, 143, 5351, -2605]
243b605P838R561j4984l074n327l150J1556j232K540j681j0786Q788K186m84J4795
258A3941q425p682J0641n03L231R67o484M844l341K353N908j3857K425K536j1793
273e239N899J096o313K237o516p50K589m798R229j789p104Q499o326Q66J3896
288E476l615O52j189n587J0143L149J711K870q666L526K085r567R820J112p408
303D512L521p483l337K481k412P213m306q204L762q625L448J3385p563r65L03
318d270n445Q789M256J116L137q073M422L02n651J3218Q42q188M847o577j430
333A295P408l639J632m699p191L839m667N147N785j4372n26M257m398Q877J49
348a103n837L788m88N877J352n517O988n209l738J1985l489J259M905q362J188
$$ y = [-2605, 5233, 14794, -190, -3264, -8591, -11741, -185, -1417, 1123, -558, -11344, -2556, -370, -854, 13941, 5516, -2166, 8475, 7972, 11203, 12170, 5686, 10530, 7189, 9542, 15450, 1593, 4018, 6554, -5239, 660, 1756, -4557, -2320, -8836, -9586, -6997, -11795, -2566, -4355, -11459, -2960, -9286, -8420, 5476, 1861, 2513, 1324, -4263, 5880, 9029, 10740, 13610, 4944, 8470, 10555, 988, 10808, 11920, 4512, 8033, 550, -2787, -306, -2718, 4495, 189, -8015, -4253, -12878, -9430, 3955, -3608, -4573, -4270, -9715, -926, 3330, 4446, 7583, -490, 3932, 4234, -1417, 11801, 12643, 4455, 9302, 2725, 1295, 8703, 5064, 6696, 1997, -5194, -1355, -6022, -875, 4910, -9462, -9988, -5731, -10129, -1252, -1103, -6940, -3152, -3640, 2237, 3589, -1928, 5060, -149, -3887, 8098, 4609, 5868, 10773, 2411, 3599]
363C599L166l5L153o214k020j170q316R591M304j0220J514p140m317J1643K630
378A68j48k835o301N794o66L947R756q465k654M296n751N796O006m625J179l396
394B101Q86K220l490P737n58j0230K616m251k224J0169n749l037J053l561M705
409a613n85J164N549o080L450L636q391N495L449n692O497j11m205J841j308P337
425A0433p48o096M186p633k34P533q000q14K660o591K14j183k88N898m164K54
441d573o21p790O840L437k293P656l793m583M530N86M357J264m676L801n151J180
457A71P085q215Q93L676q399P76J659j585M916k428j157j910m580O702k99k290
473d985Q161o078l796P521k533K855Q39n522K814j318K403N685m362L600M30q624
$$ y = [3599, 6765, 6730, 9883, 3669, 1649, 479, -7837, 1754, 6058, -4162, -2648, -9788, -14105, -2462, 168, 20, -2815, -9116, -3322, -3988, -41, 9715, 1250, -1404, 2892, -2859, 2937, 8943, 4318, 5497, 2101, 2987, 5207, 1717, 9454, 8896, -1334, 1282, -2969, -5193, 4976, -773, -3810, -2757, -6318, -1613, -2198, -1034, 4515, -1565, 1885, 5521, -2870, 2625, 6074, 382, 6879, 6768, 2563, 4404, 3096, 10433, 9685, 3589, 7775, 142, -92, 7441, -559, -1373, 1287, -5304, -5090, -6273, -6561, -663, -4827, -4573, -5194, -12984, -6144, -2707, -5000, 2656, -1137, -5720, -1190, -604, 3753, 5017, 341, 4142, -1009, 171, 7256, -959, -66, 3610, -4789, -4013, -2354, -3939, 977, -1451, -2608, -4518, -9098, -2396, -2695, -4985, 3176, -2902, -6698, 823, -1710, 1145, 1984, -3538, -724, -2042, 361, 6046, 1684, 5284, 5714, -2910]
489b910L002J78k545M457m427l477J047J53P168k988n955M701n274N57R877l018
505E46R7j174m190L787J250O24J705m712N232K087m842Q371l21n691K519n442
521a54j300M381l291K138l683l206M858m630J112L654o556L030M092l069M782
536B158j888l618L612k00M144P49p162O320P78J257O310m456k437J789m166K598
552E788J335k705Q99p793m47L834m919L281J03p755K398M6K213Q319k125j838
568F34m167m744Q189P84p92L252p828K037R529J009L657r88n508m60m214M262
584D652M165o720n59j925o194N818J284j450J762n235k223R91J679O803l937n730
600f819K860m162M019O922l561N14l89j987N501P99J534J217o519K809J71k915
$$ y = [-2910, 92, 270, -2275, 2182, -2245, -5722, -4675, -4522, 2646, -342, -6297, -1596, -6870, -6313, 3564, 546, 643, -531, -4721, -934, 316, 940, 2645, -2067, 3165, 5252, 410, 8781, 8460, 2769, 5288, -154, -1454, 2927, -364, 1774, -1909, -5115, -257, -4887, -3775, -121, -6677, -3647, 445, -2624, 2158, 270, -3348, 264, 64, 4208, 4957, -2205, 4115, 4893, 6150, 12460, 8004, 5567, 7356, 3190, 5788, 7123, 4418, 5317, -2476, -2923, 911, -4008, -727, -624, -8379, -5981, -5935, -3722, 4597, 2472, 634, -3533, -8277, -88, 696, -96, 3156, -4672, -2635, 6894, 7903, 11560, 10572, 5064, 4604, 390, 4652, 8817, 2097, 1538, -387, -6581, -763, 521, -929, 833, -4402, -6625, -5634, -3955, 2848, -1089, -6819, -3959, -8121, -4102, 2820, -741, -227, -616, -2603, 2898, 3697, 5231, 6448, -71, 2738, 2909, -6]
616fN233l817m588K870l184m1K691j190J744m612j934P059j832K328J633q497
632f143K625L902p54M338k131k164P03j297Q362M51n394K599o194j932P126j341
648B756K51J224p698o74j97L420N277m921l217k881m379J0514O162n045J276p465
664e597k596P076N784O959l275p518J4j648O256R700o855m051l165o759N561P710
680G596J771j757j0235l960k38K478J0836j538j1114j660l692L176J1716R99l357
695A021n674l645M788M264O404K695j0386m60J639j465Q441K832n056l490m932
710c024L00M836J581K483n702o267M237k400K251M700n799j695Q77k57L301j321
726a899L26J235k836M168J740m793M745j15j811M766j849k188L55k542K808L60
$$ y = [-6, 5227, 1410, -3178, -308, -3492, -3533, -842, -2032, -288, -4900, -6834, 225, -1607, 721, 2354, -6143, -3518, 384, -370, 3968, 1837, -327, 376, -921, 7441, 7892, 2498, 5097, -1097, -3029, 4097, 2756, 3007, 4231, -3467, -4141, -4338, -918, 4359, -562, -3779, -6660, -11039, -525, 5637, 592, 1868, -5597, -8193, -1117, 4667, 11626, 8351, 833, 847, -801, 5455, 15155, 8300, 4249, 1084, -5675, -114, 7596, 9367, 7610, -2625, -6585, -6823, -4345, 6491, 4953, -6161, -7821, -11513, -8337, 3379, 4378, 1021, -4653, -8298, -3510, 754, 7158, 9853, -533, -993, 646, -819, 7622, 10454, 5398, 1908, -3024, -2724, 2112, 3693, 6176, 474, -5793, -1556, -3956, -1705, 2995, -2804, -4499, -3622, -3879, -578, -1899, -1573, -338, -3174, 994, 2734, -2059, 2686, 2571, 760, 5526, 3677, 1489, 1844, -698, 2110, 2470]
742B470j11K785p459j844K744l442O058J838n819j064k566J522N963N11J764m331
758i81n724N245K634J578N321n711l137J589j028L783K736j350m76p275k28L766
774G42q95N019o32q753Q50j784N73O370j523n45l110l585M994J394N37L827m505
791a026l83L093l371M155L324j564m4m271l07J879j411M946K80m626N23l570j655
808d028N087j633M45o99m025J333j421O54N804k021j95j065n617M541M766O89
824B615K955l920k818O94m11O264N42l291Q8o017k38O019M25J190n79o978j001
841d461l49L387O025k953l673l311n522O893M512M19J285m915k050L962J408N620
857F277R9m448n84l179J724N229j659J35j350n484K864J007J399K351m531k562
$$ y = [2470, 2359, 5144, -2315, -4159, -1415, -4857, 1201, 3039, -2780, -3844, -6410, -4888, 1075, 1586, 3350, -981, -6705, -1460, 1174, 2752, 8073, 2362, -775, 814, -214, 3569, 6305, 4955, 4479, -2796, -3024, 742, -153, 4866, 4234, -4519, -3669, -5453, -4880, 1490, -33, -578, -3688, -7273, -2279, -885, -348, 3479, -1026, -1409, 1684, -1687, 2468, 5792, 4228, 4184, -87, -394, 1485, 74, 5020, 5300, 674, 1197, -2373, -4028, 1059, -574, -129, -828, -4853, -3520, -4941, -4287, 1517, -504, -699, -1764, -7381, -2840, 1926, 2615, 5570, 1650, -1168, -474, -885, 5379, 5921, 2630, 2718, -3299, -3537, 2482, 2907, 4097, 3518, -3460, -4461, -4810, -1423, 4602, 1649, -2024, -5335, -10857, -3964, 548, 967, 2252, -2663, -4713, -751, 657, 6277, 6376, 1928, 1344, -1835, -111, 5118, 3459, 3594, 2244, -3240, -376, 631, 2030, 4381, -150, -2712]
873b712j081j687N567J43l361J518l590P90L781j102Q95l3j118M721n49R85K489
890E656m477J10K065j945K138j711k059K347k551J850J695k854J782m026l214
905e194L628Kk87J518m929J84R26J190M110k452j209J587j247L977L547k949J971
922D373l288k552K361n99J281J511k717Q23j989p69M057k616j282n6m743J312
938d893J878PK866k245r78K036k319L715J789k729K870j389j205L439j869J370
954B343J414l530J256r31K81L252j842p42j72n020K321Q59l120K531j493r09J941
971a561j412J653L3k745L919p62K11L793k345Q29J626l039J545J008l41J659l287
988G84J065K245j873K897j579m981J301j178O13K460l199o15p41j626L663M4M8
$$ y = [-2712, -3793, -5480, 87, 230, -3131, -1613, -5203, -4413, -632, -1734, -839, -872, -1990, 2731, 2182, 3167, 5656, 1179, 1289, 3354, 1409, 3547, 1836, -223, 2124, -427, 1423, 3118, 264, 2046, -1980, -5194, -1566, -1564, -1851, -333, -5262, -5078, -4152, -2962, 1148, -1304, -2513, -926, -2173, 1804, 5351, 2402, 4373, 1085, -1467, 894, 295, 1576, 3087, 370, 1193, -796, -1565, 2492, -124, -1406, -1462, -6205, -4893, -3015, -3008, -142, -2387, -3365, -1329, -3648, 67, 1856, -873, 1997, 608, -597, 2842, 973, 2343, 3757, 227, 1483, 552, 833, 4085, 2243, 1501, 1329, -3691, -1370, -511, -3631, -1100, -2593, -3502, -1561, -2973, -1320, -1287, -4032, -113, -875, -664, 3129, 784, 1613, 3239, 200, 1745, 2753, 2412, 4071, 784, 1849, 4094, 2221, 5118, 3539, -1442, -141, -1319, -706, 1754, -1445, -2060, -2801, -4427, -764, -720, -672]
1005f72K776l834o6J762j327L262Q57k595m78k488J316M057o62J704k492l596
1021b476K812l97J790J829l176k026p96j389K241j78N30J299m147J150O65j239
1037c508L890P54k558R17k085K75M362o13J239j079k072K221p73J393K379k715
1053B027n45j74l133K570L47J41J494m401j054Q65k107M581j060k666O38k081
1069d558J433L084k67R43m21k383J675j250J399L052j999J044r30k492L368l12
1085A386k14K318m247r01M49n66K138p08j570Q45k605N57K129j618K053j32j888
1102b574J754m37R04K527j310J656j072k159K507q52J039K462k489r83O11k681
1118a097J552O0j009J943k524j487K28j608K558Q02j857L23j599l80L332q8J745
$$ y = [-672, 2104, -1730, -1796, -34, -1361, 1901, 2758, 163, -315, -2803, -1487, 2570, 1908, 3612, 1120, -2476, 336, -61, 1729, 3558, 382, -1644, -2440, -3829, -1588, -1766, -1236, 63, -4084, -2934, -2269, -3508, 382, 1136, -1422, -505, -2590, -2315, 2047, 1434, 2673, 1594, -478, 1743, 970, 2363, 4742, 2027, 1482, 1308, -1825, 745, 1092, 1233, 2727, -1674, -2728, -1863, -3970, 611, -449, -3115, -2477, -4558, -3125, -41, -308, 635, 214, -2169, -494, -1744, -345, 2707, 708, 1752, 822, -1670, 1698, 1386, 1172, 3490, -757, -1658, -1209, -1775, 363, -345, -1915, -1070, -3675, -3118, -989, -2607, -554, -686, -2574, -820, -1257, -353, 2174, 864, 2520, 1448, -711, 1796, 944, 1983, 4445, 1956, 973, 1584, -1097, 455, 515, -494, 1449, -1075, -2562, -2334, -3942, -1384, -582, -2439, -2116, -3715, -4095, -763, -851, 894]
1135H94O91l350J379N5J019L558k061J42nl438K796Q50p75J987l901j183k84m63
1153b089L236l39k282l53k885N84M005j295J161m77l247K625K69J202K064k744
1169e65J721n94j934L731Q96j893J385k298j068J958r82K389j627k232l9j666
1185b818J586K065l359J345m00j427K371k22j436J738j973K136Q64j469K497j255
1201B43o90K589k164K80K278j888K64P06m20J662k423p00m94k743L208P80k124
1218a636R51k441j084L227m35J109q96k274J915m6J448K607l057O23M62j435K403
1235A441J726j483O01k251m34K144q20J842j040k879J075j823O73L427k460j561
1251a822l53r94K466j34R0J0k935J784K523j109K500r97k589K264j131J698J493
$$ y = [894, 1585, -1765, -386, -331, 688, 4246, 2185, 2327, 2322, -1116, 1680, 2530, 1755, 3742, -159, -1342, -1626, -2089, 1147, 808, -1474, -1827, -4712, -4128, -123, -1418, -257, -734, -3981, -1356, -1087, 115, 2179, -565, 1156, 562, -1372, 2359, 3255, 1362, 2747, 449, -619, 1339, 357, 2746, 1119, -1113, -1152, -2818, -1232, 833, -2526, -1181, -1581, -3008, -637, -859, -2295, -557, -2530, -394, 470, -999, 1498, 243, -447, 2142, -22, 258, 2536, 648, 912, 1618, 1198, 2860, 437, -263, -757, -3500, -292, 488, -1636, -685, -3126, -4210, -983, -1418, -309, -1205, -3479, -1564, -1610, -162, 2445, -612, 11, 473, -962, 1441, 3167, 1684, 2285, 34, -400, 1744, 924, 2766, 1726, -1153, -78, -1901, -1228, 2199, -261, -1822, -2175, -3169, -703, -837, -747, -737, -3672, -1888, 635, -474, 2026, 1029, -1560, 704, -427, 1271, 2764]
1268B764r80M44j738o78K428j387P25M68m057R13J333j412K313m75k997J13o51
1285b874J981K75p48J152k302j3K700n73M12K299k135J75J463q66J661K02j541
1302A268K03k332J657Q50k294J757r12k617J967J28p27O73k134R99j039M25J683
1319d45j348OJ453j440J419R76j574J951j66m36Q94j87J935q47j578J201j911
1336i7k44K395k773r89R53j863K543M26p97j47j892R4K322k606K079K86k150K038
1354d22J71J04J212j226O73O89r52K175p87M63N98l314P05J061j449O86j87j522
1372a322M71l57J133J65k300J468n30j377K849j455m82J457o87Q27J448j373K80
1389B15j82J32K631j812J221N29k654J407j23j084P17m62j172N29j137K202q75
$$ y = [2764, 1784, 2228, 490, -188, 2240, 853, 1578, 2046, -2011, -1098, 235, -1177, 1136, 661, -2336, -2223, -2874, -893, -618, -1366, -214, -2516, -2529, 171, -402, 10, 2309, 174, 349, 1812, 946, 2607, 2809, 1268, 1471, -861, 796, 1646, -648, 1109, 197, -2420, -453, -325, -1052, -379, -2513, -1514, -2553, -2128, -445, -1793, -1787, -334, -1774, -355, 621, -953, 998, 832, 396, 1290, 1103, 3038, 2191, 613, 1814, -97, -341, 2054, -719, -1708, -755, -2618, -75, 351, -446, -593, -2485, -2391, -69, -2675, -596, -310, -2460, -422, -251, -147, 1065, -161, 512, 1201, 249, 2424, 1637, 2100, 2698, -616, 89, 1150, -299, 387, 200, -1322, -851, -1208, -75, 90, -2210, -742, -1272, -2649, 200, -1255, -1737, -280, -967, -140, 1308, -65, 215, 33, 165, 2796, 984, 2205, 2734, 80, 1487, 1364, 280, 997, 535, -637, -108, -1245, 957, 82]
1406H2j462R77k474P95K323p21q0J19k246J623J42O64P77j847L03J450r07K797
1424B315l02j421R31j524q0J707j488K01j42j135Q34n69M44J222l016m5O88l79
1442a759K069r2j535L79r51J598J610n83R80j955J44K426n12N58L65k343j3J40
1460E26l11K229j325n54j06k144J126L48o47J104j779j547J190N90R54Q56j534
1477a024K21n48j86L322j125O65K16j571J326M03m84K096q64j879M01j785J429
1494F13J250j289L46k125j344J621K7O81m97k036K38O9R8K551m44o96N80j020
1512a377P81J430n17J256r31l06K86l03J670M21k537Q82q53k87J681j180L86m86
1530A6k373J699M15j830J459j801L23J943j139J406o73o03K257r09P81N75j739
$$ y = [82, -1380, -403, -2877, -2082, 241, -480, -560, -441, -2687, -1064, -922, -258, 519, -1328, -1025, 425, -482, 2315, 2013, 592, 1523, -1, -81, 1626, 138, 339, 197, -938, -104, -673, -229, 993, -2023, -2068, -1380, -1759, 310, 218, -1317, -938, -1889, -291, 1319, 736, 1716, -239, -95, 2331, 1819, 2377, 2742, 399, 386, 526, 215, 2444, 1119, 565, 459, -1685, -559, -211, -858, 246, -1533, -3080, -1890, -1300, -346, 510, -1024, -803, -1351, -1537, 1785, 660, 1325, 1541, -30, 1296, 1699, 1215, 3311, 2447, 568, 969, -816, 613, 1863, 574, 920, -1205, -2549, -928, -901, -220, -717, -2753, -2515, -2446, -2348, 203, -241, -937, -357, -1377, -596, 834, 317, 1573, 642, 336, 622, 319, 1989, 2410, -127, 755, -98, -385, 1296, 116, 502, 16, -2357, -658, -243, -2073, -614, -2415, -2092, -149, -1288, 118, -555, -1158, 1099, 190, 971, 1546, -193]
1547a93J006K32j285J717L38j156R12j966L74J268j328J258j248j815J513o35
1563a008J125N57j925L61j24n46J543m7l75R01j651R33J187j291K401j047n90
1580D04J192j790Q97J269q22Q31q64j592J195r75P25J362k668R48j485l39J253
1597d59o65N73O09j404l87M2J25K796o43o88K33j435J290J808n73J389j718j429
1615e36J391q39K267K28k544K54o38j243K962q73p53L23k251nJ046O67J283p71
1633c2j995J504j320K366N38q86N60m62q79J930m74R0M78j295J124j294k56J544
1651A241j215pN41j033p64K33M73L75k81r49Q6j95P10L35l39J562r33q44J536
1670E32j194J828Q84j223L54j161n9J731j08k12L29k604J059J065j236J176j417
$$ y = [-193, 813, 1045, -240, 1477, 1815, 659, 1571, -395, -21, 1247, -81, 1177, -71, -1886, -373, -1008, 117, 674, -1251, -890, -1014, -1560, -17, -64, -439, 462, -1189, -256, 931, -360, 2041, 994, 404, 1596, -194, 703, 1972, 1150, 1981, 1117, -475, 720, -255, 470, 1832, -836, 112, -1373, -1712, -459, -1124, -551, 58, -1346, -1733, -1691, -1566, 1230, 587, -101, 132, -1303, -13, 1795, 1222, 2611, 893, -536, 855, 16, 2283, 2511, -33, 221, -417, -1660, 1302, 429, -324, -1, -2252, -2257, -1211, -544, 739, -32, -2027, -523, -1843, 523, 1061, 175, 735, 273, -606, 1324, 850, 940, 1418, 123, 1247, -47, -303, 1241, 26, 19, 560, -473, -1237, -1004, -531, -156, -437, -1386, -1300, -1495, -785, -450, -789, 773, -160, -1004, 532, -662, 1166, 2050, 827, 1181, 20, -39, 1692, 1584, 1372, 1701, -903, 156, 1221, -15, 1161, -256]
1687b56j568O16l71J004O16q11K75q87N2R89m91Q11O31p99N44P3q2J279n58j40
1707I27N56j531J262R2j241J103j195n7J139j365k12J15j376J714Oj214N03j186
1725a960J220K55m57J150n37j000O03J076J54J128j045l32O04m86J600q13O34
1742A794k08k147N05J035o43R60o33k139Q19o48J268K96j299Q87j402o79J660
1759e74K2P85O16k401P96L4R64J536q1k52l66j094K7J315r7J58p56j033L55l86
1779d32J31J302j817M7j147P9J037O39Q26K48k249o3R68k77J940r90p7l28k45
1798d08Q45R15j33M87j548j99J750j273J012n31j414K52k17k98J036j221J38Q37
1816C0r30N65k86m20J236p96j90J226q66L82J054j020R03k46N0O06j841O39J438
$$ y = [-256, -1824, -1208, -1579, -575, 41, -770, -495, -1382, -1330, -341, -832, -21, 610, -189, 355, 428, 346, 1625, 1067, 927, 1483, -48, 1214, 1306, 65, 1168, -27, -84, 1055, -310, -522, -407, -1783, -69, -63, -1277, -774, -1960, -740, -485, -942, 208, -329, -1329, -726, 350, 504, 1632, 587, 255, 859, 373, 1973, 1160, 1794, 1586, -561, -56, 979, 336, 1296, 663, -1476, -657, -1305, -37, 259, -1040, -153, -1555, -2234, -574, -552, 233, 849, -1552, -756, -722, 242, 1778, 1697, 1445, 1079, -15, 12, 1327, 1230, 1388, 632, -401, -46, -432, -301, 1001, -816, -769, -1916, -1837, -800, -161, 665, 913, -1336, -1399, -431, -708, 1232, 242, 165, -163, -408, 437, 1352, 1219, 1706, 158, -41, 1709, 436, 1448, 917, -497, -245, -462, -760, 276, -945, -807, 30, -900, -335, -621, -1041, 195, -601, -791, 435, -431, -49, 1005, -15, 888, 642, 692, 1298, -543, 96, 1534]
1835A534j163J744p65j763P50j004J45J450k049l01k41l90J910p28J53R55j368
1852a131K06N63j3J291k50p45O20j103J731K72k70P10j071o20J405q98J284j43
1870A838j534J87p39j82R15j162R3O33j654J009J70q03L67K88o3Q30j381J113
1888g5O85j10J079r64n66J253r26P5J845j311K79r61m48J120n09l4Q20j840N49
1907c9k17p50J804j424k00P05q11Q1P13r35J608k67o52R01r25Q77J89l13Q65l95
1927H15j264J347n97Q44O06r85m69L46j018R80l99j012J578j600L18Q6n08P44
1945a88J07m37p6p39N64N14o1J619l18j141P25k28j86J330j207k56P13k81L18
1964G72p51O14M92j592L64J84j163J447k39j145O42p78q3J250m42N79o87K61O74
$$ y = [1534, 371, 2115, 1350, -413, 337, -667, -522, 928, -1121, -1422, -1663, -2053, -143, -871, -718, 237, -1131, -925, -362, -375, 916, 666, -79, 541, -562, 1169, 1441, 1171, 1881, 810, 190, 1595, 697, 1981, 1838, 304, 491, -248, -430, 485, -677, -584, 49, -1605, -596, -426, -1229, -862, -574, -637, 193, -1188, -75, 610, 500, 1579, 615, 49, 1302, 376, 451, 2296, 985, 1264, 303, -145, 975, 466, 432, 1252, -588, -39, -256, -1006, 798, -626, -826, -121, -932, -851, -138, -1073, 535, 268, -384, 517, -408, 469, 658, 345, 1210, 815, -449, 898, 301, 1145, 1751, 766, 297, 643, -375, 605, 206, -806, 772, -828, -510, -424, -932, -188, -81, -518, -594, -1333, -769, -255, -316, 1303, 985, -156, 569, 341, 155, 1485, 278, 22, 735, 454, 772, 21, 635, 1127, -465, -101, 83, -1080, 367, 128, -1017, -375, -1153, -1236, 14, -428, 151, -536, -275, 399]
1983C99J44o47Q43r92O10K02m40R67l87k01O57j196R32o65o81P99p62n83K90n93
2003a304N23L67r55Q38J47q41J653q58p81J788r43N84M97m77R11k66o18J188j134
2022C19Q19j29n89P11j056q51J632q52L00n51p67j90j98Q17M85r22K24O42j236
2041a392J379K81j307J654j108K23J329l80M09L76q67N13q44L91J453j543l01
2058B66k2j089K31Q59n25N10j478K21O96m8K73m4j622R26j4K9J631j077L90k23
2078a10n9J725j455L46R29j511K01Q32o45O45m1r39N25l28p4Qp75P14l42q33Q57
2099c30K24j322J762j457N42O27o35N14n17J14Q73l89O69K41r02P46J00j55K68
2118I73m20l05K28n24K65J40r88J024o11m73J118j196J65k63l67R23n84K25O35
$$ y = [399, 543, -104, 739, -253, 357, 559, 119, 1086, 699, 498, 1155, -41, 891, 226, -455, 344, -418, -1001, -711, -1304, -781, -414, -1369, -531, -384, -1225, 428, -430, -1211, 577, -366, 218, 715, 238, 1149, 883, 265, 1453, 319, 1138, 1009, 420, 1131, 75, -776, 856, 4, 304, -247, -1014, -1204, -1402, -585, -100, -1022, -798, -156, -1392, -13, 268, -1039, 615, -493, -270, 1059, 679, 1088, 1464, 597, 1110, 266, 657, 2110, 567, 266, 244, -845, -614, 245, -280, 230, -1248, -1027, -331, -379, -106, -150, -1772, -846, -860, -831, 800, -277, 113, -110, -169, 1556, 101, 447, 1376, -135, 66, 898, 253, 898, 857, -82, 443, 115, 41, 49, -726, -12, -354, -1187, -330, -106, -1428, 334, -1123, -581, 46, -589, -75, -592, -478, 395, 6, 675, 916, 14, 760, 860, 705, 973, 553, 248, 476, -48, 217, 357, -631, 393, -218, -691, 427, -769, -604, -867, -1234, -311, -895, -670, -35]
2137c5n22N69L43n33N27l54j92J544r42N00k88p8o1m9k10R06j047j59M43j009
2157f47k07Q59j122J050m81o07J146j398J093L82j152J058L87p20Q04q60R59M84
2175A028j301J106q8n44M28o33P60Q52j316m54j20o45Q26J30o76j02m38O95M72
2194b0j163P65K08l70O45o02K67L56o16J309o88p23J008n25k7J027k46P65j03
2213A267j349J056q28p93J810j052J14m00r53J092p85P95K09j484M43J518j453
2230g93R85L34j269R21p64M27R95o05L1r4l16P68p04M62J455j571l58n15n43J258
2250A04O98o95m2j105k47P21l48J150Lj661J490p33R7J045p69K43mo32J669l88
2270E96j4R34j128pqp63J413m37r01J105j224J68m4O7l41k80j47J5l60K40R48
$$ y = [-35, -557, 12, 355, -178, 349, -5, -197, 1347, 405, 905, 617, 539, 478, 429, 219, 1125, 78, -81, 362, -647, -854, 5, -1117, -67, -548, -1155, -9, -1407, -314, 68, -1084, -26, 361, -359, 445, -415, 544, 1028, -273, 833, 745, 201, 629, -4, 756, 1608, 292, -162, -282, -927, -101, 29, -647, -749, -1187, -492, -20, -1183, -418, -210, -580, 65, -537, -270, 86, -530, 779, 91, -632, 376, -149, -176, 851, 605, 1370, 1267, -82, 974, 146, -647, 1163, 111, 225, -175, -1128, -36, -821, -26, 183, -1301, -858, 660, -793, 192, 526, -743, 178, -586, -159, 836, 231, 262, 168, -148, 620, -84, 378, 1833, 262, -96, -611, -1154, 104, 802, 107, 65, -1040, -1287, -566, -914, 236, 239, -1422, 68, -665, -568, 477, -292, -49, -53, -685, 984, 596, 582, 1516, 388, 381, 373, -390, 1023, 586, -315, 790, -434, -266, -310, -243, -584, -864, -1011, -996, -1356, -1116, -168]
2291a68n64M34R1l43J45O72l51Q00n02K94l65K83Q35o37k9K31j057K25K78l86
2311a14O9j02n22R86j336P82k29p75P48J31p36J032p74K83O37p68J317j39q09
2330c19M89k62J94J261O1l55o90m45j25N43L46n04j073J074o88n65R76K19j181
2349a044O77j347J32J100N5j70j36k34O23k7M89J006j120N69l94n90J336O56m94
2368A087L94j513m49R77o95J160n58r64N61j037M40M94j22k46l44q32O09M33Q11
2387B06k18n97M19l0l92J444j18p26J448j414N30K83R0J93n05q58J041r05J1P97
2407F99r33J31L28j338J338n43m94jj64J056j78r67J188m87j79O53K52l65J330
2426A326j790P65J18K84k72n8j15j4j84L53M06o62m34q6j35L79m8m08l5l36p0
$$ y = [-168, -732, -298, -207, -550, -405, 267, -84, 716, 214, 508, 143, 426, 1261, 624, 595, 826, -231, -6, 272, -114, -45, -147, -669, 317, -1019, -237, -466, -1241, -493, -362, -1098, -66, -840, -557, 80, -688, 629, 490, -319, 170, -92, 102, 1363, 1424, 1069, 379, -66, -191, 352, 698, 194, -879, 195, -493, -1058, -82, 137, -1044, -367, -1714, -1582, -482, -427, -597, -733, -967, -344, -371, 118, 1124, 4, 573, 179, -411, 925, 1581, 1087, 1481, -32, -481, 496, -199, 961, 403, -561, 0, -1037, -597, -103, -225, -471, -815, -1647, -1038, -605, 206, -12, -609, -190, -220, -612, 832, 714, -12, 1436, 22, 552, 835, 925, 1118, 613, -245, 796, -109, -98, 699, -234, -103, 225, -1113, 225, -318, -812, -813, -977, 79, -99, -1066, 122, -365, -544, 109, 361, -4, 1326, -464, 301, 419, 703, 431, 373, 258, 244, 60, 413, 819, 157, -277, -363, -498, -119, -167, -575, -610, -946, -1016]
2447a016k64M82J471j010K26N33j482J487k10j42M16q94M8Q01K84J41q3j226O88
2466B50o33M46Q95r59p40Q19m77j36k53M54o86N76O6j28j42M20J67p61J501p26
2486d7L7O18l25JL68m86J069p00m26L70m18j13M05o06L79n05l07J2J80K94m41
2507f41m96J40N29n57J004l35P4N34p02oJ85N94M21j43r25J448r94O11l61m22
2527d2Q55q54m91Q96n34m09L75o33N31Q1k71J21k66P1O88r11K44Q34q29Q58l41
2548b7l41J063o34L37K84n15N56M85j048O72r73O67P03j482L61k24p43N87r33
2567a205J118R8p75K91J55k25M4J25n77J461o72k80N77r2N06n33N19O86q96J81
2587E06M12m15mm41l14J124j115L52m66k51O79r29K7P18n83j2J233j804Q61M73
$$ y = [-1016, -1280, -798, 673, -337, -111, 422, -1060, 427, 217, 75, 491, -403, -355, 446, 730, 871, 788, -438, 250, -383, 63, 958, -1, -741, 78, -399, -535, -788, -334, -1020, -444, -378, -506, -648, -228, -61, -822, 679, -47, -10, 608, 283, 284, 652, 166, 1235, 535, 109, 479, 61, -52, 353, -253, 126, -379, -686, -674, -494, -200, -641, -1137, -997, -468, -1025, -21, -356, -282, 252, -450, -456, -271, 323, 744, 601, -324, 1124, 130, 741, 380, -42, 813, -41, -532, 364, -170, -579, -204, -837, -306, -225, -496, -375, -641, -570, 118, -793, -549, 285, -544, 314, -27, -368, 695, 61, 398, 682, 167, 723, 1208, 160, 832, -141, 526, 1229, -253, 108, -116, -859, -272, -1205, -87, 11, -764, -473, -318, -543, -499, -374, -951, 510, -162, -442, 135, 43, 549, 16, 535, 1221, 325, 506, 918, 503, 499, 58, -256, 868, -247, 105, -361, -612, 67, -862, -835, -117, -700, -712, 521, -1283, -422, 51]
2607E1l37J26P1k80J055n86L50j87l2L28k44K17J96M2o86O50j232R06q71K1j98
2628f40P13l49n28l04O96N00q48J117K1l76j81l13N93m4m6j3Q35m74O31j086L57
2649B61R05p12L12j46l89N76q96N0M45j504P66n3l57M76j17M66l96m23N33N54
2669C51q82J20l51Q62n7pK93R3m48N46l56k94P31m55k44J259p00K53j04j337j54
2690h81R39p16P55k77n44N90n26K75k8J76J22m35K70P83o94L96N61o21R1n48J317
2711A005j52n12Q8j78j36O28m74m18Q03q72k37P71p03M26k84k66M63q21K77N41
2731e1m15M71j35k23J052n68l51Q30o84N58N39o49M81m21m60J70N30n50O95j625
2751h06P75l87J29N67o31rl3k75M1N78q00RK35J52O55J9J22m8l95R64n96o4K94
$$ y = [51, -286, -160, -89, -369, 686, 100, 450, 263, 231, 559, 315, 532, 728, 770, 84, 734, -498, 408, -463, -442, -640, 73, -276, -804, -1108, -412, 88, -760, 357, 378, 2, -179, -492, 101, 57, 11, -2, 833, 359, 990, -96, 261, 1166, 454, 766, 620, 231, 807, -89, -39, 406, -1098, -332, -385, -742, -266, -383, 83, -313, -736, -203, 351, -531, -411, -762, 100, 43, 36, 329, 422, -26, 520, 164, -130, 601, 146, -98, 1161, 461, 714, 610, -727, -881, 58, -658, 97, -180, -724, -134, -660, -385, -413, -237, -115, -550, -280, 503, -191, 205, 766, 145, 236, -312, 1005, 853, 341, 429, 251, 115, 743, 269, -149, 654, -218, -455, 316, -387, 39, -245, -511, -48, -869, -592, -51, -466, 5, -130, -353, 699, 131, -220, 610, -74, 484, 1023, 374, 855, 434, -26, 144, 674, 124, 819, -806, -31, -418, -289, 278, -353, -362, -395, -670, -629, -51, -851, -842, -607, -455, 200, 219, 341, 293, -102, 862, 266, 202, 496]
2774D96j48J01jr98J421J26j048J83p58L66O70r73M54K9p70J76l24O89J062j151
2794c98O6M83j24M41j83o71P86n31R59m08l27J272m59r27M51l93l26Q42n69L86
2814C70n40K56j90r12Q78j39l16M50j95L98k93j41k88N01m81J099k47n06J060
2833G64q67K72M05m92N14R5q74O92M60j121N81k51N5j063PN79k7J68p0k76p10
2854a159R21n56L98L31p91P07k45K03Q35r07N38K17m17M60k28O20K69j161L01
2873C36k26k74K54l5l64L39l39j15K22j66J64K60j088P64J42m73J143m99M1K68
2893C54o55M82K64q1M79n00l62P62m74K47J50q38M24j42L8k4o51K45J65j84J5
2914b86L41p45P58r48M32L04p4M11m5l59K34o2m42J326J81r70L91L3N88l55n17
$$ y = [496, 348, 449, 448, -550, 871, 997, -51, 132, -626, -260, 410, -563, -109, -80, -850, -674, -998, -309, 753, -398, -332, 151, 27, 468, 285, -386, 400, -131, 828, 420, 93, 1365, 906, -21, 430, 37, -289, 553, -16, 370, -170, 86, -104, -1016, -138, -277, -593, -143, -338, 60, -233, -374, -662, -161, -642, 457, 210, -296, 764, -103, 169, 574, 82, 596, 691, -183, 509, 969, -152, 429, 178, 233, -830, -823, -244, -271, -103, -173, -449, -1159, -238, -794, -396, -65, -856, -149, -394, -191, 644, -263, 275, 492, 75, 535, 307, 927, 1196, 35, 336, 110, -164, 90, 55, -309, 30, -309, -424, -202, -368, -204, 56, -1032, -268, -126, -599, 544, 45, 86, 354, -301, 181, 445, 364, 843, 343, -19, 743, 269, 516, 666, -172, 252, 110, 148, 124, -527, -282, -117, -301, -286, 55, -690, 68, -880, -448, -144, -218, 193, 148, -211, 23, -39, -481, 845, 1026, 56, 447, 480, 1068, 713, 196]
2935A96O34j667J221r4n31L33o35K17n9J30m95R28j029L50K15k44M50Q3j80R69
2955G92q3o80J82K4O09Ok72L65o91M40k68r6k5n09jj61K95J64K01n11R1m85K19
2978c94M89k97K82P3l84M62M88j005N28l45k6P07p46L32N31n25K68Pk57O81r75
2999a06l50J008n66j73j91K39Q97j382K09J23k92R14M2q80m1O49O0K28l27ON25
3020E92o17l53N73J26P63r66M57N37j257k27P74k63R1o58M07l86j55P19k82m96
3040f21Q17n53J38O44m34k90P45m86j47N19j89n63J0R75k59M06k26q5L08J16m56
3061C69n93J495j118j9l31j04K71n68M46M13j325M24L73o05M93j31N81K6l82L33
3081D8M36o00O67J04p48K46M81j58L21m80M7M4l26K11l29m8M13j201Q52K00o08
$$ y = [196, 830, -837, 384, 290, -241, 92, -543, -326, -385, -255, -750, 178, -851, -501, -286, -530, -80, 3, -177, 792, 709, 29, 211, 235, 844, 850, 578, 943, 252, 692, 424, 328, 303, -206, -207, -368, -73, 91, 292, -219, -128, -613, -394, 95, -202, 80, 153, -231, 231, 719, -286, 242, -103, -129, 578, -168, 164, 695, 170, 438, 445, 188, 869, -106, -456, 552, -14, -187, -378, -139, 758, -624, -415, -292, -584, 330, 372, -508, -549, 100, 160, 388, 61, 67, 592, -25, -378, 195, 321, 1084, 118, 575, 1112, -145, -372, 402, 139, 230, -428, -21, -407, -562, 157, -125, -621, 196, -357, -219, 425, -9, -299, 446, -40, -187, 332, 143, -420, -410, 565, 306, 712, 486, 401, 709, 825, 369, -224, 1271, 153, 134, -197, -301, -30, -598, -152, 261, -1064, -640, -267, -872, -379, -510, 71, 97, -285, 48, 484, -116, 551, 655, -93, 153, 634, 476, 797, 317, 364, 408, 82, 293, -36, -84, 329, -872, -20, 180, -428]
3102d28L35k76J79M13l72K55l71j24M47R0m54L65n2J38N86m34K11K76k13j15o09
3123a53N84n4q61N52M86j214P76J7q52N34r0r11J024l39P06O8l49p54j96R16K87
3144A77n06L44L47l79K82l9%P39p19o5K19q25R20p91M26M26m99J07N60j135P09
3165B98n53k93P99p70L34l55l93Q86N02o98P31l68m7j67L42N87n40q4n6J55o7
3186B43K26o16J09J64j019O99J75k29Q99j402J6J67Q8M58k2j70jk17n38P86J73
3207a1M53J81n06K07k32N58J98j13l46M2m98O52j96n31L32j30l09N51l31Q9n06
3228d46K12L36j054m48J788r85J56L19j24R68j066K40R69m60m6J84l48L87j93
3247C89o2K05k46j62M56o97N81m04j72N1k29L03L65j186O20n10P15kJ15m17K37
$$ y = [-428, -93, -369, -190, 223, -149, 106, -265, -389, 58, 148, -306, 59, 7, 145, 731, 297, 508, 784, 571, 456, -153, 431, 377, -484, 68, 554, -660, 116, 133, -719, -185, -275, -1186, -162, -501, 205, 273, -76, -830, -1026, -110, 177, -329, 15, 362, -17, 265, 226, 226, 965, 246, 181, 400, -425, 495, -296, 130, 556, 57, 164, 724, -411, 298, -255, -548, 251, -519, -185, -540, -933, -47, 455, -243, 488, 120, 73, -94, 248, 835, 295, 211, 155, 310, 243, 469, -147, -38, 126, -893, -194, -19, -248, 651, -751, -735, -568, -480, -22, -44, -214, -215, -432, -970, -184, -11, 442, 623, 117, 324, 92, 650, 848, 735, 389, 431, -67, 585, 389, -142, 190, 60, -249, 302, -29, 60, -446, -234, 102, -952, -1400, 388, -597, -441, -122, -246, 722, -344, -104, 865, 405, 359, 543, 195, 582, 389, 327, 532, 286, 124, 580, -117, 464, 60, -112, -61, -290, 13, 378, -808, -188, -698, 17, 15, 130, -287, -50]
3268e0l38M60N10o55L53N9l69L87m87M46M60q65K90j35l01P33q59l08L14l70P1
3289f54Q38k46j32k36k9R4RR88j34o74j76k75R02M6k86M22K32p02J98J8q87J360
3311F76k03m01M85j003R48K24p13l5l33n72O49L6q3K31j81N4k49P0K12R0J95l3
3333F4m50M14L44l03L07k64M59k25o50K45M33nm19j05k7J82r69J062k15l36k85
3354g43O7ON37q70L82Q62j198R05K60j85M67k58PL65l31n7L95m43N68n68l71Q72
3376F69j177O21K45l05K74r7j077P28l7J96m91l68M13J90j063J244j68j91R48
3395E54q74L12M67l89M90J1n69O37j208J215o0n42N22n66k80L02l79M99N5n79
3415c82j70l20K63L84r9M69K69p72O0K33k60L85L17j24q3L04j14k79K01j13l5
$$ y = [-50, -388, 72, 582, -73, 280, 339, -30, 357, -130, 316, 776, -89, 201, 66, -235, 498, -361, -669, -355, -725, -654, 184, -62, -194, -430, -459, -365, -356, 632, 498, -176, -352, -627, 275, 321, 35, 457, 689, -13, 185, 203, -684, 676, 473, 72, 557, -446, 502, 726, 13, -22, -355, -927, -278, -242, -325, -94, -275, -221, -470, -400, -188, -98, 97, 64, -386, 28, 372, 69, 376, 112, 571, 346, -304, -59, 374, 369, -50, -155, -182, 0, -969, 93, -122, -458, -743, -676, -670, -133, -1003, -621, 241, -957, -52, 208, 23, 490, 232, 239, 604, 273, 216, 611, 168, 736, 168, -203, 669, -508, 113, 358, 53, 327, 230, -847, -119, -156, 40, -451, -819, -406, -216, -1279, -35, -203, -394, 554, -320, -8, 459, 70, 560, 571, 2, 639, -569, 646, 586, 44, 566, 0, -280, 22, -357, 142, 197, -382, -552, -872, -609, -225, -324, 145, 414, -358, -298, -65, -325, 60, 377, 253, 170, 474, 360, 81, 282, 169, 134]
3436A34R5K68q60n4Q50j022Q58m01k05K23j32L29L41m62M9l61P7qj44K14K65p57
3458g03R11l25p2N23o55J32K80pJ94L13l73M55n03k74M81p75K81L31q61P83m6
3479I0l80Q31k70m65N37k14l70k47j07J203l73kL28p44O71L9l19N18m05L39l05
3500C55J86l47K99p67L69N4l42J26q0o33J056k02m45K44p02J097l13q3J27o12
3520f13O12K14l18P44j29K50L3m09j20m08N20k37Kq6N9l18L68k0p11N95m14k30
3542f16K21O8l72J99K72K40m31q9L72K38k58L42j89K13L78m94O57q73N17nk86
3563A04J22L74j081K48N33r76J95oO34n63n3J05p8k48j05M98J30K23o53L94M60
3584B57qj09L50n32M33k06K5N85q55M20J23l21J07m51j85R18l78l21l31l36M20
$$ y = [134, 229, 497, -363, -417, 433, -589, 269, -132, -337, -114, -246, 83, 424, -38, 11, -350, -273, -281, -425, -211, 54, -703, 208, -117, -189, 334, -321, -189, 91, 84, 278, 591, 218, 673, 170, -104, 377, -398, -117, 214, -647, 136, 90, -290, 541, 271, -194, 343, 129, -241, -488, -595, 608, 235, 233, 561, -183, 488, 527, 208, 726, 321, 660, 355, 541, 194, 493, -274, 95, 149, -193, -67, -147, -780, 276, 74, -371, -127, -829, 268, -45, -128, -1, -613, -1, 213, -105, 639, 510, 760, 793, 384, 264, -144, 376, 139, 141, 55, 114, -204, 164, 144, -567, 28, -386, -616, -395, -327, -699, -500, -228, 12, -419, -508, -136, 102, -156, 186, -3, 210, 588, 94, 751, -122, 395, 390, 104, 226, 600, -481, -233, 300, -676, -481, -487, 147, -416, -469, -364, -442, -690, -795, -297, -167, 56, -597, -203, 257, 249, 140, 490, -42, 391, 185, 210, 795, -60, 360, 483, 162, 269, -182, -367, 551, 173, -148, -479, -815, -395]
3605c95M84l40k68M5K34K14J37L56Jq0k53p6j18M33j59j39P12j74k83L72m70j40
3627I3l88O73o91n67J034r83O52K0o13P99l24m24M02K92l75N34l92O2O71o96j87
3648d08L66M32n27N97J21l34j1L28l41p81N97kj26K54m92j83P57p55N1J68l61
3669f50M37p9J2J37m33N61J39n51L43N66q15K17qM19O35p39P9j48J80r3l41L97
3691B65j21o03O03o99J61L00O6j9n65M97l59N64n80Q27q13N13K65r7l13J74K84
3712C50m22M24o65L51N51m1K79p97l5K65l17M03l27K93Mj102N92K92j81M95j004
3733e92K20K84k7L66j22L60l11j78J06j9k71P33k89o62N76J92m57O49m85m71Q99
3754E01o57K46l66KM01m1K5P6l86k99R83p09K60q3R3L50j02j44M5o47L18L80K2
$$ y = [-395, 89, -251, -519, -474, -240, -26, 111, 467, 468, 388, 135, 59, -59, 374, 215, 76, 788, 614, 331, 703, 233, 93, -295, 378, -313, -880, 154, -829, -177, -157, -770, 29, -295, -719, -317, -25, -400, 134, -258, -196, 475, -221, -408, -42, 390, -137, 460, 581, 247, 236, 564, 223, -558, 39, 37, -89, 165, -327, -510, 247, -508, -457, -289, -650, -213, -292, -280, -143, -576, -15, 124, -427, -84, 482, -333, -116, -124, 295, 930, 191, 270, 122, 302, 209, -132, 265, 144, -459, 144, -555, -394, -94, -28, -47, -612, -115, -474, 90, -490, 337, -476, 37, 302, 205, -108, 66, 350, -72, 352, -313, 38, 589, 548, 827, 30, -5, 260, -57, 346, 19, 312, 316, -786, -194, 98, -83, 412, -592, -372, -88, -115, 251, 129, 489, 178, 0, 106, 87, -184, 549, 260, -402, 174, 366, -91, 558, 73, -398, 501, -156, 90, -276, -274, 127, 86, 111, 187, -199, -498, 485, -224, 36, -47, 46, 396, 294, 150, 195, -452, -134, 246, 268]
3777B68k95q8J71O71r86J86O1m74P32m91rN98o69k87K64l16K46N81r66L61m1L40
3799a43P97o85N09r71M12M00J95l59O19l23K80l24N11o80J65k27n94q7N13n83
3819e75M96l77L59l62N46m68J64L34q12O88l4k41n9k2J29M96M33m60K74k24J88
3840D73l15q44R17n19K19L23n96N08j84j36L46n49m33Q67N1km23l05N13K33k51
3861a07r5j98N06p58Q27K5j74P27m08p27Q57l52m71P99j43k7j53j76M32q4M5k58
3883H7n06O31k76j020L65J223p42k4J39m34J22P07l65M94m64P36l44o15O85Q0
3903D79j53q2l94M00J55k59l34O82j152K66k70L18K25j94J86j44l3J62N1J74j3
3924G0Jk06K90j86O59q82J49K17J06J67l12Q0l7N70l34rn99j81M59r9l12N34m51
$$ y = [268, -27, -115, 56, 727, -259, -73, -12, -486, 246, -245, -254, 344, -325, -612, -348, -664, -418, 163, -803, -442, -483, -143, 654, -31, 478, -493, -81, 319, 514, 155, 774, 451, 731, 407, 918, 238, 403, 176, -418, -505, 8, -575, -79, -456, -97, -459, 87, -381, -217, 117, -695, -7, -41, -282, -341, -363, -234, 262, 695, 235, 509, 285, 473, 158, -686, 231, -288, -69, 254, -342, 166, -18, -154, 192, -357, -790, 77, 128, 126, -297, -602, -89, 144, -107, -202, -400, 106, -652, 175, 200, 26, 753, 345, -382, 475, 123, -348, 451, 308, 281, 128, -48, 384, 300, 345, 87, -419, 212, -64, -1084, -719, 504, -238, -262, -123, -557, -435, 272, -93, 401, -63, 673, 329, -286, 399, 479, 326, 244, -150, 250, 405, 146, -188, 494, -658, -392, -662, -344, -119, -313, -127, -271, -304, -142, -91, 83, 70, 71, -135, 155, -31, 628, -254, -105, 112, 218, 385, 73, 153, 116, 686, 352, 343, -256, -437, 22, -77, -389, 145, -306]
3947c06l8L19L88j24k43o95M86j48P65p85M83nq25P10L20p8J57l85K23k57l23
3968c61Q15J03o69M72q35M13r8KJ48J75o95M80m93J53K97j90m1M10J07j57N17
3989E53n21L14J12k66M2m07M42P1m58L57l52N6L65j55k40K84o06M89L85k78n09
4010c22M08j62N55o77N37j25o08Q76n39n58O79j16l62L24P0n8N08m71P92n21n09
4031b79N20k22J27j8k06K14k82l84R75q0l04M32j183M97K68l77M71k68m05J70
4051c34l01O66O6o19M91R5j09k64N37P84q10l98m57M01K25M21l26j1n7N04m70
4072C4K0n26M78l51J99L6p81J649q84m0K81J37m77M22k49M23K23n13L7n0J59M51
4094F78m27M0R1o01J34K57l08l09L92l90L28o44M77Q7p40K11Q07k70K76k88M79
$$ y = [-306, -344, -25, 363, 239, -4, -699, -213, -361, 404, -381, 102, 97, -728, -18, 302, 224, 381, -4, 219, -38, -361, 454, 557, -112, 360, -475, -62, -160, -158, -10, 165, -530, -50, -543, -390, -93, -283, -324, 86, 193, 36, 553, 32, 346, 458, 192, 234, -173, 269, 340, -118, 239, -113, -57, 308, 153, -87, 197, -409, 80, 465, 187, -322, 86, -76, 479, -198, 339, 214, -394, 482, -57, -615, 64, -52, -414, -90, -20, -78, 430, -41, 751, 230, -279, 241, 19, 146, 128, -78, 136, -146, -530, 445, 365, 61, 493, -690, -193, 75, -302, 169, -99, -504, -334, -635, 31, 97, -522, -31, 64, -45, -309, 228, 1012, 202, -196, -653, -252, -27, 394, 68, 57, 0, 504, 34, 54, -472, 6, -345, -146, -110, -891, 758, -126, -166, 115, 252, -225, 197, -52, 371, 594, 81, 118, 68, 227, 678, 251, 291, 382, -219, -85, 172, -136, -445, -53, -443, -115, -759, -282, -195, -935, -724, 83, -187, 89, -199, 280]
4115B80l19j99N67n04m1M47j39K85Q8m08K80j68k35N45o93j10L5J91l6L29k58
4136f3J02j16o50Q22m64J201j132J2L01l6J35K98n39P66k07r78M43j8K61L48l53
4157A33l55K92j04M53Pl3l30m71O62k31l00M42l37L4k23K58k8M46m81M85L03o04
4179A8L37k42N35o40k64J095o51n18P24m22k64J02K60mJ50J09n80q9L39K35q85
4200f55J46J06L5J06Q8j44J34J52m51N67M4k32K83j87L18m44M53l37N53Q4l0r71
4222c82O08O3k81R45p83k65m67N47J69j1j59L80o35J89j92K25L84n67N58K32o64
4243a06J88O09k49J87m13m7k54O28o94N6q3k31N24J36m46P2m01P48n84M22k53
4264a91M20k5q4M97l38o51K18p7J01l74nM77L38o0o41Q09k93K45o1J2j39L47p44
$$ y = [280, -39, -238, 329, -175, -216, 231, 92, 377, 465, 57, 337, 169, -66, 479, -214, -324, -289, -98, -134, 195, -63, 39, -77, -727, 95, -369, 832, -300, -288, 13, -23, 112, 410, -129, 637, 430, -548, -105, -123, 138, 486, 133, -222, 70, -34, 419, 426, 393, 63, -408, 254, 23, -277, 165, -172, -138, -361, -103, -131, 315, -166, 319, 622, 18, 355, 113, 648, 8, -256, 839, 188, -330, 394, -28, -292, -190, 70, 66, 216, 325, -255, -344, -5, 230, -655, -509, -403, -368, -262, -174, -318, -184, -32, -483, 84, 128, -104, 179, -8, 310, -134, 319, -18, 535, 619, 589, -382, 226, 289, 8, 953, 170, -95, -562, -15, 154, 143, -16, 364, -271, -82, -274, -49, 335, -232, 326, 558, -106, 82, 691, 442, 629, 216, 169, -85, 543, -151, -95, -178, -409, 115, 251, -195, -123, -524, 224, -360, 62, -191, 229, 204, 120, 617, 279, -372, -154, -231, -130, -504, -509, -32, 306, 246, -395, 414, 121, 366, 305, 317, 178, 525, -219]
4287b19N43n34o65J058k31k81K91m8q6l19K15Q47J24o67K34l14L44j77j7L88k63
4308B23K10K28r79O82QM5k68j32J37K67n73J08L96j67p8p16L02J364r00J11o82
4329d14K73L09j88l35R86o09N7N37n67J02O7o27M95k78k28O98L10o14P1K5m81
4350d11M64j44j35O89l0l10m79q4k36K24M43n9j06j45K58N27j04q94M41M17j195
4371h69J029K1j38J02L93k66m88K20K31k00m2N77j361N67j22L25P4j82k20L18
4391c1r6k5J76j67J95k56p3O43p70J61J62J72n1j63O16K73j151O46j38k57K11
4412G7n2J35l83N33o7o36N75p75N42J41k22J04j48N21p1k66k66J22K69M59o95
4433a03nJ69m1L54l24J55K71o12j04kL02Km01L53n9Q2n9L0p17R20m58m71M98p7
$$ y = [-219, 324, -210, -875, 183, -48, -329, -38, -86, -172, -491, -276, 571, 695, 28, 262, -52, 292, 115, 98, 486, 223, 433, 661, -318, 364, 372, 417, 149, 17, 154, 421, -152, -44, 352, 185, 107, -609, -307, 1057, 157, 268, -414, -141, 168, -20, -355, 631, 22, 79, 616, 49, 151, 218, -409, 86, -192, -420, 278, 588, -26, 45, 70, -411, 53, -91, -226, 463, 433, 123, -356, -440, -676, -452, -9, -68, -174, -319, -61, 466, 362, -532, -91, 326, -869, 160, 181, 43, 145, 538, 272, -216, 4, 235, 35, -7, 570, -791, -224, -346, -21, 53, -129, -349, -31, -127, -152, 24, -143, 52, -204, -277, 366, -404, -243, -81, 91, 40, -123, 493, 766, -385, 261, 123, -134, 77, 25, 160, -223, 310, 243, -393, 182, -593, -51, 90, -132, -28, -176, 345, 274, 8, -258, -136, 133, 592, -103, -108, 61, 20, 374, 50, 205, 476, -136, -240, -242, 60, 62, -339, 14, -45, 37, -22, 8, -709, 211, -247, -718, -220, -297]
4457b97K69N4j79M9l62J68L35L80l97L62o30N80j51J39J7j196J275l92l55K62
4477f9q9P18o53N06n93J62n02N45l59L8J66PM20l07l49N06O7J6j12o3O01pK1r55
4501b85J52K00m33N02J52j29l78m9L64j30M57q78J04O53n62O05o86N84Mn26N03
4522B24l70M54n87L07n5M94r0r88J008K57j49l3j49k5o95N89K63o2j074J209q4
4543D44o44m9K0p8J36q3K57j56k97M64m23Q17m76j4L42K38n67N11p1M3P6n71l57
4566d38J018p30l8L85q6J10N0j42L42m20K91l22M27k83k97K62k48P1m80L67L34
4587A73k77J53m71Q5L60K42n49M72K72m01n9J82k76m5L35l76O66m30l24R3k20
4608c95Q50m90n62O26k19L39L67m79Q3j5j64j50P8l6J13L34K09p19M53m24J32
$$ y = [-297, -28, 26, -153, -104, -466, -298, 37, 417, 20, 382, -248, 332, 181, 320, 337, -859, 416, 24, -331, -69, -158, 560, -93, 413, -180, -18, -520, 25, -334, -296, -130, -123, 297, -10, -359, 147, 214, 230, 118, 55, 656, 649, 670, -285, -133, 67, -366, 136, 288, 159, -219, -268, 96, -34, 423, -455, -351, 302, -260, 345, -341, 243, 247, -279, 224, -146, 308, -279, 28, -27, 467, 377, -611, 397, 654, 505, 472, 323, 298, -397, 192, 455, 393, -681, 528, 444, -200, -249, -229, -307, -171, -254, 3, -153, -450, 14, -409, 408, -68, -82, 260, 498, -69, 442, 371, 414, 490, -81, -438, 580, -150, -188, 197, 111, 221, 271, 129, 471, 51, 342, 20, 447, 164, -133, 129, -119, -48, -528, -161, 173, -104, 49, -422, -337, 23, 265, -284, 188, 460, 59, 0, 182, -94, -139, 196, -180, 486, 56, -268, -175, -395, 455, -35, -597, 29, -190, 149, 516, 37, 120, 105, -59, -209, -131, -167, -54, 280, 489, -230, 223, -201, -69]
4629f9K94L8o45QM49M88o18O57k89R8r07M2M69m92N99k72r2K64k1k89L56L4k47
4652a45L7l36J5R25n38o2M6J96M02o28K66O3K33l03n63Q36o15J83K37j71k60J47
4674c5j36k9N82n33J79J77m20J86o07Q96j32J27l53K45j81o1L26l40M16j5n41
4695b49l64r5R03m52m3L54M5k23K12qj56n57J19J003m68K77L2p4p42N91m39P6
4717b58Q09m7k54L60q45P87j024P39j32k77q9J56p3j11M30p10R1M87j23M9PM25
4739C97p75k88N39L10j70Q9M44l90n55N40m8j15J15L60p73M10K21k03m81L25j29
4760a77R5l08P55q00k13N86k27R65j421Q55k89J21m2K16J43N64k93l02P9k39k70
4781b02L36n7J83o08M12M42n30O5j98n51J106p3m51j11J5l68M15K71l6K73l18
$$ y = [-69, 225, 263, -382, -374, 75, 563, -55, 602, 313, 411, -496, -454, 15, -477, 122, -150, -242, 22, 1, -288, 68, 102, -145, -108, -444, -429, 496, -42, -104, -58, 138, 540, -88, 178, 241, 474, 171, -392, 444, -171, 12, 249, 78, -182, -35, -171, -200, 382, -151, 28, 205, -215, -29, -636, 260, 128, 255, -98, 147, -34, -95, 231, -109, 307, 292, -249, -613, -708, 195, -257, -300, 54, 99, -124, 88, 80, -76, -633, -514, 489, 21, 298, 330, 256, -486, 105, -334, -258, 551, 504, 250, 610, -235, 552, -472, 267, 135, -142, -231, -75, -148, -259, 171, -539, -448, 39, -84, -35, -28, 397, -378, -666, -127, 183, 13, 102, 546, 156, -399, 141, 93, -22, 93, 453, -320, 90, 311, 108, -373, -48, -177, -82, -390, 365, -435, -648, -62, -289, 676, -745, 110, -179, -58, -100, 116, 259, 823, 530, 228, 307, 68, -202, 134, 77, 260, -348, 64, 506, -24, 41, -157, -708, 398, 325, -126, -237, -222, -590, -175, 96, 60, 333, 15]
4802A5j81J65n07R79o37k76Q09p75N13N3k8K7q6M82m38R3K35N4n24l39P69p29
4824c26P15l42l41L52Q5m19l27P46l1m13L23P7L16n53M56k6l47j12L75q7L10j88
4846B43j69l63N90j77l05N87j26l55n61O85k68k6K68n77j04P48P59q47L88k80
4866A10l3M11m11Q4qj68oJ27L09j45J39k00o0N84o84j50L41n56J14o7l32M61M82
4889C42j00l38N10l80k93M3k21l41N35L4Q19r84P75m47m47M98K47n3j86K17l67
4910a37J17J85R7j90j01J73J23n90M95o1j97k27k66NL46M18n90O88o07L8J18J61
4932bO0L43p45K28J52L7L28m76j57J35R34p30L2J24l74L28k36J32m00M0j38M57
4954G2k83M32o61O68j85J13k71R5j60N53m18M25k89L26j45o98O88m21L47J36j00
$$ y = [15, -166, -1, -508, 471, -166, -442, 367, -408, 105, 158, 130, 157, 71, 553, 115, 208, 443, 497, -27, -366, 403, -326, 389, 47, -294, 58, 143, -276, -603, 143, 112, -301, 22, 99, 415, -138, 318, 292, -55, -167, 208, 121, 431, 243, 74, -289, 301, 124, -181, 406, 280, -75, -636, 49, -219, -245, 23, -554, -658, 90, 849, 2, 390, 110, 77, 488, 77, 161, 153, -15, -21, 106, 415, 270, 409, 209, 149, 733, 49, -101, 240, -316, -202, -269, -601, -140, 342, 242, -96, 414, 34, -259, -216, -437, -778, -243, -209, 610, -374, 401, -46, -493, 5, 252, 199, 13, 230, -137, -20, 165, 262, 72, -29, 144, 267, -323, 172, 111, -86, -313, -579, -574, -228, 190, -400, 288, -319, -281, -163, -2, 58, 401, -344, -116, 36, 73, 401, -75, -232, -97, 837, 107, 139, 263, -111, 217, -19, 113, -287, -247, -385, 72, -211, 221, -440, 228, 43, 156, -115, -20, -180, 373, -45, 380, 91, 417, 272, -426, 262, -159, 188, 324, 224]
4975B24l39J91N40l54m65L63r16J001o83O57l23l1n0M28n1p0l57O49j87M1l10
4996d2J79n7n0M7j47N2O06l02m01q2J76k07K97o23M40J66L30N7k19p10M89Kk35
5019b34n66J077P9m90M54l59K32N9L3j14k4O5r1j25N1l9J232j523P90r3k55n5
5041A04k41J63J34k5n00J65k71L65L89j02n60L16l23Q12n56O47n42M93q55L58
5061b9k10K77K39l13M56o18N98n66j31O18j68m97K88k19M40K94n56M1j08J86j29
5082a07K99j44K73p30J22M3M72l63l22P15J46j42J07N1o83O72m09k10J40J89p2
5103D7O1l17P30l89R4l29K89o4M7m76K26j39J46J81k02o4j00M44J52J7l65R4J03
5126A86J90p47o9K40k30l7L72J47l20J025p30j59J34k80L46k55K44l74l18J69
$$ y = [224, -115, 76, 616, 262, -203, 160, -756, 245, -438, 219, -104, -135, -185, 243, 192, 122, -235, 414, 227, 268, -42, 137, 80, 30, 77, -70, -18, 588, 286, -115, -197, -21, -228, 69, -554, -114, 52, 382, 439, 220, -490, -1, 1, -234, -800, 277, 356, -134, 320, -39, 193, 252, 285, 171, 147, 212, 121, -4, 47, 8, 1240, -283, 507, 414, 159, 104, -137, 26, 160, 135, -365, -200, -471, -106, 283, 181, -379, -63, -386, 426, -130, 517, -25, 468, -387, -29, -239, 38, 277, -36, 420, -198, 400, -166, -297, 321, 153, -344, -56, -275, 165, 459, -97, -56, -164, 22, -107, 192, 48, 321, -409, -287, -244, 228, -135, -457, 258, 404, 262, 369, 420, -263, 409, 0, -210, -70, 119, 47, 108, -209, 521, 132, 226, -103, 186, 122, 169, -307, -81, -220, -74, 107, -95, -159, -259, 185, 337, 354, -11, 83, 186, 376, -371, -440, -200, -430, -467, -95, 52, -268, 757, 27, -132, 2, -278, 68, -187, 57, -317, -635, -466]
5146d66M88k46k7n97J365o34M7K47k73J14K18J36n32j74L51k03M20n39K62l1K64
5167A90N1m65J78M17j24p25J95J99R6j38l08O27pj22n2O8L53n15K18k35M9N28
5189D78l03l69K29p8M89j43m51Pj31L07m2K98j07j32m90K26L34p68K27P28o17
5210c08N05q49K75P34N25n26k88j47J28L48o21l51J109n22m8J88r1k40m13O83
5230I1M9K02j28j64P3L30m41k71O4o68M96M41k38j84r1P44l00j65Q15o74O4K80
5252C25k40K18J74l94j72L93l69J11j67K07O9k8J00m78k62P43q30M68M38kq94
5273e90Q31n58K76J39k35J30L47r33M49K41L52q8j19M02o13l88M16K68l04m01
5293c78N44Jm9m88N89p94L13M48m34L64K19p06J99j39Q18l37n17Q64m52j72k03
$$ y = [-466, 22, -224, -251, -848, 517, -117, -70, 177, -96, 18, 236, 372, -160, -334, 17, -186, 234, -305, -43, -74, 190, 241, -224, -46, 371, 247, -478, -283, -84, 12, -126, -434, 193, 186, 64, 12, 80, 433, -82, 136, -99, -50, 478, 175, -194, 35, -43, 446, 303, -148, -141, -272, 35, -7, 291, 184, 52, -438, -212, 122, -646, -419, 309, -308, 197, -652, -377, 357, 882, 356, 68, -79, 49, 397, -224, -575, 534, 12, -36, 152, 61, -179, -592, 91, 140, 342, 214, 50, 123, 453, 12, -259, -195, -863, -367, 74, -164, -348, -439, 305, 5, -160, 655, -19, 45, 325, 85, 303, 477, 83, -89, 304, -65, 46, -121, 86, 155, 127, 227, -251, -513, 230, -600, -132, 306, 304, -590, 241, -317, -41, 98, -137, -7, 340, -593, -144, 97, 449, 361, 242, 644, 31, -357, 59, 327, 23, -378, 166, 167, 118, -370, 219, -575, -262, 186, -248, 116, 335, -371, -172, -311, 507, 170, -347, 517, 65, -107, -310]
5314c10K12M05k67J95J34p3p40M02K25k06M7P40n20r58O60M78j45m13J60j61L7
5335i8M69q55N65j27L12m54K68l77M21r7J46L3K65o85L41n45L34M55k95n8j05
5356h7R4J7j8l93O59l04L90k26j12J44J92l41L93j81m6l17N26J8p6n69L31j9M4
5379A19J15n53M36r4k95M72q09J015R0j40p83J72Q6L86p2O4p01K59K09j9k33J60
5401a16j19P04o49P54j43l45K01j43K46m41M46J82p61K66J66q7o50K50L51k16
5421a04j0J22n4k07L5J80l98K87Q3k48Q58m14l84N44p4N6qk45k09k6N50p51j9
5444d36L53J75l97L82J08K34m92L34k32m39L89M59n11q9N09l42J76K33l57J83
5464B40k5q07J410m35n90L73k29M65o52N7M94l90n41j48Q22J92J30k72q01R53
$$ y = [-310, -98, 307, 40, 235, 369, 296, -444, -42, 183, -23, 24, 764, 244, -714, -54, 424, 279, -134, 26, -135, -98, 371, -484, 81, -46, 266, -188, 80, -297, 124, 27, 173, 206, 471, -214, 127, -418, -84, 371, 76, 18, -87, 7, 24, 6, -387, 272, -32, 358, 132, 20, 164, 356, 15, 408, 227, 181, -136, 390, 408, 332, -237, 94, 75, 119, 234, -319, 117, 23, -272, 200, -609, 406, 496, 356, -427, -255, -169, 217, 145, 209, -492, -233, -24, -43, -276, -116, -235, 469, -180, 574, 431, 86, 287, 144, 390, -51, 395, 577, -184, 82, 248, 161, -489, -239, 112, -104, -114, 8, -46, -253, -218, -38, -436, -149, -66, -314, 544, 130, -254, 290, 216, 272, 264, 19, -190, -216, 334, -417, -436, -83, 92, -305, 77, 185, 419, -73, 261, 29, -410, -21, 438, -73, -162, 347, 5, 181, 414, 57, 240, 215, -592, 818, 383, -207, 166, -63, 402, -250, -193, 301, -89, -630, -778, 44, 236, 366, 94, -707, 246]
5484B46L45m26N0m00L23j14j45J007r34M18p78J64L81m49L29j99R2K26K49j30
$$ y = [246, 591, 165, 215, -185, 138, 24, -121, 886, -48, 370, -408, -244, 137, -312, 17, -182, -90, 136, 385, 255]
$$ [...]
8191a42
##END NTUPLES=NMR FID
##END=
