##TITLE=1H_SA_sl 45/4-1
 CDCl3
 8 sc, 
 16.02.2022
##JCAMPDX= 6.0         $$ Bruker NMR JCAMP-DX V2.0
##DATA TYPE= NMR FID
##DATA CLASS= NTUPLES
##ORIGIN= UXNMR, Bruker Analytische Messtechnik GmbH
##OWNER= root
$$ XWIN-NMR		Version 3.5
$$ Wed Feb 16 08:56:30 2022 Russian Standard Time (UT+4h)  she@DPX200
##.OBSERVE FREQUENCY= 200.131346
##.OBSERVE NUCLEUS= ^1H
##.DELAY= (6, 6)
##.ACQUISITION MODE= SIMULTANEOUS
##.ACQUISITION SCHEME= undefined
##.AVERAGES= 8
##.DIGITISER RES= 18
##SPECTROMETER/DATA SYSTEM= spect
##.PULSE SEQUENCE= zg30
##.SOLVENT NAME= CDCl3
##.SHIFT REFERENCE= (INTERNAL, CDCl3, 0, 15.7039)
##AUDIT TRAIL= $$ (NUMBER, WHEN, WHO, WHERE, WHAT)
$$ ##TITLE= Audit trail, XWIN-NMR		Version 3.5
$$ ##JCAMPDX= 5.01
$$ ##ORIGIN= Bruker BioSpin GmbH
$$ ##OWNER= she
$$ F:/spectra/data/she/nmr/H-F/1/audita.txt
$$ ##AUDIT TRAIL=  $$ (NUMBER, WHEN, WHO, WHERE, WHAT)
(   1,<2022-02-16 08:54:31.06 +0400>,<she>,<DPX200>,
      <created by zg, POWCHK disabled, PULCHK disabled
       configuration hash MD5:
       00 E9 B6 7A A2 85 ED C7 34 08 36 98 17 FE 4E 26
       data hash MD5: 16K
       34 71 2E 28 D4 A2 73 59 99 95 D6 DD EB CC 11 A1>)
$$ ##END=
$$ 
$$ hash MD5
$$ 93 3B 54 05 70 4F D2 84 4F FE 97 A2 8A 58 65 57
##$RELAX= 
##$RELAX= 
##$RELAX= 
##$RELAX= 
##$RELAX= 
##$RELAX= 
$$ Bruker specific parameters
$$ --------------------------
##$DU= <F:/spectra>
##$EXPNO= 1
##$NAME= <H-F>
##$PROCNO= 1
##$TYPE= <nmr>
##$USER= <she>
##$AMP= (0..31)
100 100 100 100 100 100 100 100 100 100 100 100 100 100 100 100 100 100 
100 100 100 100 100 100 100 100 100 100 100 100 100 100 
##$AQSEQ= 0
##$AQ_mod= 1
##$AUNM= <au_zg>
##$AUTOPOS= <>
##$BF1= 200.13
##$BF2= 200.13
##$BF3= 200.13
##$BF4= 200.13
##$BF5= 200.13
##$BF6= 200.13
##$BF7= 200.13
##$BF8= 200.13
##$BYTORDA= 1
##$CFDGTYP= 0
##$CFRGTYP= 5
##$CHEMSTR= <none>
##$CNST= (0..31)
1 1 145 1 1 1 1 1 1 1 1 1 1 1 1 1 1 1 1 1 1 1 1 1 1 1 1 1 1 1 1 1 
##$CPDPRG= <>
##$CPDPRG1= <>
##$CPDPRG2= <>
##$CPDPRG3= <>
##$CPDPRG4= <mlev>
##$CPDPRG5= <mlev>
##$CPDPRG6= <mlev>
##$CPDPRG7= <mlev>
##$CPDPRG8= <mlev>
##$CPDPRGB= <>
##$CPDPRGT= <>
##$D= (0..31)
0 1.2 0 0 0 0 0 0 0 0.06 0 0.03 0 0 0 0 0.0002 0 0 0 0 0 0 0 0 0 0 0 0 
0 0 0 
##$DATE= 1644987270
##$DBL= (0..7)
120 120 120 120 120 120 120 120 
##$DBP= (0..7)
150 150 150 150 150 150 150 150 
##$DBP07= 0
##$DBPNAM0= <>
##$DBPNAM1= <>
##$DBPNAM2= <>
##$DBPNAM3= <>
##$DBPNAM4= <>
##$DBPNAM5= <>
##$DBPNAM6= <>
##$DBPNAM7= <>
##$DBPOAL= (0..7)
0.5 0.5 0.5 0.5 0.5 0.5 0.5 0.5 
##$DBPOFFS= (0..7)
0 0 0 0 0 0 0 0 
##$DE= 6
##$DECBNUC= <off>
##$DECIM= 32
##$DECNUC= <off>
##$DECSTAT= 4
##$DIGMOD= 1
##$DIGTYP= 9
##$DL= (0..7)
0 120 120 120 120 120 120 120 
##$DP= (0..7)
150 150 150 150 150 150 150 150 
##$DP07= 0
##$DPNAME0= <>
##$DPNAME1= <>
##$DPNAME2= <>
##$DPNAME3= <>
##$DPNAME4= <>
##$DPNAME5= <>
##$DPNAME6= <>
##$DPNAME7= <>
##$DPOAL= (0..7)
0.5 0.5 0.5 0.5 0.5 0.5 0.5 0.5 
##$DPOFFS= (0..7)
0 0 0 0 0 0 0 0 
##$DQDMODE= 0
##$DR= 18
##$DS= 0
##$DSLIST= <SSSSSSSSSSSSSSS>
$$ [...]
##$SUBNAM2= <"">
##$SUBNAM3= <"">
##$SUBNAM4= <"">
##$SUBNAM5= <"">
##$SUBNAM6= <"">
##$SUBNAM7= <"">
##$SUBNAM8= <"">
##$SUBNAM9= <"">
##$SW= 18.0517287032376
##$SWIBOX= (0..15)
0 0 2 0 0 0 0 0 0 0 0 0 0 0 0 0 
##$SW_h= 3612.71676300578
##$TD= 16384
##$TD0= 1
##$TE= 0
##$TE2= 300
##$TE3= 300
##$TEG= 300
##$TL= (0..7)
0 120 120 120 120 120 120 120 
##$TP= (0..7)
150 150 150 150 150 150 150 150 
##$TP07= 0
##$TPNAME0= <>
##$TPNAME1= <>
##$TPNAME2= <>
##$TPNAME3= <>
##$TPNAME4= <>
##$TPNAME5= <>
##$TPNAME6= <>
##$TPNAME7= <>
##$TPOAL= (0..7)
0.5 0.5 0.5 0.5 0.5 0.5 0.5 0.5 
##$TPOFFS= (0..7)
0 0 0 0 0 0 0 0 
##$TUNHIN= 0
##$TUNHOUT= 0
##$TUNXOUT= 0
##$USERA1= <user>
##$USERA2= <user>
##$USERA3= <user>
##$USERA4= <user>
##$USERA5= <user>
##$V9= 5
##$VALIST= <valist>
##$VCLIST= <CCCCCCCCCCCCCCC>
##$VD= 0
##$VDLIST= <DDDDDDDDDDDDDDD>
##$VPLIST= <PPPPPPPPPPPPPPP>
##$VTLIST= <TTTTTTTTTTTTTTT>
##$WBST= 1024
##$WBSW= 4
##$XGAIN= (0..3)
0 0 0 0 
##$XL= 0
##$YL= 0
##$YMAX_a= 119607
##$YMIN_a= -121492
##$ZGOPTNS= <>
##$ZL1= 120
##$ZL2= 120
##$ZL3= 120
##$ZL4= 120
##$ABSF1= 10
##$ABSF2= 0
##$ABSG= 5
##$ABSL= 3
##$ALPHA= 0
##$AQORDER= 0
##$ASSFAC= 0
##$ASSFACI= 0
##$ASSFACX= 0
##$ASSWID= 0
##$AUNMP= <proc_1d>
##$AZFE= 0.1
##$AZFW= 0.1
##$BCFW= 1
##$BC_mod= 2
##$BYTORDP= 1
##$COROFFS= 0
##$CY= 11.3945322036743
##$DATMOD= 1
##$DC= 2
##$DFILT= <>
##$DTYPP= 0
##$F1P= 2.36226072786647
##$F2P= -0.459571619588291
##$FCOR= 0.5
##$FTSIZE= 0
##$FT_mod= 4
##$GAMMA= 1
##$GB= 0.15
##$INTBC= 1
##$INTSCL= 1
##$ISEN= 128
##$LB= 0.24
##$LEV0= 0
##$LPBIN= 0
##$MAXI= 10000
##$MC2= 0
##$MEAN= 0
##$ME_mod= 0
##$MI= 1.114404
##$NCOEF= 0
##$NC_proc= 0
##$NLEV= 6
##$NOISF1= 3.799351
##$NOISF2= 2.8
##$NSP= 1
##$NTH_PI= 0
##$NZP= 0
##$OFFSET= 15.70392
##$PC= 1
##$PHC0= -16229.89
##$PHC1= 11.40078
##$PH_mod= 1
##$PKNL= yes
##$PPARMOD= 0
##$PSCAL= 0
##$PSIGN= 0
##$REVERSE= no
##$SF= 200.130013532006
##$SI= 16384
##$SIGF1= 3
##$SIGF2= 2
##$SINO= 400
##$SIOLD= 16384
##$SREGLST= <1H.CDCl3>
##$SSB= 0
##$STSI= 0
##$STSR= 0
##$SW_p= 3612.71676300578
##$SYMM= 0
##$S_DEV= 0
##$TDeff= 0
##$TDoff= 0
##$TI= <>
##$TILT= no
##$TM1= 0
##$TM2= 0
##$TOPLEV= 0
##$USERP1= <user>
##$USERP2= <user>
##$USERP3= <user>
##$USERP4= <user>
##$USERP5= <user>
##$WDW= 1
##$XDIM= 8192
##$YMAX_p= 0
##$YMIN_p= 0
$$ End of Bruker specific parameters
$$ ---------------------------------
##NTUPLES= NMR FID
##VAR_NAME=  TIME,          FID/REAL,        FID/IMAG
##SYMBOL=    X,             R,               I
##VAR_TYPE=  INDEPENDENT,   DEPENDENT,       DEPENDENT
##VAR_FORM=  AFFN,          ASDF,            ASDF
##VAR_DIM=   8192,          8192,            8192
##UNITS=     SECONDS,       ARBITRARY UNITS, ARBITRARY UNITS
##FACTOR=    0.0002768,     1,               1
##FIRST=     0,             0,               0
##LAST=      2.2672688,     0,               0
##MIN=       0,             -121492,         0
##MAX=       2.2672688,     119607,          0
$$ Real data points
##PAGE= N=1
##DATA TABLE= (X++(R..R)), XYDATA
$$ [...]
1763B03k00K16j85j59K89J13k85kK96m86J16K87o7j31j26J3l57O86l89J8K51O6
1785A67l10M1o0K93k44J40L0j54L19j7m07K17M67o21m1K77n4K30J20k51m19N28
1807B51j3p66n1R90l35r7j36K89j53J94j56q0P8k30J80j60M93l4o77K39K73L3
1829A32L5j2O9k06N9j5m7j41K19l81M0K35l90K63M89o53L49Pj42N8Q3R9m55j83
1853d88Q80m63J25L13n48J11J29J78j69j50J10j22p8M8K75k37o6K97l99N09J52
1874D07k43l44M10P9n51L45n7k37l9K10k06N05n0k71o5N18j07l17k07L92j04J16
1896A84M5j42j75J52k40n9L08Q5j99J45l05J87J34n6ko0J45k88J0K62K23k01j8
1919A35k58L08K81l41J02n14J63J99k79K58K39k84j6j58j51L97j23j33j0j0L8
$$ y = [203, 3, 219, 34, -125, 164, 277, -8, -10, 286, -200, -84, 203, 136, 5, -121, -108, -465, 221, -168, -150, 101, 167, -143, -102, -162, 131, -113, 27, 57, -97, 222, 205, -202, 15, 482, -139, -180, 97, 43, 273, 393, 142, -277, 251, 238, -528, -579, 411, 76, -21, -157, 132, -21, 173, 17, -63, 15, -215, -35, -195, 298, 264, -413, -174, 99, 132, 167, 155, 224, 18, 77, 62, 15, -126, 93, -288, -248, -13, -403, -140, 349, -304, 45, 52, -90, -32, 51, 150, -305, -488, 392, -71, 54, 367, -181, -70, 59, 237, 68, -82, 28, -94, -172, -124, 151, -86, -152, 145, -254, 255, 407, 164, -180, 230, 309, -242, 103, 46, -191, -230, -20, -226, 279, 229, -42, -107, 411, 304, -13, -220, 172, 68, 184, 229, 87, -88, 64, -176, -235, 73, 158, -41, 104, -201, -14, 120, 64, 62, 2, 147, -141, -131, 131, 354, 153, 135, -123, 185, 466, 125, 227, -287, -124, 75, -204, 54, 293, 9, -7, -165, -316, 81, -42, -175, -185, -195, -157]
1940a57M1O4M37j62k17j12j7K5M12k36J13j12j15L04k94J28j89J30K69q9k94K45
1962A74r8l11N9K33l58K46J24j32o4mJ89N2j21j5j35J50J88m6J33k55J65k82K28
1985A20P8k86j39K10n9J67K58m4l77j55m6L5J1J64K81l45q7k66L21O54j33k63
2007I9k32r4J20M05j75j8j4k75J70P5K90J89o40j94q4K53M61k18j8k19l10J77
2029b52J47L66l5O4n85J56J44L47q7k80L8k48K12K41q4j24P6k88p5J82J78R2l38
2052a53r2J48J89j95j3m8J47K8k51K05j00J51n7k44J76K25j06o2K26j74K62r4
2074A68j57j43J37K34L3J85n6k88k35K41n58N19K28k78j20p7R3j12j6N66m28l0
2096i4j87R6N7K67J34P7j79l67%P4M71m95J23k91j99M12J30K05l63J81k82j92
$$ y = [-157, -116, -52, 385, 223, 6, -106, -123, -98, 314, 78, 191, 79, -36, 268, -26, 102, -87, 43, 312, 223, -71, 174, 76, -235, -176, 57, -301, -55, 69, -63, -127, -131, 58, 110, -11, -26, -161, -11, 177, 131, 264, 9, 174, -108, 120, 198, -88, -227, -17, -76, 91, 349, 305, -72, -227, -273, -238, -227, -63, 218, -127, -214, -480, -159, 495, 362, 99, -133, -227, -107, 298, 123, 105, 91, -184, -14, 61, 351, 540, -100, -294, -378, -125, 336, 118, 100, -119, -429, -252, -105, 261, 226, 290, -295, -139, 5, 352, 265, -15, 23, -225, -13, 228, 144, 20, 96, -192, -267, -85, 93, 185, -153, -245, -97, 92, -103, -116, -164, -17, 11, -240, -35, -135, 16, -41, -285, -109, 116, 10, -52, 174, 0, 262, 168, 11, -132, 5, 239, 272, 457, 401, 113, -122, 119, -439, 80, 308, 30, -90, -167, -74, -186, -202, 364, -64, -94, -281, -185, -128, 139, 273, 350, 171, -196, -196, -122, 349, -146, -23, -314, -513, -101, 29, 234, -129, 52, -230, -422]
2118d22K60K15J38j55k04l5o6K55O2J2o1M0l52J3M94M0k39j09k06L20l1K56n5
2141A70Q2k96J49l3J4M8k07J35l21NL56j23K04k68O1p1j91M47q7j27R9q3J55l2
2165H6J60k46j18J61j81L90o68L17K45r1j00K74q9j3l11J17J08Q6J41l19mj5k55
2188c25J26K12L9k2m49j86M36M35J14j77m44K30r6J89K11l43L53l39J23k76K13
2209B4K87k95n9l76L33J61o2l2O8k61k21K49K41R1N3k42j04Q5J89L23k50j10J71
2232B63m60J72J60K6L8j07k76l7R3J58j85K89k82M1j92N90j27j39j68l4K31N5
2254A09k08J10QM40o38M13j81j01K6p5L04k10P7j07k26N50k82J85k04j40k6M3
2276a33L2P1J78j1k48j4j27L59J70k1K5k77l5j25J73N6M9q4k31j5N26l16o1J82
$$ y = [-422, -162, 53, 191, 36, -168, -203, -269, -14, 48, 60, -1, 39, -313, -300, 194, 234, -5, -114, -320, 0, -31, 225, 170, 252, -44, 105, 72, 86, 134, -73, 62, -259, -254, 102, -21, 183, -85, -24, -95, -286, 161, 74, -53, 46, -37, 118, 86, 246, 0, -118, 43, -138, 252, -416, -99, 146, 55, -45, 229, 140, 127, -184, -67, 41, 127, 268, -51, -55, -70, -325, -199, 13, 52, 30, -419, -605, -169, 266, 380, 203, -241, -11, -107, 82, 293, -50, 303, -36, 87, -189, 24, 311, 16, -43, -419, -86, 75, 13, -19, 49, -212, -433, -184, 57, 148, 201, -41, -145, -60, 129, 452, 202, 92, 263, -197, -25, 135, 161, 199, 92, -184, -221, -128, 30, -155, 134, -148, -107, -299, 291, 164, 25, -143, -177, 54, 109, -99, 11, 19, 459, -179, 234, 53, -48, -22, -97, 207, -3, 74, -33, -259, 291, 9, 194, -10, -150, -176, -133, -101, -30, 148, 137, -111, -125, -252, 107, 277, 256, 281, 4, -31, -156, 17, 73, 122, 38, -193, -208, 318, 2, -59, 123]
2300A23Rj62m9J67J60n2l02m5j51L24n7J4J30k43k72K37K94n6J16k82K44k60J19
2323FK16k10K74k4j95j73n3J79j2l0L50o14J38J32k97kM81j80k29J15j72L35K80
2346C15j31l88J6Q3o2J70J79N4l55k7Q1j05L25O8k04l43L82j64J20n5J7J48j62
2369c8J25k37L4o8J18lN5n4o1J94L0n4M4K4L9k5j25k4oL40j30j08l25L24QlK52
2396C26m81k42M56O9o1L0Q8j08j62r3K32j65R1J13m18L07J8L3k3L4J3j81J54j57
2420a27P8L57m94O9N4K69k15JP9j56r9j01L21Q6k35J31Q7j43L6k2K20m9k02M1
2444a4L54m16K6J98M5j56j4q8J71j4j70J05j61K56N4k27J05p6k42R0L56j45o7
2467c0j04K76j14j28j41N7J82On8L04j67j72K6n7Q7L62m19K34j10k40L80r0j83
$$ y = [123, 132, -30, -79, 88, 248, 196, -106, -151, -302, 22, -35, -21, 109, -134, -406, -169, 125, 69, 185, -97, 147, -113, 6, 222, 12, 286, 262, 67, -106, -159, 20, 8, -22, 328, -286, -148, -16, -313, -315, 166, -14, -243, -128, -300, 35, 315, 184, -204, -188, -105, -167, 3, 182, 236, -119, -146, -65, -170, 155, 223, 19, -324, 58, -106, 14, -41, -24, 124, -38, 87, -150, -116, -184, -66, -69, -14, -68, -129, 65, 95, 41, 85, 109, 148, 123, -2, -26, -32, 308, 178, 70, -255, 69, 77, 74, 326, -155, -397, 59, 128, 67, 97, 185, 77, -85, -178, 54, -111, -20, 93, -325, -18, 0, 33, 10, 44, 57, -124, 30, -127, -49, 308, -186, -117, -63, 206, -9, -8, 71, -85, -184, -285, 36, 122, -113, 18, 105, -38, -2, -24, 196, 147, -55, -14, 340, -76, -50, 148, 193, 37, 23, -65, 106, 92, -78, 27, -134, 122, 176, -51, 54, -22, -264, -174, 182, 37, -30, -134, 142, 28, -100, -241, -184, -2, 4, -54, 250, 83, -89, -63, -120, -33, 329, -90, 144, 34, -206, 174, 84, -99]
2490i9J40Q3K4j36j37m1J86O5k30J84j43J94K6q6k25j32N20j6N5l2l51j18K06
2513f3j55K07J14k03Q6J00J61j5r3j4j4l41J29KK83k48M3n0J44o2k03L61k12N2
2537IK4o5j44L22j1j60p2K88K9m02K21l38M99J04j56l03j86K86q4K23O6j14k50
2560b14J82J44l87O02k71j6j37R9O6j69P6J73l21K60Nk37K10j49K28k48Q8m6K03
2583A41L9m02J36k6J01J22j09R8k56K2J42n9K84k44l2l03L46q3O3R2k15K96j43
2606A0J86K1j09j4k3j79K05J50L0l3k01o0k07M15k3j16J04k14K3O3r8P4q0m3J98
2631G9k8k77N39k03j83J81L1l46K38L0j7m6LK00j53n1o9l6L90p2j57Jj87K21Q0
2656A68k61J61j5j08l4R2j81J95j97K04k30j8Q3K04J07q7r1P9l9j32J61n3m3K20
$$ y = [-99, 41, 124, 148, 12, -125, -166, 20, 85, -145, 39, -104, 90, 116, 30, -195, -327, 193, 177, 232, 200, -151, -269, -63, -218, -11, 103, -100, -14, 86, 247, 232, 139, 125, 111, -230, -101, -99, 184, -64, -21, -71, 73, 11, -192, 169, -43, 9, 33, -32, -176, 146, 135, -25, -97, 191, 220, -182, 39, -299, 200, 304, 148, -155, -341, -55, -139, 84, 150, 36, -214, -32, 112, -275, 327, 56, 40, -97, 2, 68, -101, -25, 148, -173, 87, 92, -145, 65, -84, 144, -104, -16, -62, 141, 180, -222, -86, -112, -11, 111, 2, 100, -156, -134, 8, -51, 233, -11, -43, -346, 0, -83, -20, 72, -143, 153, 10, 196, 217, 108, 94, 71, -108, 97, 247, 277, 244, 43, -17, -224, 191, 168, 52, 156, -58, -35, 28, -70, 4, -76, -119, 79, 51, -226, 313, 110, -73, 108, 139, -207, 31, 61, 44, -2, 1, 201, 48, -3, -72, -108, 282, 210, 53, 54, -133, 88, 168, -93, 68, 53, -55, -89, 3, -178, 17, -180, 24, -206, -224, -141, 63, 170, 83, -8, 71, 32, -100, 61, 8, -35, 185]
2680A85j95J25J13k36k38L03n1j33R6O2N3k4p9j48J70P0j01K45J38m14J76k40
2702a23K28j74Q8Mj54M16k29r1J02J34m11K20j21K9R5m0L6k18L03l03O2L04l05
2725a48L6L21l71K20j59J69J1J77j20n7l25K8K79L64m79J13j0k24J72J56O1k90
2747g6k54J72PM09l55K0m6p4P2J54O8P5l74L53O2j91qOl6K91l59O5K13k19NJ50
2773A30J40l35L08m15L8p1J61j01r4K96Q4j61k6J17J1j55L5j40L26K2j00RJ5k56
2797a62j51K13K66n4J31k76o9N7R6j37K28J9r3l3k04J94L0p1Mr3J66Nj87K6o4
2822a59M32k38j80L11k54M39k73r9P1k41J35O9J02j39J06k50J56j17K82p3l5J38
2844A83q3l77L22j61J27j1r2k86K72l08M90k06j4J62j20j2q6L65j77J40l23K47
$$ y = [185, -10, 115, 228, -8, -246, 57, 6, -127, -31, 31, 84, 60, -19, -167, 3, 73, -28, 217, 355, -59, 117, -123, 105, -69, 19, 23, -131, 285, 56, -35, 67, 201, -210, 10, -111, -82, 13, -27, 9, -209, 94, -209, -147, 157, -148, -112, 209, -162, 58, -101, 68, 79, 256, 136, 79, -246, -218, 61, 425, -54, 59, 49, -175, -3, 153, 214, -76, -330, -158, -151, 258, -97, -77, -123, -197, -125, 29, 97, 172, -202, 151, 213, 22, 14, 20, -16, 275, -84, -19, 194, -25, -20, 130, 270, -65, 243, -172, -134, -205, -44, -145, -239, 57, 141, -20, -46, 71, 82, -73, -38, -178, 148, 170, 70, 79, 94, -162, -313, -100, 166, 112, 243, -33, -102, -45, 51, -86, 142, 161, 68, 35, -169, 25, 55, -16, -12, -105, 61, 66, -121, -95, -159, 273, 35, -145, 166, -88, 351, 78, -21, 50, -191, -56, 13, 115, -24, 82, -168, -12, -129, 153, 80, 45, 183, 100, -277, 45, -116, 11, 0, -92, -378, -106, -414, 76, -130, -144, 18, -102, -114, -200, 165, -12, 128, -195, 52]
2866E2l1J5O7l07J29m1j93K58Q3K6L5k3J60k73k5K85n7k87O6O8L1J08k24q3K43
2891H2j52j72K12J04o9J79j2N9j43n7O7k0M9k02j8R0Lr3j04K65j60K33j32K11
2915B20m40K42O7l58J01k78P98j09q7J80j71l43O9J27R8j33J70l95K41LQ1j11
2937b8m7k5K2p9M12r4k94j07P8L1J54j98J86L53n60K05j54L27k73K05j63J25j72
2960i6J50m3J6K87k89k05K92j61k30K50m9N8k24L24j94kJ59J04k30J4L31j84J7
2983I5k2j15K50O1j16k04P1J63mk45J80j52k08J05L02l57L55m9m08K12K83k31
3005c4l9K4r2k35K81J45j48L56j32j66J44J20q3l5k12K60j12j27J8J82j93N5J06
3028H3q9k94K50J96j65l2j98Q9J86j64NOO9J44k3M7nj10J36j87J56k26P3J42O1
$$ y = [52, 21, 36, 103, -204, -75, -116, -309, -51, 32, 58, 93, 70, 230, -43, -68, 217, 160, -127, -61, 7, 38, 146, -78, -161, 82, -70, -242, -30, 74, 5, 184, 172, 231, 88, 31, 98, 78, 127, -75, -93, -3, 0, -93, -197, 68, -92, 141, 9, 220, -220, 22, 89, -269, -168, -446, 352, 243, 156, 336, 165, -178, -109, 18, 116, -17, 153, -242, -1, 2, 83, -28, -75, -100, -78, -157, 255, 161, -133, -240, -162, -131, 23, -175, 11, 364, -196, 9, -145, 182, -91, 114, -49, 76, -96, 54, 11, 27, 314, 25, -180, 112, -49, -279, -29, -78, -20, -244, 80, -114, -116, 43, 147, -83, -69, 262, 78, 95, 73, -42, 208, 269, 153, -51, 20, 183, 179, -66, 114, -38, -246, -141, 161, -196, 159, 110, -298, -86, 197, -34, -73, -49, -141, -376, -95, 50, -98, 258, 126, -40, 104, 224, 141, 106, -106, 154, 42, -85, -67, 115, -78, -23, 83, -6, -300, -50, 146, -19, -51, -249, -160, 26, -138, -133, -127, -58, 86, 63, 110, 105, -5, 131, -56, 100, -126, -53, 89, 150]
3053A50J1j96m8Q2k79L81J0l2j76J79k81P5R9k33J54R0n2J9K37k18N39n48J1P5
3077D9Nj10q6J04K49k12l06L42J42k53P0k7l68K77k9J68K79j86k79J72k6j19k00
3100c44K33J32J12J84n02K39k8o9l0K31j96J99J63m11R1j32k2J49j53J72J14M6
3122A78O5j89j30m3J27o1K53m4n79N09j0o7r8K6l2K14k58m9L53J62m20j23K89
3145G3j43J00K94k9l45j8j4Op5J03L5O7j27K6Lr5mK47j05o9L42m21L29j47K35
3170B68k51m9J96q0J21Q9l20q4J39j24K04J52k90j0j6m4L7J13j29J06o8Q9k48
3193a99J68K14mR3n6j75j13R8J60q6r7k10L48k36P7J70j01k3R9P1m06L25m39L82
3217F0J02M8j03k2j29M6k53L49j7q0j09K36j28r8J81j06K37j64j05N4J58j29J0
$$ y = [150, 161, -35, -83, -1, -280, 101, 111, 79, -97, 82, -199, -124, -25, -258, -104, -14, -66, -47, 190, -28, 511, -37, -26, 49, 54, -56, -142, -38, 211, -1, -307, 35, 177, -76, -6, -33, -401, -124, -153, 15, 294, 108, -171, 1, -25, -144, -344, -111, 21, 133, 317, -185, 54, 26, -43, -73, 158, -38, 161, 324, -87, 4, -128, -150, -1, -154, 18, 132, 178, 243, 54, -76, -119, 8, -53, 200, 156, -423, 86, 76, 9, -89, -63, -95, 119, -139, -188, 165, 327, -93, -216, 73, -70, 30, 324, 295, -50, -68, -82, -76, -151, -48, -13, 54, -73, -47, -44, -139, -143, 104, -1, -70, 272, -149, 180, 33, 268, 17, -32, 164, 84, 205, 294, -26, -110, 29, -95, 109, 261, -29, -39, -55, -99, -62, 51, -78, 28, -40, 49, -199, -31, 183, 179, 272, 216, 41, -72, 26, 186, 100, 3, -207, 141, -95, -18, 152, 51, 28, 127, 198, -208, 117, -322, 60, 162, 210, 107, 85, -44, 2, -251, 98, 81, 1, -108, 128, 0, -98, 83, -23, 214, 50, -55, -1, 157, 28, 38]
3240C8m1J7O2p7j28n6K09O1k9P5j69j31K67k0j09j12L5M6P4j21J57k35mJ04j5
3265a02K96k43M3R3m39O06m72K07J86k12mQ0k19jL02k41r5K48n5Q7k1r2J23j28
3289e3r2L62o4k59K44k65L20Nk01r2J84j30p1L02j72M8k22J55R7n8k7k64J18j0
3313a45K89k48MO3L7o0j43J5J62J07k05J61J17J70j70j84PJ94j78J84r1j26K36
3336A96j40j90J52Q1q0k23J20K20l43L07m8l22L72k57N3P9K07j42j1q4R0k1N6
3359G2j78J49M4Mk40J46N3j93J77o9RM6J17k88K51nj63O3J56k6k31j38L65k84
3383a63O75m55R9j89K32r3k34K65k77L78k67J84l4j04j8o5M7k35J96k4N1o7k40
3406c38J39J01J55P3l36M59l4l74j25L37l29M99l13J60J75k65J05j51Q8j99R5
$$ y = [38, -3, 14, 76, -1, -129, -185, 24, 85, 56, 131, -38, -169, 98, 78, -31, -143, -108, -62, 12, -109, 48, -187, -191, -87, -102, 194, -49, -6, 87, -352, 254, -218, -11, 175, -37, -41, 39, -180, -181, 121, -120, -215, 33, -22, 65, 44, -48, 75, -53, -145, 217, 153, -106, 138, -127, 193, 198, -3, -95, 89, -41, -112, 190, 18, 66, -156, -1, 96, 38, 11, -253, -135, -145, 144, -104, -100, -37, 0, -60, -203, -188, -26, 81, -124, 37, 154, 324, 154, -30, -23, 171, -7, 177, 86, -40, 196, 56, -134, 18, 99, 19, -204, -84, 136, -207, 100, 52, -270, 102, -155, -102, -23, 184, 42, 31, -53, 37, 16, 72, -106, 43, 87, 91, -149, -3, 50, -143, 34, -35, -26, 20, 137, -151, 100, 95, -68, -5, 151, 125, -106, -244, 121, -163, 512, 57, 156, -33, 199, 106, -128, 137, -140, 238, -29, 155, 121, 17, -1, -66, -19, -254, -58, -82, -31, -98, -338, -199, -98, 57, 130, -206, 253, 219, -155, -280, 57, -272, 227, -86, 74, 249, -16, 89, -62, 26, -173, -78]
3427g8K31m0Oj94P2k77K44P8l03L64O0j46j65N2O4r3P1o7LN7m8J69J9k79p1L43
3453G2J31k2m47R0K13j57L27K7j29k82L29o7R4k10N6j49j58K58j20k0J50j83K62
3476F5j08O3k47L42k57J58N4j48K32q1j83k09J92k5L59k47L0O5J6nk44k34M93
3499H1K0k90Q2J25m8j87J00j19j24L20k0K24j71Q5j52J42j70O8N6j31O4J54R6
3522B05l31j94L62l69O32k98k44K79k12j50K77K61j61m1o2M4j78J74o2K15j46
3543ALj47J90K8k40J06Q7L3j09J76MP5ro0k39QJ22j61pJ81p3j7J01j03J65K00
3569C15l61j50J21K01j05q1K93m8J15l58O6n5O8K35ml12K91l10J81r3M5k21K04
3592C7k62M40l31L20l72K74k08p2K65P4j22j15P3n4P8j28J50o3O3L00l83O6r7
$$ y = [-78, 153, 113, 119, -75, -3, -280, -36, 42, -261, 103, 163, 17, -148, -96, -32, -125, -54, -121, -118, -61, -109, 60, 79, -200, -271, 72, 203, 181, -266, -176, 37, -120, 207, 234, 105, -177, 152, 85, 179, -31, 25, -124, -282, -24, -144, -164, -14, -197, 65, -43, 20, -227, 115, -142, 16, 70, -78, 154, 73, -110, -319, -127, -152, 207, -40, -10, 55, 71, 66, -178, -412, 81, 101, -189, -107, 18, -30, -217, -117, -236, -360, -40, -60, 164, -7, 78, -74, 68, -102, -34, 22, -109, -45, 109, 205, -126, -320, 42, -327, 305, 7, -237, 42, -170, -320, -43, 218, 57, 16, -46, -2, -180, -6, -68, 147, 1, 4, -143, 47, 75, -165, -59, 28, 61, -48, 128, 132, 207, 198, 138, -101, -93, 29, -132, -139, 42, -31, -48, 53, -50, 115, 315, -46, -196, -75, 126, 21, -60, 233, 185, 300, -58, 8, -47, 21, 256, 252, -60, 231, -79, 102, 9, 54, -167, 37, -225, 215, -116, 204, -168, 106, -102, -174, 91, 165, 43, -72, 1, -53, 25, -103, 47, -16, 47, 347, -36, 30, -67]
3615f7L14m63M35J53o50J92L34j39l21J42n7K5N3J48j26K7n7Q6Op6j56r9O6K35
3639Ep4L52l75j06J9J12J54l97M34j25J22j31N2j25l2Q6K25l81J4j30J80m7L43
3662A75j69j40L06j92J03j78jJ73m8N5p0J25l04J45J4n6m8j66P2o0J59NJ71p3
3686bj5J24K8k16N9M8k2J01l12J67l00M72J8m51J80K93N7l37R8o1K08j18R1p8
3710C2nK6k59K58n0o8Q5r4Q7p8j31J5j34N07j45q9j2q4J35L9l9kj97N5l3K68o6
3737B1lJ69j5m0o1k01N9jN6M9rj51R5J99j00l3J50l45L0R8K04j53J64Q3k04k52
3763a91K62k49K25K36m66J84K71j40l16L45k8J9n4l40J75m8J66j61K6P0j6P7J0
3786E7k49J69J59k23m9r3M66l14J45k28R8K66k32Q1J3j46K17q2J3J56l13K27l21
$$ y = [-67, 247, -216, 219, 372, -278, -86, 248, 109, -212, -70, -127, -102, -49, 99, -27, 0, -57, 29, 35, -41, -197, -296, -230, 5, -69, 283, -92, -198, -179, -67, 87, -310, 124, -1, 121, -10, 42, -83, -115, -29, 196, -185, -171, -301, -121, -168, 175, 6, -134, 172, -20, 83, -95, -96, 77, 29, 84, 14, 139, -165, -20, -6, -62, -110, -276, -204, -264, -105, -100, 71, -2, -17, 107, 135, -81, -22, 26, 4, 105, -207, -40, -340, 132, 150, -301, -121, 172, 229, -108, -10, -71, 137, 19, 110, 32, 27, 53, -206, 52, 2, -66, 19, -75, 12, -66, -197, -182, -316, 191, 46, -43, -55, -139, -4, 35, -4, -6, -203, -148, -181, 87, 21, 18, 187, 172, 132, 71, -130, -71, -72, -16, 33, 24, -127, -32, 167, 67, 34, 184, -161, -131, -33, 171, 18, 182, 265, 61, -191, 71, -178, 47, 283, -183, 1, 272, 132, -184, 161, 133, 152, 98, -242, -67, -115, 51, -110, -84, -14, -30, 47, 57, -192, -23, 136, -87, -136, -229, 237, -77, 68, -160, -62, 204, -28, 53, 66, -80, 137, 55, 68, 224, -89, 138, -183]
3809a83J52J37n6J15j30j87J40n4N9p3jK00j23j3m7J05m3j88K67L28l68l2k72
3832b67K08j25L14j99l6N2r2K60J49j71J43k31j67P2k46K50J53k57J11J40P6j62
3854b5K71l87K51l36L9L98j35OK40m56J76o2k90N18j28k84J62J10k67K55J35L0
3876B21l14K28k31R3o3L6M09n63L58q8j75J56o5K40l09L49m76L36o0j85K39mN3
3899A85j87L64l78q9K17j19j17J88j06L4O9j85K31o0L1o9p5L9l4J10n1K22k06
3922A4Q0L5R4m41L24R8R2l05n2K54k26j39K75j22k40L00p7j61m1K02p5J03O7k23
3946a64K58J76k75j47K74j00j06J78n2L03m65J56L4p2j03K57J36j82J51k60O0
3967E7K9k20J38J6j79J59Q1k71J39Q9o4J7N4r3r1j6J08N7n1K08m1l4k54J42n6
$$ y = [-183, -31, 106, 50, 165, 35, -152, -12, -66, -7, -80, -81, 119, -4, -17, -64, 41, -2, -190, 77, 405, 37, 5, -267, -59, -184, 130, -69, -105, -53, -145, 115, 264, 93, 236, 5, -162, -90, -336, -86, 67, -190, -79, 61, 137, -25, 246, -141, 110, -226, -187, 211, 76, 82, 322, -134, 42, -20, -310, 208, 80, -204, -42, 68, -199, 56, 191, 221, -93, 135, -96, -3, -66, -30, 379, -184, 174, 86, -89, 67, 2, 242, -67, 282, -194, 142, 82, -103, 136, 132, 185, -2, 362, -16, -105, 112, -7, -124, 64, -42, -8, 61, -124, 107, 47, 78, 9, -66, -27, -61, 49, -2, 220, 14, 94, 129, 223, -218, 106, 204, 296, -9, -61, 193, -33, -172, 103, -19, -259, 41, -36, -197, -238, -36, -111, -8, 59, -164, 94, 270, -5, -152, 122, 22, -84, 94, 42, 345, -120, 36, 70, -2, -105, 152, 288, 106, 257, -3, 57, 86, -134, 4, 20, -159, 0, 81, -190, -51, 38, -26, -9, 45, -48, -139, -155, -47, 10, -41, 167, 126, 92, -162, -20, -76]
3992g6K4nl0J21j68j0j63J61O5j36P4K5K14l5l58M09j73Q9l1P6j91J72K0K55j23
4017B06k33K8l2J58r9M9j35q9j78O35n22P6M64n30kK79k7R0j13k6j39J35Q9J0
4041I4p0o0Q9k98L33J11l26K12K8No0K63j54k14N8K3K77m21J88j67J00L70m20
4064c9j61J88q3O9n0J88k87L22j36j07Q5J80k18J56j22L3R4j49k2J94J19k93K45
4087B06j51L3q0K35k40N2j55M3J78j11l86L81k17M96m56K68Q8j19P7k51K36j20
4109GmL4J6k61L13N1q1n3r5l49J72L97k11p7J78k0j19L08n05L41l8J8k3n2K44
4134A91j43j4L0Ok29j2J84lJ28k65L88k08j79K39k11L13k34M0j31O4O5j11J03
4157A1k05K67j1l16J55L09j83k8n0J76r6J8O9k43J64R9j02J64k46l54L68L7L5
$$ y = [-76, -52, -57, -87, 34, -134, -144, -307, -146, -81, -217, -143, -118, 96, 61, -297, 112, -61, 28, -3, 73, -118, 54, 74, 329, 206, -27, 1, -31, 127, 28, 77, -58, -147, -325, 310, -212, -136, 328, -202, -204, 75, 48, 138, 25, -1, -140, -5, 84, 94, 24, -36, 53, -245, 88, 199, -127, 85, 113, 118, 58, 321, 167, -47, 11, 34, 311, -110, 78, -89, 11, 381, -39, -200, -12, -95, -26, -76, 112, -175, 147, 11, -96, -11, 169, -49, 107, -15, 18, 112, -37, -59, 135, 254, -39, 206, 55, 88, 8, 243, 3, 55, -100, -57, 121, 10, -376, 5, -212, 284, -172, 96, 184, 65, 142, -109, 127, 7, 3, 37, 53, -208, 105, 156, 75, 22, -73, -422, -250, 147, -64, -141, 37, 17, -102, 206, -299, 42, 4, 22, -1, -53, 191, 48, 34, 64, 70, -159, -171, 13, 10, 138, -127, 261, 53, -126, 113, -98, 215, -19, 21, -110, -46, 19, -92, 11, -194, 73, 62, -254, -99, 210, 27, -1, -51, 125, 29, 47, 116, -127, 37, 136, 34, 198, -48, -402, -34, 3, 38]
4180C8J99l04K61r4Prq9J81j33k2j65K60j67J33j49k67L22K6k67K59P6n7k9J72
4204A82J18p8j03j09J6k23J72j04J64Q3k82K92k48J57k48J12J01K32jk67L7L34
4226C37l60K6l7Ko1N5M5N0J02j7k04j83J87R8J48J72l52j13J60K1M5l25J78nq6
4251a17j0L81j72L5ok53K72k67J86P8j31J73k52kR3N0k91R5J68j82j8j25L12Q1
4275I8j7l35M29l69j71L36p0k1K00j26L8j33j24K86l1K8L7j34J44q4K85n03J81
4298e6M4M6M9J83j43q4Q8j47j8M5J69J79l36P3rj98J09J73Rk79J70l60K40J45
4322I2j34Q8J08l11K35M7j58PQ8Q1Rk74K62j14J28r6j69k9L65m38L23p1J39n05
4346c27K87J14j79q1J39j36J84m2J07J43j37P8j24k03J98rl1L2r3K01j01J73k35
$$ y = [38, 237, -67, 194, 100, 107, 98, 9, 190, 57, 35, -130, 130, -37, 96, -53, -320, 2, 28, -239, 20, 96, 39, 10, 182, 300, 222, 119, 10, 26, -197, -25, -129, 35, 118, -164, 128, -120, 37, -211, -99, 2, 234, 233, -34, 3, 337, -23, 3, -34, -32, -93, -38, 7, 57, 159, 142, -62, -245, -58, 40, 188, 360, 8, -105, 55, 76, 121, -204, -26, -31, -117, -127, 254, 82, 117, 111, -142, 130, -137, 49, 127, -4, 169, -83, -85, 8, 58, -233, -138, 30, -152, -170, -295, 17, 98, 81, -254, 175, -194, -365, -29, -99, -120, 80, -46, -8, -141, -265, 21, -10, 18, 55, -79, 65, -19, 266, -237, -56, -12, 34, 83, 266, 123, 39, 127, -20, -38, 7, 176, 355, 19, 92, 83, -115, -6, 167, 176, -103, 67, -293, -53, 92, -42, 46, 154, -157, 78, 125, -33, -26, 62, 143, 152, -122, 140, 26, 154, 58, -111, -140, 225, -213, 110, 39, 178, -327, -40, 74, -105, -186, -47, -183, 1, -41, 66, 209, 72, 150, 26, -177, 21, 12, -19, 13, -80, 121, 20, 193, -42]
4369d2%J7o5K62K8j98k3j32J19L3O9K1n1J06j82N8M3r3m0N2j1K02l19J58oK31
4395B37l07j06J54R0k25K11O8k38J81J30l6j78J19l30K42M2O6n6K2j13J97j0j89
4418b9M4k36M5L17m0q5K2J15k65k8L39k76m7K16j23lk49L40r1j09n1L74j32j28
4442h0P2n2J28k1jr8J5j2N7J7j23K01O1k06n5j96M06j42lj79M01j01J03l56K64
4467A00j05N2R4r9l7j85J35J45l7q6J07k57O5K01K8L9k08N1r6N3L43m12J88J9
4491I8K3k32J84L24m00o4MJ18j67J65j55K72k40R2k3k9PJ63j07J19k09K01j03
4514D1p0K59j22k24J56Qk41J88Rn6Q4r2j76O1J48R1pN8k06J70jj06n6K30k47J10
4540Ij74K47k93M38k21M8l13L83m79L02J15r8L62m92R2j77M58k01J13j29J24j16
$$ y = [-42, -42, -25, -90, 172, 200, 2, -21, -153, -34, -1, 68, 89, 38, 144, -38, 20, 63, -30, -70, -18, -29, 173, -146, 12, 6, 237, -70, -176, -22, 68, -157, 54, 122, -116, 65, 195, 159, -19, 100, -230, 12, 54, 120, 64, 86, -27, 170, 160, -29, 15, -221, -176, 141, 101, 16, 38, 153, -112, -140, 199, -77, -124, 92, -31, -34, -283, 57, -34, -143, -194, 180, 48, -80, -8, -60, 68, 47, 46, -52, -37, -49, 8, 25, -98, 103, 164, -42, -97, -293, 113, -29, -32, -211, 190, 89, 192, -164, 100, -5, 47, 141, 42, 5, -180, -45, 100, 63, -23, 84, -173, -108, 93, 121, 160, -48, 3, -93, -40, 303, -109, 79, 98, 121, -111, 73, 397, -3, -67, -63, 55, -112, 53, -102, 170, -70, 22, -1, -30, -23, 140, 33, 152, -57, 144, 41, -29, 230, 108, -116, 40, 48, -193, -5, 4, -52, 32, -60, -236, -175, -27, 64, 57, 115, -91, 79, 78, -28, -84, 146, -101, 9, -165, 82, -211, 227, 6, 54, -259, 124, -355, -53, 62, -36, 326, -166, -74, -251, 207, 6, 119, -10, 114, -2]
4562bJ12j64j56J70M8J3j15J22k02n2K03K9J61l5r0j60K07k27O2o5J65j37Qj76
4586b81L49j79K11j79MJ21j37J60Q1k01L49q6l11J24m7P5m6J6J06J45jr2j27k05
4610a51K10l04J70L11j18n9M0k54m8Q9K10q9j3j47k9J91L2j69J83j14K1J97k60
4633a01K31q1J61k24k6O1N5m9j81L90l97P8J20k49J33Q8J00k9qn3oO4j24m4K20
4658A29q5N4k96K47J55j31j4j3R1k10K20j64mo7P0N5M8o5j76L61l31mL56n5j01
4683G0j12J32n4Kk00K49j08k09L78j59J08q5j14J93P1l55K69mJ59l15J13j48J21
4706Bj02K51j73J38k87J60j17Q0J82l97K04L6K04j52L9k39J97k5pr1K67m0k39
4729a09J88j13l0j42J86m2q4L28j60q4J90J17m74J37J98k27l8K11K7j27p7J76
$$ y = [-2, 110, -54, -210, -40, 8, 21, -94, 28, -174, -226, -23, 6, 167, 132, 42, -118, 89, -138, -76, -141, 24, -113, -105, -281, 68, -111, 100, -79, -75, 46, -91, 69, 150, -51, 298, 212, -99, 25, -22, 53, 7, 23, 129, 274, 273, 181, 54, -151, 59, -245, -75, 236, 118, 59, 99, -155, -203, -114, 96, 7, -6, -153, -182, 9, 41, -128, 55, -59, -38, 159, -101, 130, 49, 210, -14, -40, 21, 76, 27, -154, 236, -161, -83, 37, -212, -79, 9, 109, 80, 72, 19, 13, 77, -47, -91, 129, 44, 98, -198, 49, 204, 73, 59, 46, 137, -73, 147, -17, -21, -88, -18, 37, 85, 20, -156, 205, -126, -130, 226, 171, 70, -42, 90, 36, 38, -162, 87, -21, -230, 148, -11, 97, 12, -102, 91, 162, -193, 76, 72, 231, -84, 29, -119, 2, -100, 151, -22, 116, -171, -11, -128, -48, 134, -263, -59, -23, 181, 29, 68, -171, 26, 1, -6, -97, 170, 130, -109, 79, -34, -64, -206, -20, -62, -146, 182, 22, -62, 128, 245, -229, -92, 106, -121, -159, 52, 79, -48, -125, 51]
4751E1l32R1L32j7L5m06P5L10j09K07j90O5k8Q3k38m1j2k4L11j00j55L7J98o2
4775H1L1k59j0J83J35k51Q4j1l4j08J92j86J71m5j14J16q9L2J73k04J10K45m86
4798b44L63j20q9l05N16l23J92l06J85K16j95R1M61n31J09P8j82j25n6N39k48
4819B6N5m98L57K51k59J38Pk50K93j79K69m17Q6l3m8L28k61K58j83O7k74L27j33
4842g3L4N6j83K01k76nL60j0k19L10l27L0J30j77M3J4j06K52k33K71j06J68j24
4865C0O4r8q0j39JK22k5J65k66j07K68k43J47N0N4j06j13J94Rj19L70k24k08K61
4889A07m9J5j55L13k01J30k31j65K93o5R5j16l43M59p7j91pM81j37j76J60k70
4911a30M5J51q9J20l2j37J14j05J19J17l16K77j28J1O2P8k26M12m47L27j08j15
$$ y = [51, -281, -190, 142, 125, 160, -246, -171, 139, 30, 237, 47, 112, 84, 167, -71, -112, -124, -148, 163, 63, -92, -55, 143, 81, 112, -147, -157, 26, 161, -90, -6, -17, -51, -159, 33, -153, 18, -27, -141, -25, -114, -82, 91, -113, -3, 242, -244, 119, -1, -90, -395, 121, -202, -10, -316, -131, 85, -110, -19, 442, -89, 20, 98, -84, -209, -265, 274, 26, 81, -417, -60, 191, -68, 70, 77, -173, 120, -59, 210, -207, -121, -154, -202, 126, -135, 123, -60, 7, -267, 60, -73, -39, 17, -166, 35, -241, -246, 114, 104, -115, 195, -132, -102, 28, -149, -106, -92, -198, 54, -179, 92, -14, 154, 30, 94, -4, -84, -223, -222, 0, -25, 140, -126, -233, 35, -208, -61, -11, 43, -63, -176, 18, 27, -92, 278, 54, -154, 107, 58, 73, -82, 231, 30, 160, -71, -236, 57, -8, 87, -29, -372, 87, 10, -181, -188, 293, 156, -20, 140, -130, -85, 66, -23, 97, 65, -72, 42, -63, 56, 173, -143, 134, 6, 17, 79, 157, -69, 343, -104, 223, 115, 0]
4933@k1o2K25j89Q6J55j10q3n9K6Q2m42J69L55J28j57j14n1P8J37k2j59o3M2J22
4958G3q0j03kJ3p7M3j80J79J63j99k3K14K70o0n16J20L45j91jj32r4M47j89m2
4982b2R2o3j45J43K6j46J01j50O7j46M24l72J24K0L4o3J42k4j17j59K41j24L8
5005g9M3J75l95j22M51R1j61r1j16M3L32R9j29q0J09k28j1J07k08m9K92O7k09
5028f9k6J68j57M3P8R0j96J55K25l11j16n3J78O7l3J06j35j49J97j31Q6Ro2J35
5052I9k48K71j24N0O7p5pm3Q1O7k70J89n6K26p1q9J17j05l83N07j27j13oK98k86
5077c1J53J4k11J31K9j09L02q6j2l17K82j66j01L67r8k31J03M3m8K10k82o8j60
5100b86M17l6j55K58l21J09k71L60n4n7M2n4MQ3J09q9k4j93L5K61j82j09L20j45
$$ y = [0, -21, -83, 142, -47, 39, 194, 84, 1, -58, -32, 50, -392, -223, 132, 260, 103, -11, -62, 16, 153, 131, -28, -91, -49, 73, -7, -110, -112, -99, -176, -133, -313, -134, 29, -170, -193, 21, 291, 231, -285, -165, 180, -11, -12, -144, -238, 209, 20, -22, 70, 7, -138, 5, 31, -115, -14, -164, -97, -243, 181, -191, -67, -47, -13, -76, 66, 42, -75, -234, 7, -117, -79, -36, 139, -256, -378, 73, 164, 3, -88, -204, -161, 171, 270, 141, 61, 170, -58, -69, 38, -170, -219, 73, 140, -69, -95, 73, -84, -41, 37, 127, -69, 86, 311, 0, -116, -169, 9, 76, 43, 149, 14, -135, 62, -69, 17, 26, -36, 99, -149, 122, -2, 48, 115, 40, 33, -10, 71, 138, -132, 57, 1, 227, 156, 67, 184, 79, -304, 203, 76, -37, -43, 255, -31, 122, 136, -75, 56, 85, -24, 278, 192, 180, -137, 145, -21, -122, 245, 147, -84, 19, 62, 14, 224, -58, -126, -286, 131, 95, -60, 198, -123, -14, -285, 75, 21, -36, 6, -48, -44, 39, 148, 59, 35, -158, -123, 138, -44, -153, 167, 22]
5124B2N5J10j81n4J41oJ08j97L1n5Q3k48l1L10Jm6p8kj40N26j09l60j9K4J38O4
5150H7k02K52M9L8j81j39LK4J51k27L9J31m6J8j78J76m6K04n2n1O6J30k20M3j37
5175f8J18j7J32J41j34q8k01J73k14l7J4J31k78M57k46Q9m1J27l55L19j73K65
5197A14M1k36J86j61R4o3J52m56K63Q9n5J6n0j6qJ37j6m9OO6k16j7K76J00l92
5222a95K77o8j30K08q8J69o8m3l22J36K35k0l9j64K90p2k21M3N9J9o4KK49j64
5246B9J48l7j30Ol4O0k88L58N1r7j10O2k8rOk34R9J80K83M1No03Q7ol4RJ96J20
5274A30k0p8J73J30j38m94J27K71j44J59O6j77k7J67k42K60k49K19j73PJ59m7
5296G9q6j49J52j12j3J87Q5r5j72L39L5r2j21K22k02p9J46k24K61l16L6M9L9M6
$$ y = [22, 77, 187, 6, -48, 93, 87, 195, -2, 29, -26, 57, -191, -222, 88, 89, 43, -35, -37, -177, 349, 240, -120, -139, -115, 23, 87, -115, 137, 186, 224, 43, -96, -93, -69, 82, -145, -106, 25, -21, -3, -181, -5, -51, 153, 101, 50, 116, 246, 26, 69, -68, 50, 33, 165, 306, 172, 84, -117, 56, -158, -195, -181, -50, -328, 129, -117, -28, -69, 58, -297, 22, -151, 114, 155, -81, 105, -56, 38, -25, 127, -329, -66, 23, -32, -16, -66, -82, -90, 47, 31, -18, -12, 54, -162, -179, 97, 197, -195, 82, 14, -116, 92, 4, 173, 105, 62, -260, -124, 111, 91, 52, -112, 178, 106, -115, -72, -13, 6, -58, -56, 193, 29, 177, 140, 10, 16, -18, 42, -246, 112, 163, 66, -44, 18, -10, -19, -13, -247, -148, 32, 315, 356, 361, -242, -155, -161, -195, -186, 10, 130, 110, 32, 205, 335, 197, -297, -170, 101, -43, 116, 182, 5, -22, 145, -97, 163, -86, 133, -40, -33, 126, 79, -7, -156, -4, -116, -129, 58, 143, 48, -124, 215, 250, 158, 37, 259, 57, -22, 124, -100, 161, -155, -119, -70, -31, 15]
5320A5k7k78L20r4L57k49J9J06l22J90l3L30k42j85J90K21k17P7l75M31l33J22
5342B3rN2j17Q0j02Q3J05j2j92J95q5p6K1K48k46N8J07o9j20J52j49j21O7K33
5366A26q2O2p2RJ7j06J37j04k2J89j23k00K65L2l00K44k17J94j55j49L11J4m3
5389B7Q9j65o1J57k19K18P2k80P6j65N12l16O9m7L2q9K37J4m52L40j23j94JL61
5413I4n0L25m93J46p4J63k9j4j71K07R6k31J52p8m9K0J9j03j29L10P7k59l2K73
5437A70j78l4P9r2J59j28q5J44j23L35m6j80J6L7j09Q6j95K00J18r8o2j73K22
5460F3j44j77K29j69K04k34K18K20j76N2N7J8k9k53J42J17j19n2q4ml6L20r2k70
5484a99K72k60J34K12j17j91N1K34j02J49k61M6O5l3J88j28k63M4N1K19Q8m1l09
$$ y = [15, -12, -290, 30, -64, 293, 44, 63, 169, -153, 37, 4, 334, 92, -93, 97, 318, 101, 178, -197, 234, -99, 23, 14, 66, -51, 29, -73, 10, 115, 103, -89, 106, 21, -55, -34, 214, -32, 26, 133, 64, -56, 96, -53, -174, -107, 126, 44, 106, 34, 43, 60, -46, 91, -13, -35, 154, 31, -169, 96, 128, -172, 72, -145, 49, -106, -255, 56, 70, 27, 116, -49, -110, 47, -172, 46, 118, -162, -86, -251, 261, -55, 14, -33, -1, -90, 147, 161, -291, 49, -74, -268, -267, 94, 44, 369, -124, 22, -52, 111, 82, 68, -103, 104, 200, -31, 121, 43, -6, 14, 33, -70, -199, 111, 188, -71, -103, 170, -8, -42, 37, -55, 104, -24, -109, 35, -88, 247, 201, 21, 37, 74, -35, 51, -144, 56, 174, 76, 14, -159, 63, -81, -258, -29, -198, 6, -228, -10, 210, 34, 86, 143, 161, 132, -121, 21, 138, 19, -33, -117, -121, -157, 163, 71, -199, 73, -187, -53, 159, 42, -149, -98, 136, 34, 183, -78, -32, 33, 0, 188, 60, -203, -159, -108, 111, 199, 158, -151]
5507a51L55l63J19J09k21J07J50j29j7K0J15pj71j9P1LR1J4K5o4j86O4L3J7J98
5532A63k61K62r0J8k89K10j25L00l11j12L95j01PQ3j87M1k03J60J1K51m7rk87
5555a21K28j57L4J44r2N2j21o3QM8J85k07J8R3QJ16j71J30j91J60m1J38nj16R1
5580A68j05j12l2K7K48k50J2N9J20j03J59m52L63k23L43k90n4N8J59L0k00j52
5602b27N8O1j10K53j04M4j9l6R6J7j55L35l80K03j63J82k10J08N6j63K51J46p0
5625A73m28J70K70l45J51P2o0p9J93k3l07K12QL7p2J65j38q0j35K44J08l18L84
5648B02j43J8k54l3K61j0j40O0P1k53K89j68R0j22K77k47N6j37J49K2J61k46P5
5671b2j54K78qj47J28j25N5%k2J7J19n6q1J3j5K38j81R7k81p0L89r6m0m8nk2j33
$$ y = [-151, 204, -159, -40, 69, -152, -45, 105, -24, -41, -21, 94, 87, -84, -103, -32, -29, 62, 76, 101, 37, -149, -85, -52, -35, 163, -98, 164, 74, 92, -197, 13, -112, 188, -123, -235, 160, 59, 66, 149, -38, 3, -200, -40, -29, 222, 175, 166, -121, 107, -50, -16, 128, 36, 88, -33, -96, -88, -40, 145, -62, -44, 49, 57, 173, 2, 132, -59, 101, 60, 198, 193, 77, 168, 63, -49, -81, -54, 194, -56, -44, 15, 135, 32, 191, -261, 102, -121, 222, -68, -122, -64, 95, 125, -75, -227, -169, -108, -218, 35, -69, -25, -44, -80, 16, 33, -122, 213, -167, 36, -127, 55, -155, -47, 9, -154, 97, 243, 173, -255, -85, 185, -160, -9, 63, 3, -76, 117, 94, -213, -1, 7, 44, -28, 137, -1, -81, -216, 28, 136, -182, 202, 59, 77, -177, -210, 51, 41, -99, -39, 32, -221, 68, -100, -10, -132, 145, -102, -46, -183, -34, -12, 149, -97, -22, -176, 102, 94, -53, 75, -50, 5, 5, -17, 0, 119, 63, -18, -5, -20, 218, 37, 134, -147, -217, 172, 76, 36, -12, -17, -39, -172]
5698a72J62p4J06J70j39n9L2k01J58k2j80J66j8L8K50j29j69Q4R2k21K27l29K38
5721A0j66K09j10M4J48k31J52J5r7j77K30J1j12J35j28n5N18l19N8k31K89k85
5743i2J81J6j57nNM7J45k34J04j72L03OJl52J64J13k27j06K31J03j25J20k22j9
5767a72K52q4l32M74k73qR4K76k53k42L10o1M9J24k16J07j19K9K60l18K21j44
5789b6k33M08O3k47r3J54r4L16k81K52m22J21J04j60R0J62j02k17P7P0p7P0L1
5812c4M0J3K7j08n0l4j34M04J11k01k62M07j48k8l04K43o4n2o1K46J32k82Q2K64
5836B07j92j13J8P3j08J66k90J23K14p7L0m54N45k89Q5J92k59L35k29K13j7p9
5858I4l1j79K85P7m65M02j70o1J53l8O6L8L8%l35l8J06J89k91L51k66J44k79K93
$$ y = [-172, -10, -84, 22, 192, 53, -6, 26, -175, -17, -39, -219, -53, -71, -33, 217, 88, -81, 3, 95, -126, 101, -228, 10, -156, 53, -57, -13, 135, -96, 56, 71, -26, -203, 27, 38, -74, 61, -67, -122, 396, 77, 135, -96, 193, -92, 89, 105, -52, -57, -52, -5, 140, -94, 10, -162, 141, 147, 148, -204, -40, 73, -154, -260, -29, 74, -51, 69, -153, -172, 80, -4, -336, 138, -135, -143, -49, 227, -26, -268, 42, -19, 30, 154, -62, 45, -74, -45, 215, -103, 118, -26, -259, 149, 212, -35, -128, 26, -68, 248, -33, 219, -203, -82, 22, -138, -48, 114, 12, -205, -128, -58, -135, -65, -34, 6, 19, 46, -62, -112, -146, -280, 124, 235, 34, -228, 179, 31, 3, -301, -58, -122, -174, -235, 11, 143, -139, -57, 207, 15, -98, -80, -7, -115, 51, -239, -116, 98, 21, 51, -403, 142, -147, -62, 130, -129, 206, -23, 190, 173, 94, 63, -116, 169, 246, -219, 183, 13, -48, 105, 67, 133, 171, 209, 209, -126, -164, -58, 131, -160, 191, -75, 69, -210, 83]
5882H3LK7q3j82L72j35o7l1O0J11O1j91Q3P1k49J10j1m9k01p3M64l31K40K6j61
5907e3l5J12l3J51j21R0k22m6K31J06n0J17K4k13j16L83l24o4O1j36J00K7J04
5930I3Rk5k09K12%k12K58l32j1L38j20N2j16n7m2K8J92r5K91k77M1J52l52oJ19
5955f9P5J19l0k46K99J8q8P9j0rj47J68j39p0k09K30j1J51p3J2r3K17k86p8J92
5980BR3n4J91k87OJ85k83J74R0r5j25l0J66j07k70K89m0J36M8P7m30J69J13n2
6004c4j9KjK46k64J22j35J0J33n94L78k11K35J95j14J5N8K4N8j17K3J97j26Q0
6028A61k64M43k27j3j04r2pR4K93j39k07K7K40k42j13qP1K18j90K41k56j98M60
6051A88k71n8J15Mq7J99j99J69j63k76L96k4j16J20k9J70l89K06j87M28k78J13
$$ y = [83, 86, 113, 30, -152, 220, 85, 18, -13, 47, 158, 219, 28, 111, 182, -67, 43, 32, -17, -218, -291, 173, -158, 82, 108, -53, -88, 24, -9, 142, 21, 111, -111, -157, 74, 180, 130, 247, 271, 58, -58, 325, 1, -63, -2, -138, -38, -11, 93, 102, 77, -132, 80, 80, -132, 126, -206, -217, 121, 1, 53, -63, -120, -162, -134, 58, -37, 254, -23, 18, 170, -182, -188, -69, 6, 125, 95, -151, 148, 166, 78, 157, 147, 138, -9, 159, 20, -50, -259, -29, -40, 111, 38, 50, -43, 174, -112, -190, 2, 95, 41, 232, -55, -49, 136, -147, 27, 117, 22, -103, -133, 33, -74, -344, -55, -95, 41, 89, 166, -264, -95, 18, -34, -53, -51, -52, 194, -70, 52, -83, -73, 60, -534, -156, -367, -132, 63, -51, -36, 22, 46, 104, -13, 10, 207, 81, 161, -103, 340, 113, 100, -4, -96, -103, -9, 284, 145, -62, -35, 205, -37, -150, -158, -87, 131, -59, 182, -74, -272, 188, -83, -141, -26, -22, -109, 90, -109, 60, -103, -379, 17, -7, -123, -3, -32, 138, -251, -45, -232, 196, -82, 31]
6073C1K30l84P1J46Rj19j08O9r1J29j77L08j49k08k1J09kK25j02R7o6j90L45k29
6097g7k94K82K56l24M4n0Q8Oj42J90M1j13L4j2q5J23J35k15j37K30m3Q3O5r1J14
6122A08k51J85j02L10k05ROr6l4Nj65J39K69j44P7j75P5J23j20j64L5J02j0Q5
6146F2J88m04K87Q6n8j67l9L4N0j68J52j77J15l4O8l5P8q9j0k0J95j08Rj72J39
6171a8R3j55J90j29J76J6j40j61J94K9k54j4J51k2J10j61j75L96J25k41P3j45
6193f2O3q9p5K11k23L95n5j37q3K44m48L05K9j13J44J20k31N4j07J28k79L47j08
6216C0rj97K41J35k6k39N0M9j88L97l04R5M5q0QR4j2J75m66R3K24Jm59K62J74
6241I3j35J22k86L39j93L12l87M0o7K05q9l10K74Q2J86j96J70j59P0m8J32k26
$$ y = [31, 261, -123, -52, 94, 103, -16, -124, -55, -146, -17, -194, 114, -35, -243, -264, -155, -157, 68, -34, 63, -3, -193, 152, -77, -371, -89, 167, -157, -113, -163, -75, -69, -211, -21, 20, -93, -59, -71, -156, -33, 102, -113, -250, -20, -63, 20, 85, -6, 108, -143, 42, -60, 250, 45, 54, 60, -36, -70, -65, -230, -91, 178, 34, 111, -64, 11, 134, 14, -150, -115, -13, -23, 62, 250, -154, 133, 219, 161, -6, -45, -11, 39, -129, 23, -154, -39, -73, -5, -40, 38, -51, -61, -81, 114, 6, 15, -157, -18, 75, -80, 110, -19, 157, 173, 33, -128, 66, 95, -159, -173, -22, -44, 66, -95, -270, 126, 251, 10, 83, -62, 1, -88, -163, 48, -175, 220, 165, 28, -55, 189, -259, 46, 75, -38, 106, 226, -5, 49, -58, 70, -209, 138, 30, 21, -176, 65, 200, 174, -65, -15, 34, -154, 243, -61, 34, 79, -1, 7, 101, 89, 264, -202, -109, 115, 116, -343, -81, 93, -42, 80, -206, 133, -60, 252, -135, -95, -162, 43, -46, -356, -82, 0, 186, -10, 160, 1, 71, 23, 155, -71]
6263g1J30J90j89n1k8o5ko9K50ln4K1n9j50R5q9o0Q3J97j6j20qj01J24m2K77l2
6290A58j74J4L9k6L7m6O9n8o6K26J29m75O2L2p9K19k21J82j80J68N8J05j17j22
6314f6m8J48j17L08k02l8p6M0K1M9Q4j42m3K48o1K42l29J05k7n4Mm2K66l98o3
6339a91J91j6J35q5nL0n2K2p4J02k10J82l27J26K21J25jj77J0J5Q8k02j44K90
6363E3oj78J7J16q0J85j84K58j83m5Q7l4j60K97j33L52j67M0k92m0j79K72o0N5
6387il3J31r1O0K18k51j38K79J13Pl96K37o4J57k53K52Ok10j27J2L28k15k6j23
6411a36KJ8K11M6m1j35k6N6q5p5K37l5J19O4j23j1o6J39j30L73m12Q0Kj27J39
6436H4j56K94j85J45k71M50m23j45L63q5k85K50j53J85P1R8j62n4J32J12l19o4
$$ y = [-71, 59, 249, 60, 9, -19, -84, -86, -155, 95, 92, 38, 59, 0, -150, -55, -144, -204, -121, 76, 60, -60, -68, -169, -45, -87, 190, 158, -16, -2, 37, 11, 48, 2, 71, 13, -53, 173, 302, -173, -111, -79, -158, 61, -160, 22, -158, 10, 68, 173, 56, -66, -114, 34, -83, 225, 23, -15, -91, -51, -30, 19, 103, -39, -82, 166, 105, 347, 18, 123, 96, 42, 46, 4, 270, -128, -191, 0, -16, 119, 34, 29, 59, 7, 29, -45, 57, -153, 29, -298, -172, 49, 174, 173, -4, 6, 21, 109, -93, -237, 53, 47, -131, -114, 2, -78, 107, -77, 181, -2, -47, 40, 6, -154, 143, 10, 362, 195, 235, -57, -97, -276, -4, -64, -9, -42, 89, -2, 58, 276, 25, -113, 166, 279, 286, -110, 127, 63, 220, -33, 219, 225, 15, -112, -100, 228, 13, -13, -136, -134, -116, 95, 141, 100, -35, -61, -5, -90, -165, 72, 37, 156, 220, 97, 86, 20, 159, 29, 402, -10, 70, 72, -55, 84, -72, 222, 37, 182, -89, 361, -62, -207, 156, 71, -214, 36, -117, 68, 139, 237, 75, 21, 153, 265, -54, -118]
6458a18J89j61M3L04j18k62K01k78K06k24L16j19K0J40j93q8QM51m78L91k68j87
6480b25K75r3L6j74J63J15j45q6N2L7O1j45J5K89k7j43o4L96m32K39k28K35m11
6503b60K69j21Q8J46j81L9k5K21n43L15k1K2J45j58K73k33K4p5R6J04j80j00K81
6526A26k95J87o5j05J74K7j74jJ49n7K84l27J04J13n1j00J33k07J19J47j23r5
6548c7J37Q2l54K18n7n6K66J9j57j79L86j95j44O0Q1n6j99L49j29p0L8J08L4k07
6572f2J71j39P4r2k15J05J77j6j16M6J0O5J75o4l5p9k61L59k02Q7j20n4L1J04
6596e1m9J79p8j87o0L92j57j38m5R3J48j3P5j04K3j8M6n5K6j10K38j4q7l64J62
6621a48K33o5j73L14k36n6K18Lk79O1J89lK24l69r5L01j79K75o2M0k75J05j36
$$ y = [-118, 71, -90, -47, 257, 139, -123, 78, -200, 6, -218, 98, -21, -1, 139, -54, -142, -134, 317, -161, 230, -38, -225, 50, -43, -7, -181, -18, 97, -48, -134, -82, -45, 16, -129, -114, 175, 148, 5, -59, 337, -95, 144, -84, 151, -260, 9, -112, -24, 122, -59, -20, -45, 176, -367, -52, -73, -51, 94, -64, 209, -24, 0, -75, 21, 125, -55, -155, 126, -169, 18, -47, -152, 22, 49, -125, -126, 23, -34, 250, -77, 27, 140, 89, -11, 122, -85, 34, 181, 58, -37, 100, 182, -172, 46, -11, -67, 199, 218, 61, -118, 268, 73, -71, -11, 70, 14, -185, 164, 35, -35, 3, 111, 145, -62, 109, -30, 44, -48, -263, -158, 19, 3, -113, -67, -57, 8, 183, 119, 84, 5, -256, 103, -99, -12, -132, -186, -155, -51, -100, 79, 1, -186, -246, 146, -11, -149, -194, -101, 47, 34, 109, 5, 28, 10, 56, 1, 27, -83, 155, 141, 54, -310, -148, 85, 20, -153, 161, -75, -131, 87, 90, -189, -128, 61, 58, 282, -87, -182, 119, -60, 215, 153, 193, -82, 23, -113]
6644a13M2J82q6J5N2M9j66q4L8K09K3o6l80O27l12Lo8k34K03O3P9R1j04j47n2
6669a36Q0K03k6p4J6k07J42M1k6QP0L8j07J02R4k48J9m2J72j43J14j29J1j11K21
6694H2k26l0K59k46J50k55K8K24r3K80l52l3K77j06j1K92l39n7J81L3k59M49k14
6717C4l3N5J64l55J91J27j65Q4j87J14Q2p0J91l4j45k43R8j18L17J12j15P2p6
6740A00j18K21J5k41J05P6k46mn0K56j60n2PO3J67k08j86K18N1L05r4l27r2K09
6764A5P3j51J57j76j5O5M60m36k56M20o2j89K20J1j21k02K8L07o2Mj06k3R2n4
6788aJ22j81K30j92j67K72N9k64J82Mj13j3P9k8J5K48j09j43J76m07R2J00J06
6811F7k23K50P1k88Q5m2o6KJ6Q9K38j31k41L83o32M08pQ1K09j80P7l00k2J16K3
$$ y = [-113, -71, 111, 25, 40, 92, 141, -25, -109, -71, 138, 161, 95, -285, 342, 30, 33, -35, -269, -66, -3, 76, 167, 63, -84, -136, -56, 147, 121, 47, 63, -144, -2, 39, 13, 21, 91, 129, 22, 124, 218, -30, -11, -53, 119, -24, 90, -39, -28, -139, 82, -144, -174, 85, -161, -11, -266, -238, -14, -107, 173, -179, -212, 65, -41, -52, 240, -99, -156, 25, 58, -201, 248, 34, 1, 56, 220, -135, 56, 183, 18, 102, -85, 29, 111, 41, 232, 198, 53, -190, -92, -210, 107, 219, 104, 176, 100, -18, 203, 218, -23, 82, 158, -88, -92, -142, 114, -46, -98, -91, -28, 139, -69, -255, -37, 14, 319, 225, -102, -194, 15, 88, -63, 94, -82, -97, -32, 428, -8, -264, 156, 94, -95, 125, 136, 15, -187, -159, 148, 86, 90, -16, -39, 53, -1, 121, -60, 170, -22, -189, 83, 142, -122, 60, 64, -49, -62, 17, -11, 4, 252, 143, 0, 176, -231, -139, -39, 67, -156, 94, 165, -123, -38, -80, -146, -144, -128, -39, 199, 68, -173, 210, -422, -14, -21, 60, 269, 89, 166, -134, -156, -40, -17]
6836a7J93j87Q9k37Q1M8K56m5k24r6R3j59L16k09N4K19k02kN9k11lJ49J85k31
6860h1j42M68j78O3k89K34mk01q2K97J01k19o2K29N1P9k03J82k04j73rJ52o1J09
6884E7p0J43O9j42L4l1K27l41p9J61J62l00J21J22N2J7j39j22J41J4j75P6j02
6907a05rL1J12j15J30j38j33J19J42q2j06P2k7K46j63p4K3J61j01K26l87K24L94
6930D40l04Nk54K55KK2k87J98Q9j18j70K84k71K97q7j30L2J7J8J60k38J98oj13
6954C9q9J55mj00j00L81l33R0k6p1R8J92k70O3K1j29L1j83r0M05J06j92M1j21
6978h6N3j05Mr0K94J7p3L7o7K46m0p7K1p6m43M89j55O5R7j16j66K52j03q3L52
7003B47m80L0J94N7Q2k67m2J24k64J69J85Q2j84P0j19O0N9L3k06K41L0k7r8L6
$$ y = [-17, 176, -11, 78, -159, -78, -30, 226, 181, -43, -139, -46, -205, 111, -98, -44, 175, -27, -29, 30, -181, -184, -35, 150, -81, -223, 245, 67, 130, -159, 75, 71, -130, -212, 85, 186, -33, -95, 134, 185, 264, 61, 243, 39, -134, -143, 9, -52, 57, -13, 130, 199, 57, 91, 60, 287, -54, -133, 28, 190, -110, 11, 133, 185, 202, 63, -59, 82, 96, -79, -3, -105, -114, -83, 29, -86, 44, -94, -227, -108, 34, -48, -154, -82, -109, 137, -26, -100, -77, 84, -17, 209, -178, 46, 440, 136, 141, -113, 142, 144, 166, -121, 77, 166, 48, -122, 162, -109, 188, 101, -29, 3, 20, 38, 198, -40, 158, 152, 39, -50, 105, 101, 1, -99, 282, -51, 39, 13, -58, 40, 232, -38, 25, 46, -83, -52, -235, -325, 80, 186, -6, 35, -86, -33, -138, -134, -224, 70, 87, 14, 51, -16, 230, 190, 113, 134, 58, -385, 104, -51, 14, 111, -5, -171, 81, -22, -105, 247, -233, -203, -9, 48, 130, -137, -179, -55, -319, -150, 35, 117, -67, 3, -116, -56, 3, 36, -170, 71, 101, 74, -24, 12]
7027A2K5Q0k33K35l13J50j37K00R1K0j65P4l7j27K55P6k24r5J72j15k0l5J4K57
7051A60j16jp0j8j21M33k72j13M8j56J29K65j89NK10m55O06l74k27K47RmJ06o6
7075C6q7L3P8r2J0k59K71Qj10J20R4l9j8j94R0L79m71K27j71l5L2J62k01K70l13
7100a80K30j9OpR9j70Q4J39j65k41K30kR8j49M6R6j3N6j64L06k07ok65K95m1M1
7126I7k07J53N3j83K55o2l37J71q4J11J44k00k5r2J40J19N5j29P3o9L2R1J6l1
7150I1j63J05Q4j32J69j65O4j28m1J85l5J42j92J07j0oK17p5j22K51m60Q0L03
7173B69j29o0k26J24L4J7j71R3K69k14l4J99k49rJ11r9R5j35L73k38N4l68L14
7196B0j17m1K48k46J63k25K32J51N0j94j82K09j69n5L68m0R1k17L22l36J63j64
$$ y = [12, 37, 117, -116, 119, -194, -44, -181, 19, 110, 130, -35, 39, 2, -125, 130, 206, -18, -113, 59, -56, -76, -111, -97, 160, 44, 43, -27, -45, -166, 267, -5, -118, -70, -226, -97, 168, -21, -16, 194, -261, 345, -29, -256, -9, 0, -4, 102, 36, -51, -18, 60, -32, -22, -281, -10, -2, -112, 8, 102, 63, 45, -149, -59, 320, -151, 76, -95, -130, -98, 64, -137, 133, -180, 50, 31, 37, 30, 129, -41, 43, 182, 17, -224, 6, 4, 102, -47, -1, 95, 82, 138, -26, 280, 73, 67, -198, 97, 56, 97, -110, 43, 96, -87, 168, 106, -231, -60, -144, -33, 111, -89, -114, -206, -66, 53, 108, -21, 52, -17, 15, 106, 122, 91, -72, 33, 117, -15, 154, -11, 53, -75, -116, 69, 34, 176, -16, 91, 81, 75, 292, 217, 95, 346, -114, -34, 269, 140, 80, -146, -22, 12, 29, -142, -49, 220, 6, -28, 171, -78, -87, 24, -75, 20, -115, 258, 20, 74, -294, 20, -97, -138, 110, -136, 27, -198, 34, 185, 235, 41, -141, 68, -101, -156, 212, 172, 263, 46, 368, 32, 195, 31]
7218C1r9K1L1Pm4M3j4P2k19L37K8k78qQ2J04J1j31J00O1o5q2L5k23Q4Q7j63L10
7245A18j69o6K21r4l1L00q5l70L70r5j83J29qj07J84q0r2L18j09ql54L67ok16
7269f6J60k09J69pJ25l7l20M70k60r3q9J24M3RM0k77K96j8Q7k69J8o9J19M0n3
7294f7K05j9l66K97jj62K92k17M2RL6J35j39k3q8J78j66Q1k05K25k58N3K55K4
7318A21n0o0J12l17N31l08q5Q7p4k30M01M3j77j81M05j29j31j30K61j68K34k02
7340d7N9O5r6k6O1K2J28j29k0j02J3J84l61K20J99K1j80N5l8q9k7K5J61mp7k9
7366a2M0K3k8j90K12o7J95P2l73K49j87j94J75J07J43k34K7P4j50M9J44k3k23
7389a71N8K40j91mJ45k88K96l07M7O6K16k70RK1K45j0j51J99k86Q7K34n7j14l1
$$ y = [31, -68, -47, -16, -9, -53, -10, -24, 48, -171, 166, 194, -84, -92, -10, 94, 105, -26, 74, 135, 70, -12, 23, -200, -116, -29, -192, 118, -51, -117, 104, 10, -21, 279, 194, -176, 194, 99, -84, 45, 37, -70, 114, 34, -58, 260, 151, 143, -211, 156, 150, -66, 94, -115, 54, 47, 172, 135, -185, 285, 25, -68, -157, -33, 10, 19, 59, -218, 78, 60, 147, -122, -104, -173, -54, -14, -67, 138, 119, -247, 50, 49, -113, 179, -38, 4, 13, 49, 184, 45, 22, -66, 112, -54, 27, -178, 47, -211, -158, 97, 121, 71, 11, 123, -194, 337, 29, -56, 31, -43, -273, 128, 171, -6, -187, 218, 89, -42, -172, 89, -79, 155, -47, 12, 77, -19, -45, 16, 38, 166, 37, 17, -85, -72, 112, -249, -29, 170, 191, 11, 66, 28, -61, -88, -63, 98, 94, 17, -12, 28, 51, 23, -167, 45, -22, 173, 245, -128, 121, -66, -260, -85, 22, 165, -69, -42, 32, -118, -69, 75, 52, -171, -113, 127, -64, -68, 77, -211, 85, -222, -175, -109, 107, -163, -154, -133, 112, 102, -49, 150, -136, -49, 185, 128, 14, -17]
7413a7r9K25k7J15k49j00J90q6j39M21j53n9J24P3l09K2J27N4k65K4J84J3L8k16
7437a09K61o9k20J12M8k1Q9j36O1J80k41q1L07l20N8p0K6K22j78K39l58J88j40
7460a52K35M7l17L20J38k50l9j5J30k6j69q0K27j50J93k31J36P1N3K9K6r4OQ4
7484A72qq9P5j47L00k39PJ07l46L23K2j11k69K28q0j39O3J0J68l08J10K60l30
7507b21K57r1qJ23p6j2l4q2K81P6n6m0l09N25j18j80o8J86l64J64k56P7K74J86
7531B34m26L54m9K1j9l28PK98K19l76n8J99j84R2R8j7j17p5J35N0j24J58n5P1
7555A08j83j68K95m75M45K69m45J91j89j1L37k77l5J57j07Q5k02J39K90kk9j79
7577A4k32l6M16M9k59koj3L6J11o9k2J93J13Q6l44l62L58K7k13J52J30r4L3j60
$$ y = [-17, -116, 109, 82, 197, -52, -152, 38, -48, -187, 234, 81, 22, 146, 219, -90, -68, 59, 113, -152, -128, 56, 69, 107, -109, 152, 83, -137, -25, 23, 2, 91, -45, 16, 196, -45, -126, 181, -139, -81, -151, -125, 97, -81, 158, -200, -12, -152, 83, 130, -187, 133, 271, 21, -18, -33, 97, 71, -98, -178, 49, -101, 92, -139, -3, 68, 121, 150, 176, 82, 88, 172, 164, 75, 150, 3, 303, 64, 71, 178, -168, 155, 177, 66, -203, 25, -55, -194, -131, -121, 47, -261, -151, 109, -221, 36, -55, -63, 60, -16, -28, -62, -144, 137, 213, 157, 117, -192, 333, 215, 35, -33, 153, -211, -47, -303, -226, 48, 234, -192, 162, 113, 134, 115, -213, -206, 92, 311, -65, -123, 76, -108, -16, 82, 65, -52, -127, 8, 58, -66, 92, 37, 108, -75, -243, 52, -423, 22, 291, -154, 37, -152, -163, 174, -103, -138, 19, -88, -3, -205, -66, 224, 222, 193, 14, -218, -254, 162, 211, -48, -50, -56, -69, -33, 78, 9, -13, 180, 293, 379, 35, -327, 31, 58, -155, -3, 127, 33, 66, -94]
7602i4m6J92k38ON2J24K87m19J07J54j9k51R8Rj0J21o8R4Q7l09K65j54k9J13j46
7627g4J83N3j41P2M7l67K67L18l67R7J65p0k32k45L26J50l68J84l10L44n1j15
7649a34N6J5J68k95K43k50K90j56R5j27K6J6K07k60J94k15J2K45j2m6k7l6m2O4
7673C1n1m6J89N9q6j86J91l03K17J86k50j46K80O5j28p1j73K22rj93M18k48K66
7696B34q8r5J13r8l77K27j46PJ91nK00q1K5l08J06K7Q2j51Q7o2k7J39O1M9j14
7721dM5k05R1J06J03K6j4k26J61J44l22J00J77l22N3l6L0N3L4K7n7K82k47j6J47
7746A30k67J43n8J01k23l9K90o4J0j63j43L77k09J08j3K33k52j37J50j22L61k51
7768c8L5j48J92N5j13j69K92k04J07J78N6m41L81m08J02K58j53J08l26M8K40j98
$$ y = [-94, -140, 52, -186, -180, -128, -4, 283, -136, -29, 125, 106, -145, -47, -38, -48, 73, 5, 99, 186, -123, 142, -12, -41, 72, -74, 109, 162, 21, 93, 140, -227, 40, 358, -9, 88, 253, 183, -49, -294, 32, 182, -186, -2, -312, 32, -19, -134, -78, -63, 105, -190, 53, -197, 93, -63, 32, -95, -69, -53, 154, -106, 88, -127, -115, 130, 118, 72, 45, 9, -33, 31, -20, -66, 123, 182, 96, -90, 101, -202, 15, 201, -49, -195, 85, 150, 22, -49, -222, 0, -9, -202, 216, -32, 234, 146, 51, 164, 66, -311, -84, -230, -223, -32, -37, 163, 82, 107, -201, -95, -68, 14, -137, -50, -112, -139, 0, 61, 110, -4, 41, -164, -73, 33, 136, 162, 148, -78, 83, 227, -95, 5, 182, -140, -87, -123, -93, -40, -6, 21, -36, 246, -1, -17, 130, -137, 6, -52, 49, -174, -213, 77, 13, 23, -140, -283, 94, -115, -7, -20, 213, -39, -176, -26, -148, 213, -38, -3, -151, 41, 96, -17, -186, 106, -98, 9, 187, 243, -198, 183, -225, -123, 135, -18, 90, -236, -188, 52, -146]
7790a46K75j15j66L26j84l1j3J99j99l7J72o9R4o5r6K66l23l8L10k68J26P9p1
7813B6J51j98R2l09L19r0Lk67M05o0oP8l43Q5L01j48K18k10q5k78K52J28j62R8
7837@r3j1J05P7j65Q6l55L37k8K73j87Q4k30N4L75j91n1K7m1l02L35k22k6j1Q8
7862g2p6N54l60L3j01o1O4J00Q1k50K00l39J81m1J13k71K11j1K90k30K91m71L00
7885A35J05m09J17J6l5Q4l43L42j3j19J74J61j34n8J24j71J09N1j23o3J15N7k32
7908a10lJ31j96J59m3K23p9J41k05r4oJ56L5j88j06OR7R9j77J51K5Pj16r3J62
7933b4J19k37J49pJ17p8k05J57j20J43j73j6M6J73J24J27k68R5l26L04k07rm1
7956a57K75K28j89l03J39J43l04L82j79k10N4J95LL2Qj73L2K6o5J2N3J72j54k40
$$ y = [-146, 129, 14, -152, 174, -10, -41, -54, 145, -54, -91, 81, 12, 106, 41, -55, 211, -112, -150, 160, -108, 18, 97, 26, 177, -21, 71, -238, 81, -9, -6, -273, 132, 72, 66, 144, -199, -114, 187, 39, 257, 47, -38, -316, -64, 64, -98, 0, -93, -104, 1, 78, -87, -1, -356, -19, -47, 226, 39, 123, -107, -53, 322, 131, 80, 107, 66, -236, 99, -123, -149, -160, -72, -148, 406, 46, 79, -22, -83, -19, 81, 162, -88, 112, -227, -46, -87, 26, -245, -34, -45, 245, 15, 306, -165, 135, 240, -169, -52, -36, -71, 13, -330, 12, -1, -120, 54, 215, 81, 23, 147, -24, 85, 136, 13, -50, 65, 122, -110, -113, 18, -178, -19, -62, 161, 82, 223, 18, -76, -82, 74, 109, -79, -185, -179, -82, 17, -160, -9, 16, 23, -93, -186, -24, 95, -142, 7, 0, 117, 39, -166, -9, -129, 14, -159, -175, -129, 44, 168, 295, 27, 122, -204, 100, -107, -116, -157, 118, 346, 157, -146, -7, 136, -168, 214, 35, -175, -121, 74, 77, 109, 117, -56, -24, 2, -63, -51, 2, 174, 20, -220]
7980b20J32L51m53J32K49l6k00o5L39j71j76J88j30L6k34J84R7O5N0l53Q1j3Q1
8003f6J13j69j26K08J23r7k00J72n2J99J91m76Q9J12k49L42j42L0Q2Q6j02j56
8025h8o0J22K4qK19k30rj06J17j96M10j06j15j88L82j76j60J88K8k37J46K9j65
8048a79R3j07M03k23j08J97K2m01M42Q6k66k23K88K26K5l20J39m2J65m3l49J10
8070f5J29p4k45J42J18k85J96J31o2k36K93o9k03L13m1m8K78l78K87j42l33N7
8092b37K08l9P6M7j63K67O6m8j89M8N7k52L19n25J68K91j80lJ0mR7m3K5j74n6
8117b34L31P7k04q6P7J17O0k04j14K19N6q4k29K17l2L0J50R%l66K22q3M2J07k37
8142a59K05Q0l22M22j87J93k83o6o4n5O8K69k32J69k62L42J13l19J8O5J84J59
$$ y = [-220, -88, 263, -190, -58, 191, 155, -45, -110, 229, 58, -118, 70, -60, -24, -258, -74, 23, 88, 138, -215, -134, -147, -66, 47, -122, -248, -40, 83, -14, -214, -42, -94, 105, 296, -180, -91, 21, -228, 114, -28, 2, 84, 170, 68, -88, -148, -26, -2, -10, 209, -21, -30, -136, -19, -215, 195, 89, -26, -214, 168, -8, -168, 20, 48, -189, -43, -14, -179, -86, -193, 210, -13, -121, 76, 98, -303, 139, 225, -41, -264, 24, 250, 275, -45, 94, 52, 217, 174, -175, -65, 64, -10, -255, -113, 5, -280, -84, 47, -15, -251, 42, -27, -230, 83, 42, -6, 272, -106, 181, 39, -294, -237, -29, -68, 8, 55, -108, 159, 225, 177, -12, 36, 93, -159, 160, -365, -197, 94, -86, -89, -79, -83, 14, -29, -4, -178, -234, 97, 174, -30, -116, -39, 78, 138, -66, -180, 39, 95, 11, -218, -1, -33, -3, 147, 156, 156, -210, 12, -71, -29, 78, -159, 46, 126, -196, 226, 39, 232, -51, -117, -181, -236, -168, 101, -131, 38, -224, 118, 231, -88, -70, -5, 179, 338]
8164C38k00m0R2J5O5k32J17l1K7K78q68K53K37j37J58L06n27J18l4J15n1n7J39
8187H1k17J10k8J63
$$ y = [338, 138, 98, 190, 205, 270, 38, 155, 124, 151, 429, -439, -186, 51, -86, 72, 378, -149, -31, -65, 50, -1, -58, 81, -136, -26, -54, 109]
8191A09
$$ Imaginary data points
##PAGE= N=2
##DATA TABLE= (X++(I..I)), XYDATA
0@%%%%%%%%%%%%%%%%%qJ6j6J6j6J6k4L2l2M0m8N3o1O9p7Q8j03J16j28J44j62J80
39I5k01K23k47K75l06L38l71M10m53M98n48O05o68P34q09Q95r93J102j226J373
59G26j546J753k008K329k746L319m153N483p938J3928n4886p5753J09684P5005
73F3197K4381J9342j4829o3722j5824L1314L0867K1592m133p4600n9728K3595
85a8548L2694j834k679k9147m3086l409L0338J9652R955N492k5208m3010J1716
98e7074M9391J6260n584j281l706P550J3774k109o445R647p29k6041L217L5745
112C2615q122k8134P914Q978l671M196j0204k0575P458K1830j982n705R641j1396
126B843k8627L758J8251J0017Q880j7498l1174P644K9655P306p443k236r858k3002
$$ y = [0, 0, 0, 0, 0, 0, 0, 0, 0, 0, 0, 0, 0, 0, 0, 0, 0, 0, -8, 8, -8, 8, -8, 8, -16, 16, -16, 24, -24, 29, -32, 37, -40, 48, -55, 61, -67, 77, -85, 95, -106, 117, -130, 145, -161, 177, -194, 216, -237, 261, -287, 318, -350, 384, -425, 470, -523, 579, -647, 726, -820, 933, -1075, 1254, -1492, 1827, -2326, 3157, -4781, 9147, -45739, -121492, -11808, 63197, 87578, 106920, 92091, 28369, 12545, 43859, 74726, 96318, 92185, 17585, -42143, -18548, 14146, 12312, 9633, -19514, -62600, -66009, -35671, -16019, -6064, -572, -25780, -68790, -57074, -7683, 8577, 2993, 1712, -1994, 5556, 19330, 17221, 10776, 20423, 19694, -6347, -3130, 32615, 24493, -3641, 4273, 13251, 9580, 13776, 3572, -17003, -9545, 12285, 10303, 4598, 14239, 2843, -25784, -22026, -3775, 6242, 15122, -2376, -33550, -25906, 3749, 11055, 3612, 1376, -8482, -31484]
140c1484J74K8932K3557O632j7757l1302p86K6042J3711j011k003o319j9305p745
154a8664K3883K4733L172j2661k7809j4601K0115J9867n42o455o940j6277j5680
167b7859Q827K1071O782n997j9155j7292J3695K1535J576K93K716q302j3816l27
181a6253J7306J5176J475j1196j6365L006J6677K412r79N434k691j1611q096N839
195A34J2134K808q186j3064n816P432J915m581N764M488q230j1948j990J1484
209g656J0039m61n820l866N421M363n845L902J1382o41q466n226L397P107m57
224G173m628k846J252J243o916k634J2412O785n128o833k031M268J463k302K720
239C998L317j381r468j1306M203J1487R70o175o590j625J969L40O771R581J145
$$ y = [-31484, -31310, -2378, 21179, 27811, 10054, -21248, -22034, 4008, 17719, 16708, 14705, 8386, -10919, -18664, 5219, 29952, 33124, 20463, -7346, -21947, -1832, 18035, 17493, 11038, 4098, -12179, -27859, -19032, 2039, 8821, 2824, -16331, -33623, -19928, 1607, 3183, 3476, 6192, -2110, -15926, -16253, 1053, 16229, 17704, 6508, -9857, -6851, 9826, 12238, 11259, 16693, 14002, 2391, -5705, 134, 12268, 15076, 6890, -6174, -11990, -4558, -2643, -7224, -1460, 3028, -5202, -17150, -19140, -7656, 2383, 1922, -3898, -7764, -2343, 2020, -3825, 77, 11459, 10818, 2352, -2874, 523, 7630, 7173, 2545, -301, 951, 2194, -4722, -7356, 5056, 11841, 6713, -120, -2151, 2117, 3580, 1278, 3998, 7315, 5934, -3534, -14840, -10637, 850, 1820, -4355, -10945, -12570, -10601, -10261, -3490, 6091, 7236]
254G236r131j1124K776J8198J0087l762p429n774o23J352N602R699j90j2111j5215
269a0409n010J4988J4328m203j2234q665k446L035M922Q526K543r502j0517k186
283a6830J1770J6018j352j1836n046J271M647M132M548L276m903p851k053O612
297B403J0981m99j2225l938M534K891q4k655m08j077l532j071J461K936o80r296
313a0259j424J0510M285m093n914n11O311M386m18j648q21O99k809K63J0875M377
329A3809q760q779k566O604P847r07n229m782o37N02N91P189L700r885j0118l7
345a1458P706J0016N1q239m786J218K983O18K623M196n518p435K286P400O807
360H468L06q926m595L971M815K40o15K466j237o515K19L696J016j801p465l488
$$ y = [7236, -1895, -13019, -10243, 7955, 18042, 14280, 6851, 1077, 454, 1806, 7408, 17107, 16917, 4806, -10409, -15419, -431, 13897, 9694, -2540, -11205, -13651, -10616, -5694, 2832, 5375, -4127, -14644, -16830, -5060, 10958, 9606, -2230, -7276, -6005, -1358, 2774, 7322, 10598, 5695, -2156, -4209, 2403, 13384, 12885, 660, -3278, 1256, 4147, 4063, 1408, 1000, -77, -3609, -4680, -3219, -283, -963, -10259, -11683, -1173, 3112, -981, -6895, -7406, -1095, 3291, 2873, 1225, 404, 1103, -1706, -1443, 9432, 13809, 5049, -3730, -6296, 308, 8155, 7248, 2019, -2763, -3400, -2898, -2307, 4882, 8582, -1303, -11421, -11458, -3752, 6264, 6315, -1924, -6710, -5492, -2509, -1891, 732, 4928, -590, -8025, -5739, 1661, 8468, 8774, -152, -4747, -776, 4039, 4279, 3664, 6130, 4893, -1622, -1403, 2293, 3309, 1508, -5957, -9445]
376i445O452N487k887m958J26L632j043l05L890L11n52j696j294N887N201m533
392D273o692n79M547K604k041K79o60k742k88k65K696M664m955q044j99O602N029
409D229j944l060j441q69J276Q32O07L286j878n965O74O999M087l233n616j327
425c343J912K276J550k27Q16om812q37N517K840k640o418j801M624K475l05k672
442a051k970J31o11J00N356L240k815n092p55O285N296j043l787l378N77J201
458F84j503J678K570l801n554k37N640N923r98m658l161O94L338M02l03J554k297
475b9m104o43L409N081n71n059j245K081L875J433j802L61O53k806k469J00K101
492C66l00m424m21L130K570N65l254j325L893R56k207J077J427k34j677L16K732
$$ y = [-9445, -2993, 2494, -393, -5351, -5225, -1593, -2636, -2941, 949, 1260, 708, -988, -2282, 3605, 8806, 4273, -2419, -2998, 1549, 4153, 2112, 2391, 1731, -1011, -1299, -1564, 1132, 5796, 841, -7203, -7402, -800, 4229, 2285, -775, -2216, -3085, -1809, -977, -370, 2916, 1038, -4927, -4253, 2746, 6833, 3600, -2016, -3343, -1431, 845, 2395, 2168, 2984, 2978, -1834, -2671, 2846, 5686, 3046, -3372, -5173, -549, 1926, 1621, -1051, -4021, -3890, -4501, -4401, 955, 4195, 1380, -3712, -4467, 1818, 7114, 6071, 2284, -1094, -517, 684, -819, 859, 3429, -372, -5926, -6163, -523, 5400, 4402, -256, -3417, -2723, 615, 1017, 714, 2268, -29, -4133, -4776, -1367, 3714, 3143, -1916, -3161, -1080, 2795, 4228, 2426, 2787, 3440, 634, -1835, -1735, 366, 66, -4358, -4779, -1649, 921, 1486, -1768, -3093, 800, 1756, -451, 626, 2053, 1819, 142, 458, 3190]
509C190L72l066m279j992M973M430k285j503L88p24l22J38K086Q04k211l230j630
526d861L692O050j695m150q54n13k97J138K503K406j080k600j368J123M443q43
542C094n385l69K161l60N89J805J860j73j788l451j715K915K391k268O93L251
558C250k420l167K38O67J660K27k689k245K659M103q1p34K407k569n245k6K234
575a731M116L516k306m906n59K942R02j438J476q50n654m03L511K809K824j653
591B596o018j269L016J691o86J899K002l678j855K561J116Q91k7m681j941L397
607i86J872j129P56K859j001l250L22n4jK375j047j442K510rl864j192L757J762
625B238k458j438j36j035L413K275k164O77n04n154j352M704L912m90j929j992
$$ y = [3190, 3562, 496, -3783, -5775, -802, 3628, 1343, -160, 228, -496, -818, -680, 1406, 2210, -1, -3231, -4861, -1169, 4881, 3186, -964, -1818, -2331, -2628, -1490, 1013, 3419, 2339, -261, -1629, -506, 3937, 3094, -2291, -2660, -499, -859, -270, 1535, 3395, 3222, 1434, -2017, -3732, -817, 1574, -694, -1, 3250, 830, -2337, -2099, -1432, 228, 455, -2234, -4479, -1820, 2283, 2202, 1468, 3875, 1306, -3939, -3965, -1731, 2385, 5901, 3595, -1311, -1870, 1072, 1974, 536, 2012, 1162, -4492, -4895, -1384, 1425, 4249, 2596, -3422, -4691, -1675, 16, -670, 1229, 3231, -447, -2302, 259, 1375, 2266, 2239, -2442, -4383, -986, 886, -243, 513, 3372, 2371, -879, -557, -611, -612, 1763, 716, -726, 1784, 1775, -2089, -3281, 476, 2238, -220, -1658, -1794, -2829, 584, 2859, 695, 1372, 868, -4286, -5638, -934, 2978, 2488, 559, -1433]
641a433k391K615M189q8o2K99m491k764N004M905m61l330m187k955J089M232O89
658H60j281J301l330l927L556N376O51j419k439k326O46L267K023j125P54j592
674I95n029J013M715P94n47q51j956m68J840J182j061O18J530l660k601K241P48
691d97p3J352r67j443N02p05p40K024L776j410m099Q64J138j8K496J298j757j505
709B36j499j976L082M683L98m792k807R1M10K908K583j657k387k302j979K066
725b942N233J863l391m041J99J127K324L112k26k809j579j836R88M862K269k865
741B288l728j175J130R53K288L39j952p36j175p11K776J790j427j652l28N82p0
758h08p5J008K11J87J15k149J41K064k91Q9O53Q1n06j596k49J905J986Q67k887
$$ y = [-1433, -3824, -1209, 2980, 2892, 2830, 3129, -1362, -4126, 878, 5783, 5322, 1992, -2195, -5150, -4061, 171, 860, -421, 880, -2450, -6377, -2821, 2555, 3206, 1787, -652, -2978, -2332, 935, 2958, 1833, 2587, 995, -4034, -3021, 1694, 2488, 1941, 1090, -866, -1334, 506, 1688, 627, 1245, 2775, -885, -3486, -1245, -497, -570, 782, -185, -1628, -1126, -1831, -2571, -547, 3229, 1819, -2280, -1416, -278, -296, 2200, 3498, 1741, 236, -1263, -3239, -157, 4526, 4924, 132, -2675, -2584, -2174, 734, 3317, 1660, -727, -3029, -5008, -2942, 2291, 4154, 763, -3278, -3079, -1952, 372, 3484, 3258, 449, -1130, -2966, -1978, 2884, 5153, 2288, -1440, -2615, -1485, -532, 1756, 2095, 143, -593, -1768, -2479, 297, 2087, 660, -992, -1320, -738, -808, -883, 125, 336, 523, 638, -1511, -1370, 694, 403, 492, 1145, 1226, 720, -876, -1125, 780, 2766, 3633, 746]
777G46k991M4R28J543J987j92k454k858q71K435L490Q63k285l815p9K391K032
794I14K476K50k831k430j480K040L989K116k150m052j574J223J587J565R43k178
810D08k608j327Q18L713K146j084l389k015J146J363Q86J505l29j657q31o03J578
827b80K408q3j483j108j62Q73M27J145M34p79j473j552l03J964M49M9m63n23m89
846i49o15K8J270J028q26j331q21J478J640L37P85l95j076j103m14J098J980J58
864B272q41j641j006P88K25N51K10q42j017r67L12K745J715j268j548j701P6O67
882a270R97J608L18j070j354p27J097K448j42j114q57p96K65J263J548O07j730
899A091j654j750L19K153J138p94j183j341p76O35J768J563J64j570j681O4K287
$$ y = [746, -2245, -2201, -1273, 270, 2257, 2065, -389, -3247, -4118, -1683, 1807, 2670, 385, -3430, -3509, -1118, 914, 3390, 3640, 809, -1621, -3101, -1061, 2928, 5044, 2894, -1158, -2732, -1509, 78, 1643, 2586, 408, -2200, -3527, -2709, 1004, 3150, 2066, -1323, -3338, -2192, -829, 57, 1562, 1233, -424, -1255, -1858, -280, 2128, 2045, 562, -546, -708, 165, 592, 1737, 2171, 1392, -81, -1633, -1936, 28, 477, 526, 63, -460, -949, -1564, -1536, -266, 762, -64, -1395, -2216, -738, 902, 1239, 2024, 1629, 553, -550, -964, 134, 2114, 2272, 1431, -210, -1216, -428, -203, 348, 558, -284, -1301, -2268, -1956, 789, 2504, 1236, -312, -2013, -1937, -1270, -273, 1335, 1653, 583, -771, -1498, -401, 2047, 1905, 791, -66, -862, -597, 666, 2214, 2821, 1091, -563, -2313, -1994, 159, 1297, 503, -680, -2021, -2797, -2162, -394, 1169, 1333, -237, -1918, -1854, 433]
916D33K454k03q66j069j757k23Q44J677N10j354j887q42R62K594K55p76o32j718
934a598o39J654J330J018n73j996j002K92J685J073q51p3m10r18N64O98K45K08
952G07j330q44O10J020R40m49j51P39k79k79K92o16O4l8r39l08J72j90p27L40
972a266J087O06l46k25r68M02J199L94L91m19j574n20k71J928J585r82j376q39
990a194K01K169J198n79p23j753j263O06J548Q77l7j718j060J1J288J551m43m87
1008A92j373j459J351J353J497K21k041j240M60J016J950j09q31k44q89J53J180
1025A187L96o28j173j230k00O65P04M28o02l89j76k15P20M61L6J47o31L75P31
1044F06L50M27n65l56k1l99j09K16j10pl58j61O29j83l14K01J40K68K81m41K6
$$ y = [433, 2887, 2684, 1818, 749, -1008, -1231, -387, 1290, 1800, 446, -1441, -2283, -1321, 1273, 1528, 752, 120, -1598, -2237, -583, 747, 1765, 1192, -804, -1806, -1514, 171, 1244, 393, 320, -90, -1008, -444, 254, 499, 707, -623, -1467, -857, 163, 1103, 654, 503, 1242, 963, 684, 976, 360, 424, 386, -553, -861, -689, -879, -1606, -1266, -179, 427, 81, -144, -1112, -710, 489, 883, 1274, 855, -719, -1239, -1510, 418, 2003, 1021, -355, -1194, -993, 1176, 2374, 1795, 1072, -681, -1944, -1338, 210, 1087, 1050, -668, -1728, -1717, -429, 1122, 679, 192, -1181, -2640, -1289, 64, 1561, 1782, -259, -1499, -1039, -23, 1927, 1818, 987, 743, -146, 7, 1187, 1583, 955, -218, -1448, -1648, -983, -279, 149, -453, -842, -1018, -1233, -513, -52, -16, 131, -500, -125, 606, 956, 1383, 818, 462, 441, 42, -67, 149, 39, 32, -326, -487, 142, -41, -355, -154, -14, 254, 535, 94, 120]
1065A20RJ44l32r42M03P8p48M64O23p1J036L1o05J48J09R9j96K59L24l93o28j01
1087a69j6M56o7p27j5K59l30O17K67N11r95p70K35J7L15J153l99r61L46Q2J99
1108HQ04J4m64q53M75L22J3P73l01j033K5J51m48O71O25j009q33K06O59M54L16
1129E75L8j619J82O80j46N24L56l74n67J3L34J84L05K35j018n47J310M3k04P10
1149A014o83r70O9N75L20q2L6o74r14J007L92k18L08p2j399L00J139L60O1j86
1169C83p46m40P61J052k05j65N5j322J4J327K38k34l63p94m56K78J326o4r98j8
1189c71p69l76J728J73n42j83o3o31N60J201J96r98J23J81l34R74O24j017k42
1208B34J41q47M20P53k71p03l32O29k94K03N98r74n69R93k74l84J080o51q32M60
$$ y = [120, 129, 273, -59, -1001, -598, -520, -1268, -804, -181, -252, 784, 815, 210, 358, 467, 566, 370, 629, 953, 560, -68, -169, -185, 271, 204, -523, -538, -279, -609, 8, 275, 786, -209, -979, -744, -727, -412, 741, 342, -619, -273, -191, 8, 812, 826, 362, -491, -16, 306, 319, 1092, 791, -242, -217, -66, -514, 157, 782, -227, -1060, -854, -195, 259, 575, 613, -1006, -824, -144, -290, 234, 590, 216, -351, -338, -4, 180, 485, 720, -298, -845, 465, 508, 304, 1014, 331, -639, -570, 5, 325, 243, 279, -395, -1309, -302, 90, -128, 180, 108, -1291, -991, 148, 508, 569, 383, -363, -803, -42, 1010, 805, 640, 695, -627, -613, 714, 952, 718, 355, -439, -895, -617, 709, 645, -353, -371, -1140, -1516, 212, 385, -157, -340, -403, -1034, -474, 727, 923, -75, 48, 229, -105, 869, 1493, 476, 234, 375, -472, -52, 701, 430, -273, -605, 24, -270, -67, 531, -443, -1012, -19, -293, -677, 403, -248, -1080, -620]
1228f20J025q4l1L11q99m80J304N87o97O59o48j046M41J203n9m79o10m07o28J146
1248a2Q16n29j31o14r86L78J205M29m17l24m90n12P00J319l25l11J24j062R5J489
1268H42M28n40j70p88n68K50J384K7p64J61q12o64J137O09m98m6l32q01J19J179
1288A53N90n72P5n05j014R56J124p81L12m0q62L46P99J64l34k10l5o25q6J009
1308D64m7k63L52o05l43L33k01L1k42N09m9m17M94L1p47Q32j68k58L60l4l71L31
1330hO75j17L80n14l73m29M31Q74l62o9k20p28L18K70K70k48p54l43k88O56J201
1351F22k81N6n25p43J51Q81Q11l44j26n53m61K58R03L38p22m04m13j29P49M86
1371E54K42l78o89m59K26O57J42k24m0o76l08N78R67r8k25L8j151K3O95N40J18
$$ y = [-620, 405, 321, 290, 601, -298, -778, 526, 1113, 416, 1075, 427, -619, -178, 1025, 966, 487, -123, -530, -1158, -12, 804, 275, 144, -470, -1456, -1078, 127, 556, 139, -185, -675, -1187, -487, 832, 507, 196, 320, -742, -647, 842, 1270, 730, 560, -228, -796, -546, 838, 865, 101, 262, -550, -1214, -77, 532, 34, -12, -344, -1145, -1026, 153, 743, 171, 246, -259, -1273, -317, 807, 26, 338, 298, -564, -218, 581, 745, 411, 201, 166, -459, -545, 464, 417, 154, 506, -99, -442, -109, -310, -279, -521, -12, -61, -478, 16, 47, -700, 132, -36, -294, 66, 32, -339, -8, 667, 550, 930, 416, 43, -386, 45, 919, 557, 488, 268, -460, -142, 128, 398, 150, -604, -947, -1235, -579, 622, 341, 397, -128, -871, -720, 161, 972, 628, 502, -51, -512, -254, 649, 987, 265, -139, -552, -681, 68, 554, 796, 418, -271, -730, -504, 153, 295, 71, 31, -645, -953, -375, 592, 494, 269, 307, -844, -821, -126, 414, 532]
1392E32k07l75j69r3N53O4k3Q3o24J10J45J54J68M4m71l26j85J50L20j92N42k83
1414h3n11M59J51J7K94j62K23l7q7K28l7p3O33j043J48n6o24L42J83K04k87l12
1436d30l16L31J27L54j6m4j29n31J18J022L27p6l77r57p0N20N73P12o43m12o00
1457e17k7P41N58k75n04m52n20N74O74N82k07q76j30m17O60M95k11j05pq29M67
1478c26M68J5L32m02k60l67N21L16R3O6J45o66q4L02j14l8L98r5l74M8j40n8M28
1501B08q4j87m67m05N43K32N48M3q8n18j57J09M82j4K50o02M9m8j3M40M02l98
1523C25J0m63k04N63L18J38k87n78Q9m43K22N33o9k74k44m45N18M24J94j77lm47
1545c00j89J00M21M48k69j39l80j55O00J15L18L0n59J67k99p2O51k27M3m54l42
$$ y = [532, 325, -50, -219, -312, 241, 305, 282, 365, -259, -149, -4, 150, 318, 362, -109, -435, -620, -470, -150, -342, 200, -83, -594, -135, 16, 33, 327, 165, 388, 351, 264, 492, 455, 382, 1015, -28, 120, 64, -560, -218, -35, 169, -118, -430, -746, -415, -288, 66, 50, 6, -123, -654, -536, 486, 813, 737, 360, -597, -667, -147, 426, 1138, 495, 83, -517, -544, 197, 755, 480, -24, -476, -996, -422, 252, 834, 627, -249, -379, -796, -136, 359, 148, 43, 36, -793, -326, 142, 157, 489, 87, -173, -540, -19, 297, 390, 456, 601, -65, -149, 153, 39, 1, 399, 304, -70, -22, -162, -220, 208, 124, -63, -530, -935, -392, -160, 388, 431, 343, -175, -332, -223, 259, 245, 495, -107, -58, -106, -119, 321, 723, 325, 335, -128, -332, 231, 549, 687, 400, -178, -89, -532, -310, 223, 154, -120, -364, -809, -291, 133, 327, 150, 147, -300, -489, -389, 32, 480, 211, 72, -308, -463, 137, 252, 570, 600, 41, 208, -91, -163, 488, 261, 304, -150, -492]
1566d92K50J12L67k05n52j86l0K45J95J35O5k41o0M96J61P6L4o2k5O2l36K91o1
1589B39j6O1l5o8k8j76j60k80O96o4m00j92K07J66M14p2k73m79RL5N26N35r7j27
1613D21r28l5M91L44K42j34o03n0KQ4O05K23l22q37j04M32L78Q8J88n38o48K17
1635d84K68N42L58m17o34j03L78m2L19M45p24j34O1J49J49M24k97j04O7k77J15
1656E9p3J62j64Mj06n8O9L47O5n95J56M4m2k7K73J29L6k00J76l09p7R0J93k87
1680a35L05k61L7l23M64j05J52k33n4l20K14M67j65J23k23j69j27M2L90K35K5
1701C39l69L9l54N62Nj44N93n44k95J63K00K44J20k36n66p6M55j68k3J63k40m82
1723f14M71j84L56Q0j08l50j79O29O6r6l9L74o46L09L22j24M86l77m98mL02p6
$$ y = [-492, -242, -130, 237, 32, -520, -706, -736, -491, -296, -161, -96, -337, -397, 99, 260, 336, 370, 308, 283, 345, 9, 300, 239, 223, 284, 249, 181, 153, -23, -183, -463, 233, 169, -231, -423, -216, -50, 364, 292, 19, -460, -451, -416, 110, 645, 548, 421, -507, -542, -51, 293, 535, 401, -202, -252, -250, -166, 439, 662, 340, -497, -601, -169, 209, 297, 485, -53, -701, -484, -216, 326, 684, 267, -367, -470, -92, -134, 185, 630, -94, -228, -167, -18, 131, 555, 258, 154, 221, -56, 59, -14, 148, -16, -12, -118, -176, -107, 240, 305, -290, -134, -90, -132, -159, 114, 243, 279, 79, 255, -54, -131, -41, 152, -135, 170, -91, -54, -377, 87, -18, 134, -99, -153, -473, -259, 208, 43, 166, -57, -226, -353, -311, 79, 314, 339, -30, 9, -345, 217, 222, 78, 671, 127, -168, -5, 195, 439, 559, 323, -243, -319, 136, -32, -55, 108, -132, -614, -143, -327, 29, 109, 1, -349, -528, 101, 167, 71, 32, 406, -240, 69, 391, 267, 753, 376, -122, -126, 176, 100]
1745A00P9k57L00m57j49K09LJ49N4k13k40J28O4l2R8l2K48j23J57j73J55O02m34
1768B36l14J49j3r6m2K75Q2r1l02K17l55J54K23l94K30M5k59O3K15j92j39J33
1790a75K56o12O26J11k47nql3l21N62j31j75K9K36N2P5j35J64k38N31l30m48L26
1813A10k29o1L14J72n69J17J81k16j02j16M12nk33K87l92L71o2l6N2Q7m8J01J94
1836C29K11m93r2R8j43J08P2k95k03O01k11n2J36Q1n42K05M24k97KJ18J00k06
1858d9L08l6k84m3K61j04p0J58J02m00K48p3j16L3J69j70k74N06Jk58K19%l02
1881a74N4m2l5Q1M06l18k08K57K38j54j51j82J95j29J69K21j5J24l36qM16k82
1903A27j96p8J7j00K25J47j21j88r4L25k07j47N3K1k35M07n3M07r9J4m29K09J52
$$ y = [100, 179, -78, 222, -235, -384, -175, -172, -23, 31, -182, -422, -294, -230, -262, -164, -196, 52, -71, 86, -87, 68, 670, 236, -78, 71, 58, -38, -80, 195, 277, 186, -116, 101, -254, -100, 123, -271, -41, 4, -255, -192, 23, -169, -308, -175, 81, -531, 95, 206, -41, -46, -54, -87, -408, 154, 23, -152, -123, 113, 165, 240, 105, 269, 31, 562, 232, -216, 110, -119, -180, 134, 306, -263, -146, 35, -181, -283, -399, 13, 8, -225, 62, -330, 41, -21, -57, -5, 82, 34, 135, 329, 540, 47, -45, 53, -90, 18, 90, -205, -408, 193, -18, -70, 66, 147, -395, -190, 234, -63, -61, 57, 157, -49, 259, 223, -61, -104, 157, 53, -17, 141, 243, -157, 91, 18, -98, -65, 104, -66, -340, 166, 167, -91, 128, 128, -174, -120, -162, -197, -116, 290, -28, -236, 21, 259, 105, -46, -228, -33, -162, 7, 228, 213, 337, 1, -7, 409, 127, -69, -147, -130, -230, -5, 142, 21, -167, -261, 64, -143, -290, -237, -216, -451, -44, -97, 310, 211, 225, -204, 5, 157]
1926A57p9K33j2m12r2K49m7K27j14J03m15K94k20J51J59j85O5l05K00l32K89K80
1948A94l15j5K38q1J63n2k0k59k32J70N31l32J72l4j56K35J6K6n1l86P5q3l1K46
1972A9k28M04n10J04Q3J09o2q0o5M7L64K40j60k63k70L26J59J52q8R8k31p7k41
1995a70O12o5l86O8j66k20K30J26J76p2l21l62K39RN81k74k32L55l16N2K67J83
2017C14k2k15k84J80J86J22N9l09j81K26r2o2J73n1k36j77R9M44j07J52j29k36
2039a46k9L03qj71K11j35k73K91K11j32R9k65k06K76m1L4L8K20k8l19o3j71L9
2062b65K78l83L81J35J43l98Q9l68L83J35k23P7M5l67L94o8M30l04j89j88K90
2083B7l3L81j45p9k6k49j2J13P2J42N6m97j85K99K11J12k81J23m23L02j95M97
$$ y = [157, 78, 311, 299, -113, -205, 44, -3, 224, 110, 213, -202, 92, -128, 23, 182, -3, 62, -243, -43, -375, -86, 194, -121, -136, 102, 21, 184, 132, 112, -147, -379, -209, 322, -10, 162, 128, -28, 207, 223, 249, 198, -188, -113, -196, -227, 19, -209, 195, -315, -211, -128, -19, -81, -161, -226, -179, 185, 425, 265, 2, -268, 58, 217, 369, 281, 379, 148, 71, -170, 442, 377, -9, 59, -107, -327, -97, 29, 205, 133, -188, -550, -311, -302, 279, 5, -227, 128, -188, -136, 131, 314, 292, 77, -207, -27, 159, 281, 340, 31, -150, 76, -16, -78, 95, 44, -192, -369, -270, 174, 67, 219, 90, -146, -175, 128, 120, -51, 160, 25, -248, 43, 254, 122, 221, -44, -250, 26, -15, 19, 57, 277, 249, -70, -133, -304, -265, 13, -370, 11, 146, 289, -109, -20, -388, -5, 130, -93, -16, 29, -338, 56, -12, 418, 114, -75, -263, 27, -6, 375, 230, 151, 125, -124, -136, -23, 49, 191, 247, -250, -435, -136, 75, 187, -94, 29, -394, -92, -287, 210]
2105B10J21l51r1k17J98M03M7J14o50K91Q3k75K05Q8K00m75j34K41r4K41L0j17
2127F8l81Q5P9J1K96j26j1k96j93K21L30O1o3j92r3J06K77K03j44Mj83m37K84
2150i4K46k20r3J10J28j40q8l6J78k74K82q3K0J53J34r6r0K26m69K09n6m9L9J2
2174e1K25J10j65l04J27P9K45k96K14l75j47K76K20j23K6j85l2O4j13N19k23j76
2196h5j50o6J21J07O10k96j1o44J90O4L77J39j54j56l78NL45J32K83k56r4k00
2218a17l60L82L44k95j76J44k29L14J56R2k27k3j88j0j09N27k43k24L78p19M42
2239a41N62l37j18J13k0k16p5L32L3o6j50O4J07j95j51q0J55J75k99N37k81K97
2261B46m51L09j68L09k95j00R1lK41k65K56k10J31K6M9j13j1LKk47M2N40j35j61
$$ y = [210, 331, -20, -111, -328, -130, 273, 320, 434, -216, 75, 158, -117, 88, 176, 376, -99, -233, 8, -86, 155, 185, 68, -313, -228, -149, -138, 158, 32, 21, -275, -468, -247, 83, 144, 81, -111, -204, -98, 179, 382, 238, 242, 59, -378, -94, 152, -68, -161, -51, 77, -63, -151, -187, -9, -283, -1, -84, -64, 89, 223, 127, 37, 263, -206, 3, -53, -102, -63, -51, 174, 284, 119, -185, -58, 21, 266, -30, 184, -191, -338, -62, 158, 35, 61, -124, -156, -92, -205, 314, 91, -85, -235, -301, -180, -73, 537, 241, 230, -414, -224, -160, 217, 356, 202, 46, -332, -327, 18, 150, 433, 177, 83, -117, -477, -95, 249, -46, -222, -78, -307, 7, 163, 255, 28, 5, -183, -193, -302, 225, -18, -242, 136, -583, -141, 421, 84, -34, 79, 59, -157, -232, 100, 133, 67, -83, -19, 88, -107, -258, -338, -183, -8, -307, 230, -51, 246, -205, 104, -64, 245, -50, -150, -59, -62, 179, -86, 170, -40, 91, 117, 166, 53, 42, 45, 47, -200, -158, 382, 247, 86]
2285H6j22j12K19L9J0n7j92J71q8j76M90k39j24jm3n4L09J81k72Qj18J94k62J26
2309b7M83n09K74l77M9Kj11J9J75j73j68K16J91J33l34J41Kj76K86j29J45q1L84
2332D15j44k49K9o1J08j30n0L49m32J7R1o8L25m0m05J52P8q9J35qJ00k26k75J89
2356a89J97J2O6j79J73j81K23K22j66K0l73L8L20j89J4l6P3j18k6M7q6J18k20
2379b40K9N3K91m32K70K32j27l60N27Rj08j41l8J76k62L45l48K53L2J47m05M5
2401e2J14r7l5K14k15N1j58K41l98L33L27l52j72J91k21J7rM67j65j21O6k38K96
2424H4p9L18m03R3J7j96J84R6r4j18J31j50N2rJ71l94N96n76N9K57k28j04L24
2447C1J67l99K39K68j72j78J51j8j37k8J0j47M3M87j79m19J32J95r9q1K78m9l0
$$ y = [86, -36, -148, 71, 110, 120, 63, -129, 42, -46, -222, 268, 29, -95, -96, -139, -193, 116, 297, 25, 33, -85, 109, -153, -27, 456, -53, 221, -156, -107, -105, -216, -197, -22, -195, -363, -147, 44, 177, -157, -16, -14, -190, 96, -33, 112, 31, 415, 271, 22, 51, -10, 98, -32, -82, 267, -165, -148, -57, -125, 200, 160, -245, -93, -15, -104, 31, 23, 123, -103, -378, -189, 8, 20, 86, -93, 80, -101, 122, 344, 178, 198, -175, -137, 183, -6, 8, -28, 45, -73, -99, -52, -138, -20, -240, -211, -158, 133, -299, -29, 203, 76, -284, 243, 252, 144, 3, -35, 141, -121, 224, -124, 129, 161, 308, -97, -52, 62, -35, -70, 144, -71, -20, -178, 63, -335, -2, 325, -27, -199, -8, -229, -212, -221, 246, 81, -40, 26, -212, 84, 5, 323, -80, 13, 30, -166, 18, 114, 20, -98, 33, -117, -65, -74, 97, -297, 299, -277, -218, 39, -189, -293, 31, 198, -201, 38, 306, 134, -44, 107, 89, -48, -76, -66, -213, -170, 317, 138, -281, -149, 46, -53, -134, 144, 95, 65]
2470F5p4K98l11q9j8K37p0j95j47J85M4P6j41j6L05k70K64q9%o4J26k06j14J12
2494i2M82l14k4l94L55K84l81J99l35L15j38j56K66k52K59m06J61J21p0K65P4
2515B19k02J01J30k47J67j01r3J46p8Q7K50m80J01k17L74J26l23r3K42o9j3p9
2537e2J57j83l6q5J60J06k61J20L6j6j19J65J11o6Ll20J55J03kK81k76Q5j34n3
2561a21K33m6p9l41O32n54P0J65N7p1q8J58o4K09q5k80K88j72L30j96K26p1m44
2584b44J86m1K44o6j22L5P2L7J52j52N3K6l25l9J07o3n2n3M36k87K53j59pr2j2
2609a13N3J14J89M4j99j43J31j06Q7j7m2j27M37k26j07j34J38J60j18j08o2P1
2631g8M4j50L07k01M8R3j73J34j05K0K26n6M5J23m01J68j44K10J49l96j57N20
$$ y = [65, -9, 289, -22, -111, -129, 108, 38, -157, -304, -119, -75, 1, -140, -156, 149, -121, 143, 54, 54, -10, 116, -90, -204, -92, 390, 76, 52, -342, 13, 297, -84, 115, -220, 95, -43, -199, 67, -185, 74, -332, -171, -50, -120, 145, 219, 17, 118, 248, 1, 168, 67, -26, 120, 42, 129, 379, -101, 0, -217, 157, 283, -40, -133, 109, 40, 27, -52, 105, -78, -114, -199, -39, 67, -194, -74, -38, -54, -173, -8, 103, 37, 40, -280, -125, -22, -24, 257, -19, 66, -68, -121, 112, 66, -13, -354, 278, -276, -206, -41, 16, -55, -143, 15, -49, 160, 75, -205, 83, -89, 241, 45, 271, 200, -244, -58, -99, 145, 79, -43, -8, 64, 101, 253, 101, 154, 180, -145, -184, -77, -140, -192, -245, 191, -96, 157, -2, -9, -101, -113, -60, 54, 243, 287, 88, -55, 76, -30, 57, 40, -2, -129, 308, 82, -25, -159, -21, 139, 21, -87, -149, -78, -34, -184, 123, -78, -30, 63, -110, 24, -81, -61, 165, 109, 154, 277, -124, 44, -100, 110, 259, -137, -294, 226]
2653B26k64%K01l35N1J83n42O33k29L17k86k70L31j51oK24l59L28l6k15K40k15
2675a74N6K79j43N0M4j06J33r4Jj07Q1l0J10m8R6k66q3K85k07K87k10q5L99k90
2699b2j29L31m89J80L39l90L1R5J18k21K2L19R5l66n3M23j79k58K75N6q8j25j67
2722b03K50M9p9l0k30Q6J11m4L55l90J44J60l24j05M40k71J89j75p1J42J62Mj68
2745BP4j0P4l67K04J31j80J22j68K20k72J95L3j30QK2p2j58M56k39J58q7l11K51
2769d4j98L69j17Q5l6j46K60K4p6N3k64q4K14l8j64J29o3j49J64j70M26m28J91
2792f2L5p0J32p6M3l0K90r4l16j30O7L33j94J24q0j00K08r6K37j39k08J94J4k52
2816a70L03l7R9l29l72L17J54J70j50K4l8J97q0m05J26J47K36j09p1m1k91K36
$$ y = [226, -38, -38, 163, -172, -121, 62, -480, 153, -76, 241, -45, -315, 16, -135, -141, 83, -276, 52, 16, -199, 41, -174, -118, 161, 18, 68, 112, 6, 139, 45, 46, -61, 20, -10, 100, 52, 148, -118, -201, 84, -123, 164, -46, -131, 268, -22, -151, 180, -309, -129, 210, -180, -149, -54, 64, -157, -135, 184, 279, -87, -140, 283, 104, -154, 121, 177, 89, -36, -203, 47, 96, 17, -13, -243, -157, -46, -90, 265, -125, 19, 179, -145, -250, 190, -81, 108, -67, -138, 4, 166, 170, 2, 76, 66, 140, -227, -23, 108, -72, 50, -118, 102, -170, 25, 58, -72, -64, -42, -114, -272, 184, -55, 103, 16, -295, -44, -242, 127, 10, 95, 59, -87, 173, 197, 121, 174, -90, -174, 40, 2, -162, -33, -96, -245, -81, -251, 175, -253, -62, -27, -97, 35, -41, 2, -28, 262, 168, -148, -278, -211, 122, -72, 52, -28, -128, 80, -16, 221, 82, -126, 68, 82, -170, 133, 96, 195, -134, -506, -189, -35, 135, -15, 9, -29, 168, 88, -317, -191, -44, 192, 83, 12, -29, -320, -84]
2838h4K62j38M5r1O5p5j24J00Q6l8j76K52l45L05P0q8K18l41J98r1p6K78j91Q
2862B9o2k3L03P4j04k87M9j43K43q4j8P2rr9k17N6N11j51O4m59M08k07j32m3J22
2887a07K29l50L4j04M15o3M7rL8j5o2k77M24lk16M8nk19N9L11m48J86j0m5k3N7
2913a08j13N52m12O9k60K03K7m5qJ37J25k08j88J10L18j74j54N0J44J24j39o9
2935a9Q2j00K26j75R4j48L0J5r0k71L50P8j41K59j86l19K99L7k42P1J66j19k55
2958c58J91K45K6k1L35m26j25L15k28Q1K1k9M1j94n2q6P8J23O0j88j16L26J62
2981A81j19j33j5Q5J77l58K1K35q9o3J64J43k10o5J26K05j10j69j86K57J7j8Q8
3004A64j11q1K49l50K13J0j73R8l39K48r4K18J40j35J9O3l97K96J22r3R4j59K51
$$ y = [-84, 178, 40, 85, -6, 59, -16, -140, -40, 46, 8, -168, 84, -261, 44, 114, 26, 244, -97, 101, 10, -66, 212, 21, 29, -33, -56, 247, 321, 217, -70, -21, -164, 79, -5, -23, 49, 40, -59, -276, -220, 291, 140, 204, -255, 153, -54, -186, -229, -107, 122, -228, -194, -298, 117, 54, 101, 92, 130, 115, 53, -224, 200, 197, -19, 29, 24, -195, -136, 175, -273, -87, -97, -142, -165, -108, -221, 331, -81, -12, -272, -69, -42, -87, -95, 42, 167, -41, -229, -119, 199, 25, -129, -79, 65, 189, 50, -19, 63, -37, 189, 14, 108, -40, -10, 5, -85, -356, -6, 72, -69, 190, 4, -315, -16, 21, -221, -150, 16, -103, -358, -167, 78, 104, 83, 418, -8, -133, 182, -46, 35, 56, 27, 68, -126, -178, -264, -186, -63, -3, -191, -307, 19, 181, 62, -71, -86, -1, 176, -182, -161, 74, -15, -78, 86, 229, 19, -46, 80, 285, 175, 6, -180, 77, 94, 76, 164, 53, -28, 221, -129, 84, 94, -79, 19, -320, -72, -166, 52, 192, 57, 76, 139, -258, 38, 160, 67, 161, 2, 253]
3027B53k45r8J25r7K56l02J21Q9j2r2k43L02l43M3PM13K9k77J84J01j80r4M0N2
3051C2K59k82k02K58k3j13J27N8k8j98q7K39M7j14N2k84J95M9j17J48j33J82j5
3074E0j02l4J70j07J12j77K40Q5l51Q5L51k45J6K3o10N85P9p4r4j74J45j8j22
3097a67K94K9o0rm5k7J9KK0p7M5j51j18K48o9K12n0J2J37m22L9J40k27L09J88
3122B72p0j72P8J57r2j49o7j17J02j38J21J17J32j27j26j76K78N5k11L02j48p5
3144e4P0J6N0k81K25o0j5Q3L05j80p4P8k08n2K06j91J18J95m17K39nJj10K65k34
3169c0j11J64qL29l98N8j01R3k3n9K18k2K7q3O2l2o7K56k97p8q7L7K26M6j68l3
3195h1K31j78L9j29k9R2J08j43N9j76L59k69M01j51rk04R0j14K28j39k4N6R4k12
$$ y = [253, 8, -90, 35, -62, 194, -108, 13, 102, 90, -2, -245, 57, -286, -243, -236, 177, 206, -71, 113, 214, 34, -60, -20, 32, 291, 9, -193, 65, 42, -71, 56, 114, 86, -112, -199, 40, 87, -27, 25, -259, -64, -15, -132, 16, -117, 65, 50, -52, -86, 84, -23, 89, -88, 152, 237, -114, -29, 322, 77, 93, 116, -494, 91, 170, 96, 2, -172, -27, -45, -167, 127, 156, 96, 87, 42, 15, 34, 36, 56, -21, 24, -127, -245, 3, -66, 146, 96, 108, 245, -177, -138, 2, -225, 84, 272, 202, 30, 108, 265, 173, 24, -43, -160, -58, -196, -75, 42, 174, 47, -79, -255, 23, 78, -133, 169, 21, -54, 16, 32, 82, -199, 26, -34, -49, 34, 339, 159, 85, 163, -45, -97, 109, -82, 36, 231, -186, 53, 48, 49, -61, 204, -30, -141, 23, 15, 344, -54, 4, -97, -4, -27, -86, 132, 110, 137, 54, 116, 84, 17, 273, -24, -102, -189, -152, 74, 120, -48, -81, 150, -28, 11, -118, -147, -55, 53, -90, -31, -207, 152, -117, 284, 133, 124, -80, 10, -104, 124, -15, -39, 17, 111, -101]
3219a01N1J45O1j42L5q8J5J81k52P4j3O2j68J53k28k0K56P1J47j45m5n4J60k27
3243g2K31k51J61l11K09J5K03l71M30k06m9Q6j80K28k24N7N6ok59J11J27OK07
3266A98q4j56N3j73M23k51mo4o1K92O7j57l30K59j37pJ75j74J22k69K85p0O9j52
3290a46Q0j45L10M0j87K09J43j65n30L91J78q4m03K32l5Q4o0O3K85m74L2K60K0
3313I8J61k22Qj92j25K11M6Nj5j6p1P8J8J21m00J48J48p6J3K95k72j77j08J81
3337a43J39qK1N2j40K92j88k7k0L08l22l7K59k34K09m16L85j24o1J93k28oJ95
3360I9o4J28k77M42m4k65n2J79l1J08j37j60L2K25q1k03K46k00J6l27N78p4k63
3383a25J44k52Q7J91J35j96K89k24k1j74R7n5M05l61J35l65J19L88k7q8l51K91
$$ y = [-101, -50, 95, 156, 14, 49, -39, -24, 157, -95, -21, -34, 28, -140, 13, -215, -235, 21, 92, 239, 94, 49, -5, 155, -72, 159, -92, 69, -242, -33, -18, 185, -186, 244, 38, -11, 75, -105, 123, -101, -44, 12, 6, -253, -142, -15, -9, 198, 114, -42, 11, -162, 261, 10, 6, -58, -119, 173, 240, 83, -247, 12, -125, -132, 43, -131, -9, -278, 7, -63, 6, -146, -66, -211, 99, 139, -48, 161, 304, 139, -391, 0, 178, 94, -309, -77, -112, -28, -88, -25, 260, -214, -182, 78, 98, 259, 37, 45, -147, -272, -61, -15, -10, -25, -41, -112, -34, -16, 105, -295, -147, 1, -75, -62, 233, -39, -216, -324, -143, -4, -12, 9, 61, -79, 213, 25, -2, -22, 286, -36, -73, 186, -48, 161, -255, 130, 6, -55, 138, -90, -96, 99, 35, 163, -114, 328, 284, 19, -33, 146, 115, 223, 86, -74, -42, 183, 102, -101, 145, -55, -39, -366, 212, 138, -125, 19, -233, -146, 45, 180, -16, 273, 49, 28, -146, -49, -104, 301, -60, 75, -290, -171, 217, 190, 102, -249, 42]
3405D2j34N0J27j5k06M09n39K33J72k07J06kM5P2k40m5J02J20Qq0J10k10l1K76
3429A63j25j31R2J99l80K07j38K30j26n5j02L03k48J36j29K38n1k45p9K47k19
3450b13O0K90m1j75J87k71J22OO0O6j75L42l57L30k86p3J67J15j73L4Pq2m9j73
3474b82J84m9L5J52J67l55N9N0O5Q9j51j25M30j87j92J16lK65j83Rk50J22J90
3497A56J30j51J13k96o3R7J17k23K23k32K29j55k10K97K56l56J14o5J19j03q5
3518h8J52q9ll1K3m8L57r7K2j58jO8j25r6J88q4q4K06j8j22R0j79o2k0J4J92j0
3545cn2K0j20M7J1M1L6j9j05L23j81lL9J12l13O9L87m06J78J11j6O8j48j27j4
3570f5k37L38k17J52Kj6N4j26R6J28j53q6J75n6J01k06J1L47l05k0M02l13p8K07
$$ y = [42, -92, -42, 85, 70, -136, 273, -266, -33, 139, -68, 38, 36, 81, 153, -87, -132, -30, 90, 98, 18, 128, -82, -113, 163, 38, -93, -1, 198, -182, 25, -113, 117, -9, -64, -166, 137, -111, 25, -104, 134, 83, -162, -241, 6, -213, -153, 137, 96, -79, 108, -163, -41, -35, 25, 91, -84, 258, -99, 231, -55, -128, 39, 154, -19, 15, 22, -60, -109, -282, -98, -147, -112, 40, 207, -148, -89, -39, 26, 115, -36, -161, 269, 82, -110, 6, 3, 268, 85, 94, -156, -34, 156, 286, 135, 248, -48, -111, -14, 103, -120, 103, -129, 100, -55, -265, 32, 288, -68, 46, -19, 100, -3, -88, 64, -25, -28, -59, -36, -84, 273, 176, 198, 40, 39, 107, -18, -114, 74, -10, -94, 112, 94, -28, 62, -117, -179, -199, -185, 7, -3, -55, -35, -155, -108, -97, -56, -20, -39, -144, 179, -2, -5, 34, 146, -167, -98, 289, -117, 61, 172, 156, 224, 76, -51, -65, -302, 36, -181, -29, -27, -43, 11, -115, -19, 109, -44, -130, 45, -11, 90, -116, -105, 242, -63, -83, 319, 6, -72, 135]
3594A35k58L59l56j68L11n3J98l08M2J2L64k68L1K00l77J69J05J06k16J12m4N9
3616A55l16JL48qk60Q3JQ6k35n3K46Q7o6m2L6L7j19j25J66p4P0j25l6L54o7Mk21
3643g3j78L36l03L49K8r5j08K37l4k80Q9J71k03L3M7j45K82k04n7L09k51k48J34
3666a64O0K65j40M8J61k46r0j12L44o1K1j70j51K61n1O6R0k02J03j31N2J7m5M9
3690b6J14M7m16N8J39j83M95k16j14J62j86J37k23J42J53r9P5k35J35J4J01J34
3712B08O1n5P3j36l0j29N9p4j01J56k7J96j25n0J57j86m4M7l2J43J04j00k75J52
3736hK14k54M2J31j07JJ76j85Q1O4m8Jp3J65k5k46j14R3K40n05N33m18L44K24
3760C26k65o0j23oJ77r2J1K4l9J66j63j05J19L18l07k10L58q1J26O6l97K8O4Q9
$$ y = [135, -123, 236, -120, -288, 23, -30, 168, -140, -98, -86, 278, 10, 41, 241, -136, 33, 138, 244, 28, 140, 96, 155, -161, -160, 188, 180, -80, 3, 4, 90, -145, -198, 48, 135, 69, 27, 63, 100, -19, -144, 22, -52, 18, -107, -143, 211, 144, 148, -73, -251, 85, -218, 131, 159, 64, -44, 193, 159, -121, -32, 139, -64, -31, 16, -129, 153, -51, -108, 201, -50, -298, -164, -104, 161, 21, 69, 230, -16, -106, -218, 126, 65, 86, -84, -235, 26, -25, 41, 131, -71, 32, -99, -47, -30, -75, -26, 88, 135, -281, -223, -84, -267, 228, 12, -102, 60, -126, 11, -212, -70, 83, -16, 59, -176, -41, -27, 74, 208, 269, 214, 287, 151, 121, -8, 51, -23, -124, 32, 5, 201, 76, 26, 183, -3, -47, 0, -32, 111, 215, 115, -160, -8, 206, -48, -6, 125, 18, 19, 195, 10, 91, 155, 107, 108, 35, 200, 175, -71, -185, -92, 148, -357, 176, -242, 102, 326, 61, 1, -122, -128, 49, -43, -32, -8, -47, 119, -44, -149, -30, 288, -19, -229, 129, 48, 174, 240, -157, -129, -65, 24]
3784B4O1j13mJPk11K29L8J0Q7k14J14j3l2m7J68j1k0l25K76L5j2M6k15K85P2l86
3811a50K8J18l3K7%j75M8K5K73k56N9J52j95J40Q6k52J65J37k24j18J01P1l5N
3835cP9j09O5pk87K52o2R9J62l45J8K22l44L54k83L6J68mj7n4J15m1j40qJ89j40
3861h5J08J86m66K18l1K32k29m6J98j90j59JL16J09Rk61p2J27r8R8q2J95m3J70
3885B05k36m0j09K08l1j62J80p2K30j33L8J36j65J18r9N4l8j98J93J15j58k50
3907b14M36l48J71j7J14l20K67j50nK1J94j45j11K10N8m08L30j32K00q0j42L50
3929B79m20P1l25M89j64j9m7L13j33Nj30J6N0OJ46l0J10J2k0k46K89j93J17k68
3953i2L38l91O7K20k99P6K22J6k04N8o0K60r8j47n1O1j29K42O3k53k83J62r1J86
$$ y = [24, 85, -28, -32, -31, -24, -235, -6, 32, 42, 129, -85, 29, 16, -16, -63, 105, 94, 74, -251, 25, 60, 48, 94, -121, 164, 236, -150, -122, -4, -37, -10, -10, -185, -137, -112, 161, -95, -36, 116, -79, 61, 147, -105, 60, 197, -27, -145, -44, 27, -8, -3, 76, -33, 32, 25, -262, -10, -72, 27, 189, -156, -138, 84, -260, 94, -189, -153, 15, 11, -6, -60, 55, 14, -126, -134, 55, -85, 23, 209, -257, -39, -70, 162, -67, -113, 85, -105, -264, -263, 53, 162, 171, -90, -162, -35, -133, -35, -117, 78, 35, 205, -31, -71, -180, 28, -3, -165, 15, -57, 173, 40, 78, 214, 49, 167, 68, 122, 84, -114, 79, 194, 36, -214, 222, -126, 45, 28, 142, -178, 89, -61, -66, -45, 149, 4, -107, 103, 161, -247, 83, -49, 151, 71, -71, 279, -141, -70, -395, 94, -70, -89, -136, 177, 44, 49, -81, -65, -15, -9, 137, 107, 217, 229, 209, -37, 252, 59, 176, -92, 246, -145, -78, 142, -157, -81, 141, 157, -47, 11, -49, 211, 113, -34, -85, -24, -153, 89, 152, -101, -384, -222, -313, -127]
3977a27P8L6p1K4K09M5m52L45m6m3J04m4J12l71K30j46J85l66L42P1j66j4J39
4000G4j37Q1J90j75r6m7L9K14k43J65K5j32k08N5L48k71k1Q0M3q9L35k95J3N2
4024@m9J50N9k2j95O0J15n9k24P2L03j64m1Rk25L21j21J72k22J30l7K3j23J76
4048A08j85m4J18K4PJ06k07r0K68p4o5K7Q6j53N8j22K03j09K02j76j16o1K94l3
4072F6l4J9j3n1R7J3k54M0l0m4J14k4r2L31Om02J29j80L10J0r1J35J60l3j54N4
4098H2k77N86l21j99J66o1J08O8R8k83M6M4QK17j28k33M4L0KK28l70Q2K3K07j
4123A66L8j29k41O51o03O7j58K45J80l14J48j81L52j78J4k28K24O1K4j67R6k91
4145b24M27k67J31J4Pl15K73K39k43k3j4j47L80k03j66l63O97k68R6M4J8q3K14
$$ y = [-127, -49, -13, -84, -60, 149, 194, -258, 87, 41, -2, 102, 58, 170, -201, 29, -117, 68, -298, 44, 115, -51, -65, 74, -63, 18, 208, 33, -63, -110, -71, 143, -100, 65, 90, -42, -250, -195, 153, -118, -139, -59, -16, -105, 230, -65, -52, 0, -49, 101, 160, 138, -57, 3, 118, 59, -165, -93, 210, 46, 5, 14, -211, 110, -11, 161, -61, 69, 32, 55, -68, 108, -77, -121, -3, 21, 28, 134, -73, -163, 105, 31, -34, -7, 79, -74, -16, -138, 65, -44, 158, -18, -134, -195, 99, 66, 32, 51, 38, -13, 84, 97, -157, -117, -147, -191, -77, -101, -193, 138, 144, -258, -129, -309, 1, 11, -80, 55, 215, 182, 28, 82, -195, 391, 70, -129, 37, -24, 84, 152, 250, -33, 13, 57, 65, 282, 154, -79, -35, -5, -3, 225, -145, -63, -40, 167, 166, 204, 75, -166, 485, -118, -51, -209, 36, 216, -98, 50, -131, 221, 43, 57, -171, 53, 114, 138, -29, 67, -224, 203, -64, 67, 81, 88, -227, 46, 285, 42, 19, 5, -142, 238, 35, -131, -494, 203, -65, 31, 75, 93, 10, 224]
4168B24k39j03kN2Op2K31M1k20n0K04j16j6L8O7q2L0j18K51J98j33l09J57j71
4192a32J76p9J8J59l1L8k09K53j4l09L31k49K84m37P4J48K72k24j24L57k60p4
4214c2J87l54L23r8J72k62N3K19k81J33k41K73p9J81k46j21K6J92N1j93M9J7J6
4237a5K04j88j0J37M1j00l1q3J86r4p0P7J72l24l1k4L22j67k25Q4k79M94p3L4
4261C7p1P7j08J15m9j13J10P3l04L6JK33m3q7o7K76n4l27K58j15M2J06j27J51
4285E0jN7q9j80J03J69P1j49J47j99k9R2K2j7K96l06j55oK08j6J4Lj45j81J80
4310f1Q7J32N3k39m0N3J99l49O0J69k0J01j43o1k6J35M9q3J02j59J2J06J09j17
4334F9o8L0j95M08k68k26J66J13J73q3j23P9k9j0O5n5J80k34Jj00K7Q6l31L46
$$ y = [224, -15, -118, -120, -68, -62, -134, 97, 138, -82, -132, 72, -44, -60, -22, 45, -37, -7, -125, 126, 324, 191, -118, 39, -132, 44, -35, -17, 142, 111, 149, -60, 193, 179, -130, 201, -48, 236, -201, -127, 21, 293, 69, -55, 302, 42, -32, 155, -199, 124, 26, 198, -64, -11, 208, -73, 60, -181, 92, 13, 194, -52, -173, -147, 45, 96, -97, -48, -31, -15, 189, 1, -9, 128, 169, 69, 38, -45, 141, 47, -23, 54, 226, -98, -129, -153, 169, 2, -223, -139, -418, 76, 3, 37, -34, 43, -65, 50, 1, -112, -2, 71, -233, -197, -196, 37, -6, -93, -160, 116, 62, -265, -7, -122, -80, 26, -101, 50, 49, 106, 17, -163, -60, 109, 180, 31, 178, -21, -50, 42, 64, 47, 343, 37, -118, -124, 84, 68, 82, 85, -60, -241, -61, 26, 158, 211, -28, -68, -15, 184, -165, -105, 64, 44, 145, 2, -59, -85, 50, 99, 16, 118, -41, -29, 77, 186, 69, 1, 31, -164, 244, -24, -250, -84, 29, 202, 119, -4, 75, 46, 36, 101, 46, 226, -8, -7, -107, -80, 6, -325, 21]
4358B1J9j04j7J66j4j10J42P1k59K50j95r5J78P6j21k4J5j22p6J45O7l1K33k21
4382fK07l90OJ8k0K58k82J67j5P7j02J65k37J36P4K00j70r9J41j14j46J82J67
4405B17k85K26k39J4RMJ02j13k5J77j86J3K03r1k45J10K03k85M07j4j87l6L6J30
4429A45l07K86l2m4j39JJ42j04q7K37r6J39j48K50m26K67k32n2K01n2O5k56K83
4452D1j10r8R7r2K19j53L51k44PK1o5l5M0J85j92K16l22J03j4K35l32J63j42J00
4476b1j75J75k11L26k52J63k4K5n3M3M0j26k0J69j18l1J5j38O9K45m7k0N5p3J66
4501A82j06p6j28K24j44p5K21nk65O3L47j04j72M7j40J10k1l4o0LJ49O3k54M5
4525a30J81J15n7L39j63k39l0k97N03k37K18r4j41P2K73k79j55R7n2J7J90l05
$$ y = [21, 40, -64, -81, 85, 71, -39, 103, 174, -85, 165, -30, -125, 53, 129, 8, -16, -1, -123, -199, -54, 13, -18, 215, -6, 201, -189, -183, -165, -185, 73, -209, -42, -57, 20, -82, 83, -154, -18, 56, 256, 86, -13, 128, 14, -132, 50, 217, -68, 158, -81, -67, -58, -54, 48, -65, -90, 87, -99, -86, 117, 26, -219, -109, 94, -191, 216, 202, 15, -21, 15, 145, -162, 124, 92, 48, -91, -90, 52, -52, -139, 98, 2, 141, -7, 243, -183, 84, -148, -200, 1, -51, 14, -242, 41, -69, -167, -70, -162, 57, -96, 255, 11, 18, 39, -26, -61, -21, 164, -28, 188, -134, -31, -45, 190, -142, 21, -121, -21, -196, -21, -232, 94, -158, 5, -19, 6, -47, -4, 36, -90, -110, 59, -59, -90, -75, -213, -144, 101, 54, 34, 89, 16, 182, 76, 0, -128, 96, -48, -123, 98, 93, -172, -109, 238, 134, -38, 9, -131, -21, -42, -76, -136, -133, 16, 79, -175, -130, 51, 166, 109, 448, 285, 46, 16, -281, 222, -15, 203, 109, -32, 40, 313, 34, -121, -24, -76, -59, 131, -174]
4547a74K14r2J68k67L52j85j11K01l78L46j52j8J29k0R7J1P2j61l01L70O8j58
4569A1qq7P4L5j61O7P3n2J23j15M1J59l87M26k7j34J34k71K17k12J00Ml6l11J97
4594a40J01K0L20n52kM80l62J87j32J67k02K81l26L2J56K3rj65L13j41j26Q9O7
4617G9k0J53k15J09k18L51R1l13j33O3l8m2L01k42K6l9J89k08J69j67J77j25k7
4640g9P7R7j92K22m3o0O8j94J46J53j4k24J81j83NK61k55l0J31j8j82Q4L8j7J50
4665A22J69k79R7R8k67o3J54j50K28N0J1k46J00k9l6r1L91k44K21k58M3o5r5j6
4689a55K39r8J1J5oN2j06J0O6R4p6j29j26N1P1K29l25R6L98m27J56QJ32j08J19
4714A91j13p7Q2k26Q3k5K8k4J51O3l38MJ75J03k9J18nk06P0O3k10Q8n9k4O1J84
$$ y = [-174, 40, -52, 116, -151, 201, 16, -95, 106, -272, 74, -78, -96, 33, 13, 110, 121, 193, 32, -269, 101, 169, 11, 3, -84, -10, 25, -136, -69, 4, -48, 75, -40, 1, 160, -227, 199, 172, 38, 172, -99, 118, -94, 6, 10, -26, -337, -140, -39, -19, 301, -251, -253, 227, -135, 52, -80, 87, -115, 166, -160, -128, 28, 51, 42, -123, 190, 49, -77, 12, 79, 59, 212, -3, 106, -112, 239, 330, 17, -116, -53, -91, -133, 168, -74, -48, -87, 102, -106, 63, -104, 73, -52, -79, -2, 95, -97, 125, 82, 22, 90, -104, 42, 195, 181, -43, 138, -45, -40, 221, -34, -64, 67, 49, -133, -49, -11, -28, 122, 291, 12, 109, 207, -60, -123, 31, -119, 109, 159, 170, -76, 24, -5, -41, -132, 259, 15, 236, -22, 21, -44, -139, -155, 84, -14, -3, 12, 6, 58, -48, -38, 28, 122, 46, -83, -209, -158, -87, 142, -183, -87, 311, -116, 40, 48, 180, 72, 191, 78, 1, 83, -143, -60, -85, -57, -81, 70, 133, -205, -201, -26, 77, 48, 166, 161, -45, 25, 88, -122, -34, -93, -117, -56, 128]
4740A28M4j32r7K19K2j0m2j86M47j52k71K3l1J28j8Rk99K39L1j4J62k33p0K62
4764A59k41j33J65l4p7R7k58J92J06r2O4j8o5L1J79j99K70J3j96j70M90l26k9
4787g2J0Q0j0K8J6J83k34l49J09L07K4k0J17l8k60L7J11K33l28k2L07k34N4j23
4811g4k66K49K42j44j25Q0q4j78j9L57j56J55oJ7pj48J62j4m29L19L8m4K31k05
4835d9J07k44J69M15l39Q2K4l11J07k00M76j04p8k93J64M9j47M67l24K42n0l06
4857a43J34J20j33R4j36j05K96J2J01m60K73k34J80K31j21n7M3j13Q2m05M14Q5
4879A58k46R2J81j42l09J58JK37j93J02J6q1N9K5j6J59k70K1q0K32k76p6J26J74
4903E2j18o7K00k2n4K07j53j32J48k07R6J13j14N6O5k87K17m7l45P44k35j36Q5
$$ y = [128, 172, 40, -57, 162, 184, 174, 132, -54, 393, 241, -30, -7, -38, 90, 72, 81, -218, 21, 52, 38, 200, -33, -103, 159, -82, -215, -50, -84, -161, -64, -322, -130, -24, -116, -52, -70, -135, -104, 75, -124, 146, 159, -37, -207, 283, -43, -72, -62, 18, 8, 36, 52, 235, 1, -348, -239, 68, 92, 72, 189, 151, -109, -72, 39, 272, -56, -78, 229, -5, 49, -74, -340, -91, 151, 7, -118, -38, -122, -300, -319, 38, -118, 37, 31, 48, 41, -107, 55, 41, -388, -69, -31, -75, 156, -49, 58, -186, -17, 398, 59, 141, 165, -146, -39, -239, 237, 133, 55, -238, -74, -25, -172, 295, -29, 213, 163, -143, -9, 111, -22, 72, -64, -169, 127, 139, 240, -220, 53, -181, -1, 230, 109, 52, 95, -18, 64, -341, 73, 158, -88, 4, 185, 43, -266, -108, -107, 130, -63, 39, 55, -26, 33, 58, 42, 201, -69, -48, -128, 104, -172, -248, -122, 52, -66, -133, 67, 45, -9, 198, 45, -87, 61, -146, -50, 63, -51, 5, 70, -217, 0, -47, -392, 352, 117, -19, 66]
4926F6k11Q9N5l1N3Q6q0O7K8j87j79K09j4m8Pr2M12q0j3j94q5J90M9N4J48l30
4952c1O3j80K60L4k5j26r8M30l31j15J01J69p5Kj40j9K66j21l8KQ8r1k29K86L9
4977A21j30k62L72l46L23O1m63M20j93K07L3k57K01n9r4O0QL0P8j15k22K66j82
5000a43j24J21K51N9m1l49K33K68l93J56k2j60K36k3o6k8j97K46J20l52K10K08
5022B10j87J01k20m4K03o5J80l7j23j88M25k60j03n7j32N41k80N1l9O2o7J23Q2
5045A76j94j5n58O03J31m3j84K6J33q2Rm3J86k32L9L07j12j52L6Q2l41J90j01
5068a39k7J48m3K74k72O4j57Q3k29K68K50l46P3o7L4K97k25K5q1q3J63R2j12P6
5092F6O4p7j20K09j22j23Q9n0r4K22q6K2j80J2K95j98K50Mj55j21N5J37p4J60
$$ y = [66, -145, -56, -1, -32, 21, 107, 27, 94, 122, -65, -244, -35, -49, -97, -90, -182, 230, 150, 137, -57, -142, 48, 97, 151, 299, -31, 32, -148, 112, 146, 121, -5, -103, 327, -4, -119, -18, 151, 76, 78, -62, -81, 185, 64, 26, 28, 116, 25, -204, 82, 121, -9, -271, 101, -245, 78, 139, -324, 96, -97, 110, 143, -114, 87, 28, -66, -6, 2, 32, 110, -5, -227, 39, -143, -267, -146, 105, 164, 123, -226, 7, 275, -118, 38, 16, -144, 92, 69, 3, -25, -222, 24, 144, -208, 2, 210, 23, 124, -96, -140, 63, -2, 178, 141, 18, -170, 255, -5, -108, -165, -297, 244, -36, 15, -24, 38, -29, 94, 176, -18, -33, -591, 12, 143, 100, -84, -58, 75, -7, 2, -41, 145, -87, -48, 259, 147, -5, 31, 113, -228, -38, -139, -166, -18, -61, 213, -59, 5, -152, -69, -298, -30, 220, -126, -53, -120, -86, 211, -14, 11, -70, -153, 10, 102, -10, 66, 130, 53, -67, 142, 20, -103, -14, -64, -158, 64, -22, 0, -180, -168, 127, -71, 179, 183, 28, -93, -38, 99, 25, 185]
5116A85Q0j71j37j79K79P9j3r0qj50J09J3p4m3K5l0J61o7K44M0j99j70J47k27
5140a96L86j18j53PJ25J3P4m4k0j30%L4k40N84j86j57k00L28Mp8o8nK5p8l2L5
5166i0J00P7j14L93l62n1j5K69j2l21k3J56l7j13J72j48J79K06l91p8j9J25jM
5190i4L03k2l09J0J05J08k51K96j49k9L7n5j35L01j14j28K93k41p2j61L97J04
5212A94j38n9J23k29J62r8j37p1K43j13M02j56L3k95k9P9J06n7R3J43j6l15N3
5235h2L4j9n4M9P7j24q5K11q9J37o4K57k48J34K1q5q2l5P3p3K10j76J33r4l25
5260b99L52j67O8L20k11N4J13j96J7j29O0RJ98j35j1L0J2j3J1j00J10J1j55j8
5284f9K79k90k8K99k76J01Qj28J46J09j14K3K2j60M6qR2O2p7j21n2K34kj61K73
$$ y = [185, 265, 94, -43, -222, 57, 136, 123, 33, 25, -125, -16, -3, -77, -120, -95, -125, 36, -31, 213, 253, 54, -116, 31, -196, 190, 72, -81, -74, 51, 64, 138, 94, 74, -56, -56, -22, -262, 322, 136, -21, -221, 107, 111, 33, -35, -40, -15, -93, -125, -90, 10, 87, -27, 366, 4, -47, -62, 207, 195, -126, -149, 7, -30, -143, 29, -119, 60, 266, -125, -203, -222, -97, -98, -94, 209, 187, -122, -112, -7, 101, -150, 146, -3, -32, 5, -50, -185, 116, 2, -126, 167, -74, -146, -307, 90, 194, 56, -3, 120, -109, 53, -45, -182, -253, -10, -123, 279, 123, 156, -139, -168, -89, 17, -40, 53, 196, 180, -135, -82, -48, -67, -121, -72, 5, -119, -204, 7, -82, 55, -9, 248, 0, 134, 155, 70, -12, -47, 26, -47, 163, -13, 120, 26, -299, 53, -114, -46, 274, 63, 117, 230, 34, 51, -78, -18, -9, 189, 54, 43, 73, 85, 72, 83, -17, 93, 104, -51, -69, 210, -80, -108, 191, -85, 16, 24, -104, 42, 151, 37, 60, 82, -78, -32, -40, 52, 114, 37, -84, -136, 98, 96, -65, 208]
5309B08j06pj13J70k7M7k37J29O9j94j06n3N8L53j45l9k06n6Q4Q8q5N31l03j61
5333a01O6J72j78n9K54j60Q7k56K71k38J74r0J0J99q7o1J38k85R7k5J08j06R9
5356B9m1M2o3J12K51l82j08j7P0l6Q5j37K08K32P7m90J31O6k55O9K04j56J35K18
5380B44m41K41P1j60M14j22k69Mj30j6J58J90k99j8K54j71L53j95j48MR8o3PK18
5404B24j46J0n7J61m15L58n0j95k32J93J01m1K71k16J61O5k76K09m5k12J72p8
5426c8r4K06k49L24k02K00r9m5j82J20J11l69K77l2j1J4j49J94J86l24J02J91
5448A31k8j2j9j02J76l92K42J53k42K06j95NK30k15m0p9K66N8p0N5Ll31J78J73
5472A51k88K18k69K55K72k42k02J36m5o7N1r5J15o5m1K70j41p0K67l02J10J9l12
$$ y = [208, 102, 95, -18, 152, 125, 172, -65, 64, 133, -61, -167, -220, -162, 191, 46, 7, -199, -255, -171, -83, -168, 363, 60, -101, -35, 137, -41, -100, 154, -6, 81, -175, 96, -142, 32, -58, -48, 151, 64, 3, 141, -144, -47, -72, 36, -70, 29, -12, 30, -33, 79, 330, -52, -160, -177, -107, -143, -58, -195, 13, 245, 322, -168, -37, 29, -226, -157, 47, -109, 26, 244, -197, 44, 115, -45, 369, 247, -22, -18, -148, -164, -6, 184, -115, -133, 121, -50, 303, 108, -40, -36, 62, -1, 6, 224, 78, 88, 31, 192, -223, 135, 85, -110, -342, -149, -48, -89, 182, -34, 127, 192, -84, 125, 80, -132, 40, -38, -132, 74, -175, 149, -53, 147, 48, 3, -179, -59, 52, -317, -40, -72, -83, -69, -218, -24, 162, -162, -60, 131, 103, 91, 72, -30, 146, -246, -4, 149, -93, 113, -82, -77, 153, -62, -102, -181, 85, 143, 73, 128, 131, -200, -22, 151, -137, 81, -188, 67, 339, 97, -105, 31, -14, -81, -30, -125, -10, -75, -116, 154, 13, -57, 210, -92, 18, 37, -275]
5495b75L07q0j21K28l34J52L36j75k85L43j05r1J16j12R2jj03q2K71j52K47o3
5517A13j22j17J59P2j88K3K18j62k76K82J20o5k08L51k06J24J62l02K10j82J90
5538A96j06k37J33Nj71L09j08qO8j57J61P0k26J04N7j94P8K73m51j20K00K2J29
5561B7m0mJ94m35M23pl40J95j63J21N8l19K06oM0%j63J39n2Jj89L10j36J53k5
5586a2q2K41r1p8J9J63m7K0k50J61J76o4j48J26o5Nl4M2j04J2K66l32j8J22j22
5611i4O7k16K39k1J68k97J97K7k26N24l19m4j29j02O7L53m02n2M1PK82j78K36
5634A28k00K9j07L4Q1K63o8O6l64J88r0P5J9j61K88k37p0O0k14L56J28j80k5J59
5658A58j87j5OJ43k17Q2k7J36q4K39j40j37K32k57J9K22o5k8J1j50l5k0N4k2L
$$ y = [-275, 32, -48, -169, 59, -275, -123, 213, 38, -247, 96, -9, -100, 16, -96, -4, -5, -108, -190, 81, -71, 176, 113, -9, -126, 33, 105, -83, -60, 158, -4, -280, 2, 122, 57, -151, 200, -6, 118, 280, -22, 188, 6, 196, 90, -147, -14, -9, -180, 129, 21, 13, 81, -76, 85, 155, -71, 33, 90, -104, -26, 247, -204, -324, -124, -102, 27, -13, -17, 177, -258, 165, 158, -182, 13, -150, -29, 29, -290, -84, -90, -50, -50, -213, -74, -126, -125, -314, -4, -140, 13, -12, -94, 147, 56, -22, -3, 160, 113, 133, -117, 44, 220, 156, 8, 134, 69, 74, 40, 82, -22, -10, 256, -76, -94, 28, -94, -27, -243, -4, -25, 143, -154, 43, 70, -156, 368, 49, 5, -124, -226, -159, 194, -208, -260, -219, -212, 70, -108, 128, -72, -43, -150, -116, -35, 228, 160, 226, -138, 50, -40, 35, 54, -107, 181, -56, -126, -66, -280, 76, 204, 24, -1, 158, -29, -44, -38, 105, -112, -30, -57, 79, -5, 234, 94, -43, 189, -68, -49, 173, 108, 80, 91, -59, -94, -114, -60, -82, -79]
5683g9n3M81j58j42J0k42M44p5k45l8nK46M2n60M20O5n97N29k09J93k40J4J11
5706h8K54M6j99k8m3P0k37L37l12K24l1j94K68j31j08K82J55m93O2K7J33k04L74
5729A64r2k28J75J33l63L03K1r8M2K25l10m1J45L81n64J70j22J49j08j16L21P6
5751B63m9k82J25l5r3M19m24j47J66J05r5K88k64%P6k05K3K57j0k25L09j15j25
5774c8Ll2Nm1K07j23J45n4p1O3j12K46k44J74j4R6m19K92Jk52J21J38k7p3j02
5799a11P7J10N1q4l9K0k65R0K96o9j56j02J56p8K56o8k25J08k35O20k99j97J43
5822ap8J78k84L08j87m8K27j40j50O1J26R6l17L67j37PJ22k83L22k02j08r4J68
5845d7P6k8J39J10k50mr8J94l08K95O7l85J92M8o2K20k40J8K8j91J82J02l26K90
$$ y = [-79, -132, 349, 191, 49, 59, -183, 261, 186, -59, -97, -102, 144, 186, -374, 46, 111, -486, 43, -166, 27, -213, -199, -88, 166, 212, 13, -15, -58, 12, -225, 112, -200, 24, -7, -201, 67, -64, -172, 110, 265, -228, -166, -139, -6, -210, 164, 72, -156, 19, 152, -211, 92, 113, 15, 57, 282, -28, -69, 76, 457, -107, 63, -59, 90, -18, -134, 187, 263, 214, -68, 57, 22, -71, 348, -76, -223, -57, 48, -47, 241, -23, -23, 53, -152, -129, 128, 118, -107, 202, 87, -38, -35, -67, -62, -103, 104, -19, 126, 72, 1, 64, -48, 198, -46, 128, 114, 210, -209, 83, 84, -168, -47, 91, 64, -9, -111, -34, 76, 127, 43, 4, 24, -241, -151, 145, 76, -80, -182, -26, -104, 152, 84, -141, -33, -268, 352, 53, -144, -1, -79, 99, -185, 123, -64, -112, 115, -25, -175, -114, 12, 108, -209, 158, 21, 28, 150, -133, 189, -13, -121, -215, -47, 29, 1, 140, 250, 0, -4, -102, 92, -216, 79, 146, -239, -47, 1, -61, 159, -81, -63, -35, -226, -44, 58, -268, 22]
5869B2j63j4L16k99m1L4L09l96K58J81l01K17l99J70k9K44k5j3O8K8p2k16N8j46
5893b09L00K2M5l51K55m3q3o1M1R1r9J15j61J83Pj26j48K46j8Q3j68J58Kk34Q6
5918f7n1N2nO8n2JK30k57L21j33j0o6J74k18j15r1J95P5j00l7j66L9K10m2M6J95
5944A96j58J87k15%p3J08k30L31q8o4N4m8L0K6Q5l9o2Mj01k13K60L6J3r1Q6j31
5970i7J14N0J2k53K95N2k54J33N8p2J2J31j48L5k06J13K66k62J02N2l5l27J78
5993e1p2J59J12p9o1P3j94K12m0n8P0j11J50k52J21J0J52k05k72M57J63l17r1
6016a24J18j03J23J65j98l6J69j29K43n03K12N0n6oKP2p0J4o9Q9K99j37k9J03
6040A99m40N03j60q6K59m54J82R3j31n4k9O9n3J12N6J90j23n7J6m8O3Q4j31j60
$$ y = [22, -141, -155, 161, -138, -179, -145, 164, -232, 26, 207, -94, 123, -276, -106, -135, 109, 84, 71, 139, 167, 95, -121, -63, -209, 91, 113, 158, -193, 62, 19, -64, -125, -84, 7, -92, 23, -138, 45, 52, -74, -222, 24, 6, 89, -79, 79, 81, -153, -67, -118, -66, -71, -3, -55, -54, 176, -81, 240, 107, 97, 31, 205, -13, -128, -219, -24, 51, -49, -86, -252, -213, -3, -45, 1, 196, 38, 225, 10, 10, -63, 45, -185, 146, 58, -6, 48, 0, 30, 56, 141, 102, 40, 44, -57, -270, -10, 26, 39, -52, 34, -97, 17, 67, 79, -174, 121, 173, -81, 52, 110, 38, 50, 181, 33, 68, -138, -25, 241, -21, 81, 133, 98, -229, -51, -123, 36, 148, 69, 8, 81, -113, 99, 59, 1, 71, -40, 110, -142, -21, -11, 141, -64, -336, 121, 284, -33, -124, -6, -109, 14, 179, -19, -55, 114, -15, 228, -275, -63, -13, -69, -75, -73, -1, -71, -57, -126, -37, 262, 125, 96, 199, -241, 262, 102, 16, 275, -179, 3, 96, -35, -89, -118, -49, -102, 10, 66, 256, 133, 76, 92, 44, 107, 191, 60, -100]
6064a00L6J4Q2or8L4k2K13l06o6J49J69M8L4n8m2k16N4p2K29J6j87j9J50nK19
6090B50k84J73j56l2l6J14j09j06J85J8k31K88J55l97k30M19k20J94j3J36j34
6111a6J43j78R6p6O0n1J29j60L20l34Q2j83J14K22j53m5k83J49J17O6n1L83l32
6134A9j70K59j50k9J10k44K2q2K16o1K16k51K20j69J79j15L78m45O8l6q4J90l07
6157b66N00j22l3J30q8r2p2Q7k14J62L11l41N4j29R7l52K84O6K51l62L31n8J7
$$ y = [-100, -64, -50, 32, 26, -72, -38, -60, 153, -153, -219, -70, 99, 147, 181, 123, 81, -135, -81, -153, 76, 92, -95, -114, 36, 31, 250, -34, 139, -17, -49, -85, 29, -80, -186, -1, 17, -214, 74, 229, -168, -398, 21, -199, -5, -18, 118, -16, 127, -51, 45, -31, 29, -22, 107, -53, 267, -67, 15, -168, -54, 168, 15, -30, -313, -164, -47, 19, -32, 351, 19, -151, 108, -42, -71, 39, -205, -183, -265, -49, -110, 106, -145, 75, -94, 85, -30, 348, -97, -29, -65, -149, 41, -266, 234, 112, 79, 209, 121, 29, -43, 44, -170, -8, 303, -38, 16, -113, -16, -368, -84, -18, 233, -129, 202, 144, 161]
$$ [...]
8191C4
##END NTUPLES=NMR FID
##END=
