##TITLE=1H_SA_s1.LFRD.1
 CDCl3, 108 sc, 
 27.04.2021
##JCAMPDX= 6.0         $$ Bruker NMR JCAMP-DX V2.0
##DATA TYPE= NMR FID
##DATA CLASS= NTUPLES
##ORIGIN= UXNMR, Bruker Analytische Messtechnik GmbH
##OWNER= root
$$ XWIN-NMR		Version 3.5
$$ Tue Apr 27 16:13:35 2021 Russian Standard Time (UT+4h)  she@DPX200
##.OBSERVE FREQUENCY= 200.131506
##.OBSERVE NUCLEUS= ^1H
##.DELAY= (6, 6)
##.ACQUISITION MODE= SIMULTANEOUS
##.ACQUISITION SCHEME= undefined
##.AVERAGES= 108
##.DIGITISER RES= 18
##SPECTROMETER/DATA SYSTEM= spect
##.PULSE SEQUENCE= zg30
##.SOLVENT NAME= CDCl3
##.SHIFT REFERENCE= (INTERNAL, CDCl3, 0, 15.7039)
##AUDIT TRAIL= $$ (NUMBER, WHEN, WHO, WHERE, WHAT)
$$ ##TITLE= Audit trail, XWIN-NMR		Version 3.5
$$ ##JCAMPDX= 5.01
$$ ##ORIGIN= Bruker BioSpin GmbH
$$ ##OWNER= she
$$ F:/spectra/data/she/nmr/H-F/1/audita.txt
$$ ##AUDIT TRAIL=  $$ (NUMBER, WHEN, WHO, WHERE, WHAT)
(   1,<2021-04-27 16:12:01.67 +0400>,<she>,<DPX200>,
      <continue with go, POWCHK disabled, PULCHK disabled
       configuration hash MD5:
       00 E9 B6 7A A2 85 ED C7 34 08 36 98 17 FE 4E 26
       data hash MD5: 16K
       55 33 E0 34 68 AD 70 D4 5F 48 FE 49 93 4F 25 9A>)
$$ ##END=
$$ 
$$ hash MD5
$$ 49 EF 2E 24 F4 63 70 58 04 60 F9 41 6E A6 05 8C
##$RELAX= 
##$RELAX= 
##$RELAX= 
##$RELAX= 
##$RELAX= 
##$RELAX= 
$$ Bruker specific parameters
$$ --------------------------
##$DU= <F:/spectra>
##$EXPNO= 1
##$NAME= <H-F>
##$PROCNO= 1
##$TYPE= <nmr>
##$USER= <she>
##$AMP= (0..31)
100 100 100 100 100 100 100 100 100 100 100 100 100 100 100 100 100 100 
100 100 100 100 100 100 100 100 100 100 100 100 100 100 
##$AQSEQ= 0
##$AQ_mod= 1
##$AUNM= <au_zg>
##$AUTOPOS= <>
##$BF1= 200.13
##$BF2= 200.13
##$BF3= 200.13
##$BF4= 200.13
##$BF5= 200.13
##$BF6= 200.13
##$BF7= 200.13
##$BF8= 200.13
##$BYTORDA= 1
##$CFDGTYP= 0
##$CFRGTYP= 5
##$CHEMSTR= <none>
##$CNST= (0..31)
1 1 145 1 1 1 1 1 1 1 1 1 1 1 1 1 1 1 1 1 1 1 1 1 1 1 1 1 1 1 1 1 
##$CPDPRG= <>
##$CPDPRG1= <>
##$CPDPRG2= <>
##$CPDPRG3= <>
##$CPDPRG4= <mlev>
##$CPDPRG5= <mlev>
##$CPDPRG6= <mlev>
##$CPDPRG7= <mlev>
##$CPDPRG8= <mlev>
##$CPDPRGB= <>
##$CPDPRGT= <>
##$D= (0..31)
0 1.2 0 0 0 0 0 0 0 0.06 0 0.03 0 0 0 0 0.0002 0 0 0 0 0 0 0 0 0 0 0 0 
0 0 0 
##$DATE= 1619525136
##$DBL= (0..7)
120 120 120 120 120 120 120 120 
##$DBP= (0..7)
150 150 150 150 150 150 150 150 
##$DBP07= 0
##$DBPNAM0= <>
##$DBPNAM1= <>
##$DBPNAM2= <>
##$DBPNAM3= <>
##$DBPNAM4= <>
##$DBPNAM5= <>
##$DBPNAM6= <>
##$DBPNAM7= <>
##$DBPOAL= (0..7)
0.5 0.5 0.5 0.5 0.5 0.5 0.5 0.5 
##$DBPOFFS= (0..7)
0 0 0 0 0 0 0 0 
##$DE= 6
##$DECBNUC= <off>
##$DECIM= 32
##$DECNUC= <off>
##$DECSTAT= 4
##$DIGMOD= 1
##$DIGTYP= 9
##$DL= (0..7)
0 120 120 120 120 120 120 120 
##$DP= (0..7)
150 150 150 150 150 150 150 150 
##$DP07= 0
##$DPNAME0= <>
##$DPNAME1= <>
##$DPNAME2= <>
##$DPNAME3= <>
##$DPNAME4= <>
##$DPNAME5= <>
##$DPNAME6= <>
##$DPNAME7= <>
##$DPOAL= (0..7)
0.5 0.5 0.5 0.5 0.5 0.5 0.5 0.5 
##$DPOFFS= (0..7)
0 0 0 0 0 0 0 0 
##$DQDMODE= 0
##$DR= 18
##$DS= 0
$$ [...]
##$SUBNAM2= <"">
##$SUBNAM3= <"">
##$SUBNAM4= <"">
##$SUBNAM5= <"">
##$SUBNAM6= <"">
##$SUBNAM7= <"">
##$SUBNAM8= <"">
##$SUBNAM9= <"">
##$SW= 16.9725357007746
##$SWIBOX= (0..15)
0 0 2 0 0 0 0 0 0 0 0 0 0 0 0 0 
##$SW_h= 3396.73913043478
##$TD= 16384
##$TD0= 1
##$TE= 0
##$TE2= 300
##$TE3= 300
##$TEG= 300
##$TL= (0..7)
0 120 120 120 120 120 120 120 
##$TP= (0..7)
150 150 150 150 150 150 150 150 
##$TP07= 0
##$TPNAME0= <>
##$TPNAME1= <>
##$TPNAME2= <>
##$TPNAME3= <>
##$TPNAME4= <>
##$TPNAME5= <>
##$TPNAME6= <>
##$TPNAME7= <>
##$TPOAL= (0..7)
0.5 0.5 0.5 0.5 0.5 0.5 0.5 0.5 
##$TPOFFS= (0..7)
0 0 0 0 0 0 0 0 
##$TUNHIN= 0
##$TUNHOUT= 0
##$TUNXOUT= 0
##$USERA1= <user>
##$USERA2= <user>
##$USERA3= <user>
##$USERA4= <user>
##$USERA5= <user>
##$V9= 5
##$VALIST= <valist>
##$VCLIST= <CCCCCCCCCCCCCCC>
##$VD= 0
##$VDLIST= <DDDDDDDDDDDDDDD>
##$VPLIST= <PPPPPPPPPPPPPPP>
##$VTLIST= <TTTTTTTTTTTTTTT>
##$WBST= 1024
##$WBSW= 4
##$XGAIN= (0..3)
0 0 0 0 
##$XL= 0
##$YL= 0
##$YMAX_a= 1536062
##$YMIN_a= -1344367
##$ZGOPTNS= <>
##$ZL1= 120
##$ZL2= 120
##$ZL3= 120
##$ZL4= 120
##$ABSF1= 10
##$ABSF2= 0
##$ABSG= 5
##$ABSL= 3
##$ALPHA= 0
##$AQORDER= 0
##$ASSFAC= 0
##$ASSFACI= 0
##$ASSFACX= 0
##$ASSWID= 0
##$AUNMP= <proc_1d>
##$AZFE= 0.1
##$AZFW= 0.1
##$BCFW= 1
##$BC_mod= 2
##$BYTORDP= 1
##$COROFFS= 0
##$CY= 11.3945322036743
##$DATMOD= 1
##$DC= 2
##$DFILT= <>
##$DTYPP= 0
##$F1P= 15.9154993809931
##$F2P= -4.1035820241983
##$FCOR= 0.5
##$FTSIZE= 0
##$FT_mod= 4
##$GAMMA= 1
##$GB= 0.15
##$INTBC= 1
##$INTSCL= 1
##$ISEN= 128
##$LB= 0.24
##$LEV0= 0
##$LPBIN= 0
##$MAXI= 10000
##$MC2= 0
##$MEAN= 0
##$ME_mod= 0
##$MI= 1.114404
##$NCOEF= 0
##$NC_proc= 0
##$NLEV= 6
##$NOISF1= 3.799351
##$NOISF2= 2.8
##$NSP= 1
##$NTH_PI= 0
##$NZP= 0
##$OFFSET= 15.70392
##$PC= 1
##$PHC0= -11122.34
##$PHC1= 16.80102
##$PH_mod= 1
##$PKNL= yes
##$PPARMOD= 0
##$PSCAL= 0
##$PSIGN= 0
##$REVERSE= no
##$SF= 200.130013532006
##$SI= 16384
##$SIGF1= 3
##$SIGF2= 2
##$SINO= 400
##$SIOLD= 16384
##$SREGLST= <1H.CDCl3>
##$SSB= 0
##$STSI= 0
##$STSR= 0
##$SW_p= 3612.71676300578
##$SYMM= 0
##$S_DEV= 0
##$TDeff= 0
##$TDoff= 0
##$TI= <>
##$TILT= no
##$TM1= 0
##$TM2= 0
##$TOPLEV= 0
##$USERP1= <user>
##$USERP2= <user>
##$USERP3= <user>
##$USERP4= <user>
##$USERP5= <user>
##$WDW= 1
##$XDIM= 8192
##$YMAX_p= 0
##$YMIN_p= 0
$$ End of Bruker specific parameters
$$ ---------------------------------
##NTUPLES= NMR FID
##VAR_NAME=  TIME,          FID/REAL,        FID/IMAG
##SYMBOL=    X,             R,               I
##VAR_TYPE=  INDEPENDENT,   DEPENDENT,       DEPENDENT
##VAR_FORM=  AFFN,          ASDF,            ASDF
##VAR_DIM=   8192,          8192,            8192
##UNITS=     SECONDS,       ARBITRARY UNITS, ARBITRARY UNITS
##FACTOR=    0.0002944,     1,               1
##FIRST=     0,             0,               0
##LAST=      2.4114304,     0,               0
##MIN=       0,             -1344367,        0
##MAX=       2.4114304,     1536062,         0
$$ Real data points
##PAGE= N=1
##DATA TABLE= (X++(R..R)), XYDATA
0@%%%%%%%%%%%%%J08k16K16k16K16l24M32m32N40o55P63r72J101j209J404j631
29h75J931k244K507k831L239l668M104m579N127n742O395p101P880q730R665j0686
45e608J1790j3000J4326j5771J7366j9129K1072k3228K5630k8316L1361l4831
57a8338L8819m3472M8969n5584O3702p3936Q7277j05412J31482j72111K43927
68A45323m04883J318624j48547k254884K850369j962362J97767J698407k365805
77i25991J231602M13851j461893J684047j025438l42984J262242j166984M69680
86A38132L25579j036285R18418j01702o38917P24265m58094j92730Q83353r20284
96c58265J22367P01074r97513P36647M4311r63035J241065n98023m17335J139634
$$ plain form
0 0 0 0 0 0 0 0 0 0 0 0 0 0 0 108 -108 108 -108 108 -216 216 -216 324 -331 432 -540 561 -648 756 -875
29 -875 1056 -1188 1319 -1512 1727 -1941 2163 -2416 2711 -3031 3364 -3737 4143 -4587 5078 -5608
45 -5608 6182 -6818 7508 -8263 9103 -10026 11046 -12182 13448 -14868 16493 -18338
57 -18338 20481 -22991 25978 -29606 34096 -39840 47437 -57975 73507 -98604 145323
68 145323 -259560 1059064 910517 -1344367 1506002 -456360 -258593 1439814 -925991
77 -925991 305611 719462 -742431 941616 -83822 -426806 835436 -331548 138132
86 138132 463711 -572574 345844 244142 -394775 329490 -128604 -321334 562019 -358265
96 -358265 -235898 465176 -532337 204310 248621 -714414 526651 -71372 -488707 650927
106F50927j224991N01203N72711j277647J191995m27795n85413J240523j097758
115d56245K97431O10249j081261R29102j83150o31283R70482p03420N7535N53593
125C63033p76065N52175k9152n18120O84251l16114k18652N32551m58145Q9030
135i5208M20594o12232K90570K29891n22678N00339j44602l73456O27927m17697
145i6552k4446M61078p01560M73376J54854o20337O72661m18918q3915O49756
155D65997p75071L29233K45531o13482O71715l09052l20904O87082n74027J68570
165b4408L13977o26213M92356k1980l53667M41437l13154l4693L91791m01136
175a35690R9015J64413l25719L27148p9166k77570L68748j80624q1047K78474
$$ plain form
106 650927 -574064 -72861 499850 -777797 414198 -13597 -599010 641513 -456245
115 -456245 -158814 451435 -629826 299276 116126 -515157 455325 -248095 -190560 363033
125 363033 -413032 139143 109991 -408129 276122 -39992 -258644 273907 -184238 -95208
135 -95208 325386 -286846 3724 233615 -289063 211276 66674 -306782 321145 -96552
145 -96552 -120998 340080 -361480 111896 266750 -353587 319074 -99844 -183759 465997
155 465997 -309074 20159 265690 -347792 323923 14871 -306033 381049 -192978 -24408
165 -24408 289569 -336644 155712 133732 -219935 221502 -91652 -126345 265446 -135690
175 -135690 -36675 127738 -197981 129167 50001 -227569 141179 -39445 -120492 157982
185A57982l42035J30036J97386l74736L19705r2029k40112M35895l25202L0915
195a02195K57417m14729L23868L5149l51571L96278k10945n4772L36048m19195
205b04647K11323J25566l32875L37442j41841j21322K94967k75940R0150J75906
215A58729l18873K36907L924k14044K90077k01292k9223K58189k81676J00640
225C358J28384k72414K32656k4968k07030L19676k18799m4765K77518l09707J46414
236C0323R2323k76047K91895r1840j86486L11802k46840L7369K20389l46331K22592
247E9149K2489k29173K98667j88176o9387K68974k62177R2718J17015k95434K72468
258H7133l3088k02412K65479k04422K3525K08145k83116J25044R1210k20396K36809
$$ plain form
185 157982 -184053 -54017 143369 -231367 88338 -3691 -243803 192092 -133110 -102195
195 -102195 155222 -259507 64361 99510 -252061 144217 -66728 -121500 214548 -204647
205 -204647 6676 132242 -200633 136809 -5032 -126354 168613 -107327 -17177 158729
215 158729 -160144 76763 80687 -133357 156720 -44572 -73795 184394 -97282 3358
225 3358 131742 -140672 91984 67016 -140014 179662 -39137 -83902 193616 -116091 30323
236 30323 122646 -153401 138494 46654 -139832 171970 -74870 -37501 182888 -163443 59149
247 59149 81638 -147535 151132 -37044 -106431 162543 -99634 -6916 110099 -185335 87133
258 87133 54045 -148367 117112 -87310 -63785 144360 -138756 -13712 77498 -142898 93911
269I3911r0275j55457K81993j94903K2935J50671k60061J82040M3445j91783J96610
280G9126j10670o1159K38404k30695M2097J36241k13068K00007n3879j55551K30293
291A01146j34763j2708J60648k21762J11074R2283k07072J95459q8247q4404K36441
302A48095k06235L2251J28016j96770J58431M530j74440K13964j09562n6442J93986
313A35824k16349R4014Q5788j95711J76793m8626j17996J93971j29174k4828J56885
324A10591j93377R7525N3689j73404J81848p5894q5004J74364j40821J2312J15998
335G7827j75641J16147L4058j59769J73870r7415l9907J67194j75415N7651P5681
346E4281j49908J37528l1345j10611J75670j16067l441J20366j76496J12721L2679
$$ plain form
269 93911 3636 -151821 130172 -64731 -41796 108875 -151186 30854 74299 -117484 79126
280 79126 -31544 -92703 145701 -84994 -42897 93344 -119724 80283 26404 -129147 101146
291 101146 -33617 -46325 114323 -107439 3635 95918 -111154 84305 -3942 -88346 148095
302 148095 -58140 -25889 102127 -94643 63788 68318 -106122 107842 -1720 -58162 135824
313 135824 -80525 13489 99277 -96434 80359 31733 -86263 107708 -21466 -46294 110591
324 110591 -82786 14739 68428 -104976 76872 978 -84026 90338 -50483 -38171 77827
335 77827 -97814 18333 52391 -107378 66492 -30923 -70830 96364 -79051 -21400 54281
346 54281 -95627 41901 10556 -100055 75615 -40452 -43893 76473 -100023 12698 45377
357D5377j25811J32775p3674l8105J38355j26485J9545Q4429j28099J15965k3496
368B0776r6743J43868q2856p154R5273j20868N7827M7763j10951J13195m1730
379A8400p0810J45056j15378J1918P7734j23649J04182q492j00021J31814p4916
390d162l0936J25181j38350O0835N0674j35678J34211n0027o6294J23579j02263
401c3230J9913P3613j31614Q8078J9531j03816J24662p4422k9403J14999j12521
412d4210M0556M5078j04914R5269j2780r0573J17636p4890j0633J02608j37364
423g4217O7194M0237j04215J09192m8012n2149J28313j03224Q506Q1862j27125
434g3638J07620j0258r6070J33584r2296Q56J01123j26795O3579M0305j00530
$$ plain form
357 45377 -80434 52341 -21333 -59438 78917 -47568 -28023 56406 -71693 44272 20776
368 20776 -75967 67901 -14955 -22109 73164 -47704 10123 57886 -53065 60130 18400
379 18400 -52410 92646 -22732 -10814 66920 -56729 47453 38961 -61060 70754 -4162
390 -4162 -35098 90083 -48267 12568 63242 -72436 61775 11748 -54546 69033 -33230
401 -33230 -13317 60296 -71318 16760 36291 -67525 57137 -17285 -46688 68311 -44210
412 -44210 -3654 41424 -63490 31779 18999 -71574 46062 -28828 -39461 63147 -74217
423 -74217 -7023 33214 -71001 38191 -9821 -61970 66343 -36881 -28375 53487 -73638
434 -73638 33982 23724 -72346 61238 -31058 -30202 70921 -55874 7705 48010 -52520
445e2520J10139n7836m3877J31168j14649K7893N3060j04679J02514k5095q2803
456e6685J18572n7366l3954R8572j11500N1542N4088j19506J10727l1605p7466
467e4581J30161q2214k1925J01883j26677P3349M3306j50328J43719m1286o4505
478d9098J34126j35972L9534R2994j49882J00196N284j09665J48621r8379k8829
489e1070J29609j47239O9891M2102j19819J08200l8817n5323J18941r6924k455
500d2904R6421j18772O6604K0844j00603J17309m2552n9507J05879p4099l032
511c4412Q2218j06068P1763K2984j15476J35343n1963m8054J10748j05516M4070
522E637N5598j23775J02858p946q2355J27640j01228P814Q9996j28862R4412j652
$$ plain form
445 -52520 57619 -217 -44094 87074 -27575 318 53378 -51301 51213 26118 -56685
456 -56685 61887 4521 -29433 69139 -42361 9181 63269 -56237 54490 22885 -54581
467 -54581 75580 -6634 -28559 73324 -53353 19996 63302 -87026 56693 15407 -49098
478 -49098 85028 -50944 -11410 81584 -68298 31898 37182 -72483 76138 -22241 -51070
489 -51070 78539 -68700 1191 43293 -76526 31674 -7143 -62466 56475 -40449 -42904
500 -42904 53517 -65255 1349 22193 -78410 38899 -3653 -63160 42719 -31380 -34412
511 -34412 47806 -58262 13501 36485 -78991 56352 4389 -43665 67083 -38433 5637
522 5637 61235 -62540 40318 32372 -49983 77657 -23571 -15757 74239 -54623 39789 38137
534C8137r0284J12571o0848j9246Q0620j01460N4381M1816j06365Q9525l0297
545H550m0545R2014q0960N586O6580q3926L8289L2621r2964Q6951j6592o5940
557e0336J00023q2202N795P9595j10404O1106K4374j00072J13943n0028n7543
568f5749J29916j17113L6206N8651j22509J12841l2515o6127J19139q6599p81
579c4640P8037j03932P1839J1428q8393J03245m7612k3754O9579p1045K8236L6926
591B9914o6235M6214R592o4686P4056k1038l2259O0357o3110K9571M4163q4231
603c7692M7943J9827n6886P2224n4991j6683R1289r5028M6348J8230p8214R7157
615E3524m9472k1773P5824q5325M1946L6048q9122P9358l3640l0738R0279r4725
$$ plain form
534 38137 -52147 60424 -424 -19670 60950 -40510 13871 55687 -50678 38847 8550
545 8550 -31995 60019 -20941 -15355 51225 -32701 5588 38209 -54755 32196 15604 -50336
557 -50336 49687 -32515 -26720 52875 -57529 3577 27951 -72121 41822 -8206 -65749
568 -65749 64167 -52946 -16740 41911 -80598 32243 -272 -66399 52740 -33859 -34640
579 -34640 43397 -60535 11304 22732 -65661 37584 -10028 -33782 35797 -35248 -7012 29914
591 29914 -36321 9893 19485 -45201 28855 7817 -24442 35915 -27195 2376 46539 -37692
603 -37692 10251 30078 -26808 45416 -9575 -26258 65031 -29997 16351 34581 -43633 53524
615 53524 4052 -17721 58103 -27222 14724 50772 -38350 41008 7368 -23370 66909 -27816
627b7816K3555M4762p1628N6363j6400m1243P0848m3929k1142N8495n9528K5210
639b453K8104p0364N7708m821n3532O5349l0057k5500O8845p5707K6698M9003
651C3273r8295Q6182j4681o4450R9820p1740L209P0296j04552O9637K3233r5957
663f4025R8029m9928j8362R1969j05193M1282M1005p4283O6383j9444m6687Q0901
675D1647m4504j1609N2036o9177M1579K6845o2011M3341r632k5268O1018m6492
687b227j9483O6800n9481K8557J8313p4566P6699j9343l5900O2994o5746J8805
699d578N2050q2264N2382j755n3966R1285o8047q476O1255p3492N4308k69o5884
712d7451P2853k6536k5776O0337o5733K2321M1775o8771M8072r326l5672O1154
$$ plain form
627 -27816 -4261 40501 -31127 25236 8836 -32407 38441 -5488 -26630 31865 -27663 -2453
639 -2453 25651 -44713 12995 8174 -45358 19991 -10066 -35566 33279 -42428 -15730 33273
651 33273 -65022 21160 6479 -57971 41849 -29891 -26682 43614 -60938 8699 31932 -64025
663 -64025 34004 -15924 -34286 57683 -47510 -6228 34777 -39506 26877 7433 -39254 41647
675 41647 -2857 -14466 37570 -31607 9972 36817 -25194 18147 8515 -16753 44265 -2227
687 -2227 -21710 45090 -14391 14166 32479 -42087 34612 15269 -20631 42363 -23383 -4578
699 -4578 47472 -34792 17590 15835 -38131 53154 -14893 -23369 37886 -35606 18702 18433 -47451
712 -47451 25402 -1134 -26910 33427 -32306 -9985 31790 -36981 11091 1765 -33907 27247
724B7247l5136j7352M5087m9370K0522M0109p4966M7540N665m6364O5945m9268
736b0341q578O4857o5174K3061L1124p1457O5800j0954m5406P8937o7953J0592
748a5492N6001p3768M6961M907m9483O9362l2637k9784O5058n3630J8530L0817
760C6842o2226M7956n220l5126M9522k7443j5623M4050m0714J0639K5593n1976
772b3726M2366k941l2624M3797l5036k652L7838m0967J3665J6142m1289M2124
784A6697j3881k4423M3721m2402J9425K0936m5961K8658k720j7909L7103l3220
796a3976q735L9447l7124K3035k51l4574M7253k0716q379K2508l0490J8068K1277
809A7343l8757K0391j332j8318M4360l6520o289L2308k6445K0260j546k9382L3220
$$ plain form
724 27247 -7889 -25241 19846 -29524 -9002 31107 -43859 3681 9346 -37018 28927 -20341
736 -20341 -28919 35938 -29236 -6175 24949 -46508 19292 8338 -37068 41869 -26084 -15492
748 -15492 40509 -33259 13702 18609 -30874 38488 5851 -23933 41125 -12505 6025 36842
760 36842 -25384 22572 17352 -17774 31748 4305 -11318 32732 -7982 2657 28250 -23726
772 -23726 18640 15699 -16925 26872 -8164 -10816 27022 -13945 -280 15862 -25427 16697
784 16697 2816 -21607 22114 -20288 -863 20073 -25888 2770 50 -17859 19244 -13976
796 -13976 -22711 16736 -20388 2647 2396 -32178 15075 -5641 -14020 8488 -22002 -3934 17343
809 17343 -21414 -1023 -2355 -20673 23687 -12833 -19122 13186 -13259 7001 5455 -23927 9293
822I293M95k1460K9809l3238Q008L6922m2721J9187j58j6160L7572k3859j7380
835a3690L5584k3487Q919J6400m4395L6921l374k1033L1751l1660O764K4247k9345
848f398J2786K111k1431L5198j8517j6900L1304k9122J5580O502k6019K3915n480
861C529j5021K1087j5396k650K1446k9032J5520M758k3071K6808j7929k978K3130
874A0201k6291M325J7062k6022K1276j599k3630L3496k2693L140K2011l6939K6328
887F65P478k6189K5240j4656q935M0632l8006O278K2435l3677L6785j3876k2815
900a8641L8795j9847l412K4842l5273J6602J9169l2027K6959j6227j4165M0250
912B7025k6437m825J9143k2280J8489P877l6716L1005k645j8478L2079l2907M479
$$ plain form
822 9293 9788 -11672 18137 -15101 -7093 29829 -12892 6295 6137 -10023 27549 3690 -13690
835 -13690 21894 -1593 7326 23726 -20669 16252 12878 -8155 23596 -8064 -1300 22947 -6398
848 -6398 6388 8499 -12932 22266 3749 -13151 18153 -10969 4611 11113 -14906 9009 3529
861 3529 -11492 9595 -5801 -8451 12995 -16037 -517 4241 -18830 7978 -9951 -12929 10201
874 10201 -16090 -11765 5297 -20725 551 -1048 -24678 8818 -13875 -10735 11276 -25663 665
887 665 8143 -18046 7194 -7462 -16397 24235 -13771 -7493 14942 -18735 18050 4174 -18641
900 -18641 20154 307 -3105 21737 -13536 3066 22235 -9792 17167 940 -13225 27025
912 27025 588 -4237 14906 -7374 11115 18992 -17724 13281 10636 -7842 24237 -8670 -4191
925d191K4814l1734J9167J481k6490L3685j3833j5935L2140l4794J9201J5711
937A9222l9924L0409j0040j1878K7739k5894k98K1305k6896J7003J209k3242L2339
950A1054j9413l805K0230k4451J1488P527j6318J2103j636j5522K6116j7137m022
963a3786K1979k3118J3095O647j9986K0519m888j3458K8381j9554m064K3401l0123
976a4955K5903k514k5416L5309j9182m435K3601k6509J3665J2640k9849K8767
988A7025j0058j8337L2201k2589O763P762k2784J9485K518j8515J6104l097j1026
1001d548K1816k0271K435J2471j8134J5105k032j4844J3292l557q050J8115k2507
1014a0709L807K0165k5138J4908r178n675K5314k1892o87J0973j4046J4569k047
$$ plain form
925 -4191 20623 -11111 8056 9537 -16953 16732 2899 -13036 19104 -15690 3511 19222
937 19222 -20702 9707 -333 -12211 15528 -10366 -10664 10641 -16255 748 1957 -21285 11054
950 11054 -8359 -12164 8066 -16385 -4897 2630 -13688 -1585 -3221 -18743 7373 -9764 -13786
963 -13786 8193 -14925 -1830 4817 -15169 5350 462 -12996 15385 -4169 -8233 15168 -14955
976 -14955 10948 8434 -16982 18327 -855 -5290 18311 -8198 5467 18107 -11742 17025
988 17025 6967 -11370 20831 -1758 5005 12767 -10017 9468 11986 -6529 9575 6478 -4548
1001 -4548 17268 -3003 -568 11903 -6231 8874 6842 -8002 5290 1733 -6317 11798 -10709
1014 -10709 -6902 13263 -11875 3033 -6145 -11820 13494 -8398 -9085 1888 -12158 2411 364
1027C64j8289K3305j5965K119J5691k6836K0022j909o604J4482j7962J225J7565
1040G208j1761J368J472j1670K5695j2829j2145J9243j1082P378N062j6127J0458
1053B270P173j6615K0355q334j5745K7924k0595O777J1422k6575K2166L838k4508
1066a0447K3675j1334n372K9359l6259J3167J4685l0213K9464j2376j3509K8193
1078A9033k2608K43J7782k5745J6920N016k4151K6717j6258n334K1389k0420N360
1091b056R381j9275J3740J755j8981K3228j1972q730K2921k4005R558R197k1263
1104a6502J9824k529j8027K5333j5435o008K5631l0780J9526L792k4633K9701
1116I893j4886o856K2983k1112Q086J3021k9129K6604k569j9953K9480k1550L967
$$ plain form
1027 364 -17925 5380 -10585 -8466 7225 -19611 411 -1498 -8102 6380 -11582 -10357 7208
1040 7208 -4553 -3185 -1713 -13383 12312 -517 -12662 6581 -4501 2877 7939 -8188 2270
1053 2270 9443 -7172 13183 4849 -10896 17028 -3567 3210 14632 -11943 10223 14061 -10447
1066 -10447 13228 1894 -3478 25881 -10378 2789 17474 -12739 16725 4349 -9160 19033
1078 19033 -3575 -3332 14450 -11295 5625 10641 -13510 13207 -3051 -8385 13004 -7416 -2056
1091 -2056 7325 -11950 1790 3545 -15436 7792 -4180 -12910 10011 -13994 -4436 4761 -16502
1104 -16502 3322 793 -17234 8099 -7336 -13344 12287 -18493 1033 4825 -19808 9893
1116 9893 -4993 -11849 11134 -9978 -1892 11129 -18000 8604 6035 -13918 15562 -5988 -2021
1129b021J5015k4508J8445L962k1993K1790l433j7236K5839k0544M599K0396l1659
1142a1348J7238M947j9906K3463j0468j3904L1060k5003O03K2254l3075K5677
1154A1538J15k4492K9771j8689n907K8043k9187O130J6010k9358K7715p741k2973
1167a9025L3221j9868k28J3032k3889J6217R348k6456J8801k303j3641K3110k0853
1180a2534J882J6731k0579J2353L601j8369J7626j036j2230J8745j8781N649J7988
1193A1046k7009J6766M81j0672J9136j4288l541J9276j7068O899P918j8327K2935
1206A3552j1592p014J9868j8860R654O247j8391J3113P42j0205J6290j3950J4
1219e32J6126k0590J1195j65j1426J8040o321j0537J2507o757j210J2623k2727
$$ plain form
1129 -2021 12994 -11514 6931 10893 -11100 10690 7257 -9979 15860 -4684 -85 20311 -11348
1142 -11348 5890 10837 -9069 14394 3926 -9978 21082 -3921 -3318 18936 -14139 11538
1154 11538 11653 -12839 16932 -1757 -7664 20379 -8808 -2678 13332 -16026 11689 3948 -19025
1167 -19025 14196 -5672 -5900 7132 -16757 -540 8808 -17648 1153 -1150 -14791 8319 -12534
1180 -12534 -10652 6079 -14500 -2147 1454 -16915 711 -325 -12555 6190 -12591 -6942 11046
1193 11046 -15963 803 1284 -9388 9748 -4540 -8081 11195 -5873 1026 8944 -9383 13552
1206 13552 1960 -5054 14814 -4046 5608 11855 -6536 6577 7319 -2886 13404 -546 -532
1219 -532 15594 -4996 6199 6034 -5392 12648 6327 -4210 8297 1540 330 12953 -9774
1232i774J2807O520j7496J6530j2021l353J9233j6330j358J0498j5549J5755j368
1245D094j9449K2772j2744k44J1596k0902J3023P689j5735R220l882o908J9223
1258G753j5328P11J1687j6274J4661l092j1016J2716k798j954O714j2634M536
1271d318J2870j5097Q099k446l401J3090j1923P78O108n212N829n81j1054J3159
1285E901k182o744J2752j4442Q906N609j2826R723m420k214J2489j1961k187J2341
1299A0745j2788J0143j293j3368K0267j0776k618Q202j3600J0038O698j7975R689
1312C364jr190J8125j7647q6J3534j5891Q620J174j3665J2673P69j3269J4518
1326C028j2163Q67J5052k0947J0460L124j1664J3723o308q787J7002q940j272
$$ plain form
1232 -9774 3033 9553 -7943 8587 -3434 -6787 12446 -3884 -5242 5256 -10293 5462 4094
1245 4094 -15355 7417 -5327 -5571 6025 -14877 -1854 5835 -9900 -680 -4562 -11470 7753
1258 7753 -7575 -6864 4823 -11451 3210 118 -10898 1818 -980 -2934 3780 -8854 -4318
1271 -4318 8552 -6545 1554 -892 -4293 8797 -3126 -2348 3760 -1452 4377 3796 -7258 5901
1285 5901 3719 -3025 9727 -4715 4191 9800 -3026 6697 2277 63 12552 591 -1596 10745
1299 10745 -2043 8100 6807 -6561 13706 2930 312 8514 -5086 4952 11650 -6325 3364
1312 3364 3363 -5827 12298 -5349 -5435 8099 -7792 828 2002 -11663 1010 1779 -11490 3028
1326 3028 -9135 -8268 6784 -14163 -3703 -579 -12243 1480 -4828 -13615 3387 -5553 -6825
1339f825J2334j8663J3461K292j2405J4506q181j966J3480j2574Q18R968j1622
1352e377J0562j913r994J5625r729J002O877r674N867K170o718O677j733o162
1366b520J2350j0245J280O375r276R048k532o851Q164l138m284R201q610M085
1380C047M599j2983J2228o310l979J1424j1236K672N032q888N910R79j1790J4183
1394D888o227m333J0382j2797P133M284j1521P926j818m547R730p745k802J1029
1408C582j0733L844L223q163Q492j759m274O903m372k972J1504j0221J374P017
1422C445q458Q783n008m267R784k410j974K966n768M862L466r339P552j843r68
1437H23M430m155J309p15J273J376j683l835L817Q53n23m02l873N934j334K64
$$ plain form
1339 -6825 5509 -13154 307 2599 -9806 4700 -3481 -5447 8033 -4541 -3723 6245 -5377
1352 -5377 5185 3272 -6722 8903 -826 176 7053 -2621 3246 5416 -1302 5375 3642 -2520
1366 -2520 9830 -415 865 7240 -2036 7012 4480 -2371 5793 2655 -1629 7572 -1038 3047
1380 3047 7646 -5337 6891 581 -3398 8026 -3210 -538 4494 -4394 1516 2495 -9295 4888
1394 4888 -1339 -5672 4710 -8087 -954 3330 -8191 -265 -2083 -6630 3100 -4645 -7447 3582
1408 3582 -7151 -3307 -84 -8247 245 -1514 -5788 1115 -3257 -6229 5275 -4946 -3572 3445
1422 3445 -5013 3770 -1238 -5505 4279 1869 -105 2861 -2907 1955 5421 -3918 3634 1791 823
1437 823 5253 1098 2407 1692 2965 4341 2658 -1177 2640 3493 2970 2568 -1305 4629 3295 3559
1453C559k156j720M562k073n07m07J197j271K382l449K2K570m204N750n893q64
1469b502M357k694L50L169o570K344M733j0274Q407l263k744P841j0614M402L475
1484D17o248L737J63n107P203m390k267J0743j1410N770J451n636O317j796k580
1499c633N535k627j998P853p766L626K080n116P149m666j402N576l118j63L421
1514D751m558L421J119p543Q316m448m40P061p667L082o92k065M771j948m661
1529a501P442o375J978M048q740P776l589k554N300p081K367N567q290L433L123
1544B904r996J0816m677l691P836r421M052M483j0207N763K674o988Q588o324
1558d188m712J3800j1729K882O194j1144R429p1q778J1272m980n974J5152j2000
$$ plain form
1453 3559 1403 -317 4245 2172 1665 1258 2455 1184 3566 117 139 2709 -1495 4255 -1638 -2502
1469 -2502 1855 -839 -489 2680 -3890 -1546 3187 -7087 1320 -1943 -4687 3154 -7460 -3058 417
1484 417 -5831 -2094 -1931 -7038 165 -4225 -6492 4251 -7159 -1389 62 -5574 743 -1053 -3633
1499 -3633 1902 -725 -2723 5130 -2636 990 3070 -2046 5103 437 -965 4611 1493 1330 4751
1514 4751 193 3614 4733 -2810 5506 1058 618 7679 12 3094 2402 337 5108 3160 -1501
1529 -1501 5941 -434 1544 5592 -3148 4628 1039 -1515 3785 -3296 -929 4638 -3652 -219 2904
1544 2904 -7092 3724 -953 -4644 3192 -6229 -2177 2306 -7901 -2138 536 -6452 2136 -4188
1558 -4188 -8900 4900 -6829 -3947 2247 -8897 532 461 -8317 2955 -2025 -7999 7153 -4847
1572d847J295P930j1984J2139l844p364J2308n724m113Q559q440L727O604j2676
1586f430J0765l664m385R132o802J600N350o839K768N343r885O577R4m345P211
1601F490p633J787O164p701L678K179m676M702l857k222Q560p916J398K287o145
1616b905Q675n772l701O469l757j216L013o738O055k26o191P904p702K339M059
1631C06o672M703o85l232N592k920n642Q642m555K996K282q156P242L77m330M616
1647E64k602j446P334o159j83N893q411R985k269q582J0079l888N46N643q552
1662b048K430N868r274Q108k474m418J0270r360K427K499m973N820q06n282M951
1677C738j532k756O898q156L204L368n558M062l428j740M968j718k937N182n329
$$ plain form
1572 -4847 -3552 4378 -7606 4533 689 -6675 5633 -91 -4204 4355 -4085 -358 6246 -6430
1586 -6430 4335 671 -3714 5418 -1384 216 5566 -1273 1495 6838 -3047 3530 3624 -721 6490
1601 6490 -1143 644 6808 -893 2785 4964 288 4990 1133 -1089 7471 -445 953 3240 -2905
1616 -2905 5770 -2 -3703 2766 -991 -2207 806 -5932 123 -103 -6294 1610 -6092 -3753 306
1631 306 -6366 -1663 -2348 -5580 12 -2908 -8550 92 -4463 -1467 815 -7341 -99 278 -4052 564
1647 564 -2038 -3484 3850 -2309 -2492 3401 -5010 4975 2706 -5876 4203 315 861 6504 -2048
1662 -2048 382 6250 -3024 5084 2610 -1808 8462 -898 1529 4028 -945 4875 4069 -1213 3738
1677 3738 2206 -550 6348 -1808 1396 4764 -794 3268 -160 -1900 3068 1350 -1587 3595 -1734
1692a734J806J400o107P345m406j618N599o704J867K403l922M501q74n816Q519
1707B259p180J496M331q271Q756j937n760P946n115j254P513q641L910L953q839
1722f833P888j181m602Q277n717J067M994q535M179O190j0324Q068k208n176J0923
1737G010r461J726P366q187L721L426r532J0275k543o655J1564q814J737O444
1751H077j1014Q209l19o400P212k870n784R862p317J029N319j0561Q515o53n731
1766b426M998l494j924O494o683j132O102p411P132k924n445Q240m585M19L485
1781H46o042M114L528q721N832j776k502P351q263K932L571n314N053j304m490
1796e185O751j596k561O465r274O141M152r318O482k553j514O382n196k04O515
$$ plain form
1692 -1734 72 1472 -4635 2710 -1696 -3314 2285 -4419 -2552 -149 -4071 430 -444 -6260 2259
1707 2259 -4921 -3425 906 -7365 1391 -546 -6306 1640 -3475 -4729 2784 -5857 -1947 2006 -6833
1722 -6833 1055 -126 -4728 3549 -2168 -1101 3893 -4642 -463 5727 -4597 3471 1263 -3913 7010
1737 7010 -2451 -725 6641 -1546 2175 5601 -3931 6344 3801 -2854 8710 -104 1633 8077
1751 8077 -2937 5272 4953 -1447 5765 2895 -2889 6973 -344 685 6004 -4557 3958 3305 -2426
1766 -2426 2572 -922 -2846 3648 -3035 -4167 1935 -5476 1656 -1268 -6713 1527 -3058 -2639 846
1781 846 -5196 -1082 2446 -6275 -443 -2219 -4721 2630 -5633 -2701 870 -4444 609 -695 -5185
1796 -5185 1566 -30 -2591 3874 -5400 741 4893 -4425 2057 -496 -2010 4372 -824 -1028 5487
1811E487p180M172K144p441P881k866k933O902o664J846M103n974K907K441n992
1826a167O917m743k943R338p921J845L135n651K614K531n574M349j619k896O901
1841E116q545K858L190m914L566j866j797L805j721l198M669m602K450J117n157
1856e029L008K57j062O74j808P60K762j833q50J555k070M622l236p78J322o09
1872b315L110j619q20J104J144p40J455l341K278K896l219J740k013L9L967l374
1888B92L58J43m1J523P65l733L099L33r65J641l768L082Q28j568J330j430j312
1905E77K881j848j590L234l682L302K06l722J659J58m8k24n42j255K949k602k78
1922h25R3k031L252j970q50M28j130J821N16k305k65J968j361J603m022K475J693
$$ plain form
1811 5487 -1693 2479 4623 -2818 5063 2197 -736 6166 -498 1348 5451 -523 2384 4825 -1167
1826 -1167 5750 1007 -1936 7402 -519 1326 4461 -1190 1424 3955 -1619 2730 1111 -1785 5116
1841 5116 -3429 -571 2619 -2295 1271 -595 -2392 1413 -308 -3506 1163 -3439 -989 128 -5029
1856 -5029 -2021 -1764 -2826 -2152 -3960 -3200 -438 -2271 -3121 -1566 -3636 986 -2250 -3028 -1706 -2315
1872 -2315 795 -824 -1644 -540 604 -136 1319 -2022 256 3152 -67 1673 -340 -301 3666 292
1888 292 650 793 752 2275 3040 -693 2406 2739 1774 3415 -353 2729 3557 1989 3319 1889 577
1905 577 3458 1610 20 3254 -428 2874 3080 -642 1017 1175 1127 903 361 -894 2055 -547 -825
1922 -825 -732 -2763 489 -1481 -2331 -1903 -3033 -1212 -696 -3001 -3266 -1298 -2659 -1056 -5078 -2603 -910
1939i10j738J223k469K988K57o39n76N43J32L32j13j346K844k147K555n08k480
1956b052L143Q95m02J9j157P0L811n343J854J664l464N092l740O0J724j401O41
1973A414J353l268N06M925n678L535k427o89N899n795K09J454j038J009J014n352
1989b929M346J219l984L823m529K574J618k506j211K124j316M53J010m676L986
2004Bj492p52K487m183K829L23j557J56J67q90L008j243l441L464k98K301l368
2021b487M66J040K75N23k125J232q60K197j050O05l99M58O77j392R99k051L814
2038A922j6k373L95J195J789j89j539k018M310j294j563K039j928L289m63k164
2054A392M79J022r86J834k683k049M678k897N64o65j643L124k81j701k9p67k93
$$ plain form
1939 -910 -2648 -1425 -3894 -906 -649 -1288 -1864 -1321 -1189 -857 -970 -2316 528 -1619 936 428 -2052
1956 -2052 1091 1986 1584 1603 446 516 4327 -1016 838 2502 -962 4130 390 450 2174 773 1414
1973 1414 2767 -501 5 4930 -748 2787 360 -329 5570 -225 -16 1438 400 1409 2423 -2929
1989 -2929 1417 2636 -1348 2475 -2054 520 2138 -368 -1579 545 -771 -318 692 -3984 2
2004 2 -1490 -2242 245 -3938 -1109 -786 -2343 -2187 -2020 -2910 98 -1145 -4586 -1122 -1420 881 -2487
2021 -2487 -2021 -981 -706 -183 -2308 -1076 -1936 261 -789 -184 -583 -125 552 -840 159 -1892 1922
2038 1922 1906 -467 -72 1123 2912 2723 1184 -834 3476 2182 619 2658 730 4019 3556 1392
2054 1392 1871 2893 1907 3741 1058 -991 3687 790 1354 689 -954 2170 1889 188 159 -608 -901
2071i01L182m772J388J823k289K429l364o08K887j371n84P50j555O21L246m346
2087c464J778m37J19K425l207Q76O68J789l056J455p77K409j597O65J9j753K711
2104F23j358J410N17l175L847k42j838R20L66m83L102m507j02M101k616K369k190
2121G44j508L702j683j145L545k156O77K368n745M108j072l365N302k338k551
2136a117M517l626K86L969p095N085k97m459M350l519K52M680n631M75M930n385
2152b585L112k80n162O902m819r42N207m462J441J512k311O74J539m968O771l921
2168b292j501N817n612K598Q84l551L096P55k714L093l10k228M362m673K724J096
2184A544l722L104j441J157J224j313j027K588k094K975j032k609M970l740K102
$$ plain form
2071 -901 2281 -2491 -1103 720 -1569 860 -2504 -3112 -225 -1596 -2180 -1430 -2985 -2364 882 -3464
2087 -3464 -1686 -2123 -2004 421 -2786 -1910 -1242 547 -2509 -1054 -1831 578 -1019 -354 -335 -2088 623
2104 623 -735 675 1192 -1983 1864 1622 -216 704 1070 587 3689 -818 -920 3181 565 2934 744
2121 744 -764 2938 1255 110 3655 1499 2176 4544 -1201 2907 1835 -1530 3772 1434 -1117
2136 -1117 3400 -226 60 4029 -3066 2019 1722 -2737 1613 -1906 -1654 3026 -2605 -2130 2800 -2585
2152 -2585 527 247 -4915 1987 -2832 -3774 1433 -3029 -1588 -76 -2387 -1713 -174 -5142 1629 -2292
2168 -2292 -3793 2024 -3588 -990 -106 -3657 -561 194 -2520 573 263 -1965 2397 -2276 448 1544
2184 1544 -2178 926 -515 642 1866 553 -474 2114 20 2995 1963 -646 4324 584 2686
2199B686J283l694J060J192m41R40p61k570M200l105m79K842m717M441j993j854
2215i70L202j928j231L044m778K155L094o328N194l304j097N875m554k5J776l381
2231c256J814J041m799M758j96l618N944m405p88L760m113K385J002k893L183
2246a81L29m676N638l138J323K003m781L380J377l071K558l31k092M327k216j440
2262i91M296m905M194J6l503K895n24k85M84l72j940L764k577J775j330r72L032
2279C057k218M95M4m95J738j304j917L029n77j226J419k491J145j45j321K105
2295A338k327m9J546k59j130K179k930K258n27l702L346k557J491O30k047P21
2311b019P90j674K949k112j412M799l832J850Q92l198K507P36k780K141N80k416
$$ plain form
2199 2686 3969 275 1335 2527 2086 3026 2265 -305 3895 790 311 3153 -1564 2877 884 -970
2215 -970 2232 304 -927 2117 -2661 -506 2588 -3740 1454 -1850 -2947 2928 -1626 -1651 125 -3256
2231 -3256 -1442 -401 -5200 -442 -638 -4256 1688 -2717 -3505 255 -3858 -1473 -471 -3364 -181
2246 -181 148 -4528 1110 -2028 -705 1298 -3483 -103 1274 -1797 761 430 -1662 2665 449 -991
2262 -991 3305 -1600 2594 2610 -893 2002 1478 1193 1677 1305 -635 3129 552 2327 997 25 3057
2279 3057 839 1334 1378 883 2621 1317 -600 2429 1852 626 2045 -446 699 554 -767 1338
2295 1338 -989 -1038 508 249 -881 1298 -1632 626 99 -3603 -257 -2814 -1323 -693 -2740 -2019
2311 -2019 -1229 -2903 46 -2066 -3478 1321 -2511 -661 231 -2967 -460 276 -2504 -363 217 -2199
2327b199L691k277r2J993j885K307r96k729L959J89j959K779k138o94M296n540
2343a295L118J23j763L261k911O95O46q50L96J581k517J696J6k652L378k903J409
2360A428J041j803K99n16m0J8K82j655J953o23o1o63k267L667r69q68M36q46P97
2379c90J020l333J268N54k640L983k955M56K207l035K091n32j504K084M29l236
2395c533K835j645R47K961n239M072L00j744J668n89r76K914j914k01L084l624
2411f84K186J027m192L364j033j66K166k302q58L254l353J818R44l959N504k485
2427A231j556K352o24J56P67k176N01J248j949K244r46j777L067k386N70r16L59
2444A65P50P93k469M69J62r79J722j743K99P80n74q12j103J503R4m30q82J564
$$ plain form
2327 -2199 1492 -785 -877 1116 -769 1538 542 -2187 1772 1961 2 2781 643 -51 4245 -1295
2343 -1295 1823 1946 183 3444 533 1228 1874 1024 1420 3001 484 2180 2196 -456 2922 19 1428
2360 1428 2469 666 965 449 409 427 709 -946 1007 384 323 -340 -2607 1060 91 -777 -341 -1187 -390
2379 -390 630 -2703 -1435 -881 -3521 462 -2493 -2037 170 -2865 -774 -1306 -2810 -726 -297 -3533
2395 -3533 -698 -2343 -1396 1565 -3674 398 698 -1046 622 33 -943 1971 57 -144 2940 -684
2411 -684 1502 2529 -1663 1701 668 502 2668 366 -492 2762 -591 1227 2171 -1788 3716 1231
2427 1231 -325 2027 1403 1559 2326 150 651 1899 -50 2194 1248 -529 2538 152 722 -194 165
2444 165 915 1708 -761 -292 -130 -1109 613 -1130 -831 -51 -625 -1437 -2540 -1037 -943 -1373 -2255 -691
2462f91j664J327k27j497K017p83N82j00j020K04K542q33j938N13K72K197k239
2479a338J040P99j314J935j688j92N59J666r88J781k686J282J579j066K84j779
2495a26Q28Q17j065k23J372P01j077J595k306O68J638k276J513j187K13J198l64
2512A919j642J442r78k46J670k821J045J49Qr31j01k19O53Lj900J890p53m88R65
2531c35j304M44J322j465m04J504j502N42K33j022J646j605N90K75J57o17J217
2548c24j349J309p17j352L305j280l81J019p40p26K021j149O94P94j938K296j171
2565C11j070K136n66L16N80j092k65L017l600J870l14q90K629k478J308l08q33
2582G51Q36j62j010J413M28k563J422q83J985m73k015J576m78n66K28q63J88O98
$$ plain form
2462 -691 -2355 -1028 -1255 -2752 -735 -1518 -936 -1036 -2056 -1852 690 -143 -2081 -1568 -1296 901 -1338
2479 -1338 -298 501 -813 1122 -566 -758 -199 1467 479 2260 -426 856 2435 1369 1653 -126
2495 -126 702 1519 454 231 1603 2304 1227 2822 516 1184 2822 546 2059 872 1085 2283 1919
2512 1919 277 1719 741 495 2165 -656 389 538 546 -385 -486 -705 -52 -49 -1949 -59 -812 -1300 -335
2531 -335 -1639 -1195 127 -1338 -1742 -238 -1740 -1198 -965 -1987 -341 -1946 -1356 -1081 -924 -1541 -324
2548 -324 -1673 -364 -1081 -2433 872 -408 -789 230 -510 -1236 785 -364 330 1124 -814 1482 311
2565 311 -759 1377 811 1127 1707 615 350 3367 -233 1637 1323 433 3062 584 1892 1584 751
2582 751 1587 1425 415 1828 2256 -307 1115 232 2217 1744 -271 1305 827 261 489 -374 -186 512
2600E12j394N56l95p49K001j283o94O22q3R23r42j386M3J773j064J311j851k47
2618b347K140j744K037j656j038J805Oj577K367j437J103J818m230K905K5p47
2634e70J988k608J169K322j008j484K143j658R06R26l011K193j724J262J631j353
2650A124m99J652j458N19J421l932L277k23j101J253p64r0J53j511K04K048k107
2667c4K123j457j840L294k596J53Q49r55j69J120j426r6m62k45K009j194q32R94
2685g64j099R23q43K79P39m51k57l08P52o0J35n14O03k56P10p74N6Q15j166R47
2705e33J846k199m81K487j802J498p08j311L155j434j12N77j848J503J791k548
2721a19J841M33j771L309m038J43L527l388J418K15j610J110Q71k491K532k169
$$ plain form
2600 512 -882 -326 -721 -1470 531 -752 -1446 -824 -907 16 -926 -2312 -2269 -496 -1560 -249 -2100 -2347
2618 -2347 -207 -1951 86 -1570 -2608 -803 -797 -2374 -7 -1444 -341 1477 -2753 152 177 -570
2634 -570 1418 -1190 -21 2301 1293 -191 1952 294 1200 2126 -885 1308 -416 846 2477 1124
2650 1124 625 2277 819 1338 2759 -1173 2104 1881 780 2033 1269 1179 1332 -179 25 2073 -34
2667 -34 2089 632 -1208 2086 -510 -357 492 -463 -632 488 -938 -1034 -1496 -1741 268 -926 -1758 -764
2685 -764 -1863 -940 -1783 -1504 -765 -1216 -1473 -1781 -1029 -1089 -954 -1468 -865 -1121 -411 -1185 -1129 -314 -1480 -533
2705 -533 1313 -886 -1367 1120 -682 816 108 -1203 1952 518 406 983 -865 638 2429 -119
2721 -119 1722 2155 384 3693 -345 -202 3325 -63 1355 1570 -40 1070 1941 -550 1982 -187
2737a87n53M381m750J460M30j286J720r59j244K497n44k268J813k881K219J338
2753A186j911M66j184N54J296j723j101L259k460j43J071j527K219j208J84J306
2769B84k021J700j011m06K00m31O55J868k601L66J432j864K233o17o21N73M39
2786A78l82J714j956J117O64l478M555k009O13J240k845J774O97j637R05J414
2802B564k678L912k101j361K536l249J894P72l336K321N06k367K257j525r26L619
2818B838l709J64J656j649J873j145j329J954p79j601K330j583q85K798m017L207
2834A23j007j069K061r16j610K056p51n31L252m857K165L93j345K018j494K83
2850a229J975j597j037K381k100J709P70k147J895j213O18j57o10P95N87O20j127
$$ plain form
2737 -187 -740 3641 -1109 351 781 -505 1215 256 -988 1509 965 -1303 510 -2371 -152 1186
2753 1186 -725 -259 -1443 -889 407 -1316 -2417 842 -1618 -1761 -690 -2217 2 -1206 -1022 284
2769 284 -1737 -37 -1048 -1454 -1254 -1685 -1030 838 -1763 -1397 35 -1829 404 -213 -834 -261 178
2786 178 -204 1510 -446 671 1335 -2143 2412 403 1016 2256 -589 1185 1882 245 1150 2564
2802 2564 -114 3798 1697 336 2872 -377 1517 2289 -1047 1274 1780 -587 1670 145 -781 2838
2818 2838 -871 -707 949 -700 1173 28 -1301 653 -126 -1727 603 -980 -1865 933 -3084 123
2834 123 -884 -1953 108 -808 -2418 -362 -1113 -1644 1608 -3249 -1084 -691 -2036 -18 -1512 -1229
2850 -1229 746 -851 -1888 493 -1607 102 872 -1275 620 -593 25 -132 -742 53 640 1260 133
2867A33q01K44K827j800k83N84j399K532o55m21R7j59l25J587j702R88R27j120
2885A254P46j258q4K66j540J161k08Q6L20n9j519K083q22j609K111k268J530m96
2903c06r83J477q91j063J268N90k512K422k689K590N38l013K446r64J27Q2j51
2920a032o79K292k119N50J234k270K058k79r93J563r73m69J560o43j184K139k182
2937a427J953M58j691J672k60k60J96O1k028L279j202m61J851j401L82K50K33
2954A605q31J202k69j014K51k04J169j128N40o51J026r68l20j94K70J243k344
2971f17K030R8j048O62r05o72M9R50k273R18l12l02J548r61k92m61J45JJ342j155
2991a255k08P53r68J339j917N74J428p96M86M0l29P25Q45l205K217j109J091P58
$$ plain form
2867 133 -668 -424 2403 603 320 904 -495 2037 1382 961 1058 899 574 2161 459 1447 2374 1254
2885 1254 2000 742 658 924 -616 545 337 423 743 684 -835 1248 426 -1183 928 -1340 190 -306
2903 -306 -1289 188 -703 -1766 -498 92 -2420 2 -2687 -97 441 -2572 -126 -1090 -963 -881 -1032
2920 -1032 -1711 581 -1538 -988 246 -2024 34 -245 -1238 325 -648 -1117 443 -200 -1384 755 -1427
2937 -1427 526 984 -707 965 705 445 641 702 -1326 1953 751 290 2141 740 1122 1372 1605
2954 1605 774 1976 1707 693 944 740 1909 781 1321 670 1696 728 408 214 484 1727 -617
2971 -617 1413 1511 463 1125 220 -452 -403 547 -1726 -808 -1120 -1422 126 -835 -1127 -1588 -1443 -1442 -100 -1255
2991 -1255 -1463 -710 -1678 -339 -2256 -1682 -254 -1050 -564 -524 -853 -128 717 -2488 -271 -1380 -289 469
3009D69j907J395jJ67l66l65P83J69N90p94P23k25R11n63J7r53R16M03j234J018
3029A153n80R79N66j277K73j04J010p48N80j352J431j305k75p7j91O12K58o5j205
3048c17N35R2j87K82r79L74k1K16l15m99m7P58m74j014J473j031J051p91k74R12
3068b56m39Q70j471J24M46L40j052O44O24r85K31L22q12N74J609j259M74j219
3086a235Q8J322Qj233O28J109M14p54j9k11K041j404n93N94p39J843j563J144
3104A440r15Q68q76J329j867K004j16j073O67j123L11J09O31j205P25j331k87
3121g09L429l147Q20K11r98P21j278j26R61k93o47O78r77M94N15j573J27k5K99
3140a518J157l70r16J639j138K26J302k317J415K57j228J032P32j173R28m30j367
$$ plain form
3009 469 -1438 -43 -44 123 -243 -608 175 344 934 140 863 638 1549 986 1003 50 966 1369 135 1153
3029 1153 573 1552 2118 841 1114 1010 2020 1272 1852 500 1931 626 351 274 83 695 953 888 -317
3048 -317 218 310 123 405 -574 -200 -221 -5 -320 -819 -866 -108 -582 -1596 -123 -1154 -103 -894 -1168 -256
3068 -256 -695 175 -1296 -1172 -726 -386 -1438 -794 -170 -1155 -924 -602 -1414 -840 769 -490 -16 -1235
3086 -1235 -1147 175 183 -1050 -422 687 1101 347 328 117 2158 754 161 755 16 1859 296 1440
3104 1440 525 1393 517 1846 -21 1983 1867 794 1461 338 649 758 1389 184 909 -422 -709
3121 -709 2720 -427 393 604 -394 327 -951 -1077 -116 -409 -1056 -378 -1355 -861 -346 -1919 -1792 -1817 -1518
3140 -1518 -361 -731 -1647 -8 -1146 -920 382 -1935 -520 -263 -1491 -459 273 -900 28 -402 -1769
3157a769K076q62P50N81j773K035p78l52L0O40p9J163j507l93J556m81J315r61
3175A191p44O26m01p2m40J730j004q2m19M76o49R38Q24j769O49m15K00J073k463
3194g51L99O08k77P38l66j659J548J13k180K465j067O44j22r72l42J417j901J707
3212Bn21j450K332j728p1P99q64J357L50k123L94O54j486L578l039r2K171j701
3230a438J356N05k183J799k23o11K458j555l71J575j919J021M59o97J078p44p14
3247b04Q38P20m16M80j496J060K35k69L56o77J024q90J63m67M41O77L8j154o30
3266a71J603j366J514n86j600J291q18l30J17N7J76P63j311N2N20k49L06p08J159
3285D19j240O21q68Q90m10j32M34k148K803k124M28J990j743N40M2p97M50J303
$$ plain form
3157 -1769 307 -555 195 776 -997 1038 260 -92 -62 578 499 1662 155 -238 1318 837 2152 1191
3175 1191 447 1073 672 600 160 1890 886 804 385 861 212 1150 1974 205 854 439 639 1712 -751
3194 -751 -352 256 -21 717 351 -1308 240 353 -1827 638 -429 215 93 -879 -1221 196 -1705 2
3212 2 -519 -1969 363 -1365 -1436 -637 -1501 -144 206 -1917 -1523 -869 -2355 1223 -1816 -1908 263 -1438
3230 -1438 -82 423 -1760 39 -184 -795 1663 108 -263 1312 -607 414 873 176 1254 510 -204
3247 -204 634 1354 938 1418 -78 982 1217 948 1304 627 1651 761 924 457 898 1575 1613 459 -171
3266 -171 1432 66 1580 994 -606 685 -133 -463 -346 -289 -113 650 -661 -609 -89 -338 -32 -740 419
3285 419 -821 -200 -1068 -178 -588 -720 -286 -2434 369 -1755 -1327 663 -1080 -540 -498 -1295 -845 458
3303D58k632K641j898R2K749k875J420p9o73M92O35k63N25j057k38J872k124R55
3321@O92r78J302J536k345P36L83p44J466j030q12M36k39M11p6q29J065k25o56
3340I3J277j277j79K136k367O35l26R04m94o00k7J76J091j209J94o35M55J79j163
3359a137J730j261p01R25J33n9o43J277l10k16p91K59L8K56k91j876J976j09Q98
3378I8j036j039J545j61m96J914j636j28J973k030Q4J669p69J044l00q82P07q6
3396D71K64R61j753J071N84k727K913j289J1M38k3n25R65o71q61K151j347J544
3414B177j452j341K092M9r52P10r74j88Q22k64o23M48n33r0l49Q90p4o14o6L64
3434C2o63L31J474k787J073Q5j002J292r76P17q56O07k96P19m86q82J421m36Q87
$$ plain form
3303 458 -2174 467 -1431 -1339 1410 -1465 -45 -124 -797 -305 330 67 592 -465 -703 1169 -955 0
3321 0 692 -286 1016 2552 207 943 1326 582 2048 1018 206 642 403 814 738 -91 974 749 93
3340 93 1370 93 -86 2050 -317 318 -8 896 402 -198 -225 -49 1042 -167 27 -608 -153 26 -1137
3359 -1137 593 -668 -1369 -444 -311 -370 -1013 264 -46 -262 -1053 -794 -756 -500 -791 -2667 -691 -800 98
3378 98 -938 -1977 -432 -593 -1089 825 -811 -939 1034 -996 -912 757 -12 1032 732 -150 557 471
3396 471 735 1696 -57 1014 1598 -1129 1784 495 506 944 921 396 1361 690 -171 1980 633 2177
3414 2177 725 -616 1476 1525 573 1283 309 121 943 679 56 504 -29 -119 -468 422 348 -266 -332 32
3434 32 -631 -300 1174 -1613 -540 -455 -1457 -165 -1141 -424 -1280 -673 -969 -250 -736 -1618 -197 -633 254
3453B54j625R76n5O18K69j075Q62L50o28M5N96j360J239r53P28j60p95J996p33
3472E49j017J03P71l95J144n39m03Q99p35J411j107p64J151m53o16Q20p44P40
3490H15N11q70k26K40n02O82N9j356J655p69j173J600j20j337K300l133K083k00
3508B59k510K363o39m80R31j050M65J322k636J379N53j366J209N22j023k35j15
3525a051j010J163O95j316Q12k01J196q1m00L46M09j479o7J154m90R73p65J14
3543BO96j796J469l64m0M67N59j024J421p71K10L82j13q39J028m69k84J318r3
3562A759q22R27j407R51l90o58R49j135L12M30p56j172J915m65l52l50K46j39
3580a57l5N24j573J593j379K89Q56j150O53p6L49j001J462r64J354j249L30k88
$$ plain form
3453 254 -1371 -395 -450 168 437 -638 224 574 -54 -9 587 -773 466 -487 241 81 -714 1282 549
3472 549 -468 -365 406 11 1155 616 213 1112 377 1788 681 -83 1068 615 -1 819 75 815
3490 815 1326 456 230 470 -32 650 709 -647 1008 239 -934 666 546 -791 1509 -1624 459 259
3508 259 -2251 112 -527 -1007 -76 -1126 -661 661 -1975 -596 -43 -1409 -200 322 -701 -936 -1051
3525 -1051 -2061 -898 -203 -1519 -707 -908 288 207 -193 153 562 -917 -984 170 -320 653 -112 2
3543 2 698 -1098 371 7 -33 434 993 -31 1390 619 829 1211 1098 259 1287 818 534 1852 1759
3562 1759 937 1864 457 1408 1018 360 1309 174 486 916 160 -1012 903 438 86 -264 -18 -157
3580 -157 -192 332 -1241 352 -1027 -738 118 -1032 -379 -455 -106 -1107 355 -609 745 -504 -174 -462
3598d62m78J966k072k06N55Q43q95L50J000q62N46j90q85Q92K93K12j051K3Q44
3617D23M46r18M24K25j157L055k416K50R35j466K075o59j573J779K50j151M09
3634I31m71j014K019q55k14R06j153R60q01j022J073O51j350K066j568j362J853
3651F49m56K49n41m31M46Q25j255J353k546J441q86m97J065n59M67r50R34j42
3669h34J426p77m95O2l0O52n15J33k1Q1M31r92M72o34M27k95P99j000M91Q12k26
3690c3O61o86O1l03j6J53R25k90M00l93o90J696n90o37Q66j072J225n00l62o18
3710b03R36J15O02o62j260J155n02M18m61o75R67J12j67j22l58J1J255j730J051
3729D82j47q58J136j782R37j75M51m80M98q75m40R44j376J582j535Q72o7Q0j171
$$ plain form
3598 -462 -940 1026 -1046 -1252 -697 146 -749 -399 601 -261 285 95 -790 102 395 607 -444 -421 423
3617 423 869 -49 375 600 -557 2498 82 332 1267 -199 1876 1217 -356 1423 1673 522 931
3634 931 460 -554 1465 610 396 1302 149 1109 308 -714 359 1010 -340 1726 158 -1204 649
3651 649 193 442 -99 -530 -84 741 -514 839 -1707 -266 -1152 -1649 -584 -1143 -676 -1626 -692 -834
3669 -834 592 -185 -680 -618 -648 4 -511 -378 -399 -318 113 -879 -407 -1041 -614 -909 -110 -1110 -619 193 -33
3690 -33 628 -58 3 -300 -316 -163 762 472 872 479 -211 1485 895 258 1124 52 1277 777 415 -203
3710 -203 733 848 1450 788 -472 683 181 599 138 -537 430 542 375 253 -105 -94 1161 -569 482
3729 482 335 -523 613 -1169 -232 -407 44 -436 62 -813 -1253 -309 -1685 -103 -1638 -766 -833 -753 -1924
3748a924O68J41NJ219q43M26k50j33j03M63O2K92K28r50o31J050M08L54n77K82
3768A87L01N17q72N3J65p8J652j961Pl0J310k67L97o05p08J152n10m20m54O01
3788D37M49q88j21R86L18p43R70k171J347p2q98M10J92j14M58o50r45J360r24
3807e99Q08l69o45N50J18k06Q00j024j87K83J78r36J262j887J556k25q07J447
3825A17j182L37M52p09L91N27o85q9Q63p35J152j599N50R24n21M58l65J36l32
3844c10J325j499J486m24j34K12o41L43L59M50n54P96j596J008L3m60l75P27j23
3863F23M5l27J42j155J387K2r10k76J105p18J303q58o19J271j468R67j743M34
3881g75P05N68r02j70q11O63M43j232J494P2j200N96N99j187J009p3j304K78N25
$$ plain form
3748 -1924 -1256 -1115 -1110 109 -734 -308 -558 -691 -794 -331 -269 23 251 -699 -1330 -280 128 482 -95 187
3768 187 488 1005 133 186 351 273 1925 -36 -29 -59 1251 984 1381 776 68 1220 710 290 -164 437
3788 437 886 -2 -123 863 1181 438 1408 -763 584 512 -386 24 216 102 560 -90 -1035 325 -599
3807 -599 209 -160 -805 -255 -137 -343 457 -567 -754 -471 -293 -1229 33 -1854 -298 -523 -1330 117
3825 117 -1065 -728 -276 -985 -594 -67 -752 -841 22 -713 439 -1160 -610 314 -207 251 -114 22 -310
3844 -310 1015 -484 1002 578 444 656 15 358 717 1167 613 1409 -187 821 854 394 19 746 623
3863 623 668 341 483 -672 715 737 -173 -449 656 -62 1241 383 -236 1035 -433 534 -1209 -775
3881 -775 -70 498 -404 -574 -1385 -722 -279 -1511 -17 55 -1145 -549 50 -1137 -128 -201 -1505 -1227 -702
3900g02o50J837j726O31n16l06J619j425P2J925r68j408K436j505J039K75r82
3917c54N52j58n4K07J66M65J033j508K46M07o26K11J35r6KK74j3L04n37q75J139
3938I20p22J666j126j241Q45j016M42N6M95l07Q31q75M33o64K67J094j252P8q8
3957a64M93J3n50K1m56R08p06K19k68L98k24j32J45r80J063K68r58N5j35L10L75
3978c05l52rJ003j339O59o08j099J568l51K37K78L26L8N72j106J84M45k39K94
3997A96O79k83k03l66L59J104j475L8J125m64l87rk51J065j286J207n35N21l3
4016A002n01K28m3L18r37N78o30J66p46m4R92O48j414N98Q95k621J364l0q16J157
4036A64j072Q03o27P33j623R16M57M4n79r38J353j007O69j27L21Mj47k06j47J000
$$ plain form
3900 -702 -1352 485 -1241 -610 -1126 -1432 187 -1238 -1166 759 -209 -1617 819 -686 353 628 -354
3917 -354 198 40 -14 193 359 824 1857 349 595 1002 376 587 722 626 628 902 889 1193 656 -219 920
3938 920 198 1864 738 -503 342 -674 -232 -176 319 12 843 -32 401 -263 4 1098 -154 -76 -164
3957 -164 329 342 -208 -187 -643 265 -441 -222 -490 -92 -316 -448 -303 -1283 -220 48 -910 -855 -990 -680 -305
3978 -305 -657 -666 337 -1002 -343 -951 -2050 -482 -833 -596 -318 8 46 618 -488 -304 141 -98 196
3997 196 875 592 389 23 382 1486 11 49 1174 710 323 314 63 1128 -158 1049 514 1035 1002
4016 1002 501 729 686 1004 67 645 15 181 -565 -609 383 1031 -383 215 1110 -1511 -147 -177 -993 164
4036 164 -908 -105 -732 1 -1622 -706 -249 -205 -784 -1722 -369 -1376 -707 -834 -513 -509 -656 -862 -1009 -9
4056ik11o64O66j50o18N56r3o12K90n14K536p62l8p0K61r42P15J76L37m6j49k61
4078C98N56o92k84J542j399P54l19J87l68P43j473K319j688P35o13K13p30N6P26
4097F63p71Q62j058m27J158j009J119q13l32r7M70r9J474j514m65J244q95Q02
4115C12n83j060k82R80j47J225k381J365O07r01k78R53N2O28r17j94j85O66n75
4134g15L3L77k28R56q72J07P56l0r15L65K03l62J181j133L08l75P57N81p89k32
4154b7J405l88r35R55p91J409n70m09j13j16l3J56J50o22J019n3n71l33J77r25
4174f15L98J190j223K38l38K35K31l27j65o3L21J14n66m57J242K06k162K326j732
4193a147M29m20M15N88q75N26k57P19j021J347j426N46J68K57N50r76j35L85L68
$$ plain form
4056 -9 -220 -884 -218 -368 -986 -430 -523 -1135 -845 -1359 1177 415 377 307 568 -374 341 517 854 808 659 398
4078 398 954 262 -22 1520 121 875 556 743 375 1118 -355 1964 276 1011 398 611 -119 -63 663
4097 663 -108 754 -304 -731 427 -582 537 -276 -608 -705 -235 -334 1140 -374 -839 405 -490 312
4115 312 -271 -1331 -1613 -633 -780 445 -1936 -571 36 -865 -1143 -190 -138 490 -427 -621 -806 -140 -715
4134 -715 -682 -305 -533 423 -449 -342 414 384 -531 -166 37 -325 856 -277 31 -344 413 994 205 -27
4154 -27 1378 990 55 1010 219 1628 1058 649 536 420 387 543 693 71 1090 1037 466 133 310 -615
4174 -615 -217 973 -250 -12 -350 -115 116 -211 -376 -439 -118 -4 -570 -1027 215 421 -1741 585 -1147
4193 -1147 -718 -1138 -723 -135 -1010 -484 -741 -22 -1043 304 -1122 -576 -408 -151 399 -577 -712 -327 41
4212D1j121O98k6m2J773k487J834j87q33J187r17M53J229j279M19j31R48j218
4230C41R46j148R47p22R59o04M10r46P61j029J367K21j651N99L64p86l20P40o03
4249a54N37p73o53J832q11K39m18P88j279k38J11N11j027P91N37m29O6l55k38
4268i63Q56o68O38p97l52Q51J8K60j831J045K91k49r5Q4K65L90j16p73L20J2J161
4289C47j15l47J82J075r73j84N63r14l3J372k130J773p93N9R5K41j76P52o7m31
4309B96Q04j617K237j280j53N77o74N25Q26j5j152L41r16J445j212M4J217j126
4327A67N51p22j75k14J497j673Q15J8j059J433j330M9K79q44J243q31Q12n32J99
4346c17J47J73o40m30J032m67L8j043J521q83K17j93r8P0N83k8j077J027Mj46
$$ plain form
4212 41 -1080 -382 -408 -450 1323 -1164 670 483 -350 837 -80 373 1602 323 742 611 1559 341
4230 341 1287 139 1086 364 1323 719 1129 183 944 -85 1282 1503 -148 451 815 29 -291 449 -154
4249 -154 383 -390 -1043 789 -22 217 -201 587 -692 -930 -819 -308 -1335 -544 -7 -436 -370 -725 -963
4268 -963 -107 -775 -137 -934 -1286 -435 -417 -157 -1988 -943 -652 -901 -996 -912 -647 -257 -373 -1146 -826 -814 347
4289 347 232 -115 67 1142 169 -15 548 -366 -399 973 -1157 616 -177 -118 -23 218 42 794 727 296
4309 296 1100 -517 1720 440 287 864 190 715 1541 1526 374 715 -201 1244 32 76 1293 167
4327 167 718 -4 -179 -393 1104 -569 246 264 -795 638 -692 -643 -364 -1208 35 -796 16 -516 -317
4346 -317 -170 3 -637 -1067 -35 -502 -464 -1507 14 -869 -652 -845 -943 -873 -290 -318 -1395 -368 -364 -510
4366e10K7K27Q98q69J1J38L62k88Q27j023L57J18l93J727k540J056M55q8J88R12
4386A592k172J203K09m09L44O61j027P03p78L29J03J4k13P47j213q6Q31j586R59
4405B11P6n53J21k20O8p44N95N68L65m94L71p37p23J100j135Q15m92M64j304J232
4425d16j037J270N40k219K683j461L14K09o73K15O40n3j266P32J64J114n30l58
4443a32o3q6P99l81j5J8n7n28N48P3k32J285J44r39MN36j268J329L01j353Q43
4464H26K8o87qP16K1N3o61p79K073j070q03P98j388J491j087M33M15o0j313J708
4484G06j771K03K068j379R54j238p7j05L76o51R3J30k02J253o97j149J000l8o90
4503a214R55l69m41J362j293P69j02o51J725n48r5r68L39Q09k93p39P97Q10j045
$$ plain form
4366 -510 -483 -256 642 -227 -216 -78 284 -4 823 -200 157 275 -118 1609 -931 125 580 492 680 1592
4386 1592 -580 623 832 423 767 1428 401 1104 326 655 758 772 559 1306 93 7 838 -748 211
4405 211 287 -266 -145 -365 -297 -1041 -446 122 487 -7 364 -373 -1096 4 -1131 -316 -808 -344 -1648 -416
4425 -416 -1453 -183 357 -1862 821 -640 -326 -117 -790 -575 65 12 -1254 -522 -358 756 226 -132
4443 -132 -195 -281 518 137 122 140 83 -445 103 176 -56 1229 1373 434 438 974 -294 1035 1336 -17 826
4464 826 854 167 159 875 896 949 288 -491 1582 512 -291 507 -881 610 -477 -44 371 311 -1002 706
4484 706 -1065 -862 1206 -173 781 -457 -534 -639 -263 -914 -821 -691 -893 360 -337 -1486 -486 -524 -1214
4503 -1214 -259 -628 -1069 293 -1000 -231 -333 -984 741 193 98 -870 -531 278 -15 -754 43 853 -192
4522a92R51l89n86J346q04L29L3p18J384l30q67O09r44K95N50m79J78K75O01j433
4542a91N83Q6K48m9L70m08K70l25m01n07k8O70M06j166J095o18J013j312J869
4561A605q00j410L10j128J237j41Q42r65L8q69J759j367L98J92o41R02j153L84
4579h07L03n38M90N03k01j76K1m56Q6J185j92M74j151L78o01L82M99k36K37N55
4599G55r69k08J121k67r13M39J155J23j301K55m23Q57m66j09Q85o49N60m06j88
4618B51R65o92J39j018L8P80P87j181K33l58P58o52L43l64J61M4j36o98k88l90
4638a278Q94K98n67j7J46n53P44n74M6K38k75O14n73P94k63M09l61l3qj89J064
4659E56k211J279n0M46p72Q51m61m38J838j571J473j148r5J200j133O63N14l56
$$ plain form
4522 -192 759 370 -216 1130 326 655 688 -30 1354 1024 157 766 -178 117 667 188 366 641 1242 -191
4542 -191 392 478 726 677 1047 639 909 584 183 -324 -352 318 724 -442 653 35 1048 -264 1605
4561 1605 805 -605 -295 -1423 -186 -327 515 -450 -412 -1281 478 -889 -491 -299 -940 -38 -1191 -807
4579 -807 -504 -1042 -552 -49 -250 -426 -405 -861 -775 410 218 692 -459 -81 -682 -300 199 -37 200 755
4599 755 -214 -422 699 432 -481 -42 1113 1236 -65 190 -233 624 158 49 934 285 845 439 251
4618 251 1216 524 663 -355 -317 463 1250 69 302 -56 702 50 393 29 190 234 98 -600 -888 -1278
4638 -1278 -384 -86 -653 -670 -524 -1077 -333 -907 -861 -623 -898 -284 -857 -63 -326 83 -278 -311 -319 -508 556
4659 556 -1655 -376 -426 20 -752 99 -362 -800 1038 -533 940 -208 -303 897 -236 427 941 585
4677E85p54J422j009j79Q44l96M07n4L34n21L26L9N20n32k70m4m34O68n05k40
4697B07L03k72p16J304P5j696J624r9l88qp84Q84J27j121J76J036j279J254j69
4716D58q42n69K77P90p47k42M50k82QR28r15j097O98J736j006m11M75p10O64J25
4736b12j588J279o38N02l94J013N80q68Q19o33o82j84K073o65l49J016q86K90
4754D73L17j02j28l32N51l80J51O03n30o40R34k25j15j06J75L17o01P75k089Q4
4774h68K082j094R6m0J10K94j32l98N93n69J89N70j327O97l42J39K3k15k41k43
4794f76N92j70J000k411J765j3n98O29j503J524n27K40m57R33j012J70L01n95
4812h08J034m02K19j194J669k04L80l62J42P29j661R66l05J59N21j15l22m14L42
$$ plain form
4677 585 -169 1253 244 65 909 513 920 866 1200 679 1005 1044 1564 1032 762 718 284 952 447 207
4697 207 510 238 -478 826 901 -795 829 730 342 334 -450 434 561 -560 -384 652 -627 627 458
4716 458 -384 -953 -676 114 -633 -875 -425 -707 -699 229 -686 -1783 -1085 651 -355 -766 -291 -1001 -337 -212
4736 -212 -1800 -521 -1159 -657 -1051 -38 542 -326 493 -140 -822 -1006 1067 402 53 1069 183 473
4754 473 790 688 560 228 779 399 550 1153 623 -17 917 692 577 471 646 963 362 1137 -952 -868
4774 -868 1214 120 216 176 286 580 448 50 643 74 263 833 -494 203 -139 0 23 -192 -433 -676
4794 -676 -84 -254 746 -1665 100 87 -511 118 -1385 139 -388 -148 -605 328 -684 -514 -213 -808
4812 -808 226 -176 43 -1151 518 314 694 332 474 1203 -458 508 203 362 883 768 446 32 374
4831C74o43R76k81k40l9k79j10J415r16J97l55L58l0M45j274J390j374J003Q75
4850A492j075O5m63K27j292J680j963J270q55P60l44L32j1n0M28j270R54n55k25
4869h95J005n57O53k7n74q22P67J85o21J60J84K146k505RN23l96o93J021O8k82
4889f51J597j625qk74J527j05j070J27J026Q4j331Q75j71M49K98k217K140j22
4907E49L98o5j229J175j98Q79r75M45o2q72M11K94l40M04k85l09O38j26k71K38
4927F99l68j62m41N38n17J035n17n08J80j15j44r60J456o27Q9q54J397r97M04
4946d12M84o18K92m12L47N45p61j0m79O17k92O74j83O2j010N22R02p92K58p1O83
4967C46l20J48r9r1N34k69J92l49Q76j74j336R16J39j92K28j99k98N87l08L11
$$ plain form
4831 374 -269 707 426 186 147 -132 -242 1173 257 454 99 457 427 872 -402 988 -386 617 1492
4850 1492 417 482 19 246 -1046 634 -1329 -59 -914 -154 -498 -166 -177 -227 201 -1069 -115 -670 -895
4869 -895 110 -447 206 179 -395 -1217 -450 -265 -886 -726 -542 1604 -901 -892 -369 -765 -1458 -437 -369 -651
4889 -651 946 -679 -687 -961 566 461 -609 -482 544 628 -703 172 1 450 748 -1469 671 549
4907 549 947 882 -347 828 630 1509 534 979 917 45 456 750 410 814 529 220 858 732 461 699
4927 699 331 169 -272 266 -251 784 267 -241 -61 -176 -320 -1280 176 -451 -362 -1216 181 -816 -412
4946 -412 72 -546 -254 -666 -319 226 -535 -545 -1024 -407 -699 -25 -208 -146 -1156 -634 268 -524 -266 -337 346
4967 346 26 174 75 -16 518 249 441 92 968 794 -542 374 513 321 549 350 52 639 331 642
4987F42n52K02L84J025j516j14J556o78l08K29l83R56r30K42l09P83j226M46J94
5006F43p79J029k425J134P54o69k56P56mj73m37Q52o53o61N5j22k15P34m14j64
5026a015P59o81O24q40N36MQ33r36O02o48K02J05K91p78R06K6q25Q21J7O58p02
5047d1O44L67j255J394j110L16p76J744j176K16L95O98k51l37J350k628J976p92
5065G34l68J315j366K45J08q98L60J23n58Q07J86m53J57l72j44j85n97K206j446
5084a46k73J052m61j093N94N82p56L91J67k45q41P86N73j89p39m68O74j032J835
5103D11q18p42J127j019Q41r14Q30j61M16m41m52O09n48P46r76J053n37L99K0
5122a56m09Q76l15R70j139O35q06M76l09K02L73r23J369l10j74K17l62nJ074j435
$$ plain form
4987 642 90 292 676 1701 185 71 1627 949 641 870 487 1443 513 755 446 1229 3 449 643
5006 643 -136 893 -1532 -398 356 -313 -569 187 183 10 -427 425 -228 -889 -834 -956 -1171 -437 -851 -1015
5026 -1015 -256 -937 -313 -1153 -617 -613 220 -716 -114 -762 -560 -455 -164 -942 -36 -10 -835 -14 3 661 -41
5047 -41 603 970 -285 1109 -1 315 -461 1283 107 323 718 1416 1165 828 2178 -450 1526 734
5065 734 366 1681 315 560 668 -230 130 253 -305 502 688 235 392 20 -124 -309 -906 1300 -146
5084 -146 -419 633 172 -921 -327 255 -501 -110 57 -188 -1029 -243 330 141 -598 -1066 -392 -1424 411
5103 411 -407 -1149 -22 -1041 -200 -1114 -284 -445 -29 -470 -922 -313 -861 -115 -1091 -38 -575 -176 -156
5122 -156 -565 311 -4 966 -173 462 -344 132 -177 25 398 -525 844 534 360 577 215 210 1284 -151
5142a51Q75m53M20O76j171L64o7L42k04k9J60o97M99j007J361j080M37N30j067
5161b62L94l6N0M5m81O0q0L75k161K211m18O02j12j972R85K55L16l90L36k75j35
5182f93N32M68n19o90P83n06O2k81j95L07J280k93j370J402p46M54n94K79P28
5201D08o10J34JK50o5J307j119L76M61j674N04Q8N36l95J016j093j96J446o80
5220F95J88n74N56J48l56o9j533J114o93J390j233R71j88r6Lq32J578j804Q78
5239A43J68m49j463J005R90l93j72k96N24q41K32m47J71J75l62J3J50K24M89l36
5259d75J01M1k78j09L02o04R15K17m4n9l24m31J66R30j75J17J35p55J17O51l86
5280E2k11J353j107l05R46j215J238j093O76n00N16j5q7k9Q71p32K26o1n36L21
$$ plain form
5142 -151 724 271 691 1367 196 560 493 835 631 602 762 65 564 -443 918 -162 275 805 -262
5161 -262 132 96 146 191 -290 -230 -310 65 -2096 115 -303 299 187 -1785 -800 -545 -229 -619 -283 -558 -693
5182 -693 -161 307 -212 -902 -119 -625 -563 -844 -1039 -732 548 255 -1115 287 -459 -5 -599 -320 408
5201 408 -202 -68 -67 183 118 1425 306 682 1143 -531 -27 61 597 202 1218 125 -71 1375 695
5220 695 883 309 865 1013 657 588 -945 169 -524 866 -367 604 416 320 323 -509 1069 -735 143
5239 143 311 -138 -1601 -596 394 1 -171 -467 57 -784 -552 -999 -828 -653 -1015 -1002 -852 -628 -139 -475
5259 -475 -374 -333 -611 -720 -418 -1022 -107 110 66 7 -317 -748 -582 348 173 290 425 -330 -213 438 52
5280 52 -159 1194 87 -218 728 -487 751 -342 334 -166 350 335 248 219 1090 358 584 523 -13 308
5300C08J048p16M67n24p43Q61l9l17L86p07J165k87j371N81j63O29j96m36p50
5319h04N34N24l45p12l3R42j19m67Q74j843J206j93n51M70M98r22k09O9O66N26
5339A11q23M37o84J09M10l28J489j289j64J94J086j152M72K19N76o42j98J061
5357H84L06o82J51j152J329j126J691j297K73K15J218q0j764J866j483jj90R27
5375A085k24j35o74M83L87j579J244r86O22L14J07j89l55O81j302R24r28O45L01
5394D21j045L72k23j25K01O5Q03k82r84m54Q01n18J006j029K98L36J28J16n59
5413f72L43n83J294p20j35M80L78j63r59J436p4j024p9R20p1q69J231o64N70k05
5433D34k6j007L90m0O83M09n94J398k174N84P43q63K27J175l08j336J189p15Q79
$$ plain form
5300 308 1356 640 1107 583 -160 701 662 345 731 24 1189 902 -469 112 -51 578 382 -54 -804
5319 -804 -270 254 -91 -803 -836 106 -13 -480 394 -1449 -243 -436 -987 -517 -19 -941 -1150 -1081 -415 111
5339 111 -712 -275 -959 -850 -440 -768 721 -568 -732 -538 548 -604 -132 87 663 21 -177 884
5357 884 1190 508 659 -493 836 -290 1401 104 377 592 1810 1730 -34 1832 349 348 158 1085
5375 1085 861 726 52 535 922 -657 587 -399 223 537 644 455 100 781 -521 403 -525 120 421
5394 421 -624 -252 -475 -600 -399 -334 469 187 -797 -1251 -450 -968 38 -991 -693 -357 -229 -113 -672
5413 -672 -329 -912 382 -338 -473 7 385 222 -737 699 625 -399 -478 442 371 -498 733 69 639 434
5433 434 408 -599 -209 -249 434 843 249 1647 -527 57 800 -63 164 1339 1031 -305 884 169 1048
5452A048m81j98J089q21m01k2J94n79J192l1q26ko16M27j82K81j60M58n38j48
5472c16Q97j654J171l69j01O7j051R17m85P1K77J88q43J993j06q48j94k63M02
5491b47q70Q83j03O92k026J308K40K71n40J288n81l52k97J182j142J044j228J464
5509I86p91j10P98j188J195p94J51k54J060l67L87k09n56j96l73J392r70P38m73
5528D26L90m13j62Q82j643J385p51K55j7l09P79j102N80R3L56j350M03ML96q47
5548f45Q63m31O35q04j150J500j409N66J319j139N08k61L60m15N29j601J446q29
5566i58k24J370q12Q52l00M01J27n1n15Q88j093l66J388m68m00J143j414P79K77
5585F24K92p19M30k58m07j51K90R95j279J309m27p35q3R28n28J30P66o73N93j584
$$ plain form
5452 1048 567 369 1458 637 236 214 408 -171 1021 990 164 162 -454 -27 -209 72 -88 370 -168 -316
5472 -316 581 -1073 98 -271 -372 -305 -1356 -439 -924 -853 -576 -388 -1231 762 656 -192 -386 -649 -247
5491 -247 -1117 -234 -337 355 -1671 -363 -123 148 -392 896 315 -37 -334 848 -294 750 -478 986
5509 986 195 85 883 -305 890 96 247 -7 1053 686 1073 864 308 112 -261 1131 161 899 426
5528 426 816 403 241 1123 -520 865 114 369 352 43 822 -280 300 393 749 -601 -198 -194 202 -645
5548 -645 218 -213 422 -382 -1532 -32 -1441 -875 444 -695 -187 -448 -88 -503 26 -1575 -129 -958
5566 -958 -1182 188 -624 228 -72 329 456 405 -110 778 -315 -681 707 239 -161 982 -432 347 624
5585 624 916 197 627 369 -38 -189 101 1096 -183 1126 699 -36 -119 809 281 411 1177 504 1097 -487
5605d87M26M57N3K37k95M2j234J352o54R30m67r61R10j8m07j60j34J007j228M54
5625a77l29L20n83J284j868N19R90p78k9j084J510N37p19k77k65P37j86o21J52
5644h67J179j547J318p98K60R63q95R21o56n1J220o30q17J207k57k86R94j406
5662a48k50J202j09l01K57j67J63p3k32M91j204R4J158p12l23Jm12L06R42r25
5682b42N70o05j30O36j021R35N81m79j5r55j26R45l03k35O64j010L32N7m38N73
5702b66q33P54J77l79n07K15N81o14N32K22r59Q18o15J1O12l48O27k49m24N0J195
5723F00p14K72l01L91j83P23n27m78M37j73q4O21m14K14J76j390J480q28K2N63
5743D07k72J604j103M98o05Q6k79J35m93P73j323L70J276j144O56j1l41j77k4
$$ plain form
5605 -487 -61 396 449 686 391 433 -801 551 -103 827 360 -601 309 291 -116 -276 -410 597 -631 -177
5625 -177 -506 -186 -769 515 -1353 -834 156 -622 -651 -1735 -225 312 -407 -684 -949 -212 -398 -1019 -867
5644 -867 312 -1235 83 -715 -455 508 -387 534 -122 -173 1047 417 -400 807 550 264 1258 -148
5662 -148 -398 804 695 394 651 484 647 574 342 833 -371 -277 881 169 -154 -153 -565 -259 683 -242
5682 -242 328 -277 -407 229 -792 143 724 245 230 -725 -851 94 -209 -444 220 -790 -458 -401 -839 -266
5702 -266 -1099 -345 -168 -547 -1054 -839 -258 -872 -340 -118 -1077 -259 -874 -863 -251 -599 28 -221 -645 -595 600
5723 600 -114 158 -143 248 65 788 261 -217 220 47 -37 584 170 384 560 -830 650 -178 -156 407
5743 407 135 1739 636 1134 529 615 336 471 -22 751 -572 -202 1074 -70 586 575 234 57 33
5762C3k22N00l95P60j367J661k247J668m72p83K62P08o69O70m29J24P97r93L15
5781g9j37m62R2M89j104M34m61N96l24o4J56J37k54o80J390l71L47Q72j751J041
5801a33M73l69O7o77J822m33q56p3J91L25n61O89r03J052o62r6J91L9O17O64o80
5822F87J29l89m83K27n39L23L5M73R57k670J912r93J173M1j422J450o99J286k455
5841i57R73l94R39o62r45J097n84M92l79K65L47m97m09M60n00J54j19P43k87K16
5861d7K00j80k6j52o87J180j340J143k26J46n55r6J296j760M19J305j21n81M93
5880D11n07n58J167p42Q30P55q43n15qO55n82J049l79j89J11o80J394j293J082
5899A158l46l81n35J077l76l29k01L61P6q3l47O42m66j255M32M63n37R93o1q5
$$ plain form
5762 33 -189 311 -84 676 -691 970 -1277 391 -81 -864 -602 106 -563 107 -322 -198 599 -394 -79
5781 -79 -216 -678 -586 -97 -1201 -767 -1228 -632 -956 -1020 -864 -727 -981 -1661 -271 -642 -295 577 -1174 -133
5801 -133 340 -29 38 -639 1183 750 -106 -179 12 337 -224 465 -438 614 -48 -144 47 86 703 1367 687
5822 687 816 427 -56 171 -368 -45 -10 463 1420 -1250 662 -331 842 883 -539 911 212 1498 -957
5841 -957 16 -378 561 -101 -1046 51 -533 -41 -420 -155 192 -305 -714 -254 -754 -600 -719 24 -263 -47
5861 -47 153 -27 -53 -205 -892 288 -1052 91 -135 11 -544 -640 656 -1104 -685 620 499 -82 411
5880 411 -96 -654 513 -229 601 1356 513 -2 -10 645 63 1112 733 544 655 -25 1369 76 1158
5899 1158 812 431 -104 973 597 268 67 428 504 421 74 716 250 -1005 -573 -110 -647 346 285 200
5919B00q42N44M62j34k65j230Q74m09l28M86J659j785K68q65J031r2K58M37m90
5938b21j38K04m54J301j134p8M2q32J305n70J559k443J420p3L58j327P06O25m12
5957a62J183j923J697l89q3k35m7N92n44Q34q86N66K39J00j355J172n25J07L18
5976F59o71J298r21k52J171q90j88l0Q23j022J279p66p59J149j279M34P00j354
5994f19N90J01l61m46Q77p98P16l7n0n37n23J220j079J18O63R60j959J110m23
6013d77m1k50J18Q35p71l3l83R49l81j44J042j123N99n68J189q78Q26j198J44
6032e45O13l66p0P72L87j194M67q1m88k63O36P57l31P51r39L7O24m08N60n87Q46
6053A178j161N10o06M31N24m94M59n37n6q7l39J68k42L61M36p61q58O58N19Q8
$$ plain form
5919 200 -642 -98 364 230 -35 -1265 -391 -800 -1128 -642 1017 -768 -500 -1365 -334 -426 -168 269 -221
5938 -221 -359 -155 -609 692 -442 -520 -478 -1310 -5 -575 984 -1459 -39 -112 246 -1081 -375 250 -162
5957 -162 1021 -902 795 406 323 88 41 633 89 923 37 603 842 942 -413 759 234 341 659
5976 659 -12 1286 365 113 1284 394 206 176 999 -23 1256 490 -269 880 -399 35 735 -619
5994 -619 -29 72 -289 -735 142 -656 60 23 -27 -564 -1087 133 -946 -828 -165 795 -1164 -54 -477
6013 -477 -518 -768 -650 185 -586 -619 -1002 -53 -434 -578 464 -659 -60 -628 561 -317 509 -689 -545
6032 -545 68 -298 -368 404 791 -403 64 -17 -505 -768 -132 625 294 1045 106 143 767 359 919 332 1178
6053 1178 17 527 -79 352 876 382 841 304 248 161 -178 -10 -252 109 545 -216 -1074 -416 103 191
6073A91l8o44n23N5J437k81o64L11J16k34M10M16q68l03L3J338j508J515j337
6092e78q41J109l72K75J71P52j227k15R88p10P90j388O99j78Q53L29k8J18j654
6111a107K219j704R07j013J369j190N17Q57j810J587j95M23p14J2R24q59L32m99
6129E6n5K15q12P16L07k64k54Q36j009P31j97m50j55J70K71L29Pj528J016p3l18
6150d61K80o0J65q12r9N39J98R04l73n88j137R91k6l15L40l03p36K442j776P88
6170c9j72N63m04j65j42M10j163R13l40J120j100K84j64O70L3q05O75k5m58M44
6190A35K04L40k0o72QJ146j241k93J053r6lj30M6p9N3j80M7m17q2k86N12M25Q0
6213E50n82l00J012j392J808p65l52M99k20l95J138j431j75L49L05J5q67j19K75
$$ plain form
6073 191 153 -491 -1014 -959 478 197 -467 -156 -40 -274 136 552 -316 -619 -586 752 -756 759 -578
6092 -578 -1419 -310 -682 -407 -236 516 -711 -926 62 -648 142 -1246 -547 -725 128 457 429 547 -1107
6111 -1107 1112 -592 315 -698 671 -519 -2 855 -955 632 437 860 146 158 1082 223 555 56
6129 56 1 216 -596 120 427 163 -91 745 -264 467 270 -180 -335 -165 106 435 442 -1086 -70 -143 -461
6150 -461 -181 -241 -76 -888 -987 -448 -250 654 281 -307 -1444 -453 -479 -794 -454 -757 -1493 949 -827 -39
6170 -39 -211 352 -52 -217 -359 51 -1112 -199 -539 581 -519 -235 -399 271 304 -501 174 149 -309 135
6190 135 339 679 659 -13 -5 1141 -100 -393 660 564 561 431 477 398 451 271 318 -99 -181 -467 45 470 550
6213 550 -32 -332 680 -712 1096 331 -21 478 258 -137 1001 -430 -605 -256 49 64 -803 -922 -647
6232f47k1J76l83M66O55k375J893j055R49q38J62O66l46M38j25o65R07J109j394
6251d28J61q78Q80Q69j323J226n48k11J71k40N50l6K8l75Q79m14l6K21j77k85
6271C4O07j191Q60J126j098P88k79o73J146j272K44K19n26N36Q81j625p19J124
6289A82j328J985j65j015L87j089O93P91p87L98j96k92L58m41N15m19m54N75q99
6308a201J09R69N2k06q46P42q44K73o4J219k49j029r8J078M28m33M05j031M29
6327b97M92n02K05j068J632K74j95o56R64q87J83L65q39M38n6j17N04j305J504
6346F39k3J004j242l46N35M74j066L96J08k36M17n35M57j608J270n34l86P33R1
6365A48N82q50K6J12J7Q1q20J054j271J260j071o4O54N65q06N2J241j271O06K5
$$ plain form
6232 -647 -668 -492 -875 -409 246 -2129 -236 -1291 -342 -1180 -1018 -352 -698 -260 -385 -1050 -143 966 -428
6251 -428 -267 -1145 -265 604 -719 507 -41 -252 -81 -321 229 193 221 -154 725 311 275 496 319 34
6271 34 641 -550 310 1436 338 1126 847 174 1320 48 292 511 -15 521 1402 -223 -942 182
6289 182 -1146 839 674 -341 46 -1043 -350 441 -346 52 -144 -436 -78 -519 -4 -423 -877 -302 -1201
6308 -1201 -1092 -123 -71 -277 -1123 -381 -1225 -952 -1016 203 -46 -1075 -1173 -95 333 -100 305 -726 -297
6327 -297 195 -307 -102 -1170 462 736 541 -115 849 -38 145 510 -329 109 53 -64 440 -865 639
6346 639 616 1620 378 32 567 1041 -25 371 479 243 660 125 582 -1026 244 -290 -676 57 148
6365 148 730 -120 -94 18 35 116 -704 350 -921 339 -732 -796 -142 423 -383 -331 910 -361 245 270
6385B70p86k36N71oq9K43j768J656k55J108j093m74J655q26l67J107j094n22J187
6404B81m2j03j463Q22N36N62n38R58j093J174k018J006J064K6j60n02J45k32j122
6423f99K013k14j121J22P48j148J541l24j102l39J064k61N38m12O07j226M36O47
6441H70n21m01o84P25p5j47l16Q76m89j60R17j057j53q3Q32p11q8K32k5j46Q55
6462B51o09J061j368Q76q38M07k87L89J00o61j29q8R72k03pj389M86J172K49j086
6482g02P24N87o21o69J267K26o27L02l65J62L28j179R46p1o56M4J30Q05o83O59
6502F07O03o98R36r45J22l03n3l60P72q92K4M39J8L09l96L73q70K45J98j10L85
6523D04o17L88p33o2P6Q42n46j54l33K12J248j610O00J15q18N88m42K02K01k60
$$ plain form
6385 270 -516 -752 -181 -187 -276 -33 -1801 -145 -400 708 -385 -859 796 -30 -397 710 -384 -906 281
6404 281 239 136 -1327 -505 31 593 55 1013 -80 1094 -924 82 1146 1172 1012 510 655 423 -699
6423 -699 1314 1100 -21 101 849 -299 1242 918 -184 -523 541 280 818 406 1013 -213 223 870
6441 870 349 -52 -736 -11 -86 -233 -549 327 -162 -322 595 -462 -615 -698 134 -577 -665 -433 -458 -604 251
6462 251 -358 703 -665 211 -627 -220 -507 -118 -18 -679 -808 -896 76 -127 -134 -1523 -1037 135 384 -702
6482 -702 22 609 -12 -681 586 812 185 487 122 284 612 -567 379 308 -348 -304 -174 631 -52 607
6502 607 1210 512 1448 503 625 322 269 -91 681 -211 -187 252 270 579 183 556 -314 -69 129 19 404
6523 404 -213 175 -558 -620 -544 298 -248 -402 -735 -523 725 -885 -285 -170 -988 -400 -842 -640 -439 -699
6543f99K72L45q75n9J133m12K98J35K69j223R98j95K04J42k98l46K74L44mQ1m14
6564c0j59M99M97p29l72N22N3M25j03m85L92J78m79L54M1k17p7n17O15p77K00
6585a69J126n43Q5n59O60n20j63M09l7O99j054Q2L88q9j04o07K32m65J456j086
6605b59L83L8l84K24L83o72p41J162J40q90m99J120m40J58k58k56L18L08r8l13
6625e76K97r0k91M24J33j56J3K23n99K60N96o80O73q36K00j24O07R0k67J380j362
6646h5P99k45l57N60r85O90j197J755j462Q93L7M54o04O69j79j166M01k42K62
6665bP5L27Q01j075j55q13N54j130Q81P04m8l91k4Q28j011Q80j344Q98r11J212
6685B56j039M59O63j223P7q41K727j224O83j202Q38k02p54R52m46J65RK1q40K75
$$ plain form
6543 -699 -427 -82 -957 -1016 117 -295 3 138 407 -816 182 -13 191 333 35 -311 -37 307 303 384 -30
6564 -30 -189 310 807 78 -294 228 281 706 603 118 510 688 209 563 604 387 310 -207 408 -369 -169
6585 -169 957 414 499 -60 600 80 -83 326 289 988 -66 16 404 315 211 -396 -164 -629 827 -259
6605 -259 124 162 -222 2 385 -287 -1028 134 274 -616 -1115 5 -435 -277 -535 -791 -473 -165 -263 -576
6625 -576 -279 -369 -660 -236 -103 -259 -246 -23 -622 -362 234 -446 227 -609 -409 -533 74 164 -103 1277 -85
6646 -85 714 469 112 672 -313 377 -820 935 -527 366 403 857 253 922 743 -423 -22 -264 -2
6665 -2 73 400 1201 126 -29 -842 -288 -1418 -537 167 119 -272 -296 532 -479 401 -943 -45 -956 256
6685 256 -783 -324 339 -884 -807 -1648 1079 -145 538 -664 174 -28 -782 170 -276 -111 -102 -81 -921 -646
6705f46R2n84L57P85j75L31j033J400k70K71m72q57Q9P29J90L33O65j448Q21o45
6725f7Q48p91K82k72K28N62l67L19p61L43o18Q00M1J97k34m68Q19j3r81j25l34
6746e92J014m44Q29j145O71L04j297L32q7P10r05J007j52k80n90J77m34k0L69
6765e33l2J449j350J275j159K43j22L12j99k76N15o47R63j032K79P97j412R13
6783a6Q4N65n27o24J255o04l44m18O64M16m52p62J551M5n39Q4l83J10l2J121n38
6804F56k14m82o2J87K32M72l64l03N51j068J045o78k63P46l78j81J74m26L25N51
6824E20q87J206o02q18L71JL41M95q58n09J80L62o25Q83r32L41o31O90k33J148
6844D43m06oj404J154K82l33L8m97K92M26p72k35J205m71J60K98n00n2J034n29
$$ plain form
6705 -646 -554 -1138 -781 4 -171 160 -873 527 257 528 56 -801 -712 17 207 540 1205 -243 578 -67
6725 -67 781 -10 272 0 228 790 423 742 -19 324 -294 506 547 744 510 42 861 848 -133 -258 -592
6746 -592 422 -22 807 -338 333 637 -660 -328 -415 295 -610 397 245 -35 -625 -448 -882 -902 -533
6765 -533 -565 884 -466 809 -350 -107 -229 83 -116 -392 123 -524 439 -593 -314 483 -929 -16
6783 -16 68 633 106 -518 737 133 -211 -629 35 451 -1 -763 788 833 294 378 -5 105 73 1194 656
6804 656 442 -40 -102 85 317 789 425 122 673 -395 650 -28 -291 455 77 -104 70 -356 -31 520
6824 520 -367 839 237 -581 -210 -209 132 627 -231 -740 -560 -198 -823 60 -872 -531 -1162 -472 -705 443
6844 443 37 31 -1373 -219 63 -270 -232 -729 -437 -11 -783 -1018 187 -284 -124 174 -326 -378 656 127
6864A27R30j379J58J013j472k18P86P52m72P8n29M85N08J22p20J76q42N18J96
6883B17L26K66m01J80k42J81M58o98o36o21J226k80M3K48j92m89n6J91L05L20
6903C46j162L58m83J218j016J79M92J11n29p5M37m86n69M46N38Q38j403N01K61
6922Bj59J73j006R43j046O76J95m87P97r1r71L66R15O4K53o18k6K65q52P25k64
6943a46k21K01k51J049O20j086L58K62p91J68o30J96J68J097J42q01N63l91k22
6962B85l90L5O62o15N99n87K04o59P92n80J607j300J192j049k32q7M44n93k25
6981d97J016M41j824j15N85J004q28r17J056n94J352j034l63m98J755j109J105
6998E35p15J18K73q59j89J5J18J82O38j98o45R27k45N79r12J99J171p67oO18M0
$$ plain form
6864 127 1057 -322 -164 849 -623 -841 -55 697 225 303 -226 259 767 889 169 345 -497 21 217
6883 217 543 809 408 588 346 527 985 287 -349 -970 256 -24 19 267 75 -414 -470 -279 26 346
6903 346 -816 -458 -941 277 -739 -560 -68 43 -486 -561 -124 -610 -1179 -733 -195 643 -760 -259 2
6922 2 -157 16 -990 -47 -1093 -417 -222 -709 88 -3 -974 -608 307 371 624 6 -20 245 -607 118 -146
6943 -146 -367 -166 -417 632 1252 166 524 786 -5 163 -467 -271 -103 994 1136 335 898 507 285
6962 285 -105 -70 592 -23 576 -11 193 -466 326 -254 1353 53 1245 196 -36 -123 321 -272 -497
6981 -497 519 960 -864 -979 -394 610 -218 -1135 -79 -673 679 -355 -718 -1216 539 -570 535
6998 535 -180 -62 211 -648 -837 -822 -704 -522 116 -82 -727 200 -45 534 -378 -179 992 225 219 837 877
7019H77o96Q76j237Q21p91O19M11k57j6j116J504p32m95J460l62k65o57J188j009
7038A23o34J123J45j63J6o15J01k64j10n59O94j16N36l49M53K16l0n69P41p72
7058c3J58l8r78J350j282O56q05J69J176j020j4K3K35L44P87j268K9N3Q17o70
7078c11j02k9n04R30m13j16J463r98j032L87R74n53K71j031J645R9j192N53l27
7097b86M63K00j62k79J048r72K45o7M65K28n72M51j251Q30j384J630r1m22N66
7116F40N1rO5j245J5Q29q74M60k45M7J189n10p04j72J040q49o23R91j073J470
7136D93l33j219J162m29N07R2o46N57n06n63k9Q33m28J610j373n44M32M98n46
7155d32J588j867K06Q26%j018o63J590K60j112N13pJ76K88j04k63K13Q8K29R50
$$ plain form
7019 877 181 1057 -180 641 -150 469 880 623 607 -509 995 263 -232 1228 866 601 -56 1132 123
7038 123 -511 612 757 594 610 -5 96 -168 -278 -837 -143 -259 277 -72 381 597 567 -2 739 -33
7058 -33 125 87 -891 459 -823 -167 -972 -803 373 -647 -661 -638 -403 -59 728 -540 -511 -458 359 -311
7078 -311 -413 -442 -946 -16 -429 -545 918 -80 -1112 -725 249 -304 -33 -1064 581 680 -512 41 -286
7097 -286 177 377 215 -64 984 12 257 190 655 883 311 762 -489 341 -1043 587 496 74 640
7116 640 691 682 747 -498 -483 346 -528 -68 -313 -266 923 413 -291 -463 577 -272 -895 96 -977 493
7136 493 160 -1059 103 -326 181 273 -373 184 -322 -885 -914 -81 -509 1101 -272 -816 -384 114 -432
7155 -432 1156 -711 -505 321 321 -697 -1360 230 490 -622 -109 -116 60 348 244 -19 194 282 511 1461
7175A461j348J006j273J195J10r41K18j05l96O75m11n57M96Q20r53J075j116J004
7193I60j322k5P49j041J364N65j544M94j4N24o14l24N01k13j267N46k4N26M50
7212B91r31m50K3J212L50j74k01o58m87J10P22o94J10nM89O60o61L89o53Q58j152
7233h52P14l41Q4N60m86J24O14o38k01J191K32l41n22N62l38l34m30M09m22K1
7253c94M68L70q89M20R94r50P93n03L16K03m86l7k83l04N13N60j159M87J41N57
7273H17l01Pl41n11m15K13j65l42J031j188J806j789J074J55j88j74m82J307j498
7292i84R61j94k48r76J478L30j331O89N80n01k57j26K54Q07j31o50N3K0R16j141
7312d51R5P0j9q1L83l47J176j139M9K82K14r6L81J93r1O5j461J497q15J14M62
$$ plain form
7175 1461 113 1119 -154 1041 1151 210 428 323 -73 602 191 -366 130 950 -3 1072 -44 960
7193 960 -362 -387 362 -679 685 1250 -294 200 186 710 96 -228 273 60 -1207 -661 -685 -159 291
7212 291 -640 -1090 -1067 145 495 321 120 -538 -1025 -915 -193 -887 -777 -782 -293 367 -294 95 -558 300 -852
7233 -852 -138 -479 -395 165 -321 -197 417 -221 -422 769 1001 660 138 700 362 28 -402 7 -415 -394
7253 -394 74 444 -445 -25 969 19 812 309 625 828 342 305 22 -282 231 791 -368 119 260 817
7273 817 516 523 182 -329 -744 -531 -696 -1038 -7 -1195 611 -1178 -104 51 -137 -311 -793 514 -984
7292 -984 -23 -217 -465 -1441 37 367 -964 -275 305 -196 -453 -579 -325 482 351 -299 -246 -226 690 -451
7312 -451 -356 -286 -305 -386 -3 -350 826 -313 -264 18 232 136 517 710 619 684 -777 720 -95 19 481
7333D81q80k13J048k80k75O70J74L28o88K65K96J18j974O42P85p81R48o10J96
7352B50o3m09J09J97l18M97O3r67L16K00M26l00q38N82l69R70j286R50r2J2M64
7373C94q86R89r62j36L44N87K98r78p0K84L30n81M76M00j115L86O19K72p97N97
7393D51l89N73K20j238P69p46J308m81p77P09N56m84J10M72j135M37n69j68J777
7412A395j087q77P58K27j50J76m57p3L98j71P48p12N58p29K59o7k02Q35n44q09
7432e24K76p97O95k52M18P0K67r62q2M78R1l2M58j26r74N95J100p05m29Q15n76
7453a96l08n18Q74k90L57J04l83m75R19j14n69J103p5m05k45M53M79m82L28j397
7473h40J480p63K39J066k23l18j085k71P80j54m94M06J307j253J65O04j068P79
$$ plain form
7333 481 -399 -612 436 156 -119 551 725 1053 365 630 926 1044 -930 -288 497 -284 664 54 250
7352 250 187 -222 -113 84 -234 263 326 -641 -325 -125 301 1 -837 -255 -624 346 -940 10 -82 -70 394
7373 394 -492 497 -465 -601 -257 330 628 -350 -420 -136 194 -387 89 489 -626 -240 379 651 -146 451
7393 451 62 635 855 -383 386 -360 948 467 -310 399 955 471 581 1053 -82 355 -214 -382 1395
7412 1395 308 -569 189 416 266 442 -15 -88 310 139 887 175 733 4 263 196 -6 829 285 -524
7432 -524 -248 -1045 -350 -602 -184 -114 153 -809 -891 -413 -322 -354 104 -22 -996 -401 699 -6 -435 380 -196
7453 -196 -504 -1022 -148 -438 -81 23 -360 -835 84 -30 -599 504 429 24 -221 232 711 229 557 -840
7473 -840 640 -123 116 1182 959 641 -444 -715 65 -89 -583 -177 1130 -123 42 646 -422 357
7491C57m67J127n08j02J02j14L96o30n26N02j008M73J41R3O17o21n94L13K85M02
7511B38j58M37j026L8K00M80k61J25o27L98P42j669J033O49r93P21j150J055L95
7530F27j074j226R33L49M80L99j484J275j61J42m59O43p75J160m17P28p78j146
7548g84J062RO71o38j88j0O19m20P3N28m12m88J19M27R7o14o0k06J485p78j70
7569C22l95J3R54n44l40L19l65K68m48L24r88L11O66j03M6O23m91l25r45l2J274
7590A44j331J122o62l87J395k05n3J89n6j97n78L47O68p1p28j90n85R97o9P1m37
7611f16L32K70K31k57m13K73N26l75r6n83N10j12p1Q08o20O15r30J071J65p43
7631a5J66O97J12n29k7J46j51n79j37K5J078q09O08q70J232q75k87J76o40P00
$$ plain form
7491 357 -110 1017 509 407 509 395 791 161 -365 137 -871 -398 -257 -164 453 -168 -762 -449 -164 238
7511 238 80 517 -509 -471 -271 209 -52 73 -554 -156 586 -1083 -50 599 -394 327 -823 232 627
7530 627 -447 -1673 -740 -391 89 488 -996 279 118 260 -199 444 -331 829 412 1140 362 -784
7548 -784 278 287 958 320 132 122 741 321 394 922 510 22 141 568 665 51 -9 -215 1270 492 322
7569 322 -73 -60 894 350 10 329 -36 232 -216 108 -880 -569 97 -6 40 663 172 -153 -1098 -1130 144
7590 144 -1187 -65 -727 -1114 281 76 23 212 156 -41 -619 -272 396 325 -403 -593 -1178 -181 -250 -179 -616
7611 -616 -284 -14 217 -40 -453 -180 346 -29 -125 -708 -198 -310 -381 427 -193 422 -508 563 728 -15
7631 -15 151 848 960 431 404 550 399 -180 -317 -292 786 -23 585 -285 947 72 -215 -39 -679 21
7651B1J67K50m13r5J6M33P3m38m57Q6J054j216J0J107j269J94r8L01J80q6J3r40
7673a107J728j476L65N31q84Q99j060J170o44R49j081J638j355P61j069r3Q18
7690I0p3L45k41L10j301N99M28k21O40j61p50J126j041R31q07l05J098P10j406
7709b9j3M97q2J77p42R52K99p35j12l2m39J029m97p87Q81P03m76k44k02q22J876
7730A202k423N55J207j499k75R46J25K31r56O61N68k31o26j21Q62j279O38k77
7748f92J209j74m60n47J84l50N40M74k97j96n55O28M45J12M73j13j323R19k04
7767G3j146R38N9L41m63M76J61j187L53J198n5r0r40O97j2o58M86O30O1r74J158
7788A106o24q4k18l8p42R35J28r94O03k11K93m56J404n74o01M01k43j55n86M76
$$ plain form
7651 21 188 438 25 -70 -54 379 452 14 -443 -357 697 -519 -509 598 -671 -477 -575 -274 -94 -180 -167 -1107
7673 -1107 621 -855 -490 41 -843 56 -1004 166 -478 471 -610 1028 -327 434 -635 -728 90
7690 90 17 362 121 431 -870 -271 157 -64 576 415 -335 791 -250 681 -126 -431 667 1377 -29
7709 -29 -42 455 373 550 -192 760 1059 324 212 180 -259 770 273 -514 367 1070 594 350 148 -674 1202
7730 1202 -1221 -666 541 -958 -1233 -287 -162 69 -887 -226 342 111 -515 -636 226 -1053 -415 -692
7748 -692 517 343 -117 -664 -480 -830 -290 184 -113 -309 -864 -236 209 321 794 681 -642 277 73
7767 73 -1073 -135 -76 265 -198 278 439 -748 -395 803 748 658 -282 415 403 -255 231 861 922 -52 1106
7788 1106 482 398 180 142 -600 335 463 -531 72 -139 154 -302 1102 528 -73 328 85 -70 -656 -180
7808a80L74O81k384J598L82n24m18o24J363J62o03M88j056P18M23n37j5L96o77
7827d33J019j071n74Q02N19j67k68M12k217K514o50L67o15R68l21n84k36J355
7845H20l00j065J688q98n10P74l76O88l28j205P98Q34m49r5j20N89K41k69L07
7864A124j226OL92O36o42K80O47r74l80m44J34N71R0k36J77m17o39M61P41q46
7884e45Q01j424J485j310J55R73o71j18P84j08k83K69q68J220K00j623J990j527
7902f00K92k99K8o95J043M78q71Q32q41P52M7l92N07l37l7J31J55k20q1O1m20
7923d67j28J78L08L14o33J134n43l83Q83L03r91Q8J02r61J200j3L04J81n41q8
7943B47L34j69J97p08K6J016k12j112J228p50o56P62l50j65l01J146k13j77j25
$$ plain form
7808 -180 194 875 -1509 89 471 -53 -471 -1095 268 430 -173 315 -741 -23 400 -137 -152 244 -433
7827 -433 586 -485 -1059 -257 262 95 -173 239 -1978 536 -114 253 -362 606 285 -299 -535 820
7845 820 520 -545 1143 245 -265 509 133 821 493 -712 86 920 471 376 256 845 1086 817 1124
7864 1124 -102 -96 296 932 290 570 1217 243 -137 -581 -447 124 214 -22 155 -262 -901 -440 301 -545
7884 -545 256 -1168 317 -993 -838 135 -536 -654 130 22 -261 8 -860 360 560 -1063 927 -600
7902 -600 -308 -607 -579 -1274 -231 247 -624 208 -633 119 166 -226 281 -56 -93 38 193 -27 -108 -47 -467
7923 -467 -595 -417 -109 205 -428 706 163 -220 663 966 -25 63 165 -796 404 391 695 876 335 247
7943 247 581 412 609 -99 -73 943 731 -381 847 97 -559 203 -147 -312 -613 533 320 143 18
7962A8N20j09k63L27l92r14P99k70k23K274k559J03J175p56J49R99j144l27J340
7981G47r95L1N2N78k45qj32J03J19q76K83L94L1q4pj070M52J019o1M0l18P27m25
8004C55m68J56p4l57K52k35M43R85j015O8j42k1P36m12K4J17l57o53N03M8J215
8025A168o79k29r78ON64M06n7n51J050r13R21op22k21pK65m16L7N8j79L77q63
8047i69J65O08J04n12Q73J02l68l35Q29j46q42J95O32N6j92l70q04J701q68J85
8067D4J22o32L3Q48j227Q92J09o44k51O65R53j096O74j88L64j72r29J599q26p2
8087B66Q56m80j444J791k80m13O43p82L95l72M49r68M87R4r47M34K76P77p90M5
8107C7j88J09K1M12j097N15J01j207J559m07l63N52j8M91l78jo75n82J542o49
$$ plain form
7962 18 538 429 166 493 101 -813 -14 -284 -507 1767 -792 -689 486 -270 -121 878 -266 -593 747
7981 747 -248 -217 -165 413 168 160 28 131 250 -626 -343 51 82 -2 -9 -1079 -627 392 331 371 53 780 355
8004 355 -113 43 -31 -388 -136 -371 72 1057 42 110 -32 -53 683 271 295 412 55 -598 -95 -47 1168
8025 1168 489 260 -718 -712 -148 258 201 -350 700 -213 708 702 -20 -241 -248 17 -399 -362 -304 -483 -106 -969
8047 -969 -804 -196 -92 -604 269 371 3 -332 497 351 -491 -296 336 392 200 -170 -974 727 -141 44
8067 44 166 -466 -433 415 -812 80 189 -455 -706 -41 912 -184 490 302 666 494 -435 1164 338 266
8087 266 1122 642 -802 989 709 296 939 157 552 180 629 -339 148 242 -705 -271 5 782 -8 37
8107 37 -151 -42 -21 391 -706 -191 -90 -1297 262 -145 -508 44 26 517 139 138 -537 -1119 423 -226
8127b26o29J012k16m51J129p40P7N13r29L7K60j45K39L19L01N52p64o4j299R06
8147a18J224o88j98j71M25k04L32r05L68K46o21N32m89N94m33O99k29N35q63j32
8167i6L82K60o48K41l06l40l22J302o35L36J377j657L39j9o22M5M84K84K43j521
8187h73N36k%N2
$$ plain form
8127 -226 -855 157 -59 -510 619 -121 -44 469 -460 -423 -163 -308 -69 250 551 1103 339 275 -1024 -118
8147 -118 1106 418 220 49 474 270 602 -303 65 311 -310 222 -267 327 -106 593 364 899 36 -96
8167 -96 286 546 -102 139 -167 -507 -829 473 -162 174 1551 -106 233 214 -408 -363 121 405 648 -873
8187 -873 -337 -339 -339 -287
8191b87
$$ Imaginary data points
##PAGE= N=2
##DATA TABLE= (X++(I..I)), XYDATA
0@%%%%%%%%%%%%%J07k15K16k16K16l24M32m88N96p54Q62r72J188j404J620j836
29i72K138k463K809l239L671m144M682n276N940o665P457q319R259j0293J1417
44F002j2651J4006j5479J7084j8836K0744k2856K5182k7731L0556l3698L7208
56A9531m1149M5617n0731N6640o3568P1822q1833R4296j10309J31721j62141K09380
68A19276k97199P91214j772043J740432K69020j981816K667178j953370r4692
77e12000J666236j841215R04965K58731j412842J610902p08755l93497R51576
86E24101j016679L98515N57996r90760N75084P5628n96427Q12545m05036n36573
96f01606J067374p38791J8175P37005j121660P55902K89073j111470J199522n26808
$$ plain form
0 0 0 0 0 0 0 0 0 0 0 0 0 0 0 107 -108 108 -108 108 -216 216 -272 324 -430 432 -540 648 -756 864 -972
29 -972 1166 -1297 1512 -1727 1944 -2200 2482 -2794 3146 -3519 3938 -4381 4878 -5415 6002
44 6002 -6649 7357 -8122 8962 -9874 10870 -11986 13196 -14535 16021 -17677 19531
56 19531 -21618 23999 -26732 29908 -33660 38162 -43671 50625 -59684 72037 -90104 119276
68 119276 -177923 613291 -1158752 581680 850700 -1131116 1536062 -417308 -512000
77 -512000 1154236 -686979 217986 476717 -936125 674777 -33978 -427475 524101
86 524101 -492578 -94063 463933 -526827 48257 123885 -472542 340003 -65033 -601606
96 -601606 465768 -273023 -254848 482157 -639503 116399 405472 -705998 493524 -33284
106c3284m59500J249392j231868M34416N93352j247347J179697l88415o21872
115e25429J172211r79198K61955O00704j057067Q18879r7534n98026Q75137o14280
125a42648M1539M91304p29077M85914Q7305n60976N52064j64464k79120N58615
135C40456m35947q7624N40571n28174J85860K61880n78188M95380k6966m53054
145b85806O05670m39366k8043N90994p54782L69239J39289n52994P46042m60361
155g0118k07885O80577o64974K96874K15325o73227O76495j96073l44620O11209
165C23583n60529J43320L76668n61543L42442l213l11933M54161k43473j68749
175b09266L70895k99475J07156J66971l93088K92200N1080k82673L07194j67712
$$ plain form
106 -33284 -492784 756608 -475260 -40844 552508 -694839 484858 96443 -525429
115 -525429 646782 -332416 -70461 530243 -526824 292055 194521 -403505 471632 -142648
125 -142648 -101109 390195 -338882 147032 234337 -326639 225425 60961 -218159 340456
135 340456 -95491 -183115 357456 -170718 15142 277022 -301166 194214 167248 -285806
145 -285806 319864 -119502 -147545 443449 -311333 57906 197195 -355799 390243 -70118
155 -70118 -278003 402574 -262400 34474 249799 -423428 253067 56994 -287626 323583
165 323583 -236946 -93626 283042 -278501 63941 60728 -251205 202956 -40517 -209266
175 -209266 161629 -137846 -30690 136281 -256807 35393 86473 -196200 110994 -56718
185e6718j13019L61058l31973Q1130K12305l92160L55790o0443k74525M09788
195A91233l03410M4800L05969m47261K48521R0047l12556L91746k40359q4766
205a16036L68193l80943J64146J17493l07899L06158j12118j37027K96221k73461
215g5273M1994K17242l06752K01909L780k21212L01296j71164r5013K64190k45796
226h4799N8807J64852k98684K20506J981k48110L34861j86201q5068K68487k87473
237a40841J36635J25884l13403K65978m2304j94843L21050k56223P060K46157
247A55150l14011J96046K0284k41010L04624j28620j12699K58316k61032R3107
257b9845J77452l15494K16633j1030j67618K75765k03588m7354K40781k27289
$$ plain form
185 -56718 -169737 191321 -140652 -59522 152783 -239377 116413 55970 -218555 191233
195 191233 -112177 -67377 238592 -208669 39852 129899 -182657 209089 -31270 -116036
205 -116036 252157 -128786 35360 152853 -155046 151112 38994 -98033 198188 -75273
215 -75273 -33279 183963 -122789 79120 82900 -138312 162984 -8180 -103193 160997 -84799
226 -84799 -25992 138860 -159824 60682 62663 -185447 149414 -36787 -121855 146632 -140841
237 -140841 -4206 121678 -191725 74253 31949 -162894 158156 -98067 -91007 155150
247 155150 -158861 37185 57469 -183541 121083 -7537 -120236 138080 -122952 -29845
257 -29845 147607 -167887 48746 37716 -129902 145863 -57725 -105079 135702 -91587
267i1587R6145R7531k64930K45332k9949j71036K46265j93566K3422J92478k46380
278i6275J09390N5788j74835K30978j04007j32154K46446j82413M9420J15887
288A18225k37619J89610L438j59732J95462j30834m0225K10021k14937P0009Q2416
299H5834k01964K22928q0559j28829K20480j62475J7886J35514k19188J36632
309B6259M7917j89826K08118j13177p0284K06239j97942O9604R2632j95548J58096
320D2088r612j42319J92985j09648m2851J66855j88572Q9293O5065j75245J68601
331E6640m1335j04109J63435j22339m010J45088j82480R6326M0825j51699J81702
342G8044r4066o3866J66331j41489M2221P8543j64100J33973K64j20913J68491
$$ plain form
267 -91587 4558 102089 -162841 82491 52542 -118494 127771 -65795 -42373 150105 -96275
278 -96275 13115 68903 -105932 125046 21039 -111115 135331 -47082 2338 118225
288 118225 -119394 70216 73654 -86078 109384 -21450 -61675 148346 -66591 3418 85834
299 85834 -116130 106798 26239 -102590 117890 -44585 -26699 108815 -110373 26259
309 26259 74176 -115650 92468 -20709 -90993 115246 -82696 -13092 79540 -116008 42088
320 42088 32476 -109843 83142 -26506 -69357 97498 -91074 -1781 63284 -111961 56640
331 56640 15305 -88804 74631 -47708 -51718 93370 -89110 7216 48041 -103658 78044
342 78044 -16022 -79888 86443 -55046 -12825 65718 -98382 35591 35855 -85058 83433
353H3433j20454n433J38115j60765P9635L2702j10341J36378n5872p8593J42371
364H1176j00165K0931P7505j48061J12000J764r7314J22132p5493k2847J08169
375G9797j12520L8182N4618j28015J27121l0669r1066J32971j02111J7816P7618
386F3742j33953Q9226J5832j13610J32294o9995m5987J33281j35939N9467N3494
397D7852j37485J20307k8637o5553J17627r8759K710R8326j31803P4504K2744
408B1833j06310J30333o1991m3766J04419r4234L5577O3760j19164Q2306J1920
419B4683r0787J22915q1538k3178J16930j19439M9790L6335j05728J17032k8236
430A8779p9007J27930r4352J5439Q6910j39070J04556k653r1696J29802q8308
$$ plain form
353 83433 -37021 -42454 95661 -65104 14531 47233 -63108 73270 17398 -61195 81176
364 81176 -18989 1942 79447 -68614 43386 45150 -52164 69968 -5525 -28372 79797
375 79797 -32723 5459 60077 -67938 59183 28514 -62552 70419 -31692 -13876 63742
386 63742 -70211 19015 34847 -78763 53531 -16464 -62451 70830 -65109 -5642 47852
397 47852 -89633 30674 2037 -63516 54111 -44648 -41938 56388 -75415 -911 21833
408 21833 -84477 45856 -16135 -59901 44518 -49716 -14139 49621 -69543 12763 24683
419 24683 -66104 56811 -24727 -47905 69025 -50414 -624 35711 -70017 47015 18779
430 18779 -60228 67702 -26650 -11211 75699 -63371 41185 38532 -53164 76638 -11670
441a1670k1191J10770j09586M7325L1696j10342J26602m6380o2212J16617r6791
452b5162L3886N1466j20087Q9260J7610r9841J03101n2151m0534J13356j15372
463d4468M0831N9489j24230J05941n764r8379J21983o5800k6105J19076j51623
474f9049O0307P1709j46335J25941n0192o6354J49800j28364O892J04975j41404
485h2074R7729J3410j24852J54721q5164l5208J28101j30835N1291M8278j10200
496g4803J01070k2713p7814J29081p5343j8605R8721j14320O7187L9559j08613
507e6593R9090j3112p0263J03244o6780j2015R6198j26429P2632M1362j23809
518e6475J16128m0600m4088J10395j11226K7083P6827j27310R3156j0480q7518
$$ plain form
441 -11670 -32861 77909 -31677 15648 47344 -62998 63604 17224 -44988 71629 -25162
452 -25162 8724 60190 -59897 29363 46973 -52868 50233 -1918 -42452 70904 -44468
463 -44468 -3637 55852 -68378 37563 31799 -66580 55403 -10397 -36502 82574 -69049
474 -69049 -8742 62967 -83368 42573 -7619 -73973 75827 -52537 -45645 59330 -82074
485 -82074 15655 29065 -95787 58934 -26230 -61438 66663 -64172 -12881 35397 -74803
496 -74803 26267 3554 -74260 54821 -20522 -39127 59594 -54726 12461 52020 -56593
507 -56593 42497 29385 -40878 62366 -4414 -16429 79769 -46660 25972 67334 -56475
518 -56475 59653 19053 -25035 85360 -25866 1217 78044 -49266 43890 33410 -54108
529e4108J32283j01169N066Q2803j25754Q3045J3270q7787R4585n6818k1190R7812
541F2038j06954L3991M8389r2737Q3654l1069n2306R3878n6384j8454P3687q4278
553d6545L1437N6447j02907Q1335r705o7113J08672p8838j1140R0506j05583N5210
565A776L7410j18731J21527l8569o3076J26839j13196L8239O0012j21059J04821
576C5993j4990p6556J09777p0852n772P9330j08196O7170K4661q3791Q2820l7849
588A745k2757O8147n8376Q618M9677p2818L7512K9039p2768O0111k1047k4936
600a7853P0125p1945J396O6505o9699L7158P264o7307R7530n6015k9624Q2678
612E0213r2528N5251J6569q2378Q6192m4551k3240Q3129q7057K9437L7445q1281
$$ plain form
529 -54108 78175 -22994 -17928 64875 -60879 22166 35436 -52351 42234 -14584 -35774 62038
541 62038 -44916 -10925 37464 -55273 28381 -2688 -54994 38884 -17500 -35954 37733 -46545
553 -46545 -15108 41339 -61568 19767 10062 -57051 51621 -27217 -38357 52149 -53434 1776
565 1776 39186 -79545 41982 3413 -59663 67176 -46020 -7781 52231 -68828 35993
576 35993 21003 -55553 54224 -16628 -22400 56930 -51266 15904 40565 -43226 39594 1745
588 1745 -21012 47135 -11241 -2623 47054 -25764 11748 40787 -31981 28130 7083 -17853
600 -17853 52272 -19673 -18277 48228 -21471 15687 22951 -44356 53174 -2841 -32465 50213
612 50213 -42315 12936 29505 -52873 33319 -11232 -34472 48657 -38400 -8963 28482 -52799
624e2799Q7302m3388m0105R2030p1926J5332K9121o2402N6696K35n7517O3804
636A6383k6666k1827O1617o3153K2580M0583p0656M4883J5128n9470O5945k7161
648a814l3603Q6254q4571K2851N9605j01436Q1422m322o5587R5965p0923k731
660a8890Q8977j09280N2481K9893q5743J01018n9496l0960R6865q2175K4224L1921
672C8835p3991O4687M99n8164O5563m1039q914O0813p0699J6317L2280m6615M2259
685B1831j0822n2652O9542k4243k8370N9932p3362L6132L5917p7702N9096j8591
697c292l1145P6417o7365r02N6929p6130O3195m714o8825Q8327n0849k341N0915
710C0220p7059M7851K2489o3992N5688k3994k7410P3275o0663Q341L8914n9791
$$ plain form
624 -52799 34503 -8885 -48990 43040 -28886 -13554 15567 -46835 9861 10096 -47421 16383
636 16383 -10283 -32110 29507 -33646 -11066 29517 -41139 3744 18872 -40598 25347 -1814
648 -1814 -35417 50837 -33734 -10883 48722 -52714 28708 24386 -41201 54764 -16159 -18890
660 -18890 70087 -39193 13288 43181 -42562 58456 -1040 -32000 64865 -17310 6914 38835
672 38835 -35156 29531 30030 -28134 37429 -3610 -12524 48289 -22410 -6093 26187 -20428 21831
685 21831 11009 -41643 27899 3656 -24714 35218 -38144 -2012 33905 -43797 15299 -3292
697 -3292 -34437 41980 -25385 -26287 30642 -45488 17707 12993 -55832 32495 -18354 -20695 30220
710 30220 -46839 1012 23501 -40491 15197 -8797 -36207 37068 -23595 -15254 23660 -36131
722c6131M8392J364m6209N2082j8901k0119N7646n8407L763N6001o5373M4181
734A8289k737n0606P4387l6740k3902O5759o2239J9600M1631p7399O2709j3594
746A5158m7075Q5117o2870l163N0477o3931M1325J3489o4080O1944j6826l2518
758b2953O0692n5387J3584L4869n5852L6510J218l9904M6139j4998k5323M6451
770B5046m4027R851L2760n0883L6286m040l1731M5595k3752j6613L7113l5772
782b0167J5260K0355m8781M0983j4436j6294M4699m5406R432K6349l3670K7048
794E372n140l0070M8226k0589j3068K9864m2259L3915Q176l3410K9732j5709k726
807g686L2672l1324p51K7435k8700L0038q314l3471M4364j6954l446J7443l2976
$$ plain form
722 -36131 12261 13625 -32584 19498 597 -19522 38124 -20283 -16520 39481 -25892 18289
734 18289 15552 -35054 39333 2593 -21309 44450 -17789 1811 43442 -33957 28752 15158
746 15158 -31917 53200 -9670 -12833 37644 -26287 15038 28527 -35553 26391 9565 -22953
758 -22953 37739 -17648 -4064 30805 -25047 11463 12681 -27223 18916 3918 -21405 25046
770 25046 -18981 -9130 23630 -27253 9033 4993 -26738 18857 -4895 -21508 15605 -20167
782 -20167 -4907 15448 -33333 7650 -6786 -23080 21619 -23787 -14355 11994 -21676 5372
794 5372 232 -29838 18388 -2201 -15269 14595 -27664 6251 14427 -18983 10749 -4960 -7686
807 -7686 24986 -6338 -7089 20346 -8354 21684 13370 -20101 24263 7309 3863 21306 -11670
820a1670J8369K0101l4683K0242n585j7987M5438l5391p620K7193k6524K5364
832A7247k480l6121L4593m098j9282L0326l6106J1498K7594m1512K6041q865j5337
845a6502L5632k4465o918K0579k5428J9368O774l4928L3771j1869j1333K4876
857I557k9955J4998J2227k5728J8388k381j5171K4364j4944m944K4609k7398J5134
870a244L087j8902K7158j3245j0574K5896j8244L20J9486l0585K5090J823k3970
883a3904L3663k7737L188K8755l2408J3009Q822k5320L3893j4885k3201M2277
895B6152l0882J1173J3622m0448L5943r07k5189K9489j9201q960L5826l2142Q165
908B641J1997k9689L6474j2066k5815L0121j3645j156J9719l4163J1931K1384
$$ plain form
820 -11670 6699 26800 -7883 12359 6774 -11213 34225 -1166 -8786 18407 -8117 17247
832 17247 14767 -21354 13239 9141 -10141 20185 -15921 -4423 23171 -18341 7700 -1165 -16502
845 -16502 19130 -5335 -12253 8326 -17102 2266 9040 -25888 7883 -3986 -15319 9557
857 9557 -20398 -5400 6827 -18901 -513 -2894 -18065 6299 -8645 -13589 11020 -16378 -1244
870 -1244 1843 -17059 10099 -3146 -13720 12176 -6068 -5748 13738 -16847 8243 10066 -13904
883 -13904 19759 -7978 -4790 23965 -8443 4566 13388 -11932 21961 7076 -16125 26152
895 26152 -4730 6443 20065 -20383 15560 14653 -10536 18953 -248 -9208 26618 -5524 2641
908 2641 14638 -15051 21423 9357 -16458 13663 18 -1138 18581 -15582 -3651 17733
920A7733l4600K5710p835k0439L8349k7022k657K0290k8219J8864Q471l3623K9996
933E018j3098j1720L7591m0856J3824J7243k8779K5514r117j5266L0173j7052
945f525m635K1489k9814K2205L959k3738K8580j3967n128J9114j6379L694J1421
958A0276j7441J6670J981k2780K7646j4126m868K1023k3465J0169P913k1127K0509
971A2380q35k2713L1192j9491j865K2953l7609K8402R95k4758K7656j6359q282
984h334K6158k6378R799J3700l3326K9441o261j6550K3263k1312R358J0558k2780
997a2664Q818R430j8020J6403n328j4845K1929j5962L690R324j6897J0040O797
1010B715j4829J2846n227j1875K7934j9368j722J0799j7412K4511j0519j2827
$$ plain form
920 17733 -16867 8843 1008 -19431 18918 -8104 -10761 9529 -18690 174 8645 -24978 5018
933 5018 -8080 -19800 17791 -23065 -9241 8002 -20777 4737 -4380 -19646 10527 -6525
945 -6525 -11160 10329 -19485 2720 6679 -17059 11521 -2446 -7574 11540 -4839 -1145 10276
958 10276 -7165 9505 11486 -11294 16352 2226 -2642 18381 -5084 5085 12998 -8129 12380
971 12380 11545 -11168 20024 533 -1332 21621 -15988 12414 13409 -11349 16307 -52 -8334
984 -8334 17824 -8554 1245 14945 -18381 11060 4799 -11751 11512 -9800 -442 10116 -12664
997 -12664 -3846 5584 -12436 3967 -1361 -16206 5723 -10239 -6549 2775 -14122 -4082 2715
1010 2715 -12114 732 -4495 -16370 11564 -7804 -9526 1273 -16139 8372 -2147 -14974
1022a4974J9685p851J059R560k1926J7218M023j6978K3076k0913L355J6132j8586
1035g120J5199p800p752K0968p768r400J1981j1362J3749M028k6220K2113l068
1048G548o090J1827j4469J454J3409j5314N099R512k3997K4328m205j6035K3222
1061A6289k3092O433J8723k9308J2117P318k0229K6055j8770j1543L5231l2903
1073a3679J1444J1059k9537K9393q655j5141K4754j8250k382K0891k7786J6421
1085a468N346k4360K6724j1943q426J9020j4361K738J3725k1202J1841Q145k2300
1098a6521K5326r893j0047K2505k1434O829J3865k2510J7441L011k0955K7044
1110A4661j6263m678K4881l0336K0275L461k3430K6776j1486p882K2510k3623
$$ plain form
1022 -14974 4711 -3140 -2081 7479 -14447 2771 6794 -10184 12892 -8021 -4666 11466 -7120
1035 -7120 8079 279 -7473 13495 5727 -3673 8308 -3054 10695 14723 -11497 10616 7548
1048 7548 1458 13285 -1184 270 13679 -1635 3464 12976 -11021 13307 9102 -6933 16289
1061 16289 -6803 -370 18353 -10955 1162 8480 -11749 14306 -4464 -16007 19224 -13679
1073 -13679 -2235 8824 -20713 8680 25 -15116 9638 -8612 -10994 9897 -17889 -1468
1085 -1468 3878 -20482 6242 -5701 -14127 4893 -9468 -6730 6995 -14207 -2366 5779 -16521
1098 -16521 8805 -1088 -11135 11370 -10064 -3235 10630 -11880 5561 8572 -12383 14661
1110 14661 -1602 -6280 18601 -11735 8540 12001 -11429 15347 3861 -4021 18489 -5134
1122e134P643J7506l1051K3834l072j7373K6721k1008K303J5870k4428J2302J1170
1135A5283k6457J9295k944j6539K8571k3672j297K2659k5490J1682N237k3193
1147a6865K5949l641k4308L1585k3926J524K4157l5076K2454K441k4740L0469
1159A0023j4453j5778L1423k3732O306J7011l6702L0150p93j9567K3177j7573
1171a0508L460J8412k5234O171J7596k2226J7774n315j4094K6060j7297N03J4419
1184I721j9133Q911J2136j8661J2763j776j0808K4783k1825R20J6622j7650J3272
1197I275k552j4009K0690q110r485J7332j8529J0623P764k4028K1617p969n402
1210b783J5889j7899N574R454j5294Q914j215j1993K1581j2857n004J4100j8247
$$ plain form
1122 -5134 2509 20015 -11036 12798 9726 -7647 19074 -1934 369 16239 -8189 4113 15283
1135 15283 -11174 8121 5177 -11362 17209 -6463 -7760 14899 -10591 1091 6328 -16865
1147 -16865 9084 5443 -18865 12720 -11206 -9682 14475 -20601 1853 4294 -20446 10023
1159 10023 -4430 -20208 11215 -12517 -6211 10800 -25902 4248 3455 -16112 7065 -10508
1171 -10508 -7048 11364 -13870 -7699 9897 -12329 5445 130 -13964 12096 -5201 -4698 9721
1184 9721 -9412 -501 11635 -7026 5737 3961 -6847 17936 -3889 -2969 13653 -3997 9275
1197 9275 6723 -7286 13404 5294 -4191 13141 -5388 5235 12999 -11029 10588 2619 -2783
1210 -2783 13106 -4793 781 10235 -5059 3855 2640 -9353 12228 -629 -5633 8467 -9780
1223i780J2796J935j5213J0881J324r008J2649j3770p71J9570k0833P743K236
$$ plain form
1223 -9780 3016 4951 -10262 619 1943 -7065 5584 -8186 -8957 10613 -10220 -2477 -241
$$ [...]
8191g36
##END NTUPLES=NMR FID
##END=
