##TITLE=1H_SA_pyrnamide
 DMSO-d6, 108 sc, 
 15.2.2019
##JCAMPDX= 6.0         $$ Bruker NMR JCAMP-DX V2.0
##DATA TYPE= NMR FID
##DATA CLASS= NTUPLES
##ORIGIN= UXNMR, Bruker Analytische Messtechnik GmbH
##OWNER= root
$$ XWIN-NMR		Version 3.5
$$ Fri Feb 15 14:21:45 2019 Russian Standard Time (UT+4h)  she@DPX200
##.OBSERVE FREQUENCY= 200.1313
##.OBSERVE NUCLEUS= ^1H
##.DELAY= (6, 6)
##.ACQUISITION MODE= SIMULTANEOUS
##.ACQUISITION SCHEME= undefined
##.AVERAGES= 108
##.DIGITISER RES= 18
##SPECTROMETER/DATA SYSTEM= spect
##.PULSE SEQUENCE= zg30
##.SOLVENT NAME= DMSO
##.SHIFT REFERENCE= (INTERNAL, DMSO, 0, 15.7039)
##AUDIT TRAIL= $$ (NUMBER, WHEN, WHO, WHERE, WHAT)
$$ ##TITLE= Audit trail, XWIN-NMR		Version 3.5
$$ ##JCAMPDX= 5.01
$$ ##ORIGIN= Bruker BioSpin GmbH
$$ ##OWNER= she
$$ F:/spectra/data/she/nmr/H-F/1/audita.txt
$$ ##AUDIT TRAIL=  $$ (NUMBER, WHEN, WHO, WHERE, WHAT)
(   1,<2019-02-15 14:20:41.03 +0400>,<she>,<DPX200>,
      <continue with go, POWCHK disabled, PULCHK disabled
       configuration hash MD5:
       00 E9 B6 7A A2 85 ED C7 34 08 36 98 17 FE 4E 26
       data hash MD5: 16K
       E7 1A E1 8A 46 DF B5 9B 65 B0 E2 8C 48 3C 8D 77>)
$$ ##END=
$$ 
$$ hash MD5
$$ 49 AA 91 26 E7 72 40 78 7F B4 EF 7B 93 64 A7 FD
##$RELAX= 
##$RELAX= 
##$RELAX= 
##$RELAX= 
##$RELAX= 
##$RELAX= 
$$ Bruker specific parameters
$$ --------------------------
##$DU= <F:/spectra>
##$EXPNO= 1
##$NAME= <H-F>
##$PROCNO= 1
##$TYPE= <nmr>
##$USER= <she>
##$AMP= (0..31)
100 100 100 100 100 100 100 100 100 100 100 100 100 100 100 100 100 100 
100 100 100 100 100 100 100 100 100 100 100 100 100 100 
##$AQSEQ= 0
##$AQ_mod= 1
##$AUNM= <au_zg>
##$AUTOPOS= <>
##$BF1= 200.13
##$BF2= 200.13
##$BF3= 200.13
##$BF4= 200.13
##$BF5= 200.13
##$BF6= 200.13
##$BF7= 200.13
##$BF8= 200.13
##$BYTORDA= 1
##$CFDGTYP= 0
##$CFRGTYP= 5
##$CHEMSTR= <none>
##$CNST= (0..31)
1 1 145 1 1 1 1 1 1 1 1 1 1 1 1 1 1 1 1 1 1 1 1 1 1 1 1 1 1 1 1 1 
##$CPDPRG= <>
##$CPDPRG1= <>
##$CPDPRG2= <>
##$CPDPRG3= <>
##$CPDPRG4= <mlev>
##$CPDPRG5= <mlev>
##$CPDPRG6= <mlev>
##$CPDPRG7= <mlev>
##$CPDPRG8= <mlev>
##$CPDPRGB= <>
##$CPDPRGT= <>
##$D= (0..31)
0 1.2 0 0 0 0 0 0 0 0 0 0.03 0 0 0 0 0 0 0 0 0 0 0 0 0 0 0 0 0 0 0 0 
##$DATE= 1550225663
##$DBL= (0..7)
120 120 120 120 120 120 120 120 
##$DBP= (0..7)
150 150 150 150 150 150 150 150 
##$DBP07= 0
##$DBPNAM0= <>
##$DBPNAM1= <>
##$DBPNAM2= <>
##$DBPNAM3= <>
##$DBPNAM4= <>
##$DBPNAM5= <>
##$DBPNAM6= <>
##$DBPNAM7= <>
##$DBPOAL= (0..7)
0.5 0.5 0.5 0.5 0.5 0.5 0.5 0.5 
##$DBPOFFS= (0..7)
0 0 0 0 0 0 0 0 
##$DE= 6
##$DECBNUC= <off>
##$DECIM= 32
##$DECNUC= <off>
##$DECSTAT= 4
##$DIGMOD= 1
##$DIGTYP= 9
##$DL= (0..7)
0 120 120 120 120 120 120 120 
##$DP= (0..7)
150 150 150 150 150 150 150 150 
##$DP07= 0
##$DPNAME0= <>
##$DPNAME1= <>
##$DPNAME2= <>
##$DPNAME3= <>
##$DPNAME4= <>
##$DPNAME5= <>
##$DPNAME6= <>
##$DPNAME7= <>
##$DPOAL= (0..7)
0.5 0.5 0.5 0.5 0.5 0.5 0.5 0.5 
##$DPOFFS= (0..7)
0 0 0 0 0 0 0 0 
##$DQDMODE= 0
##$DR= 18
##$DS= 0
##$DSLIST= <SSSSSSSSSSSSSSS>
$$ [...]
##$SUBNAM2= <"">
##$SUBNAM3= <"">
##$SUBNAM4= <"">
##$SUBNAM5= <"">
##$SUBNAM6= <"">
##$SUBNAM7= <"">
##$SUBNAM8= <"">
##$SUBNAM9= <"">
##$SW= 20.0189088683792
##$SWIBOX= (0..15)
0 0 2 0 0 0 0 0 0 0 0 0 0 0 0 0 
##$SW_h= 4006.41025641026
##$TD= 16384
##$TD0= 1
##$TE= 0
##$TE2= 300
##$TE3= 300
##$TEG= 300
##$TL= (0..7)
0 120 120 120 120 120 120 120 
##$TP= (0..7)
150 150 150 150 150 150 150 150 
##$TP07= 0
##$TPNAME0= <>
##$TPNAME1= <>
##$TPNAME2= <>
##$TPNAME3= <>
##$TPNAME4= <>
##$TPNAME5= <>
##$TPNAME6= <>
##$TPNAME7= <>
##$TPOAL= (0..7)
0.5 0.5 0.5 0.5 0.5 0.5 0.5 0.5 
##$TPOFFS= (0..7)
0 0 0 0 0 0 0 0 
##$TUNHIN= 0
##$TUNHOUT= 0
##$TUNXOUT= 0
##$USERA1= <user>
##$USERA2= <user>
##$USERA3= <user>
##$USERA4= <user>
##$USERA5= <user>
##$V9= 5
##$VALIST= <valist>
##$VCLIST= <CCCCCCCCCCCCCCC>
##$VD= 0
##$VDLIST= <DDDDDDDDDDDDDDD>
##$VPLIST= <PPPPPPPPPPPPPPP>
##$VTLIST= <TTTTTTTTTTTTTTT>
##$WBST= 1024
##$WBSW= 4
##$XGAIN= (0..3)
0 0 0 0 
##$XL= 0
##$YL= 0
##$YMAX_a= 623538
##$YMIN_a= -766324
##$ZGOPTNS= <>
##$ZL1= 120
##$ZL2= 120
##$ZL3= 120
##$ZL4= 120
##$ABSF1= 10
##$ABSF2= 0
##$ABSG= 5
##$ABSL= 3
##$ALPHA= 0
##$AQORDER= 0
##$ASSFAC= 0
##$ASSFACI= 0
##$ASSFACX= 0
##$ASSWID= 0
##$AUNMP= <proc_1d>
##$AZFE= 0.1
##$AZFW= 0.1
##$BCFW= 1
##$BC_mod= 2
##$BYTORDP= 1
##$COROFFS= 0
##$CY= 11.3945322036743
##$DATMOD= 1
##$DC= 2
##$DFILT= <>
##$DTYPP= 0
##$F1P= 18.9103706918063
##$F2P= -1.10871071338519
##$FCOR= 0.5
##$FTSIZE= 0
##$FT_mod= 4
##$GAMMA= 1
##$GB= 0.15
##$INTBC= 1
##$INTSCL= 1
##$ISEN= 128
##$LB= 0.24
##$LEV0= 0
##$LPBIN= 0
##$MAXI= 10000
##$MC2= 0
##$MEAN= 0
##$ME_mod= 0
##$MI= 1.114404
##$NCOEF= 0
##$NC_proc= 0
##$NLEV= 6
##$NOISF1= 3.799351
##$NOISF2= 2.8
##$NSP= 1
##$NTH_PI= 0
##$NZP= 0
##$OFFSET= 15.70392
##$PC= 1
##$PHC0= -9060.021
##$PHC1= 20.80014
##$PH_mod= 1
##$PKNL= yes
##$PPARMOD= 0
##$PSCAL= 0
##$PSIGN= 0
##$REVERSE= no
##$SF= 200.130013532006
##$SI= 16384
##$SIGF1= 3
##$SIGF2= 2
##$SINO= 400
##$SIOLD= 16384
##$SREGLST= <1H.CDCl3>
##$SSB= 0
##$STSI= 0
##$STSR= 0
##$SW_p= 3612.71676300578
##$SYMM= 0
##$S_DEV= 0
##$TDeff= 0
##$TDoff= 0
##$TI= <>
##$TILT= no
##$TM1= 0
##$TM2= 0
##$TOPLEV= 0
##$USERP1= <user>
##$USERP2= <user>
##$USERP3= <user>
##$USERP4= <user>
##$USERP5= <user>
##$WDW= 1
##$XDIM= 8192
##$YMAX_p= 0
##$YMIN_p= 0
$$ End of Bruker specific parameters
$$ ---------------------------------
##NTUPLES= NMR FID
##VAR_NAME=  TIME,          FID/REAL,        FID/IMAG
##SYMBOL=    X,             R,               I
##VAR_TYPE=  INDEPENDENT,   DEPENDENT,       DEPENDENT
##VAR_FORM=  AFFN,          ASDF,            ASDF
##VAR_DIM=   8192,          8192,            8192
##UNITS=     SECONDS,       ARBITRARY UNITS, ARBITRARY UNITS
##FACTOR=    0.0002496,     1,               1
##FIRST=     0,             0,               0
##LAST=      2.0444736,     0,               0
##MIN=       0,             -766324,         0
##MAX=       2.0444736,     623538,          0
$$ Real data points
##PAGE= N=1
##DATA TABLE= (X++(R..R)), XYDATA
$$ [...]
2638a725J507J750j158j254m98K177L49q24k095J19K299Q42n88k804n02K313K966
2655B874j812k605p62M10L443L2j730j513O16L179n33j840q48J192K115j034j850
2672f66n47J425K864k314j695j351J703L107n74k350j296N12J612O63j221p26
2688h54j1J277J56j476k2J451Q43o34j087j181N59K381K23k204m84p00L140J018
2706B395k087j080p58R97K443j565p24k19J528J40j762j42J98J773N35j402j896
2723a626m63L569J048j535k063m8J354P96Q22j906j433J501l5O27q83l79P00P62
2741H08j039K74k92J110K93j281j366Q73R91J208n84j627o83N38J629L48r28r20
2759f48KJ28o6K90J58K79O25p53q29J36J452N42p19j167j027O48J932m83l11j471
$$ plain form
2638 -1725 -218 1532 374 -880 -1378 799 1148 324 -1771 -1652 647 1489 901 -1903 -2405 -92 2874
2655 2874 1062 -1543 -2305 -1895 1548 1580 -150 -1663 -1047 2132 1599 -241 -1089 103 2218 1184 -666
2672 -666 -1213 212 3076 762 -933 -2284 -581 2526 1952 -398 -1694 -1182 430 1093 -128 -854
2688 -854 -865 412 568 -908 -930 521 1364 730 -357 -1538 -979 1402 1625 -579 -1063 -1763 1377 2395
2706 2395 308 -772 -1530 -533 1910 345 -379 -598 930 1070 -692 -834 -636 1137 1672 270 -1626
2723 -1626 -2089 1480 2528 993 -1070 -1118 236 1032 1854 -52 -1485 16 -19 608 -275 -654 46 808
2741 808 -231 43 -249 861 1154 -127 -1493 -620 371 1579 995 -632 -1315 -777 852 1200 272 -648
2759 -648 -646 -518 -584 -294 -136 143 768 15 -814 -678 774 1316 597 -570 -1597 -949 983 500 189 -1282
2779a282Q70N70O93q99m08M68R55j154L45o31M78K82p04m04o6J079J525r97q95
2798a75q63O55O75J01M70j724N36K74J383r77l59k13k34M65n67R06M6n08j68j87
2818d64j46R57N47l99j028l47J64R49P05o83j69j423O48M79K31M19k7l6o99L77
2838E5M40n69J014j223k9m34L36O85k0l24j081Q59j5J443k80j668Q97j171J654
2857E69q19K99L3k77p6m21L65J084q52Q1j063K66N41K04M83n4j70m76j48J587
2877A156j288N28n8k98m5p28J103o90R78p21k15k1L18N11j63j137J0J2J055K1
2897C28N06k94q10o35J219O3k35N70j339j3K86M50n70l73J128m62J023o11J82
2916D13m0Q5o11j32k31Q96p89Q72l99n04k52J032m8l59m72P35k66J15j57K39M68
$$ plain form
2779 -1282 -412 158 851 -48 -456 12 967 -187 158 -473 5 287 -417 -821 -887 192 1717 720 -175
2798 -175 -1038 -383 292 393 863 -861 -325 -51 1332 355 -4 -217 -451 14 -553 353 399 -109 -277 -464
2818 -464 -610 347 894 495 -533 -880 -716 233 938 255 86 -1337 -689 -210 21 440 413 377 -322 55
2838 55 495 -74 940 -283 -312 -746 -410 275 255 -69 -1150 -291 -306 1137 857 -811 86 -1085 569
2857 569 -250 49 82 -195 -271 -692 -327 757 -95 -14 -1077 -811 -270 -66 417 363 193 -283 -431 1156
2877 1156 -132 396 338 40 -5 -733 370 -320 658 -63 -278 -299 19 530 367 -770 -760 -748 307 328
2897 328 834 540 -270 -905 314 377 142 712 -627 -640 -354 96 -474 -847 281 -181 842 231 413
2916 413 373 458 -153 -285 -516 380 -409 463 64 -440 -692 340 292 -67 -539 196 -70 45 -112 127 595
2937E95j338K66o17O98k46J570o7m37j048J93J37O6J066j20p76R49j131K95P02
2956G57q66O0l08J084p44k66M50L79j593O9K71R30J18O48j297k79O18m04Q96p07
2976a84l0N18q46J272J30J50q07j215J586L55m95m60L16q98k26N84N15Q93j452
2995b94M1m12J68L62L40K54k68q42R8J462r19K3J442k007M2Q79o59Q6K24k51K62
3016C1l59P81L97r5p76j048M6P49L81q3J041m05j156l06J807p88J71J14j515L80
3036f33M78K32L46j97j56l83J55M00n99J112j162J56M48m34O72r47J02O08n06
3055c08K15k59J072r96K62m0l64N02J91l87j00K95p15K69r1M56O70j419Q28l42
3075b61n26M31Km30j90R14J23O88p58k00K4l38J132j342J278q1K3n33P76m40K7
$$ plain form
2937 595 -743 -477 -1094 -396 -642 928 861 424 -624 -431 -294 -228 838 718 -58 891 -240 55 757
2956 757 -109 -49 -357 727 -17 -283 167 546 -1047 -978 -707 223 341 989 -308 -587 31 -373 523 -184
2976 -184 -214 304 -542 730 860 1010 203 -1012 574 929 434 -26 290 -608 -834 -250 265 1158 -294
2995 -294 -253 -665 -497 -135 205 459 191 -651 -553 909 -10 13 1455 -552 -510 369 -290 -204 20 -231 31
3016 31 -328 453 850 755 -21 -1069 -1023 -274 107 24 1065 660 -496 -802 1005 217 388 502 -1013 -633
3036 -633 -155 77 423 226 70 -313 -158 242 -357 755 -407 -251 197 -237 435 -512 -410 198 -308
3055 -308 -93 -352 720 -276 -14 -54 -418 84 275 -112 -212 83 -632 -363 -454 2 672 -747 81 -261
3075 -261 -787 -356 -354 -784 -974 -60 63 751 -7 -207 -183 -521 611 -731 547 466 489 -44 732 292 319
3096C19q37J177j38q65J95q74J539q1j40r99P35K17J26j38o84o03N88M65M39l89
3116E2j59o87J645m75q33q3N79l78M09j085J181m39K00n7o41J115J15L72j56j403
3136g28P44o65R25j59n46P47p85k93J492j158O43L76n80J33L11n67N04q9j29K87
3156D63p36J64K35k67L61m58L42j157J350L7J99Q63j966J164j370J081M84o81
3174A08q17P31j060J090k11M28j98N41j128J108k16k34q2m77M55J05j75p2N40
3193D36O4m49n52K34n9N96r01j53r9J494k90j095Q88o22j9N4N34l41j50K81n5
3214b04M88q75M50Q47L20j107j198J657q54P74Q7p13L7M85M41L39l07j380M96
3233b17l91K31O10l79k2O2m35P29J05j72L70k62o19j81O69o05Q32j139M18r27
$$ plain form
3096 319 -518 659 521 -344 -149 -1023 516 435 295 -704 31 248 374 236 -448 -1051 -463 2 441 52
3116 52 -107 -794 851 376 -457 -540 39 -339 70 -1015 166 -273 -73 -130 -771 344 459 831 675 -728
3136 -728 16 -649 276 117 -429 318 -467 -760 732 -426 217 593 13 146 457 -110 394 305 176 463
3156 463 -273 -109 126 -141 220 -238 104 -1053 297 334 533 1396 -570 594 -776 305 789 108
3174 108 -709 22 -1038 52 -159 269 71 612 -516 592 376 142 60 -417 38 143 -32 -104 436
3193 436 500 51 -501 -267 -326 270 -631 -784 -883 611 321 -774 114 -508 -527 -473 61 -280 -430 -149 -204
3214 -204 284 -591 -141 706 1026 -81 -1279 378 -476 298 385 -328 -291 194 635 974 667 -713 -217
3233 -217 -608 -377 233 -146 -168 -106 -541 188 293 121 491 229 -390 -571 98 -507 325 -814 -396 -1323
3253a323J188J23L24K39n21j118J236m31O87l61l92J543k028J35N70K21l38J98
3271d8q10N85p4O44j14m10L38L68m98N22n12l14M79k67k95M73J29k68M23p39k23
3292f11J96N44K43k12J07m81J94L91M53j208L37l66J100N30q65K06p38J117j139
3311b02J19rp81K57L31L63K66p25R61n33k63K50j617J913q21N30M31j204R34k11
3331a1K22K79k90l07l04M93p22j08L51M03q19R01K12Q98l86p02r8q26J572k93
3351D65N1p20k19n1O74m36M90j143J551j182j31L58J411j556J70O8l86J025j00
3370C39l26n33J68L73j13P68p15M97n66p9P70k64l85N89l17n01O24m96n7J43O46
3391E65k31o30k80J057m08N0N44l9r91P95n05L99n49P28l51K27n88Q73m41q9O03
$$ plain form
3253 -1323 -135 -12 312 551 30 -1088 148 -283 404 43 -349 1194 -834 -699 -129 92 -246 -48
3271 -48 -858 -273 -347 297 183 -227 111 479 -19 503 -9 -323 156 -111 -406 67 196 -72 351 -388 -611
3292 -611 -415 129 372 160 267 -214 -20 371 824 -384 -47 -413 687 1217 352 558 -180 937 -202
3311 -202 -83 -92 -873 -616 -285 78 344 -381 580 47 -216 34 -1583 330 -491 39 470 -734 200 -11
3331 -11 211 490 200 -107 -411 82 -640 -748 -397 6 -813 88 300 1198 812 110 12 -814 758 465
3351 465 516 -204 -423 -474 200 -236 254 -889 662 -520 -651 -293 1118 -438 -268 -200 -586 439 339
3370 339 13 -520 -352 21 -92 676 -39 458 -108 -187 583 319 -66 523 206 -295 329 -167 -224 -81 565
3391 565 334 -296 -576 481 73 123 667 628 -363 432 -73 326 -223 505 154 381 -207 666 225 136 739
3412G39l1o97Q33o87O02o76o03O59r2m4M22p85m65P26M53j77l05R30j021L0n24
3433g13Q63m06P93j048J19L43o2n64M81R7O4L04o12Q28J59l17j058Q21o1o36Q33
3454B28J31j907K046n9j649J022k24M76j34l91O94j22J05L1q91pJ131j8n7j84
3474B21p19N99M41k76l79p2m0J89J02m76J403m17q97R11m21J19J88k34j81N89
3494F50j127O59r3P28j049M0M96r12M24r7K23O41j269J443j363N78Q43j701R11
3513B5n05K27m79N14j06k93L97j10N54L3k7q98J834n72r92J87J161j188J387j273
3533a24L49j11j033N90m42J042k74J224j677K33L55J78k18r62R29N07m55n26l29
3552g44J99j00M32P9l09K58k1l78J53L89P78m63j12n70J239p58m2J090q24k57
$$ plain form
3412 739 708 11 844 157 759 83 -520 139 47 3 425 -360 -825 -99 354 177 -128 802 -219 -189 -713
3433 -713 150 -256 537 -511 -392 -49 -111 -675 -194 -97 -33 271 -341 487 646 329 -729 92 31 -605 228
3454 228 359 -1548 498 439 -1210 -188 -412 64 -70 -461 233 111 216 247 -644 -651 480 462 405 221
3474 221 -498 101 542 266 -113 -185 -225 -36 66 -410 993 576 -321 590 169 288 476 242 61 650
3494 650 -477 182 89 817 -232 -192 304 -608 -184 -281 -58 583 -686 757 -606 -28 815 -886 25
3513 25 -480 -253 -732 -218 -324 -617 -220 -330 224 257 230 -668 1166 594 -398 -211 950 -238 1149 -124
3533 -124 225 114 -919 -329 -771 271 -3 1221 -456 -223 132 310 92 -870 59 566 111 -415 -744
3552 -744 -545 -645 -213 -134 -443 -185 -206 -584 -431 -42 736 273 161 -409 830 72 30 1120 296 39
3572C9l13k38L87P27p39O84J26m62R31j283R97j262N58K9PM50l91r1p27J409n96
3593B42l46L0N39j55o10L63J49l75J287j432L10M05K40n82M21m02j34R78r44j180
3613a196J421rM58q75o32J096K09M1k61l29P7q9K8mR28j834J045p11P28R40j199
3634a68j16P57j35N1M02j021J19M71o79L2J72l64L78l70O48J09m34J219j560N52
3654F3R84j049k02j10N13m04J70l31P13k30J65j041J038m92P81o17m5L98J93j301
3674h04R95m90N98k3l11o0r1n81P00m32l33P01K73K21R3N20j388L84n00O76jL47
3696D94O46l77q83j46O33l76n61J446j520N26J17j3J70L84q47O02j5J72k13O1
3716C00j90m01N56o8j93J85n56O29n79m2M61l13K94J20m18n68k66J602j05o31
$$ plain form
3572 39 -274 -512 -125 602 -137 547 673 211 1142 -141 856 -406 152 181 188 638 247 156 -571 838 242
3593 242 -104 -74 465 310 -300 63 212 -163 1124 -308 2 407 647 65 486 84 -50 928 -16 -1196
3613 -1196 225 216 674 -201 -833 263 472 513 252 -77 0 -89 -61 -65 863 -971 74 -637 91 1031 -168
3634 -168 -284 473 338 389 791 -230 -111 360 -319 -287 -115 -479 -101 -471 177 286 -148 1071 -489 63
3654 63 1047 -2 -204 -314 199 -205 -35 -366 347 117 282 -759 279 -213 568 -49 -94 304 497 -804
3674 -804 191 -299 299 276 -35 -95 -186 -767 -67 -499 -832 -131 142 363 456 976 -412 -28 -528 148 147 494
3696 494 1140 763 -120 -266 367 -9 -570 876 -644 -118 -1 -14 156 540 -307 295 280 452 239 300
3716 300 110 -291 265 197 4 189 -367 262 -317 -359 102 -211 83 203 -215 -783 -1049 553 448 -183
3736a83L03m79Q41k38k60L20P36j268O30j50l6k85J29N4j079k8J122n16N29M63
3756F05r05j49Q82q84k33Q86N87j01n28p87O13M75q58k1j95J148m72L08M56j333
3776e06L68o1m77N53J87K16n26Q57j73q33R1P04K91j106O87k04k52K11N81l77
3796B31J15j097L81Q57j058q3J158j179R65m10m14O72j202K309j037O85j472J776
3814A197o82p27j6m17Q32N93j166o78O53J398j007K19o59N06k58J206m28j751
3832a185J188k48P04P2o37L52j43j40J02k63j23J108k13m05J38r8q5N85l4l12
3852C63l71R3M67J87m85m80o26J255M07m35n62M54M73k32O9j246J377o73m5j73
3872a83L19o71J023n00L99r27L54R56J58o45j106P99l14N37n05j02J58J367j437
$$ plain form
3736 -183 120 -359 482 244 -16 304 1040 -228 402 252 216 -69 60 114 -965 -993 129 -387 142 605
3756 605 -300 -449 433 -451 -684 202 789 688 160 -627 -14 461 -397 -418 -613 535 63 371 827 -506
3776 -506 -138 -199 -676 -123 64 280 -246 611 438 -395 -304 400 691 -415 272 68 -184 27 608 231
3796 231 346 -751 -370 487 -571 -654 504 -675 290 -120 -534 138 -1064 1245 208 893 -579 1197
3814 1197 515 -212 -228 -645 187 780 -386 -1064 -411 987 -20 199 -460 46 -212 994 566 -1185
3832 -1185 3 -245 459 531 -106 246 103 -37 65 -198 -321 787 574 169 307 209 124 709 675 363
3852 363 -8 85 552 739 254 -226 -852 403 810 375 -187 267 740 508 577 -669 708 35 -10 -183
3872 -183 136 -535 488 -12 387 -540 -186 770 928 283 -823 -24 -338 199 -306 -408 -250 1117 -320
3891c20n48J008J19J28n17o9j186Q67J166l24o14M26N51j05N74j551m21M11R68
3910E63n2o00N48j59M16j496N45J62k76M81J155j332L16j221J581k81QM22j396
3929f16J233p47O15k207J355J194J14n85q99J21O71K93p2j26j155R49l98o95j65
3948a120O05K64O98K2j201O04l92M09O7p67O95lR80j462L66l03R28J142j286r80
3968g34k36J079N29j04j005L76k43R94M1l65l44J5L57j24n84m85J344M80K26j525
3988c08l67Q90k3Q12l02j669J388J26j52j307j49R02O38P98j799J68o45K235Q
4007A244j263l14O67j18p4n44l29K0J702m70k22j105M55O84n03Q38j547N36N55
4026B12P15j326n01J28L81O46j66p46N70J486j184r88L38l70R54J41q0j057N61
$$ plain form
3891 -320 -868 140 259 387 -130 -199 -1385 -518 648 324 -290 136 687 582 1156 -395 -816 -405 563
3910 563 511 -89 459 300 716 -780 -235 -73 -349 132 1287 -45 271 -950 631 350 358 780 -616
3929 -616 617 -130 485 -1722 -367 827 941 356 -543 -422 249 542 470 344 -811 138 -260 -955 -1120
3948 -1120 -515 -251 447 469 -732 -128 -520 -111 -44 -811 -116 -119 861 -601 -235 -538 390 1532 246 -734
3968 -734 -970 109 638 534 -471 -95 -338 656 697 332 -12 3 360 236 -348 -833 511 991 1217 -308
3988 -308 -675 215 192 1004 702 -967 421 547 395 -912 -1061 -159 479 1277 -522 -354 -999 1236 1244
4007 1244 -19 -333 334 216 142 -402 -731 -711 991 521 299 -806 -351 333 -170 668 -879 -343 212
4026 212 927 -399 -900 -772 -391 255 89 -657 -87 1399 215 -773 -435 -805 149 290 210 -847 -286
4045b86O2P87n2j228N14J245n89l43l76k55J421n64j098j064P29J394O21o76L
4064B45j620J855L71j524j7R67N58n7j285o9l82J602L01r19r0l7o3J770o45j096
4084a35k91O14Kp68J5L63O68M85o86l58j208J710J07m33l29K36Q43J21m1p91j235
4105a111J977n49R66k602O90J083m70M23m70q49L82O09L50p58j000P90J539J42
4123A142j991m58J667P88l40p85m91k47R40P42j659l48J001J064q20K56j112J182
4141E31k6qo53j050R6J482O31j731k52O6J427j070L79m70N58J076l56j170J59
4160c81J051j0l91q54L61j139K225k2p38j071N20J251m64l0j345L91Q30j4k07
4179c7p87n9J773l33p59j150Q48N18N86r71l78k17Q03J767q13j277r59J770j04
$$ plain form
4045 -286 -224 563 511 -717 -203 1042 453 110 -266 -521 900 336 -762 -1826 -1097 297 918 242 245
4064 245 -1375 480 851 -673 -690 277 835 778 -507 -576 -958 644 945 26 -64 -101 -164 1606 961 -135
4084 -135 -426 188 190 -578 -563 -200 468 953 267 -91 -1299 411 518 85 -244 -8 835 956 915 124 -1111
4105 -1111 866 317 1283 -1319 -629 454 -16 407 -63 -912 -530 79 429 -329 -1329 -539 1000 1142
4123 1142 -849 -1307 360 1148 808 23 -468 -715 225 967 -692 -1040 -39 1025 205 461 -651 531
4141 531 505 497 -156 -1206 -1110 372 1003 -728 -980 -914 513 -557 -178 -648 -90 986 630 -540 -381
4160 -381 670 660 269 -585 -224 -1363 862 840 102 -969 -449 802 338 308 -1037 -646 184 170 -37
4179 -37 -824 -883 890 557 -202 -1352 -504 14 600 -371 -749 -966 -163 1604 791 -486 -1445 325 221
4198B21l3m75l17Q48O47o34j063K54L35J552p69j221N77Q93J3o34n33j69J473
4217I65l69q09n72l45J883J21n78r20P2N06L88n0j535N43J178K04mo07j784J398
4237c15J174o64nr45O07M92K42q28p85J257O80k27j449q8P28J432o24j497K33
4256e82j97J753r48o2m88R64P5K25j666o10J153N45P08q93j219J95R57Q83o24
4275A69n81M20O37J8q76n45J511m24P71j169j552R24P98J701j415q65j116J466
4293a28J120j294l79Q62Q0O72q37j271J325M56N04j417j068p3J935N63r32j009
4311h91O02J2J06K46q80J22J264J471j989l29J88n04J237j464K59K13N05J223
4329A391j036R4j81m1M80n69j087R29P80K87j036r13l42J242Q05J76j920J168
$$ plain form
4198 221 188 -287 -604 244 891 257 -806 -552 -217 1335 566 -655 -78 815 828 194 -339 -508 965
4217 965 596 -213 -785 -1130 753 874 296 -624 -552 -46 342 292 -1243 -700 478 682 678 71 -1713 -315
4237 -315 859 195 190 -755 -148 344 586 -242 -1027 230 910 683 -766 -854 -126 1306 682 -815 -582
4256 -582 -779 974 26 -36 -524 440 515 740 -926 -1536 -383 162 870 -23 -1242 -1047 -90 793 169
4275 169 -412 8 645 663 -213 -758 753 329 1100 -69 -1621 -697 101 1802 387 -478 -1594 -128
4293 -128 992 -302 -681 181 261 933 96 -1175 150 606 1110 -307 -1375 -1448 487 1050 118 -891
4311 -891 -289 -277 -171 75 -805 -683 581 2052 63 -266 -78 -582 655 -809 -550 -337 168 1391
4329 1391 355 449 268 227 707 138 -949 -20 760 1047 11 -902 -1244 -2 803 979 -941 227
4347B27p82R18l36o15m27N51J096L76k185R85N5N16P70j872N46K59k25N42l03
4366I6j83j27L3O24n93m51Q59p7L41o43j82J463p91J192j219r91j53J166j46j198
4386i80j64Q10J125m34l66M6o38M53J43n93o04J500L60n61K4j560R08N13J116
4405A098j192n33J1Q17N8K94j103L58M32L45m19j056M67Q19N08j043J24j384J650
4424B51N54o99k70o38J500j87l79j365J043k05K09N68j199m13R80J150k01n89
4442A10p91N43J136m87m87l24M47N29L12j716q3l4J128o86l96K04j82J311n04
4461C0o82j18J85J361O55k270n98R66P95L3r08o53J121K2O94p23j012J326k22
4480Bkn76Q5L86O81n40p98m16O77P41n10L1l42M61J097o83o23n97k65K601j212
$$ plain form
4347 227 -555 363 27 -588 -1015 -464 632 1008 -1177 -192 -137 379 1149 -723 -177 82 -143 399 96
4366 96 -87 -214 -181 443 -150 -601 258 181 522 -121 -303 1160 369 1561 342 -649 -802 364 218 -980
4386 -980 -1144 -334 791 357 -9 37 -601 -148 -5 -598 -1202 298 658 97 121 -1439 -531 -18 1098
4405 1098 -94 -627 -616 201 259 553 -550 -192 240 585 166 -890 -423 396 904 -139 -15 -1399 251
4424 251 805 106 -164 -802 698 511 132 -1233 -190 -395 -186 382 -817 -1230 -250 900 699 110
4442 110 -681 -138 998 511 24 -300 147 676 988 -728 -811 -845 283 -403 -799 -595 -777 534 30
4461 30 -652 -770 -585 776 1431 -839 -1437 -471 324 357 -551 -1204 -83 -61 633 -90 -1102 224 2
4480 2 0 -576 -491 -105 576 36 -762 -1178 -501 240 -270 -239 -581 -120 977 294 -329 -926 -1191 1410 198
4501A98j279Q74p3O91R33j599RN84j4J249j337o57K66M02m61n06L42j19J216O0
4521G79j343L33O64J61n95K26n64j34P34K18l65j89p61P33P71J87j988J376K0
4540B63l40p50K0P08J469j185p82J62Q87L23j219J413o34n61K65Q48j250j92J03
4559d52J562J04j179r79J354k72r9M9k63N86l79M99j167J017q83L06P09k3L7j250
4579g23J14l37J235n80K20L78j68j20m61j7N08Q34j422R31n18l52m3J024o6j777
4599a340N59J772q3K97j800N67j96Q21l82o22j93N65P81q69k78o4P74P34j236
4618a93q93J183M63k79k91L70o96J409M6j141j031J017M66Jm62j00n69R21p92
4637e71R32r58p26J587J10l55j93K61K76O65p46r78L17Q55j08j193o3K21J032
$$ plain form
4501 198 -1081 -207 -280 411 1344 -255 -246 338 324 1573 236 -421 -155 247 -214 -720 -378 -497 719 779
4521 779 -564 -231 433 594 -1 225 -339 -473 261 479 114 -75 -836 -103 668 855 -1133 243 263
4540 263 -77 -827 -807 -99 1370 185 -597 -435 452 775 -444 969 335 -226 39 887 -363 -555 -452
4559 -452 1110 1214 35 -944 410 138 39 88 -175 411 32 531 -636 381 -502 -196 513 490 527 -723
4579 -723 -609 -946 289 -291 -71 307 139 19 -442 -459 49 883 -539 392 -126 -478 -521 503 437 -1340
4599 -1340 -781 991 908 1205 -595 -28 -224 597 215 -407 -600 -35 746 -123 -401 -465 309 1043 -193
4618 -193 -1086 97 560 281 -10 360 -336 1073 1119 -22 -1053 -36 430 431 -31 -131 -700 221 -571
4637 -571 361 -597 -1323 264 374 19 -174 87 363 1028 282 -696 -379 476 368 -825 -888 -667 365
4656C65j38p53k15l69J525o77M81N22q97J60o4P7p7m63P23K91K35r20j20J047
4676G33o04K96m49L49n78J381j352K01j54M02O04j31j684P63P34L26j23m22j079
4695g87L83P57o18j25L9P02o92O60r79J036m42M85k75m10P35K40K2M74r84j052
4715h31j50Q70J04n2j066O84N08n92L73O98L01k16o60M53p30N61p3N69l3p67r0
4736a39N39m40R5k01j85L77L73M04j354Q3K94J81o4%J56m85N94p59N79k9j66J098
4758I51j073M56j76r7k72n0Q71r71K89K32m09n41m91J594N84j228K36j042J660
4777E23l11q35M06l26l76J315N7j305O17M84J732j172o02l49j23O36n35O46l43
4796A39r50L31K27R99j117l16M32J675j671J25K9K95r46L41L96j55N76j92m74
$$ plain form
4656 365 227 -526 -741 -1110 415 -262 219 741 -156 4 -60 17 -60 -523 200 491 726 -194 -314 733
4676 733 129 425 -24 325 -253 1128 -224 -23 -177 225 829 698 -986 -223 511 837 714 292 -787
4695 -787 -404 353 -265 -390 -351 351 -341 319 -660 376 -66 419 144 -266 469 709 731 1205 221 -831
4715 -831 -981 -111 -7 -59 -1125 -441 67 -525 -152 546 847 631 -29 424 -306 255 182 751 718 -49 -139
4736 -139 400 -40 55 -146 -331 46 419 823 -531 -448 -154 27 -37 -37 119 -366 228 -531 48 19 -147 951
4758 951 -122 334 158 61 -211 -261 610 -361 -72 160 -249 -790 -1281 313 897 -331 -95 -1137 523
4777 523 212 -623 -217 -543 -919 396 453 -852 -235 249 1981 809 207 -142 -265 371 -164 482 139
4796 139 -811 -480 -253 746 -371 -687 -255 1420 -251 -126 -97 198 -748 -407 -11 -166 410 218 -256
4815b56M2K12q03J560m95j211J701n97R3q39Q36R7n52J64p35J450n06L04m48L01
4835C18l30J95J0m45m1J84m15K97O58k54l23N70J18l14o49K80O11n69J99m09N36
4856B27k61L16J13o77O56k21R29j125Q47q79N74k30n53j22l02J267M84r19j031
4875i07j02J064qm96M55L90j27j29k30M21K0o15o0N92J76O85j359O80q69Q66n11
4896f4L2j81m4L96N5j78k51j67K6L91P1p11R39P21j630P38j107P88k16N31m46
4917c07N62O37j455K67M87o24j79J82j36J24J196j269M98J60j30M77p94o36J010
4936G0rK41K04j06n99M96j38l86Q74p50J24j88M56m80K03R49j525R14L23m04J79
4957D48l09J35n2j41n40R37j031J056M6n9k81m00R02o0o82n30K54O46O58r61l04
$$ plain form
4815 -256 -214 -2 -805 755 260 -951 750 153 246 -593 243 340 -212 -48 -783 667 161 465 17 318
4835 318 -12 183 193 -252 -293 -109 -524 -227 431 177 -146 424 542 228 -421 -141 470 -99 100 -309 227
4856 227 -34 282 395 -282 374 153 1082 -43 804 -75 499 269 -284 -406 -708 559 1043 124 -907
4875 -907 -1009 55 47 -449 6 396 269 140 -90 331 351 -264 -324 268 444 1129 -230 450 -419 447 -64
4896 -64 -32 -213 -257 139 194 16 -235 -402 -376 15 86 -625 314 1035 -595 143 -964 -176 -392 139 -307
4917 -307 255 892 -563 -296 191 -433 -612 -430 -566 -442 754 -515 -17 143 13 490 -304 -940 70
4936 70 61 302 506 400 -199 297 159 -227 647 -103 21 -167 289 -191 12 961 -564 350 673 269 448
4957 448 139 274 222 81 -459 478 -553 503 549 490 209 -191 711 651 -31 -561 -307 339 997 36 -268
4978b68m37K05J118k4n43M9o3m5L48n50O5O20L7q25P22k87M25k4q89P78p3j19
5000B20j097J670j075J280l65p08M36o74q8k06P23L9n88Q77p33k98L11M68K28
5019D20q03M86j98O55n79m75L79O17q23O86j031L04N16rJ28m46K51l33j25K41
5039a39n95N29M40r2l25L72r84J292o21p30M54L86j19J36m15L41n49O41O6k14
5059a26j96M43n26P6J0n8o21Q8J015r23O9J008l23N42l13l78L89om1J93m86L53
5081A89m14Q61k506K493o20m47k85P28N0k97P93j025K07M75P0l68J56k97O04N5
5101D22N58j029M27j821J654m77O42l32K07P2j006J092M69j335P2j88L47n67N18
5120b75k6K15l04N18L44q49N20l96L61M41n59M76o05M26K57j71p25J271n38j62
$$ plain form
4978 -268 -705 -500 618 594 51 100 37 -8 340 -210 -145 475 512 -313 409 122 547 523 -366 412 339 220
5000 220 -877 793 -282 998 633 -75 361 -313 -401 -607 116 155 -433 444 -289 -587 -276 192 420
5019 420 -383 103 -95 560 -19 -494 -115 502 -321 365 -666 -362 154 145 273 -173 78 -255 -380 -139
5039 -139 -734 -205 235 143 -182 190 -794 498 -123 -853 -399 -13 -132 4 -411 -70 -619 22 88 -126
5059 -126 -322 121 -405 -329 -319 -377 -998 -910 105 -818 -749 259 -64 478 165 -213 176 170 129 322 -164 189
5081 189 -225 636 -1870 623 3 -444 -729 -1 49 -248 545 -480 -273 202 272 -96 60 -237 367 422
5101 422 980 -49 378 -1443 211 -266 376 44 251 323 -683 409 878 -457 -385 -573 -226 -793 -275
5120 -275 -301 -86 -390 128 472 -377 143 -253 108 549 -10 466 -139 287 544 373 -352 919 381 219
5140B19M6k18k46m4M60p23L02L91k55j32R84m45p5j97n44J201p12o87J027j05
5160B47j03k02j24k63P11q40N01M09l95L60K83p24L73J53n00Q3j98M87J22m53
5180g3o23J750j821M70j67J047n10O64K10n37n20L41o63P5L87m44l65J520o31
5199A10j97q6M19k02pJ02m01j1l8j28J059o46n33Q11l36l14J206l95n4l62J62
5220A59K06k36r25N41R53j022N10l50j91K21Q09j388L58N96n95J05J99j07M18
5239B61j78j15n10O58J13p4K9J040j404J020m26p01L31o82J080l78j50K1l59k69
5259f93R24m2M03N24j059L21k34L74j203M94l54N6K21J095O5m91j136J468j462
5278g29M98M97l81L60J3K87K07j173Q36q80J004m36j66o2M8J75k65R85j35p00
$$ plain form
5140 219 265 47 -199 -243 217 -506 -204 187 -68 -200 784 339 264 67 -477 724 12 -675 352 247
5160 247 144 -58 -182 -445 266 -574 -73 336 -59 301 584 -140 233 386 -114 -31 -229 258 380 -73
5180 -73 -696 1054 -767 -297 -464 583 73 737 947 410 -110 231 -432 -357 30 -414 -779 741 110
5199 110 -87 -173 246 44 37 139 -262 -273 -311 -439 620 -26 -559 252 -84 -398 808 413 359 -3 159
5220 159 365 129 -796 -255 698 -324 186 -164 -355 -134 675 -713 -355 241 -354 -249 -50 -157 261
5239 261 83 -32 -542 116 229 155 184 1224 -180 840 414 -287 44 -638 442 64 -86 -65 -424 -693
5259 -693 231 189 592 1116 57 378 144 518 -685 -191 -545 -489 -268 827 892 401 -735 733 -729
5278 -729 -231 266 -115 245 258 545 752 -421 415 -465 539 103 -63 -125 -77 98 -167 818 683 -17
5298a7l09O7o09j1L92j05o0J321j94n52o57J20J442r55O33j52l71P6q64O72j103
5319a236P59m56J326K99n16p7l59L97N6J21M63j326j01O3j03L76L36M09L09o13
5339A27q3L92j058P24k25Q76j151Q44l91O0p34P32J38o66R82j312O83N4J9J99
5359B10k31j66M70P2j37j01k76k32O71K3k54k53O00p24m4o64J586j17J86q39n61
5380g81J89k06K74P16J25o66R42q72O93J55J92m58l17Q82q09k48J10M80k69r57
5400h25O15N60J33L08j342J68O17j079J013l40m3J182j170O97m43n78L59m84P59
5419A07m33N16J47rMk15m30Q68n25n75O11J282l68m07j584J542o2j50n68J85P4
5440A0k96J9K5N66m61l68Q59O06q49P44q28j34M61k12m21m74k30J693o70K62m98
$$ plain form
5298 -17 -326 -259 -868 -879 -487 -592 -652 669 475 -77 -734 -614 828 -127 506 354 -17 59 -805 -133 -1236
5319 -1236 -477 -933 393 692 176 99 -260 137 193 314 777 -549 -650 -587 -690 -314 22 431 740 127
5339 127 44 436 -622 102 -123 753 -398 446 55 115 -619 113 251 -415 567 -745 -62 -8 11 210
5359 210 -21 -187 283 355 218 117 -159 -391 280 303 49 -204 396 -328 -372 -1036 550 433 619 -220 -781
5380 -781 -592 -798 -524 192 317 -349 593 -279 414 569 761 303 -14 868 59 -189 -79 401 132 -825
5400 -825 -210 350 483 791 -551 -383 234 -845 168 -172 -215 967 -203 494 51 -527 -168 -652 107
5419 107 -326 190 337 328 332 117 -313 555 30 -545 66 1348 980 573 -1011 531 469 319 -249 -64 10
5440 10 -286 -267 -242 324 -137 -505 354 960 111 855 27 -107 354 142 -279 -753 -983 710 40 302 -196
5461a96R29l6j194J042l34J24mP8j75K80o62L18Mj49j65m39P54k47J54J5j265
5482a168M85n88P04J004p99J238k64q67O31k44j58K54L15m80j149J146n4J26P30
5501H62p76P15j233o1O79N74j106M62k45k44M07j58q03J197q10N99j43r0M88j332
5521a018M71J150q61R03j119J008L07r21L39k39k59j00N2k61k28J577j105q0J013
5540F29n15L19l80l86K21J569k289J118q91L46N55p97J028p36N05L74r9r98R12
5559D85n26k66J133p80k59n44J215o70J040m76p98N08Q8m39M95k28k4L80j122
5578g88J267J24k03m91O73m37l43M97L87j094N39j60l09J295m35k17o55K49L87
5597B86o39k29J42J115j428R40p15Q55m27j086J301m6m47P2j64J129j021K49j154
$$ plain form
5461 -196 733 697 -497 545 211 335 331 409 234 514 -148 170 174 25 -140 -579 175 -72 82 97 -1168
5482 -1168 -683 -1271 -567 437 -362 876 612 -255 376 132 -26 228 543 63 -1086 60 6 132 862
5501 862 86 801 -432 -493 186 760 -346 116 -129 -373 34 -124 -927 270 -540 59 -84 -174 314 -1018
5521 -1018 -547 603 -258 645 -474 534 841 -80 259 20 -239 -339 -287 -548 -776 801 -304 -384 629
5540 629 114 433 53 -333 -112 1457 -832 286 -605 -259 296 -501 527 -209 296 670 571 -427 485
5559 485 -41 -307 826 46 -213 -757 458 -212 828 352 -446 62 150 -289 206 -22 -46 334 -788
5578 -788 479 603 400 -91 582 145 -198 299 686 -408 131 -29 -338 957 522 305 -350 -101 286
5597 286 -353 -582 -440 675 -753 187 -528 327 -100 -1186 115 69 -378 -306 -470 659 -362 -113 -1267
5616a267J166K50j80K60j67k85J97m17m55J283O0m30R43m05M74j783J101R2q95
5635d58Q73k07j37j85L81n27N28K98r65k31M98M89K51n3j26l52j62m37M90K25
5655A93k50j468K532n20l98O47j29m86q08J278j55j187M91J658j766k0J224p37
5673I9o51N84q18O63M60k14j61p33Q11m06q5K03k94R58q95k21P2J181p14N9j0
5694a12p08J139r8m38K4k21Q54p03l90K18k05Q07n39Q0j71j64R98p66J185n65
5714B25n51l08K66N01q10Q96O49j139J5l23J324j408J673j123K1q18q8J061P01
5733G64K0q94o0N08n98K27J6J41j279J115O01m06o94M63k07Q52k16K9q08N65j15
5754B4l82O39Q97r98J097j974O76O28r12J1P00n62j23M4O68k6J3j57k17k06K66
$$ plain form
5616 -1267 -101 149 -31 229 62 -223 -26 -443 -898 385 445 15 958 553 1027 -756 345 437 -458
5635 -458 415 208 71 -114 267 -260 268 566 -399 -630 -132 357 608 555 429 77 -85 -522 -32 193
5655 193 -57 -1525 1007 487 89 736 607 121 -687 591 436 -751 -260 1398 -368 -388 836 99
5673 99 -552 32 -786 -123 337 123 -38 -771 40 -366 -451 -248 -542 416 -479 -700 -628 553 -161 -102 -112
5694 -112 -820 319 221 -217 -193 -414 440 -263 -653 -435 -640 167 -372 -292 -463 -627 371 -395 790 225
5714 225 -326 -634 -368 133 -677 219 868 -271 -256 -579 745 -663 1010 -113 -92 -910 -998 63 764
5733 764 784 -110 -170 338 -260 -33 -17 124 -1155 -40 561 155 -539 -76 -283 569 353 382 -426 139 24
5754 24 -358 281 1178 180 1277 -697 -21 607 -305 -294 406 -156 -279 -235 433 407 420 263 46 -160 106
5775A06m2n54Q72J57q02K7P62j41p66L69N68l69L33j370R89j75k73j06N19p63
5795f59J530o0j312M99lP7r0j0J219j667L69P32l32k75R26r5M41j263P64q68p36
5816h13P36R89l13q42O39j56K02m21k41l65P40k60m75N41q3l4k82N24p58J130
5836D58Q1m91N85j87o76o75J262q11O88J035j558O56n94J500j238N4R81p31M03
5855G42j039L07L66j398P24M3K31L84k15N39o02m91J441j233n53Q25J23m79O90
5874D05Q64r57N58j025o88J469j248O02l08J204j140Q24r18K56L51k45O78p85
5892a03j173J365r38Q25ok98p90M31J179p17R88j369L58KO68p57M78L7J71M1N11
5913I03j277K85J527j322n18R22o84l55R9N52j43R1p22O17K90k52O1n04K28l64
$$ plain form
5775 106 64 -490 382 539 -263 -236 526 385 -381 -12 556 187 520 -850 139 -36 -309 -415 104 -659
5795 -659 871 811 -501 -2 -5 72 -18 -28 1191 -476 -107 625 293 18 944 849 1290 27 791 -77 -813
5816 -813 -77 912 599 -243 396 240 442 21 -220 -585 155 -105 -580 -39 -122 -156 -438 86 -672 458
5836 458 539 48 633 446 -230 -905 357 -454 234 1269 -289 367 -227 1273 35 89 1070 339 742
5855 742 -297 10 376 -1022 -298 -255 -24 360 145 684 82 -409 1032 -201 -754 71 194 -285 405
5874 405 1269 312 870 -155 -843 626 -622 -20 -328 876 -264 560 -358 -102 249 4 682 -103
5892 -103 -1276 89 -849 -24 -30 -328 -1118 -687 492 -225 763 -606 -248 -246 422 -335 143 180 351 392 903
5913 903 -374 -89 1438 116 -402 520 -164 -519 -420 132 -11 80 -642 -25 265 13 74 -430 -202 -566
5933e66P20q40L97L37O76l96J88l13M22j71m54N51k80n48K11Q2K21j96O31j043
5953c71K15K50k58k14O50J05O19j278j49M39J441j899j07J095l18P6l36L52J78
5972D90M76o38Q15j329N20j24n41R17n6o89o3R22q21L47q51N58k12L9J331j335
5992b44P24p76l10M25k81K47n98N19k0m39J520j124J104p01l96O20j23p46N02
6011i7l4k07M50n80K52J68L88m21M9q0P17o70r0L60L03q18j00P79j307O24R36
6032F22j139L64J92r52M85PQ04k33L57j8l40k07jq66R55No92N47j325J014R75
6053E54j60J02m33p08J185j249J157k75o7q08O91J95j061J084m44r19J668j60
6071C52N7r05P27l71%o46J887k21r55P72n63l72J26M06r31J489j44o97L88l73
$$ plain form
5933 -566 154 -686 -289 48 724 328 516 203 625 454 0 551 271 -277 -66 16 237 41 672 -371
5953 -371 -156 94 -164 -378 272 377 996 -282 -431 8 1449 -450 -557 538 220 296 -40 312 490
5972 490 966 328 1143 -186 334 210 -331 586 530 -159 -222 700 -121 226 -625 -67 -279 -240 1091 -244
5992 -244 480 -296 -606 -181 -462 -215 -813 -294 -314 -753 767 -357 747 46 -350 270 147 -599 -97
6011 -97 -131 -338 112 -468 -216 -48 340 -81 -32 -112 605 -65 -155 205 508 -310 -410 369 -938 -314 622
6032 622 -517 -153 39 -913 -428 -421 383 150 507 489 149 -58 -59 -925 30 35 -657 -110 -1435 -421 554
6053 554 394 496 63 -645 540 -709 448 173 106 -702 -11 184 -877 207 -237 -1156 512 352
6071 352 409 -496 231 -140 -140 -786 1101 880 -75 697 134 -238 -112 294 -637 852 708 11 399 26
6091B6m52M69J61m1n63r25N36J134q24k64O98j33O67m56N26m51k40K62l95m97
6111g62j97J744k07j468J093l93j92L23m07P29r66M50j02Q04m21J05r6k15J567
6130A389j292L38m6q4j86J49J94l35o3M53m48K6n15M58l92K76Q4k23M29R56j179
6151a1p75P18J79n00M60l31K93j109J853J60n78j078J023M71n34Qn66K92J69o6
6171G8n97J06O85K09O5Q1j015J159k67j169J101J57j070R26m66J67m21K55j89
6190b05P9n59J172m93P04r70m07J48L10R48n31o60N15R03j042N75j215K49J15
6209c64O21m16k51J193o12k13n29K78M75r31J011m13o7M24J26K40n43r73L76N89
6229B1r2n29m06J057k55Q07n80n42J28J129J41p45l51K76M23r2k86k43jq08P74
$$ plain form
6091 26 -426 43 204 163 -400 -1325 -789 345 -479 -743 -45 -178 489 33 559 108 -132 130 -265 -762
6111 -762 -959 785 578 -890 203 -190 -382 -59 -466 263 -703 -253 -355 449 28 133 37 -178 1389
6130 1389 97 435 389 305 119 268 462 127 64 517 69 95 -420 38 -354 -78 6 -217 212 1168 -11
6151 -11 -786 -68 111 -389 71 -260 33 -1076 777 937 359 -719 304 775 241 249 -317 -25 144 78
6171 78 -519 -413 272 481 546 627 -388 771 504 -665 436 593 -477 449 -17 150 -271 -16 -205
6190 -205 -126 -685 487 -6 698 -272 -679 -531 -221 727 196 -464 51 954 -88 487 -728 -479 -364
6209 -364 257 -159 -410 783 171 -42 -571 -293 182 -749 262 -151 -218 206 332 572 29 -944 -568 21
6229 21 -71 -600 -1006 51 -204 603 23 -519 -391 738 879 134 -217 59 482 390 104 -139 -140 -948 -174
6250a74O82j106J021j85j59n38J77J58L59l31J1n75L96N76J67O7k61m73k23O84
6270B73q34J172j53l47L79j40m93K02j082P28k79R32j87j56K92K01m16k51L68
6289B09L54n46J73J67J15m63m03N36o03K10N71M46o12j09M09p94K51K16m83n00
6309h56M03j6Q61j177Q88j67J25n97k74J512j190O80j20Ok36m45O22q73O23M37
6329B06j7j8q7k7n89J103k54q22N62k63K60K51n49r1O90O2K65k70q65J100p24
6350g7J064n57J85j065K28M97pn32PJ78k52Q35j375J118j751J387R77q72J84J28
6370C00P03l33o0n14M44o51N78k05j3j24k82O04j78l76R11l98M88p97l36l53R12
6391C20P06j782J549r91K02p15N7J172j151J05J277o87j69K08r84J624n43p32
$$ plain form
6250 -174 508 -598 423 238 79 -459 -282 -124 235 -96 -85 -660 -264 312 479 546 285 -188 -411 273
6270 273 -561 611 458 111 490 350 -143 59 -1023 -295 -574 358 171 15 307 508 92 -159 209
6289 209 563 17 190 357 472 9 -394 142 -461 -251 320 766 154 45 454 -340 -89 127 -356 -856
6309 -856 -453 -469 392 -785 103 -64 61 -536 -810 702 -488 192 72 78 -158 -603 19 -854 -231 206
6329 206 189 171 84 57 -532 571 317 -505 57 -206 54 305 -244 -335 355 417 682 412 -453 647 -77
6350 -77 987 430 615 -450 -222 275 268 -264 -257 -79 -331 504 -871 247 -1504 -117 860 -12 172 300
6370 300 1003 670 610 96 540 -111 467 262 249 125 -157 447 269 -107 804 406 894 97 -239 -592 320
6391 320 1026 -756 793 -198 4 -711 -654 518 -633 -528 749 62 -107 101 -883 741 198 -534
6409e34M58j83O03j200J84R43J71K48n42Q6k65J31j41J73K1n86M66N48p29n88
6429g36J361j020m00j39K116q70l40O1j79m77J106j443J229O15J78j499M85Q1
6447A29J31n78Kk01N69Nj209J294L53o61P49L85q27l52k7Q81n60n13J210L5r91
6468a76o22O91M54k9M72r94M4r3Q25k15r50M90K15m80K85q96R80J5m6M16j060
6489f74N79r9n35J060q8j213J184k15R2m69P66m64J620j590K8l21P29k47O61o40
6509A64L26p86O83J99j092J90L24j80J3J64j29Rl95J038j088J179j45n93J74q1
6529b6q06L14Q31j072J375j384J70n46J488o75K22j19M19l24K36q42J493q67P85
6548F72j52P03j262j46Q06j56n88O61k95Q6o32J56J21M39p46L49j95m3L62N97
$$ plain form
6409 -534 -76 -259 344 -856 -672 271 442 690 148 234 -31 100 -41 132 153 -433 33 581 -148 -736
6429 -736 625 -395 -795 -934 1182 312 -28 33 -146 -623 483 -960 269 884 1062 -437 48 129
6447 129 260 -318 -316 -517 52 57 -1152 142 495 -166 583 968 141 -211 -238 643 83 -430 780 815 -176
6468 -176 -798 -107 347 318 790 -204 -160 -253 572 357 -593 -103 112 -368 -83 -979 1 16 -30 386 -674
6489 -674 -95 -194 -729 331 243 -970 214 -1 91 -378 388 -76 1544 -46 -18 -339 390 143 804 164
6509 164 490 -296 387 586 -506 -316 8 -172 -159 5 -124 -115 -510 528 -560 619 474 -119 55 -26
6529 -26 -832 -518 313 -759 616 -768 -598 -1144 344 -331 -109 -228 191 -133 103 -739 754 -113 672
6548 672 520 1223 -39 -185 621 465 -123 538 243 329 -303 -147 -26 413 -333 16 -179 -222 140 737
6568G37k51l44nn15M12m2j20j79q4J48M45n91j74P01L58o23O81o35l88P79p50
6589d40n63R78J733j351j73j73O81k21o26P07j286P22N41l58O86k85j017P27n13
6608b31N47r51J539j139O00q34P03m44j523J862k61O46o08L54m07Q13o71j22K25
6627I8m91rO37K82l84j82K3o11N17r7P21M74j136o1M85n04J00K75k94m66j51Q33
6649E9L65j18r89R36j72k59P78j244m13P54R42m15j666J658Q4n9m49K07k2Q28
6669H05p34k5K89o77J193j731J032q23L66O1l22l79J40J140j20J91p26j06P37
6688C11o66M73R6l47n49L70J291m14r57M63n9R6J86J2q05Q81o82k65J295o87O37
6709F80o90k71L21k34R72o99q35j27P74k41O04n37k28O37k24Q84r89m23j43M64
$$ plain form
6568 737 486 142 137 -378 34 -8 -128 -307 -391 -243 202 -389 -563 138 496 -127 554 -81 -469 310 -440
6589 -440 -1003 -25 1708 357 184 11 692 471 -155 552 -734 -12 529 171 857 572 -445 282 -231
6608 -231 316 -635 904 -235 365 -469 234 -210 -1733 129 -132 514 -94 260 -147 666 -5 -127 98
6627 98 -393 -402 235 517 133 -49 -26 -637 -120 -217 504 978 -158 -219 266 -238 -138 137 -157 -623 -774 59
6649 59 424 306 -683 253 81 -178 600 -644 -1057 -303 639 224 -1442 216 300 241 -208 -1 -23 805
6669 805 71 46 335 -342 851 -880 152 -671 -305 -244 -566 -945 -805 335 215 406 -320 -426 311
6688 311 -355 118 214 -133 -682 -312 979 565 -392 71 12 108 294 306 -499 382 -300 -565 730 43 680
6709 680 -10 -281 40 -194 778 79 -756 -883 -109 -350 254 -283 -511 126 -98 786 -203 -626 -769 -305
6729c05P01j593J478J9n16J149j145K56N33J60l78m68J149j443J40O53p21N28
6747A97k79n69J196K47p61K65J99m54o24O4L02M94n63o37J367k91k88q07J106
6766A64m00r58J181L81j50l52L28M9k59J34O3Q2J27j063J156q99M22l59J091r45
6786b07J98l09M45P6m70n39N35O72K64p77m94Q15l18J36L7O78m79p90Q60l74M53
6807D12K25m62J92k58M14r52N47j73K87j18m68M3R63k5m53M07n89J144r13q69
6827f46Q54p34Q2P6R84k09O0k29j61K75l25L00l09J17k18K56l8m38N80r76R68
6848B69o75J014r04R21j587R45Q5J26o73l8J109j554N74N16m36R30l68k59k15
6867b20M75o85J220p55J29J48o74N99q00P74k02j34m27J031k71n32M02P29n79
$$ plain form
6729 -305 396 -1197 281 300 -216 933 -212 44 577 737 359 -109 1040 -403 -263 390 -331 197
6747 197 -82 -651 545 792 31 296 495 41 -583 -519 -217 277 -286 -923 444 153 -135 -942 164
6766 164 -236 -1194 -13 368 218 -134 194 243 -16 118 181 263 390 -673 483 -416 6 -353 738 -207
6786 -207 -9 -318 127 203 -267 -806 -271 401 665 -112 -606 209 -109 27 64 742 263 -527 333 -41 412
6807 412 637 175 367 109 523 -429 118 -55 232 114 -354 -311 652 627 174 581 -8 1136 223 -646
6827 -646 208 -526 -444 -368 616 407 467 238 77 352 27 327 18 135 -83 173 135 -303 277 -699 269
6848 269 -406 608 -296 625 -962 -17 68 194 -479 -517 592 -962 -388 128 -308 622 254 -5 -220
6867 -220 255 -430 790 35 164 312 -362 237 -563 211 9 -125 -552 479 208 -324 78 807 228
6886B28q91R14j61J72l44M47o30J124m05K25k99p07P57j42k33m83O99k46M00m59
6906c4M93j034k01M48Q57k10o66J96p88K56k67P55k15M40K37j209J223q56L05
6925b70P13J43l63n96J39J78J58o56j03R50j09n90N08n04J48N0j27l46J789j004
6945A08k71k23N14l51J21L18m96n36Q81O5j76Q28r44M03l60j53j02Q6K12j39J62
6966e3L01RK54q04j69N35J80L55p70j65M23l48K77j67J179j245k71J350m92M5
6986D24l60O12J47j102M53K6L76k45n90K21l41J962k020J31M50l56O67J08n72
7005iL89m73j49K1r25P53N71m24N63k65j04P72o44K39r39J058j146K32k27J463
7025G56K31j447J489j345K5P70q71q61J080K58r58J360r47P26j42k06j30n62K7
$$ plain form
6886 228 -663 251 90 262 -82 365 -265 859 454 679 380 -327 430 288 55 -428 271 25 425 -34
6906 -34 459 -575 -776 -328 529 319 -347 -151 -939 -683 -950 -195 -410 30 267 -942 281 -575 -270
6925 -270 443 586 223 -373 -234 -56 102 -554 -657 293 184 -406 102 -402 -254 -204 -331 -677 1112 108
6945 108 -163 -386 128 -223 -102 216 -280 -816 65 130 -46 782 -162 241 -119 -272 -374 -288 -76 -215 -53
6966 -53 248 257 511 -293 -462 73 253 608 -162 -327 96 -252 25 -142 1037 -208 -479 871 379 424
6986 424 64 676 823 -279 174 200 576 331 -259 -38 -379 1583 -437 -306 144 -212 455 563 -9
7005 -9 380 -93 -242 -221 -1146 -393 178 -246 317 52 -52 720 76 315 -624 434 -712 -480 -707 756
7025 756 987 -460 1029 -316 -291 479 -392 -1253 -173 85 -873 487 -460 266 124 -82 -212 -774 -747
7044g47J160N50q99l04M59L0m51O76n62J27M83j209J453o14p05R14L38k23M0l6
7064D80l08O83j064J360p88m92n66J356n05r74J761j382J489j903R21n43N06P73
7082H04j005j51K32l04K06L45o51O3l58L06L25O49j110M53K85M79k77O35j003
7101g7n58O32L96l84k94P5P73J97j06q24L3k86m10J665j339N32p30J321l54M94
7121G56n58r1Nm63J45O64o78n47O94O47m48n5L56J06m97m8m3k15Q03m21k93J113
7143I32j356m59N74M44J76k44M90j27n12R44o62o1j768J699m00N91O52j017R39
7162H35q33J72O30r28N79j363M68K45K60J46J018j205q4P18j056P56r94m0J218
7181E42l18r92K74J06N48O29n63n09J83K86O04m22o16Q36L5o24q3O20k26l13L68
$$ plain form
7044 -747 413 963 64 -240 219 249 -202 474 -88 39 522 -687 766 152 -553 361 699 476 516 480
7064 480 172 855 -209 1151 363 -129 -695 661 156 -818 943 -439 1050 -853 68 -475 31 804
7082 804 -201 -352 -120 -424 -218 127 -524 -461 -819 -513 -188 461 -649 -196 89 568 291 926 -77
7101 -77 -635 -3 393 9 -285 -210 563 760 654 -170 -137 -423 -833 832 -507 25 -705 616 262 756
7121 756 198 107 112 -351 -206 458 -220 -767 -73 574 126 71 427 533 36 -12 -55 -270 533 112 -181 932
7143 932 -424 -883 -309 135 311 67 557 430 -82 862 200 139 -1629 70 -330 261 913 -104 835
7162 835 2 174 804 -124 455 -908 -440 -195 65 211 1229 24 -60 658 -398 358 -636 -676 542
7181 542 224 -768 -494 -388 160 789 226 -283 -100 186 790 368 -248 588 623 -1 -84 536 310 -3 365
7202C65m14O5R9P99j251O02m74N23j072M64L16O98o55j112J073L31n10L68N55
7221G70j741N36K56Q41N09j663O87m20K06M11l72L56j80L93j004K70J87k81P51
7240E12l58L0l74j01R25p33j88k43O58P8M28j115L4P24n30P93l52l07m88N77J95
7261A65j13L80m97l06N00P4l27M72j92J53k20N0L45q20N27l93J346j486K96j85
7281b31K66P30q32j209J518n89M12r85R29n8K23j6n61J13J260q53l15JN14K04
7301E21k49K49j43k45k9L80K57j345n6N61J11J6P9m99j17J391j805P11L85l4n5
7322H4J53o05R94q9R7Jp53M78m57R93k52o50k98O8K42K47o51m46R57r1K32r8p01
7345e45J221n40j36k13Q11o83M95j91l25L7j44Kl55L14m94J348j001M11o39N87
$$ plain form
7202 365 -49 16 115 914 -337 265 -209 314 -758 -294 22 720 65 -1047 26 357 -153 215 770
7221 770 -971 -435 -179 662 1171 -492 195 -225 -19 392 20 376 196 589 -415 -145 42 -239 512
7240 512 154 184 -190 -291 634 -99 -287 -530 128 206 634 -481 -447 277 -253 540 188 -119 -607 -30 165
7261 165 52 432 -65 -371 129 203 -124 348 156 309 89 139 484 -336 191 -202 1144 -342 -46 -231
7281 -231 35 765 -67 -1276 242 -347 65 -920 9 -49 174 158 -403 -290 970 117 -198 -197 317 521
7301 521 272 521 378 133 104 484 741 -604 -660 -99 12 28 107 -392 -509 882 -923 -212 173 139 84
7322 84 237 -368 626 537 634 635 -118 360 -97 896 644 -6 -304 -236 6 253 -398 -844 113 22 254 156 -545
7345 -545 676 136 0 -213 598 -85 410 219 -106 -69 -213 -211 -566 -252 -746 602 -399 12 -627 -40
7365d0J68P28m61Rj46M10o79P8k98J164j020m12P85j22k57p1m9J042j450p1J031
7386C39mq90Q29m07j16J35k08N26r86P37L41m16M89j03p28k21R46k50l08N13N64
7407G82n11k07K29K72p62K48K6j54J03R0j22k43N90l33K91p52M03K0k89Q14m19
7428G6N57j079P13p92J026j88J71p3n09j85J033p12K18m50m35J01M46r71O72J131
7448G50j287Q69P20j433J055J74k3j514Q04n0N6p90J33J239j720J924j098J45
7466d6m02P13N41j099J94L83j72K56p74N93o7Q18j554Q20k90N78j079J106j048
7485e29L93N40j197J056n60K9K79m26q38J73J260P91j327O12j21p65J012k31O20
7504G71j090Q10n60k22P49K73o46p5M8m8k45k81K96k78L1J99j37M69p70O4L36
$$ plain form
7365 -40 128 856 395 404 258 668 -11 67 -231 933 -87 -499 286 164 -93 -164 -213 829 -621 -692 339
7386 339 335 -555 274 -133 -249 -114 -322 204 -782 -45 296 -120 369 266 -462 -683 263 13 -295 218 782
7407 782 271 64 293 565 -197 51 77 -77 26 116 -6 -249 341 8 299 -453 -50 -30 -319 495 76
7428 76 633 -446 267 -525 501 313 484 411 -98 -283 750 38 256 -194 -629 -528 -82 -1053 -381 750
7448 750 -537 332 1052 -381 674 848 825 -689 115 65 121 -669 -536 703 -1017 907 -191 -46
7466 -46 -448 265 806 -293 -99 284 112 368 -406 187 120 938 -616 204 -86 492 -587 519 -529
7485 -529 -136 404 -793 263 -297 -268 11 -415 -1253 -1080 180 971 -356 256 135 -630 382 151 771
7504 771 -319 491 -69 -291 458 731 85 10 58 10 -235 -516 -220 -498 -467 -268 -405 64 -706 -642 -306
7525c06K09L17M28j011n80J607n58J02L97m94K53L89j165J000l86n25O70j133
7543g86J49Q45M04j057J399j117m6q9N22L01R4j007K7J114j096J06R06o83m07
7562d21n73J757q39j013N65N54R48p37l10l04M33N2o18P57K54o24j80Q41J23j196
7582e31J303q89K50J59J65k37q7j42Kp81O78n6m77M32J086j169K68l3M94R3j175
7603f47R51j219P33L29p2q58M44n1O56N7k77r92J067k52n1p17Q08k92L28k48Q14
7624E11J94p23Rn9R75q66N11n22j73l82k60J121r13J539n69J034j071L80n03L05
7644E38n54O89j98j136J111K90m61j07q81J60L13N98n32P0L71l07j94O83m98j04
7664a49j79n19M56R53K08j03l0m23J32k156J768jL50O88l67n79L43q4K42p73P60
$$ plain form
7525 -306 -97 220 648 -363 -943 664 106 208 605 111 364 753 -412 588 202 -323 347 -786
7543 -786 -637 208 612 -445 954 -163 -209 -298 224 525 619 -388 -361 753 -343 -237 669 -14 -421
7562 -421 -994 763 -76 -1089 -524 30 978 241 -69 -373 60 112 -506 251 505 -119 -299 542 665 -531
7582 -531 772 -117 133 292 457 220 133 -9 -7 -788 -110 -166 -643 -211 875 -294 -26 -59 435 528 -647
7603 -647 304 -915 -182 147 75 -783 -339 -390 266 323 46 -946 121 -131 -182 -899 -91 -383 -55 -303 511
7624 511 705 -18 -9 -68 907 41 552 30 -143 -525 -785 336 -577 962 393 1427 356 736 233 538
7644 538 -16 673 475 -661 450 740 279 172 -709 -549 -236 362 -170 -100 271 -36 -230 453 -45 -149
7664 -149 -328 -847 -391 562 770 667 637 214 346 -1810 -42 -43 307 995 628 49 392 308 550 -223 537
7685E37m25l79N00m83l0j11l22R53j63m93R9l08L27k07L00J48l01K15P55j19O9
7706E62k17k77J2n04R55n5L03q07m9M75n23J085m25n87K09K4M56j4l44o76K40
7727a57L05l42M79j63m02M60j121NJ012J86M24m20l98J23o73k49P61P95k24l33
7747F8j3J18J96l43l85O6L5R1P87j059K77J94N81O7k57k15l47O47p60j34M08j12
7769i0M67n00n4J795j533m29O22r87J495o30M86k70r72J468r62j12J15j002J136
7788D3p69J0N86O6M07q68O17K78J22l02J33m58N17m65O24k68j42j79m81N85P81
7809H37q16j417J116k26J271j62n76J91m84j20M06L83o96m52R4J215j17J8j95
7828B70o83L49J84o4j86J73l1KJ61J44k96K54j14k07n39M97p06J364l44j01j7
$$ plain form
7685 537 112 -267 233 -250 -280 -391 -713 240 77 -416 -317 -625 -298 -505 -205 -57 -358 -143 612 493 562
7706 562 345 68 80 -424 531 476 779 -28 -77 398 -125 960 535 -52 157 181 637 623 279 -397 -157
7727 -157 148 -194 285 122 -280 180 -941 -936 76 262 686 266 -132 -9 -682 -931 -170 625 401 68
7747 68 55 173 369 26 -359 -293 -258 -167 620 -439 -162 32 613 680 423 208 -139 508 -252 -386 22 -90
7769 -90 377 -123 -177 1618 85 -344 278 -709 786 156 642 372 -600 868 -94 -206 -91 -1093 43
7788 43 -726 -716 -130 -64 343 -525 92 370 492 190 323 -135 382 -83 541 273 131 -48 -529 56 837
7809 837 21 -1396 -280 -506 765 603 27 218 -266 -386 20 403 -293 -745 -651 564 447 465 270
7828 270 -413 -64 120 56 -130 43 12 14 175 319 23 277 163 -44 -583 -86 -792 572 228 127 110
7849A10k46n93O91j86M88K03r32K02J47K78N52j576J410r03L01L81j00K32j075
7868f16o3O3O18N8L11J59o50M12J02j1L77j001J661j514P00j116N09R0J04j10
7888H3M6p45P95k27k17N28o90K49R9J000n64M32q47O65j113J138q14L47k1N10
7908F54l76lJ64n77M14r32Q83l37J35O3k07L66l49jQ05p84J63k18Q71j157O71
7929B48k17qM05n60J1J90n9j78p68J613p54L63m45j041K022j208J620j023q6K41
7949C66O37n61Q9P84r47n43k14O25m59Q75m99p7l13K12lP27j281L57l75P01K34
7970C35j018K14P07j29j60M73l21Q33j462P87p90Q5O46j370J475O06j196N44r81
7989g22J029o41M57k23P74n60m92l71K79K06L69O90k18q51o2P01P6r99P22M79
$$ plain form
7849 110 -136 -729 -38 -224 264 467 -465 -263 -116 162 714 -862 548 -355 -54 327 227 459 -616
7868 -616 -679 -616 2 60 371 530 -120 292 394 383 760 -241 1420 -94 606 -510 -1 89 193 83
7888 83 129 -616 179 -48 -265 263 -427 -178 -79 921 357 789 -58 607 -506 632 -182 165 144 654
7908 654 278 275 439 -138 276 -656 227 -110 25 88 -119 247 -102 -103 702 -82 81 -137 734 -423 248
7929 248 31 23 428 -132 -121 69 10 -168 -936 677 -77 286 -159 -1200 822 -386 1234 211 125 366
7949 366 1003 442 531 1315 368 -175 -389 236 -223 652 153 76 -237 -25 -28 699 -582 -225 -600 101 335
7970 335 -683 -469 238 109 -51 422 101 934 -528 259 -531 -446 200 -1170 305 911 -285 259 -722
7989 -722 307 -334 123 -100 674 114 -378 -749 -470 -264 105 795 577 -274 -336 365 441 -558 164 643
8009F43p43K63j63j26P26o74K54o87O63k86L6O0O7j299O02J009l47j90j24K90
8029b6n55Q82k73r10J147O2l21k92L81J00J27o78J321j497M21Q79J25j156J5L64
8049A16j10O18q07Q70o55L95nn30q78J248M1q04J158K6l33l13N5O65j224R50q1
8070D02N98r34P76m44K52j842Q01N02J45L55j107K7PN50K72q12O62j28N4l01o02
8091g67J590j362J44J441j689O00j53M47q9o46J022p63J421j066J64o25k38K61
8109c08O74n83J54J42Q2n08R64q36q14Q92O46J00n36k16j4M68k93o80l6J254l79
8130A73l14l85P08N2j021Q49M82j100J50K08M58p78M64p00L03J70l56O43J26p1
8150F1n34j85L16M68lR59j851Q17P81q9o18j42M55j54rK05m2o18K57K09O76n63
$$ plain form
8009 643 -100 163 0 -126 600 -74 180 -507 156 -130 -94 -34 33 -1266 -664 345 -2 -192 -316 -26
8029 -26 -581 301 28 -882 265 327 6 -286 95 195 322 -356 965 -532 -111 768 893 -263 -248 116
8049 116 6 624 -183 687 32 427 422 -108 -986 262 303 -501 657 683 350 37 92 757 -467 483 402
8070 402 1000 66 842 398 650 -1192 -391 111 256 611 -496 -469 -462 88 360 -452 210 82 136 -165 -767
8091 -767 823 -539 -395 1046 -643 -43 -196 251 162 -484 538 -225 1196 130 294 -331 -569 -308
8109 -308 366 -217 -63 79 161 -347 617 -219 -1033 -141 505 605 69 -147 -161 307 14 -666 -702 552 173
8130 173 -141 -526 182 234 -787 62 544 -556 -406 -198 260 -518 -54 -754 -451 -281 -637 6 132 61
8150 61 -473 -658 -342 126 123 1082 -769 48 829 740 122 -20 435 281 272 477 435 -183 74 283 959 396
8172C96j50q56P95k33l09m72k78J711m24n25M58N87p84m70Q13n9K17J40o64
$$ plain form
8172 396 246 -610 185 -48 -357 -829 -1107 604 180 -345 113 700 -84 -554 259 200 417 557 -107
8191a07
$$ Imaginary data points
##PAGE= N=2
##DATA TABLE= (X++(I..I)), XYDATA
0@%%%%%%%%%%%%%%%%%%%k6J34k16K16k16K16k17L15m22M32m57N62o46P20q28R23
35D90j035J177j316J457j634J825k036K262k507K761l047L368l714M097m516M974
51B606n474O034o665P363q145R033j0048J1240j2633J4289j6317J8861k2156K6616
65A4604l3035M3106o1435J05577m51107l84034O04976N86049J98837m52942n06904
76c36308j61099L05986L59297J80342r9521k32127k65700j00125J54052L79488
86A84285K77816j27362n14294l93704J54065N96875M26190j70387o02934m12073
96e81523J71146N45696L50636j34494m17893k86940L5053K66667K63070J02141
106C13559j15202k69414k58956j9146L11788M08613R8447l65490n04076j29781
$$ plain form
0 0 0 0 0 0 0 0 0 0 0 0 0 0 0 0 0 0 0 0 0 -26 108 -108 108 -108 108 -109 206 -216 216 -241 321 -325 395 -433 490
35 490 -545 632 -684 773 -861 964 -1072 1190 -1317 1444 -1603 1765 -1949 2148 -2368 2606
51 2606 -2868 3166 -3499 3864 -4281 4752 -5296 5944 -6689 7600 -8717 10144 -12012 14604
65 14604 -18431 24675 -36760 68817 -382290 -766324 -161348 424701 623538 170596 -336308
76 -336308 -497407 -191421 167876 348218 248697 16570 -249130 -349255 -195203 184285
86 184285 462101 334739 -179555 -573259 -419194 177681 603871 433484 -169450 -581523
96 -581523 -410377 135319 485955 351461 -66432 -353372 -318319 -51652 211418 313559
106 313559 198357 -71057 -330013 -349159 -37371 371242 469689 104199 -399877 -529658
116e29658M07565N44338J18653m24803n13726q9381L79383M31736Q6444k71965
126A38586l27001j18160J16590K17615J92788O4928j46114l07988k17632J32267
136b54121M22327L13173j55664n13580l47404J98743N41890L18834k15109m90412
146a81323k62499J79098L74994K04349q4430k25746j84556n7782Q9327K15093
156F6525K13789L405k83214l50595m8775L60966M36511M5608m11584m49728k2445
167d39537M07913M03567P340l46534l25577j9041K35476K43557P9566r6554j88076
178c7900j73159m1051J60987K84108J54849j69159l80467k17581J96085M36794
188B13506K35871k19347m47440k16799K20133M07584J83389j78678l21918j59349
$$ plain form
116 -529658 -122093 422245 540898 116095 -397631 -487012 -107629 324107 410551 138586
126 138586 -188415 -306575 -189985 27630 220418 285346 139232 -168756 -386388 -254121
136 -254121 168206 481379 325715 -187865 -535269 -336526 205364 524198 309089 -181323
146 -181323 -443822 -264724 110270 314619 230189 4443 -180113 -237895 -148568 66525
156 66525 280314 283719 505 -350090 -398865 -37899 398612 444220 32636 -417092 -439537
167 -439537 -31624 371943 379283 32749 -292828 -311869 -76393 167164 246730 150176 -37900
178 -37900 -211059 -252110 -91123 192985 347834 178675 -201792 -419373 -223288 213506
188 213506 449377 230030 -217410 -434209 -214076 193508 376897 198219 -123699 -283048
198b83048R3075K11431J59920K7288j05909j91834j56518L2012K50047K69758
208C06222K039l20557l43144K051L71076L65350k6077l77353l32048L9593L26966
219A4118K65328k5094k27665j95004l1443J00845J48164J27837K1374j44462k39581
230a85583j11843J73292L35699J57369k16434l89694j56274K44970L85685J27941
240C65128k39013l32749j00339J87764K52051R3302r4253j65551j23564k1711
250a78935J00118J78714J32390o2244k44899k12762N1900L01027K56170o2048
260B59431l31481k60305P3800L23193K37755o8817k73741k02143L7161J95340
270i807J66749K3491j03908j44079j02277J4444J47949J88614N2523j72140k63467
$$ plain form
198 -283048 -189973 21458 181378 208666 102757 -89077 -245595 -213583 36464 306222
208 306222 308261 -12296 -355440 -353389 17687 383037 356960 -20393 -352441 -312848 14118
219 14118 279446 254352 26687 -168317 -199760 -98915 49249 177086 198460 53998 -185583
230 -185583 -297426 -124134 211565 368934 152500 -237194 -393468 -148498 237187 365128
240 365128 126115 -206634 -306973 -119209 132842 226144 131891 -33660 -157224 -178935
250 -178935 -78817 99897 232287 170043 -74856 -287618 -235718 65309 321479 259431
260 259431 -72050 -332355 -258555 64638 302393 233576 -40165 -242308 -205147 -9807
270 -9807 156942 180433 76525 -67554 -169831 -155387 -7438 181176 233699 61559 -201908
281b01908q9010K04770L10276R8103k28714l18843q2279K23935K84720O3086j81971
292H2165k19519o0571J05299J48108Q6193n711r4371j41164r2248O5757K11352
303H5290J68871o7730k72242k08072Q8839L03520K03608j06051k93923j72912
313b70802J01012K41321J40386o3843j67560j17731n749Q6267J20269Q9492j7900
324A35162j45901j68400k3240J80029K25629L7056k09257k51341l4191K19106
334c5348K45859K8822k01692k18891k9694J56272J75295M9072q7963j33459q5043
345a36770J2646J03878J32701N7593r1217j83152j12615R2829K28854J42862j01521
356A46088k52675j46568J05164K47728J34372r6433k10575j15326O5567J54605
$$ plain form
281 -201908 -290918 -86148 224128 322231 93517 -225326 -307605 -83670 201050 264136 82165
292 82165 -137354 -197925 -92626 55482 141675 135964 41593 -99571 -191819 -126062 85290
303 85290 254161 186431 -85811 -293883 -205044 98476 302084 196033 -97890 -270802
313 -270802 -169790 71531 211917 148074 -19486 -137217 -142966 -56699 63570 153062 135162
324 135162 -10739 -179139 -202379 -22350 203279 240335 31078 -220263 -254454 -35348
334 -35348 210511 239333 37641 -181250 -210944 -54672 120623 169695 81732 -51727 -136770
345 -136770 -124124 -20246 112455 170048 78831 -104321 -216936 -124107 104747 247609 146088
356 146088 -106587 -253155 -147991 99737 234109 137676 -72899 -188225 -122658 31947
366C1947J02555j0850r2115j05953o0512L6811J29976J30735l10j63010j85343
377a86069j2702J93506K11309P138k06712k05710J262J92337J78125J057j49391
388B4150j42523k3764Q5170J11987O6750j6796r6997j20333m0948R6523J70435
399A13654Q0156j09603k04893r6249J20116K16054R6383j17551k05358q9234R7923
410i8602J71689Q5400n8543j29023r0968O354Q8870J06139M9190n4541j31167
421e5202j00502L5106J56207J36616k2454j73287j58806J7022J78402J59808j2100
432A60810j63679j48064J687J34215J29011J6671q7440j08810n0700L5952R7497
443A7150R4026J2111r7000j37128m7440J04397J69902O7466j13524j85225p0069
$$ plain form
366 31947 134502 123652 31537 -74416 -134928 -98117 31859 162594 162284 -726 -186069
377 -186069 -198771 -5265 206044 213182 6470 -199240 -197978 -5641 172484 173541 24150
388 24150 -118373 -142137 -56967 55020 121770 104974 7977 -112356 -153304 -56781 113654
399 113654 193810 84207 -120686 -216935 -96819 119235 215618 98067 -107291 -196525 -98602
410 -98602 73087 158487 99944 -29079 -120047 -113693 -24823 81316 130506 75965 -55202
421 -55202 -155704 -120598 35609 172225 149771 -23516 -182322 -165300 13102 172910 160810
432 160810 -2869 -150933 -149246 -15031 113980 130651 43211 -65599 -116299 -80347 17150
443 17150 111176 123287 26287 -110841 -158281 -53884 116018 183484 69960 -115265 -185334
454a85334J14074J79674O5269j01171j51672o3549O6574J16649P1132j8256q1934
465A1456q9443l6943N7568J18369Q0637m4163j46968j10727M2578J62783J23174
476A68321m1421j63574j21257L4183J44686J11428j7523j11204j01221j3329P3605
487c7306R8013M8853l7404j00421q5444P348J06250J16539J4217j09883j39252
498a18490k8411J10856J45506L7910j01812j41717m6399Q3513J29319N4958n6490
509F8743j09650o8332K4073Q9146Q3444J4549p0667j03148m8795N6969J21906
520E8238P5778m7488j35783r2733M2914J39459R9166l5776j30731r6667K4175
531i9448J07124Q9364J095p6531q6345l1757M2526R1033O4853j5844r6915r5778
$$ plain form
454 -185334 -71260 108414 173683 72512 -79160 -142709 -76135 40514 111646 93390 11456
465 11456 -77987 -114930 -57362 61007 141644 97481 -49487 -160214 -117636 45147 168321
476 168321 126900 -36674 -157931 -123748 20938 132366 114843 3639 -97582 -110911 -37306
487 -37306 60707 109560 72156 -28265 -113709 -106361 -111 116428 130645 20762 -118490
498 -118490 -146901 -36045 109461 147371 45559 -96158 -142557 -59044 70275 125233 68743
509 68743 -40907 -109239 -85166 3980 87424 101973 31306 -71842 -120637 -63668 58238
520 58238 134016 86528 -49255 -141988 -99074 40385 139551 103775 -26956 -123623 -99448
531 -99448 7676 97040 98135 21604 -64741 -96498 -53972 37061 101914 86070 -10845 -106623
543a06623j522J03490J17515J1587j07908j24079j7695J01231J18907K5055q2986
554C6972j05677l6821N3987R1047N6388k2796q1663p6784o375P3209R6277L2420
566A10184o9048j11390m9661O2459J17329O1005n1288j15562p0211L8399J05325
577B7541P5048j9685r1930p9319j581P2848Q5245K4565n2791q9742m8385L4051
589f4135R1681O9532j5766r3827q6524K009R3255R6874R563q8247r9516j9105
601a04206P5827R5746L0492n6209q7825m4670L3107P8916N8912m632p0524p8551
613g3617j8820O6679R4211L4749o1269j02518m6154N4550J03319N3813m4089r5198
625c4344n9745K8487Q1842O4282n630o5704p3841j7599N1570Q2763L8632l9136
$$ plain form
543 -106623 -108145 -4655 112860 124447 16539 -107540 -125235 -24004 94903 119958 36972
554 36972 -68705 -105526 -51539 39508 95896 73100 -8563 -85347 -91722 -18513 77764 110184
566 110184 41136 -70254 -119915 -57456 59873 120878 69590 -45972 -116183 -77784 27541
577 27541 102589 82904 -9026 -88345 -89926 -17078 68167 92732 39941 -49801 -98186 -64135
589 -64135 27546 97078 81312 -12515 -99039 -97030 -3775 93099 102662 14415 -85101 -104206
601 -104206 -28379 67367 97859 41650 -46175 -90845 -57738 21178 80090 75458 4934 -73617
613 -73617 -92437 -25758 68453 103202 41933 -60585 -106739 -52189 51130 104943 60854 -34344
625 -34344 -94089 -65602 16240 80522 74892 9188 -64653 -82252 -30682 52081 90713 51577
637E1577q9696n6443L0023R1218O7935j9037q8509p3128N908P7940P7160R370
649H4318o5198q0281k4691M9581Q0761M0400l2530p9854n4876J7513P5301O6264
661G6708j139o8987p5160j3817N8691Q2508K8617n1317q4121m1497L8180Q5526
673C4192N1210k5723q0516n9333J2089O9251O6302L925n7569o9284k1775M3575
685c3656P3883L9849l2325p7038n4619K1237Q0571O1901r769p5557o8189K43O5884
698g585O9681J2826n2999o8382k7066L5975O7672M3632j9644o8587n7208O289
710f5396O8645O6121M145o2391p1665j4504N3468P3046K5455m2855o9602l7215
722g2748K9027O5179M8192j2479o2643n7504j804N7613O6196J1750m9795o9628
$$ plain form
637 51577 -38119 -94562 -64539 26679 94614 75577 -12932 -86060 -80152 -2212 74948 84318
649 84318 19120 -61161 -85852 -36271 44490 84890 52360 -27494 -82370 -64857 10444 76708
661 76708 75569 6582 -68578 -82395 -23704 58804 87421 36104 -48017 -89514 -51334 34192
673 34192 85402 59679 -20837 -80170 -68081 1170 67472 71397 13828 -55456 -77231 -33656
685 -33656 40227 80076 47751 -29287 -83906 -62669 17902 79803 70034 -5523 -73712 -73469 -7585
698 -7585 62096 74922 21923 -46459 -73525 -37550 30122 73754 54110 -14477 -71685 -65396
710 -65396 3249 69370 73515 11124 -60541 -75045 -21577 51469 76924 34069 -35533 -72748
722 -72748 -43721 21458 69650 57171 -5472 -62976 -64780 -7167 59029 70779 20984 -48644
734d8644k4413M0762O9083L5761l0220o5561m5347J4744O3359N5231l197n7762
746C796o1634r402M9735O5867K0211m1337o6093l0582L0555O2175M1360j5615
758D9036o1140m8897L153N4339N8439Q596m8966o3455j8878M1508O4288K9370
770F7393l2873o2943l6154J9743N9728M5542q277n2684n2658o202M6268N9000
782D5883J8664l9789o3338k7861L3268O2751L4556k1957n9099m2974J0948N3663
794D715M8889J848m5898n5050j4355L9343N8139K5952l1624o0842l2985K3251
806c8617N7819M0538j2449n4570m5306R46M6356N0170J0427l7739n4435k2869
818e9729L0526N6987L2889k3055n6481l9732J4269N3578M3206l573m7390m8057
$$ plain form
734 -48644 -73057 -32295 36788 72549 42329 -23232 -68579 -53835 9524 64755 61558 3796
746 3796 -57838 -67240 -17505 48362 68573 27236 -38857 -69439 -38884 23291 64651 49036
758 49036 -12104 -61001 -57848 -3509 54930 63526 14560 -48895 -67773 -26265 38023 67393
770 67393 34520 -28423 -64577 -44834 14894 60436 52159 -525 -53183 -59385 -13117 45883
782 45883 64547 24758 -38580 -66441 -33173 29578 64134 42177 -16922 -59896 -48948 4715
794 4715 53604 55452 9554 -45496 -59851 -20508 37631 63583 31959 -28883 -61868 -38617
806 -38617 19202 59740 47291 -7279 -52585 -51639 -5283 44887 55314 17575 -36860 -59729
818 -59729 -29203 27784 60673 37618 -18863 -58595 -44326 9252 52458 48885 1495 -46562
830d6562p254L9248N0841J8564l0254n3629k9296K1525N5973L6914j3388n3665
842a0983m2523N012M7724M6841M155m0631m7786j5192L0201N1271K4984k1855
854C1218n0271l5222J3662N0437M2051n913m7000m5999k983M2745M6657J1751
866E1133l3557m7636k0615K3178M7785L1075j3901m7949l8537N450M6057M3403
878D5886L059m2243m5680j0897L5353M6632J7826k4533m6413k8239J5977M6286
890A3014L4210p792m1703m0691k399L8977M6156Q799l4727m5807j5836K6717M5311
903B4229K3386j8567m3030l2057R410M0539L8398O46l9135m2990p024L4201M4552
916C2558J3955k7646m4393k0697J9992M2662K6259r908l9203l4506J034L6439
$$ plain form
830 -46562 -53816 -14568 36273 54837 24583 -29046 -58342 -36817 19156 56070 42682 -10983
842 -10983 -53506 -48494 -770 46071 50226 9595 -38191 -53383 -23182 28089 53073 31218
854 31218 -19053 -54275 -40613 9824 51875 45962 -1038 -47037 -50020 -7275 39382 51133
866 51133 17576 -30060 -50675 -27497 20288 51363 37462 -10487 -49024 -43574 2483 45886
878 45886 48945 6702 -38978 -49875 -14522 32110 49936 25403 -21010 -49249 -33272 13014
890 13014 47224 39432 -2271 -42962 -45361 -6384 39772 48571 13844 -31963 -47799 -21082 24229
903 24229 47615 29048 -13982 -46039 -36629 3910 42308 42954 3819 -39171 -46195 -11994 32558
916 32558 46513 18867 -25526 -46223 -26231 16431 42690 32782 -6421 -40927 -39893 -3454
928c454M0082P259l2382m5057j3746K8815M4922J9973k2651m3398k4289J5126
940b8800L8375K9235l939l4524l4388n985K9961M0322J3783k5767m2504k1089
952d5320K1226M3085K4907j3720m1256l0285Q235L6533L2462J201l0865l6241
964c0038q987K4215L9647J6778j9171l9993k3000J3132L8807K9201q765l4455
976b629l2484l94L1299L5221P580k6255l7920j4286K1109L8288K1502j6308l7680
989a2957k5590R202L4190K9830k462k9239l1732o873K3265L6288J4734j9418l7205
1002a7967k3284J4874L9399K6381j1722l5904k8475M958L3367K7658J709k4786
1014F208l0571r768J8877L1615J8639j1670l4149k5527O020L5389K9721j234l5325
$$ plain form
928 -3454 36628 43887 11505 -33552 -47298 -18483 26439 46412 23761 -19637 -43926 -28800
940 -28800 9575 38810 34871 347 -34041 -40026 -10065 30257 44040 18273 -24231 -45320
952 -45320 -24094 18991 43898 30178 -11078 -41363 -33128 3405 35867 37068 6203 -30038
964 -30038 -39025 -14810 24837 41615 22444 -17549 -40549 -27417 11390 40591 31826 -2629
976 -2629 -35113 -35507 -4208 31013 38593 12338 -25582 -39868 -18759 19529 41031 24723 -12957
989 -12957 -38547 -29345 4845 34675 32213 2974 -28758 -35631 -12366 23922 38656 19238 -17967
1002 -17967 -41251 -26377 13022 39403 27681 -8223 -36698 -31740 1627 29285 30994 6208
1014 6208 -24363 -34131 -15254 16361 35000 23330 -10819 -36346 -30326 5063 34784 33550 -1775
1027a775l1166k143L0308L2701N285k2853l0489j2509J5058L0486J8746p622k8249
1040d222k6887J547L0193K8760M366k6315l2443r984K2506L4252J4101j8860l1790
1053a4776j8166J0286L1960K4054n908k9640k7285j55K7629K6591P140k1616k9000
1066a8886j1898J5358K8585J8039r034k9203k4800M064K8861K9917M50k8761l1320
1079b8628m065K7144K9274O702j9731k7941j2371J3531K5001J7349m554k3288
1091a577k4004k700K1919L0005R186k2844l3457j1684K1747L2288J3944j8335
1103A4488l0114j5203J2652K5879J7109m164k1165j9745o459J8247K6124J0348
1115B7997j3590k9772j6365J2210L0455K0625r782k9850k0633N834K5481K2702
$$ plain form
1027 -1775 -32941 -35084 -4776 27925 33210 10357 -20132 -32641 -17583 12903 31649 24027 -4222
1040 -4222 -31109 -29562 631 29391 33757 7442 -25001 -34985 -12479 21773 35874 17014 -14776
1053 -14776 -32942 -22656 9304 33358 27450 -2190 -29475 -29630 -2001 24590 31730 10114 -18886
1066 -18886 -30784 -15426 13159 31198 22164 -7039 -31839 -27775 1086 31003 31453 2692 -28628
1079 -28628 -32693 -5549 23725 30427 10696 -17245 -29616 -16085 8916 26265 21711 -1577
1091 -1577 -25581 -28281 -6362 23643 32829 9985 -23472 -35156 -13409 18879 32823 14488
1103 14488 -15626 -30829 -18177 7702 24811 20647 -518 -20263 -26722 -8475 17649 27997
1115 27997 14407 -15365 -31730 -19520 10935 31560 21778 -8072 -28705 -22871 2610 25312
1127B5312j013k0556k3926o081J7293K4990J0922j2364k5092j5758Q441K4533
1139F701J8445k377k3016k3353j382K0918K5572O909j9334k7281j0498J5490K9041
1152A5835J3433j2789k6378j6161Q197K2604J6656j273j7496j9607o375J4294
1164i060K2666J2457j0919k6252j7153Q704K8889J9525q758k6756k0317O076K2481
1177A583J9966j063j7869j7850o079J1201J8760J3160o301k0217j8811K075K3075
1190A630K2578o68k2928k3460k415K1929K2777M508j7267k2543p372J2688K0398
1203I855J1928o964j9163j6106K011J6970K0118K754j6236k1356p605J4712K2957
1216A3875R684j0391k1934j4870Q457K1276J6875n383k0199j8384J737J8397J8497
$$ plain form
1127 25312 24299 3743 -20183 -26264 -8971 16019 26941 14577 -10515 -26273 -17832 6701
1139 6701 25146 22769 -247 -23600 -24982 -4064 21508 28417 9083 -18198 -28696 -13206 15835
1152 15835 29268 16479 -9899 -26060 -17863 4741 21397 20124 2628 -16979 -23354 -9060
1164 -9060 13606 26063 15144 -11108 -28261 -19557 9332 28857 20099 -6657 -26974 -20898 1583
1177 1583 21549 20486 2617 -15233 -21312 -10111 8649 21809 15508 -4709 -23520 -21445 1630
1190 1630 24208 23540 612 -22848 -25263 -3334 19443 23951 6684 -15859 -23231 -10543 9855
1203 9855 21783 14819 -4344 -20450 -18439 -1469 18649 21403 5167 -16189 -23794 -9082 13875
1216 13875 23559 13168 -8766 -23636 -15179 6097 22972 17589 -2610 -20994 -19257 -860 17637
1229A7637K423j5082j7323p640R797J8190J2210n098j7658j8206J405J8991K0916
1242B0562J858j9544k1915k607J8747J9466M488j4723j8216o670Q726J5043J1693
1255A6908k588j5449j4395l995J4017K0886N990j4031k2495p928J3786K2725Q547
1268B1978j1569k0504r143O428J6825J3541k881j4071j5358l128J2376J6878Q245
1281A9617r956k0233j0068P752K0258J2545o152j7607j5365K386J6956J5574K334
1294A8041j5382j6275n776J2437J7825R153j0361j7889r928O386J6649J1743j715
1307A4908j4713j5259j534J2556J5980P261j0921j7846j0646J0074K0103R624
1319A9587q136j8177j0913M803J6286J1823k222j1190j2846l608Q463J4899Q703
$$ plain form
1229 17637 20060 4978 -12345 -19985 -10188 8002 20212 15114 -2544 -20750 -19345 -354 20562
1242 20562 22420 2876 -19039 -21646 -2899 16567 21055 6332 -11884 -18554 -9828 5215 16908
1255 16908 14320 -1129 -15524 -19519 -5502 15384 21374 7343 -15152 -23080 -9294 13431 21978
1268 21978 10409 -10095 -19238 -12810 4015 17556 14675 604 -14754 -17882 -5506 11372 19617
1281 19617 9661 -10572 -20640 -12888 7370 19915 13763 -3844 -19209 -16823 133 15707 18041
1294 18041 2659 -13616 -19392 -6955 10870 20023 9662 -8227 -18155 -11769 4880 16623 14908
1307 14908 195 -15064 -16598 -4042 11938 19199 8278 -9568 -20214 -10140 9963 19587
1319 19587 11451 -6726 -17639 -12836 3450 15273 13051 1861 -10985 -14593 -6130 8769 17472
1332A7472p618j6599j0958M713J8136J3674m635j8309j2586J512J5317J3640L53
1345A4112j0748j4722k921O816J4974Q111n930j3980j1728K749J4969J3356p6
1358A4982j4438j5044r05J2650J3705M300r754j4314n825N540J4364R917k855
1371A2323j3799j2649J37J3862J2988J976j2309j4304l216R438J4945O122o936
1384H578j4030q858L271J3918J1436j486j3573j3113l4J2584J2914K883j0945
1397C545j2502m374O886J1661P841l870j1585j0170k93J2491J3247J333j1877
1410B333j4683j666R876J4826K846p533j3739n603N143J1524R117k529j0775j0611
1424a1474j670J0856J2318L838r739j4303m271R599J2563N363n238j2205p908
$$ plain form
1332 17472 9854 -6745 -17703 -12990 5146 18820 14185 -4124 -16710 -15198 119 13759 14112
1345 14112 3364 -11358 -14279 -7463 7511 15622 9692 -4288 -16016 -13267 1702 15058 14982
1358 14982 544 -14500 -15405 -2755 10950 15250 5496 -8818 -14643 -9103 5261 15178 12323
1371 12323 -1476 -14125 -13988 -126 12862 14838 2529 -11775 -14991 -5553 9392 15514 8578
1384 8578 -5452 -14310 -11039 2879 14315 12829 -744 -13857 -13891 -1307 11607 14490 3545
1397 3545 -8957 -13331 -6445 5216 13057 9187 -2398 -12568 -12861 -370 12877 14210 2333
1410 2333 -12350 -14016 -4140 10686 13532 5999 -7740 -13343 -8200 3324 12441 9912 -863 -11474
1424 -11474 -13144 -2288 10030 13868 4129 -10174 -14445 -4846 7717 13080 7842 -4363 -12271
1437a2271L082J0033R989M31r263j2664k116R159J1691M932p559j3856m541N976
1451f977J2621P314n241r787r281J746Q701J0971J918q178j1533n855Q570J3285
1465H274N559p171j2216o646M666J0613Q591k638r073q817j701P591J1543M019
1479A2594p746j1819n818O034J2738O511l792j2193p805K612J0219P966O03q556
1493A548j1058j932O827J1183N177m270j2786p386M714J1497Q834l953j0995p052
1507i652q5Q199R346J856o080j0190l892M876J0612N986l681j0135q638K218J1251
1522A991P681m57r286r023o88Q514P849L062n167r981n509M095R426P871k232
1537H146r590q156L78R286R328m9p931q832j323O000P789M896l604r408p011L812
$$ plain form
1437 -12271 -9189 844 10833 11264 2001 -10663 -12779 -3620 8071 13003 5444 -8412 -12953 -6977
1451 -6977 5644 12958 7717 -2070 -11351 -9605 -904 10067 11985 3807 -7726 -13581 -5011 8274
1465 8274 13833 6662 -5554 -12200 -7534 3079 11670 9032 -41 -8858 -10559 -2968 8575 12594
1479 12594 4848 -6971 -12789 -6755 5983 12494 8702 -3491 -11296 -8684 1535 9501 10104 1548
1493 1548 -9510 -11442 -4615 6568 11745 7475 -5311 -12697 -7983 3514 12348 8395 -2600 -9652
1507 -9652 -9737 -1538 7808 9664 3584 -6606 -10498 -5622 4990 10976 7295 -2840 -11478 -9260 1991
1522 1991 9672 9215 -71 -9094 -9782 -1268 6581 9643 4476 -5505 -11014 -6919 2507 10378 8146
1537 8146 -1444 -9600 -9222 64 9392 9343 1412 -7420 -8743 -2743 5046 9942 6338 -3070 -10081 -6269
1553f269P895Q374p31r210q734j061Q968R355j38n992p732l907N258O933N437
1568H446k623p877o105k2Q600Q207P46o979j0116k605P833Q436L522n507r460
1583e504l121K937Q311M836J88p951p278j280P692P762J813m647r463l627N166
1598d166Q673M033k975q286n646J597Q091O014J33o770p543j998P211P446K571
1613H385n219q261k690L190O798O037j218p435o963m85O073R468J995o959r312
1628f596l747P785R053K003m733p636m016L356O093M023M21n281n485k672M301
1643c131P673M200l557r831n605N102R718N571m431r293l944J567P522M833j392
1658E002m887n807J75K948M353N009j284n759p290J003O854P958j080p340p898
$$ plain form
1553 -6269 1626 10000 9269 59 -8675 -9736 -768 8587 8449 2457 -5275 -9182 -3924 3009 8446
1568 8446 5823 -2054 -8159 -8181 419 8626 9372 2393 -7723 -10328 -2495 5941 9463 3956 -5504
1583 -5504 -8625 -5688 2623 7459 7647 -304 -7582 -8862 -1170 6592 8405 3758 -5705 -9332 -4166
1598 -4166 4507 8540 5565 -2721 -8367 -6770 1321 7335 7468 698 -6845 -8843 -1632 5814 8385
1613 8385 3166 -5095 -7785 -4595 2203 8240 7022 -413 -7376 -7861 -1788 7680 9675 2716 -6596
1628 -6596 -10343 -2558 6495 8498 3765 -3871 -7887 -4531 1562 5585 6006 725 -4760 -7432 -3131
1643 -3131 4542 8742 5185 -4646 -10251 -5149 4569 10140 5709 -3584 -7528 -5961 1561 6394 5002
1658 5002 115 -5692 -5517 -2569 1784 6793 5509 -250 -7540 -6537 317 8275 7195 -145 -8043
1673h043n15Q339P140o21m396p221k017N883M690L613l254o167k598M79M285N359
1689D956J748m268o709l505L463Q989L806l287j0108m917L960J0088L584k787
1703E013p911m371L423N372J833j7k227l317k452L92M737N112J536o390q501k00
1719g968P778R734j493r292o898Q31Q884O240k150p010l516J723K584K046J644
1734C137M38j751n085k692K112P951M328m313r900l462O173R203L379o923r027
1749f432q03N589O042J83l279l755n66R37J202J729L447j09m496o007q79P868
1765F71O691j205p671p108J595Q012P162j502r224n394M141O303K035j736l337
1780e67m42k97j204P56L866L156r43p889n456M467R666O412q308j1347q22Q013
$$ plain form
1673 -8043 -8558 -219 6921 6300 1904 -5317 -7334 -1451 3239 6852 3598 -2569 -5167 -4688 -403 4956
1689 4956 6704 2436 -4273 -7778 -4315 4674 8480 5193 -4915 -9832 -5872 4216 7800 5013
1703 5013 -2898 -7269 -3846 1526 3359 3342 1115 -2202 -4654 -4262 475 5587 7123 733 -7768 -7968
1719 -7968 -190 9544 8051 -1241 -8139 -7308 1576 7816 5666 -1344 -4860 -3137 -553 1493 3137
1734 3137 3575 1824 -3261 -5953 -3841 4110 8438 4125 -5775 -9237 -3064 6139 9518 2595 -6432
1749 -6432 -7235 -1646 4396 4579 1300 -2455 -3021 -2084 -882 847 4294 4185 -311 -6318 -7197 671
1765 671 7362 6157 -1514 -8622 -7027 985 8147 6645 -2579 -7973 -3832 2471 4506 2770 -567
1780 -567 -1009 -1306 -2510 -1754 2112 5268 4325 -3564 -9020 -4553 5113 11525 3217 -8130 -8952 -939
1796i39Q730J07q187n687K145M889J323j770r35Q80Q9l551k390M215Q223N96p376
1813C62r606J165J0218Q165l973j0937n271O151Q906K951o836n807J032M268p
1828G81j775J285K658J14m278n422J585R186N009n056j0728l641Q469J0928P20
1843I835r672q812K185Q996L933l045n921q99L299K212l449j043N335K603l564
1858A993q253j953P917J0367j914j1410q372N315J1972N561q586j0240l80Q067
1872H4O755l514n395K79L450P11m511k335M938O717j355r933p087Q073J1638L262
1888A1777j1248j1931L227J1198O785m737j0898p67N936M598j828m610R47M664
1902C113L83o689l293M050J0324P78j0576q014K225J2983O553o868j3328j960
$$ plain form
1796 -939 7791 7898 -289 -5976 -3831 1058 2381 611 -324 556 645 -2906 -5296 -1081 7142 7738 362
1813 362 -9244 -8079 2139 10304 6331 -4606 -9877 -3726 5180 8131 1295 -4512 -3480 788 781
1828 781 -994 291 2949 3063 -1215 -6637 -5052 4134 9143 4087 -6641 -10282 -1813 9115 9835
1843 9835 163 -8649 -6464 2532 6465 3420 -2501 -3400 -101 2111 -1338 -2381 2954 5557 1993
1858 1993 -6260 -8213 -296 10071 8157 -3253 -11625 -6310 5662 11223 2637 -7603 -7983 84
1872 84 6839 3325 -2070 -1791 1659 2370 -2141 -4476 462 7179 5824 -4109 -11196 -3123 8515 11777
1888 11777 529 -11402 -8175 3023 9808 5071 -5827 -6594 -658 3940 2112 -2498 -1551 3113
1902 3113 3496 -3193 -6486 -2436 7888 8666 -1910 -9924 -7699 5284 11837 4969 -8359 -10319
1916a0319R383Q781m55r687m673N263N825k077m786K47N283K355o132o949K642
1931e299J0609O076q449j1333k628J2024J0780k629j4431o424P732R851J999q403
1945e25n283L329O216n50p377n37P689M702m987j1246o05J1349J0035m766j4901
1960g457n299R202J3391L93j1620r829N669J0045K559o249p232M349O789k260
1974B451p058j940P940P987m433j0453m478Q322J2741p10j2926r899N123J4541
1988G208M481j0554r219K042R436L504o339n976K879P453P13r239n513P673J1147
2003I696j42j1894r789N902J4871L223j0839j2298K255J2392P909p375j1051n46
2017g686R150N399n721q085K898Q844L186r342q504L237J3692N056j0816j3233
$$ plain form
1916 -10319 -936 7845 7390 -2297 -6970 -1707 4118 2041 -2745 -2498 2785 5140 -992 -7941 -5299
1931 -5299 5310 11386 2937 -8396 -11024 1000 11780 9151 -5280 -11704 -3972 5879 7878 -525
1945 -525 -5808 -2479 3737 3187 -4190 -4727 2962 7664 2677 -8569 -9174 2175 12210 7444 -7457
1960 -7457 -12756 -3554 9837 10230 -1390 -11219 -5550 4495 7054 805 -6427 -2078 4711 2451
1974 2451 -4607 -6547 1393 9380 4947 -5506 -9984 -1662 11079 10369 -2557 -12456 -7333 7208
1988 7208 11689 1135 -8084 -6042 3394 6898 559 -5417 -2538 4915 5628 -3611 -9124 -1451 9696
2003 9696 9554 -2340 -12129 -6227 8644 11867 1028 -11270 -9015 3377 11286 3911 -7140 -7686
2017 -7686 1464 6863 1142 -6943 -4045 4799 7985 -1357 -9861 -6624 7068 12124 1308 -11925
2031a1925J817J4084R310q412j3326l329J2710R713n746j0066k215R007O024m887
2045B759q880L27J0251N481q840j1121J124J3715Q673q804j4128k130J2205J1007
2059A1639m115j3866m390Q361J1283k143j0434k709O145P767m187r743j565J0116
2073B159Q697n913j3579k522J1193J2169l843j5055o583R361J3522j10j1746p630
2087i880N501J1801m2q284o945N858Q878j677j0940l553Q774J0772j179j4747
2101e663o996Q672J5107J10j3579r978M945J4222M269j1265r403M512J0653J521
2115G127q146p972N918J1004j551r880p614P654J3440J444j3397j1202N648J5539
2129H012N188j1777j2678K178J3368O717r580j0097K105J0126M364q109p552K875
$$ plain form
2031 -11925 -10108 3976 13286 4874 -8452 -11781 929 10642 4896 -5170 -7385 1622 7646 2759
2045 2759 -6121 -5794 4457 9938 1098 -10023 -8899 4816 13489 4685 -9443 -11573 632 11639
2059 11639 7524 -6342 -10732 -2371 8912 6769 -3665 -6374 -229 7538 3351 -6392 -7957 2159
2073 2159 10856 4943 -8636 -11158 35 12204 8361 -6694 -13277 -3916 9606 9496 -2250 -9880
2087 -9880 -4379 7422 7380 -904 -7849 -1991 6887 5210 -5730 -9283 -509 10263 9084 -5663
2101 -5663 -12659 -3987 11120 11230 -2349 -12327 -7382 6840 11109 -156 -9559 -5047 5606 7127
2115 7127 -1019 -8991 -3073 7931 6380 -3500 -11114 -3460 9980 11424 -1973 -13175 -7527 8012
2129 8012 13200 1423 -11255 -9077 4291 11008 1428 -8669 -6564 3562 7926 -183 -7735 -4860
2143d860J0691L182j0299r386M028J3288O029j1065j3351J642J3999Q520p918
2156D500j3344j465J1050R154n936j0325j07Q564O012o062r841K85J1774N758
2170A0017p649j2809P72J3039R161o795j4851j989J0943J1009l184j3201m825
2183a0362Q129J1747l817j1065k323Q728P760n969r740j797J1236Q051m789j3711
2197g922l416J1541J0942l597j3018p262Q891J3197p81j1128p226O033J0807j421
2211E640r008m981P974Q286k381j0438m842Q531J1587q33j4958o339Q099J2350
2225H687M06j0271r774N151J1439K988r296p841M407R142J027p587n791M553R564
2240F804O20j0537p275P028J1420J492j1495r328M643J2963N796j1203r950J155
$$ plain form
2143 -4860 5831 9013 -1286 -10672 -6644 6644 12673 1608 -11743 -10101 3898 12418 4500
2156 4500 -8844 -10309 741 9895 3959 -6366 -6473 2091 8103 2041 -7800 -7515 4259 10017
2170 10017 2368 -10441 -9669 3370 12531 5736 -9115 -11104 -161 10848 7664 -5537 -10362
2183 -10362 -2233 9514 5697 -5368 -7691 1037 8797 2828 -6912 -8709 2527 10578 5789 -7922
2197 -7922 -11338 203 11145 7548 -5470 -12732 -3841 9356 8575 -2553 -9779 -3746 7061 5640
2211 5640 -3368 -8349 -375 7911 5530 -4908 -9750 -1219 10368 9535 -5423 -11762 -3663 8687
2225 8687 9093 -1178 -10952 -5801 5638 8626 -670 -8511 -4104 5038 6065 -1522 -7313 -2760 6804
2240 6804 7424 -3113 -10388 -3360 8060 9552 -1943 -11271 -6628 6335 12131 928 -9022 -7867
2254g867J1900M839p149q924K367Q718K802o106q479K651J1837K971j0094r682
2268a0216L122J2579N936q843j1599R77J0523P505n595j0645k125R414P408m741
2282C700r379j21R184L226n253q355J181R493O272q512j0733J141J1178Q048n853
2297E217j1990k288R427Q833l378j0428l024P616P684l763q853j636P503O677
2311G597l781r650j419Q759Q348m381j1576m659J0027R203j969j0509n108O008
2325c110J0064k04q164o610O507O780P82r803l510O490P830k118j0119m342Q506
2340a021R886k226j0353n358N470J0580Q36p806q607M598R691M68o436o558L860
2355b976P724J967q954n834O358P420M70r664n549N488J0419K377r133q524L243
$$ plain form
2254 -7867 4033 8872 1723 -7201 -4834 3884 6686 580 -7899 -5248 6589 9560 -534 -10216
2268 -10216 -7094 5485 11421 2578 -9021 -8044 2479 9984 4389 -6256 -8381 1033 8441 3700
2282 3700 -5679 -5800 3384 6610 1357 -6998 -5817 3676 9948 1436 -9297 -8156 3022 11070 5217
2297 5217 -6773 -9061 366 9199 5821 -4607 -7631 -15 7669 3906 -4947 -6583 920 7597
2311 7597 3816 -5834 -7253 1506 9854 5473 -6103 -10762 -735 8468 6499 -4010 -9118 -3110
2325 -3110 6954 6750 -1414 -8024 -1517 5263 6045 -3758 -7268 -778 7052 4934 -5185 -9527 -1021
2340 -1021 8865 6639 -3714 -9072 -3602 6978 7814 8 -8599 -4001 5690 6158 -278 -6836 -2976
2355 -2976 4748 6715 -2239 -8073 -1715 5705 6175 -3489 -9038 -3550 6869 9246 113 -8411 -5168
2370e168J0468K885p287p270J760P314L715n911o301J721O754K930o823n389J984
2385d618J0000K218p999o640K127R876K897o209q865J486O676N747l702q789K93
2400e502O765M328m935n452J256O273L454n103o818J142P283M426n064q660k55
2415f862Q250O176l386q440k698O950O539k504p611j747M877N091k058o898l17
2430d638N905N210m420o750j553P125N755k358r580k127N676Q437j364q098l397
2445f177M841O215p92o234l385M862N268j836o162j682M314N228j524o267k930
2460f261N336O913q10p495l427L497N978J924o702m649K659N970J669n373l139
2475c910J875N491n74n511j979L079O264p04n296m357K389O740J775n059n010
$$ plain form
2370 -5168 5300 8185 898 -6372 -4612 2702 6417 506 -5795 -4074 2680 5610 -1213 -6602 -4618
2385 -4618 5382 7600 -399 -7039 -4912 4964 7861 1652 -7213 -5727 949 6696 2994 -5795 -5502
2400 -5502 1263 5591 656 -4796 -3540 2733 6187 1084 -5734 -4592 2691 7117 2053 -6607 -6862
2415 -6862 1388 7564 4178 -4262 -6960 -10 6529 4025 -3586 -5333 -456 4635 2577 -4321 -4638
2430 -4638 1267 6477 2057 -4693 -6246 879 6634 4276 -5304 -7431 -1755 6682 5318 -2780 -6177
2445 -6177 -1336 4879 4087 -2147 -5532 -670 4598 2762 -3400 -5082 -768 4460 2936 -3331 -6261
2460 -6261 -925 5988 5178 -2317 -5744 -2247 3731 5655 -1047 -5696 -3037 2933 4602 -771 -3910
2475 -3910 -2035 3456 2882 -2629 -4608 -1529 4735 4031 -1265 -5622 -3233 3507 5282 223 -4787
2490d787J635N643K333m198m773M22N496K351l588l612Q59N080M13l609l735J008
2506c062O247J713m152o287Q25P391K975m314n686L02N234L338l848l814L70L813
2522A045K356l484l286R32M955J425l797m163Q55N356K812m002n116l1N759L000
2538D616k701m396j555L885L566j418l676j445L605K107j611l896j90M754J452
2553C097j330m479j296L988L816r96m015k467L374L390K48m726j894K849K708
2568B267K78l605j805K594J905m5k862j877L316K774r41l492k723M369K997k00
2584B950m942j816J236N300Q44l376l360J797K285J462k876p94J031K052k47k814
2600a268j031J380L024M92l577l012K059M083J045k732l598L10M045J971k913
$$ plain form
2490 -4787 -3152 2491 4824 626 -4147 -3725 1771 4122 534 -3078 -2219 2861 3274 -335 -4070 -3062
2506 -3062 3185 4898 746 -5541 -4716 2675 5650 1336 -4350 -4048 1186 4524 676 -3138 -2768 1045
2522 1045 3401 -83 -3369 -2437 2518 3943 146 -4017 -3162 2194 5006 1004 -4112 -4143 1616 4616
2538 4616 1915 -2481 -4036 -151 3415 1997 -1679 -3124 481 2588 977 -2919 -3109 1645 3097
2553 3097 1767 -2712 -4008 -20 3796 2800 -1215 -3682 -308 3082 3330 -1396 -3290 -441 2267
2568 2267 2545 -1060 -2865 -271 1634 1589 -1273 -3150 166 2940 1999 -1493 -4216 153 3150 2950
2584 2950 -1992 -3808 -2572 2728 3572 196 -3164 -1367 918 2380 -496 -1290 -259 1793 1546 -1268
2600 -1268 -2299 -919 2105 2597 -980 -3992 -1933 2150 3195 463 -3135 -2825 1220 3191 278
2615B78k270Q62J509J694j610j405J44K283J67j412l234K289K711rj723l658J024
2632b360L198J702k088j771j205K963J002m48l000J052J160K022j881j366N28
2647d92J650J095j977k545J182K035J477j063l592j5K836J863o48l085K98J351
2663C70J25Q71k725L81Q80M55O05j299m55J284J974j919k090o07K763K254j148
2680A719k373j524K365N63N55k759L80M73K86R14k346O03J659J597j599r19j035
2697a441J331K760j621j378q02J379K134p37k221m35m00J484N12o76m84O45j12
2714f2M55o69J09J129o2l99j555o2O82J610O29j719j270M63L53J174m62j837O72
2733h21R99Q57m10j153PK25J226j466j135J658L87O06j678r59J202K207m63j23
$$ plain form
2615 278 -1992 -1130 379 2073 463 -942 -798 1485 1652 240 -2994 -705 2006 1997 274 -3384 -2360
2632 -2360 838 2540 452 -1319 -2524 439 1441 993 -2007 -955 205 2227 346 -1020 -492
2647 -492 1158 2253 276 -2269 -1087 948 2425 1362 -2230 -2245 591 2454 1806 -1279 -981 370
2663 370 495 1366 -1359 -978 -98 357 962 -337 -792 492 2466 547 -1543 -2150 613 2867 1719
2680 1719 -654 -2178 187 750 1305 -1454 -1074 -601 -315 599 -1747 -1144 515 2112 513 -406 -1441
2697 -1441 -110 2650 1029 -349 -1151 228 2362 1625 -596 -1031 -1431 53 565 -111 -595 50 -62
2714 -62 393 -276 -167 962 900 501 -1054 -1116 -434 1176 1805 86 -1184 -721 -368 806 344 -1493 -821
2733 -821 178 1035 625 -528 -521 -296 930 -536 -1671 -13 374 980 -698 -1657 -455 1752 1289 1166
2751A166l827J609J459Q27n14r88j50l13Q64Q70j314K55O99n42m3o69j03J705
2769I91l52q47p97K45J128R24l60j534J82J11J297j026M72j128N81N48P5p06p3
2788b69R91j903J517j246J78J498r6j291Q22j431J141L71R68j535j209P73J105
2805C84O21j283J31M79L1pq39M22J071j418J06j359J314R30L33j091j111L97Q99
2824A0M10m0p02Q11j698P85J66o92L97J57P8L73l79Q94N55o15K56j303q5M38M07
2845B23P71j214l33n73J821q5N81j392J22J16r1K26R9K14K09j634Q54p27Q23J59
2865A69M01n70j053J063L79M01p44M11r53J653m84o35K0k83Q2L45J122p46r26
2884c48J049o14r03L32M42O16Q3j987N81P85L61n32L17l21p58o29J793J72L17
$$ plain form
2751 1166 -2661 -1052 407 1234 720 -268 -418 -731 133 1003 -311 -56 643 101 58 -611 -714 991
2769 991 639 -208 -1005 -760 368 1292 932 -602 -420 -309 988 -38 434 -694 -113 435 510 -196 -269
2788 -269 722 -1181 336 -910 -732 766 670 -621 201 -1230 -89 282 1250 -285 -1494 -721 384
2805 384 1005 -278 -147 332 363 356 -483 -61 1010 -408 -302 -1661 -347 583 916 -175 -1286 -889 10
2824 10 420 380 -322 489 -1209 -424 -258 -950 -553 -396 -318 55 -324 570 1125 510 766 -537 -622 -184 223
2845 223 994 -220 -553 -1126 695 610 1191 -201 -79 37 -54 172 271 485 694 -940 -86 -813 10 169
2865 169 570 0 -1053 10 389 790 46 457 -496 1157 673 38 58 -225 -143 202 1324 578 -348
2884 -348 701 87 -816 -484 -42 574 657 -1330 -749 36 397 -135 182 -139 -897 -1526 267 439 756
2903G56j208O5m67L19Q91k6L9L84q40m88J81J664j029k40K04k72o76J576r7l26
2923D10N4j418N17P87j59M08p58P05j533J145K05P21p4p27j215P54j30m35J254
2942E11k80j461L67R58R3k35J272j208m28Q3k99J336p59k22Q8P98j569J714J90
2961I49o65j084K80n34J665K67r15j6l98N28k09K9Q09p29l65R12p06O14L80j102
2981b90n8o6L15K36o1M91r21J91J52j76Q53J4n84r37J29J473r12J51L22r90j49
3002h17J489m36l34J90o68n2K94Q87m53Ml25m00k28P82k05M66k34m9r29J168p46
3023e96O29o3l06Q44n71N27j76O26r23k73J04O43K94k65n4o87j84N13p17L19M03
3044H7j34m5m99lO29M88o03o74O11K98K0M58o53Po36N79P3O72q79R38o73j39N25
$$ plain form
2903 756 -452 -387 -854 -535 356 330 369 753 -87 -575 -394 1270 241 1 205 -67 -743 833 736 410
2923 410 464 -954 -437 350 191 599 -159 546 -987 158 363 1084 1010 283 -932 -178 -308 -743 511
2942 511 231 -1230 -863 95 188 -47 1225 17 -411 -328 -627 709 -50 -272 -184 614 -955 759 949
2961 949 284 -800 -520 -1054 611 878 -37 -53 -451 77 -132 -103 706 -23 -388 524 -182 432 812 -290
2981 -290 -348 -414 -99 137 76 567 -354 -163 -11 -187 666 680 96 -841 -712 761 -151 0 322 -668 -817
3002 -817 672 236 -98 92 -576 -628 -334 553 100 104 -221 -621 -849 -67 -272 194 -40 -89 -1018 150 -596
3023 -596 33 -30 -336 508 -63 464 288 914 -9 -282 -178 465 759 494 440 -247 -431 82 -635 -316 87
3044 87 -47 -92 -591 -594 35 523 -80 -754 -143 155 175 633 -20 -13 -649 -70 3 675 -204 734 61 -78 447
3067D47j96Q77j628M45n48L32J3N06j166M49J61N15l37R47p42m2k98o02P19L36
3087A88k32J95o70J11M37Q58j346Q78j88j126j87J242p37J230m39o33O19j010
3105h10J076n22P55j062j18j91J196Q0K42j047n57R96l24R18p51M4k99o19Q72
3124a21P41m4p29q2J92j648K138M36l87m02j1j34J56k49L60r92M95l94O72p36
3144g39J429p83N30j89l57k50M95l68L99k53o16L10K32n72N96J072j284KL07J247
3164A208j408m5o71M92M33J08r54J107j16n52P75k63Q15n37M5n90j84O33O45j080
3184a39n65L67L36Q52m31L83p72m08M24r2K39M42l8n71n86M03J06O84p21j01O94
3205E06j140K81Q66o08L56j143P38J17k14Q00r11q7J54J046m54j388J578j63l76
$$ plain form
3067 447 251 1128 -500 -55 -603 -271 -258 248 -918 -469 -308 207 -130 817 75 33 -265 -867 -148 188
3087 188 -44 151 -519 -408 29 887 -459 419 231 -895 -1082 160 -577 653 214 -419 200 -810
3105 -810 266 -256 499 -563 -681 -872 324 404 646 -401 -958 38 -286 632 -119 -75 -374 -993 -121
3124 -121 620 576 -153 -235 -43 -1691 447 883 496 94 83 -51 105 -144 216 -776 -281 -675 -3 -739
3144 -739 690 -93 437 248 -109 -359 136 -232 167 -86 -702 -392 -160 -732 -136 936 -348 -346 -39 1208
3164 1208 -200 -245 -916 -424 9 117 -837 270 154 -398 377 114 929 392 437 -153 -337 296 941 -139
3184 -139 -704 -337 -1 851 420 803 31 -377 47 -45 194 636 598 27 -559 -156 -50 634 -87 -188 506
3205 506 -634 -353 513 -95 261 -882 -144 -27 -241 559 -352 -439 -285 761 307 -1081 497 334 -42
3224d2K09k95N43M11l25m23j23P76j082N32M39o55j17m2L54K54l69K38p11J214
3244G86n78p13K43J00Q73j086K10%J015r0J35o09k59K97Q9o92k5N6p8J008k06
3265D76k6p14K88N45l40nM56l49k01K45r96O47n90N95N48r32N6j50M14J142j311
3286b02O84J43j174J009l52j14l39L04J2k18P69j72p3p94J61L97j61j78m4N50
3306B08M10r13Q21Nn56O00p90N5Q18n21J65o70M13J34m92n64R31m36R00K04j343
3327f21J143j4l06M88o66n38O81M47p89K8R22m28m69J46j1P59k94m29m79R22o98
3348b06N84p16J06L01m12J116j264N09J97m15l2q57K223l13q58P71q68M00j411
3367a145J315l37M07k06k99M76O36o93Q57k095r0J913m94q0k85N79m76p8r52Q12
$$ plain form
3224 -42 167 -128 415 826 501 78 -45 731 -351 181 620 -35 -152 -194 160 414 45 283 -428 786
3244 786 208 -505 -262 -162 711 -375 -165 -165 850 760 895 286 27 324 413 -279 -304 -248 -326 682 476
3265 476 450 -264 24 569 229 224 680 331 130 375 -621 26 -564 31 579 -353 -297 -447 -33 1109 -202
3286 -202 482 625 -549 460 108 -6 -345 -41 -29 -247 522 350 277 -517 -356 41 -120 -298 -342 208
3306 208 618 -295 526 531 -25 575 -215 -160 658 137 302 -368 45 179 -313 -877 54 -382 518 722 -621
3327 -621 522 508 202 690 24 -514 167 614 -175 -147 775 347 -122 24 13 772 478 49 -430 492 -206
3348 -206 378 -338 -232 69 -343 773 -491 18 215 -200 -232 -1089 1134 821 -37 734 -134 266 -1145
3367 -1145 170 -167 240 34 -265 211 847 154 1011 -1084 -1174 739 245 165 -120 459 -17 -95 -1047 -235
3387b35Q10j09N41j585k07Q42q90J811n66q77R64m15k39Q83j153L68K3o09L48
3406b95M75p1p66N56k53L99p13L65q5M00n69P8J476r28P66n93j760J040R8J31
3426b49M27oJ81l08J89n42l26J202L45j259K87L13j82p1N56m00n41N63m80Q2q75
3447a094J354M3K72m91n29M93R7j77l01M9K28m77j9l83J325l1M50l99k07o1J89
3468C31q2J94J12j77k3j029R88r20O85N94r45j04l93N17o10J005MM77j505O59
3488b22N39n09N29p20r8j1N53l15M28j24j188J611q1j97n04k19O09l37N37J86
3508D67q39j85N92O5n71K05Q88p10j64J38N75j199R89j60m22L02J10l3j32M13
3528C29k51K10l56j13N11j72Q85o40M2j48o11O22l57O2m21O28n75L58L14N59j143
$$ plain form
3387 -235 575 466 1007 -578 -785 57 -833 978 412 -465 499 84 -155 728 -425 -57 -34 -643 -295
3406 -295 180 109 -657 -101 -354 45 -668 -303 -388 12 -557 -479 997 69 835 242 -1518 -478 -380 -249
3426 -249 178 172 353 45 234 -308 -634 568 913 -346 -59 254 72 1 557 157 -384 179 -301 -219 -1094
3447 -1094 260 303 575 84 -445 48 145 -32 -333 -284 -56 -533 -552 -935 390 359 809 410 203 142 331
3468 331 249 443 555 378 355 -674 314 -606 79 673 -272 -376 -769 -252 -862 143 147 624 -881 -222
3488 -222 317 -192 337 -383 -481 -492 61 -254 174 50 -1138 473 392 195 -309 -528 81 -256 281 467
3508 467 -372 -557 35 100 -471 -266 622 -88 -252 -114 461 -738 251 91 -331 -29 81 48 -84 329
3528 329 78 288 -68 -181 330 158 1043 403 445 297 -314 308 -49 13 -408 220 -355 3 317 876 -267
3549b67J34m82N07N41j98M83j513J974n54j260Q74q5M89j432J1J192p4N3k04r41
3569g52P82O99j850J766o0k62j12J16R8j071N93j64L2J176j266Q07n72K89M09
3588F58r67O98K11n35k35M39k72M45l71M19l3j019Q51o56K96l79Q65L31l38j089
3608f81R75r95Q71M41m61J9j163R57N17k03p05J94o32N75R13n30K88k72J76o6
3628B18k74m83Q45J60j317O79n7K96N9J00n58k11l02M43K78o88N47k99K69m10
3648g05O86N33p17J250n73m00q8R10R8j261K8m94J28L37K56o8m89M58J14j51J11
3669c7M82M3r72K40K84k26L48l25n38Q99L0j50j08P34n36P25j429N59M0K7l3q
3691D9K70K12j197M13P24p1m77P52l90l11l98K02J81JQ29k99N1n53L31N17l87
$$ plain form
3549 -267 -133 -615 -108 433 235 718 -795 1179 625 -635 239 154 643 -789 -778 414 340 393 189 -752
3569 -752 30 729 -1121 645 585 323 211 327 425 -646 -53 -217 -185 991 -275 532 -40 249 658
3588 658 -309 389 600 65 -170 269 -3 442 71 490 457 -562 289 -367 -71 -450 415 746 408 -681
3608 -681 294 -701 170 611 150 169 -994 -37 480 277 -428 -234 -866 -291 622 92 380 108 284 218
3628 218 -56 -539 306 466 -851 -172 -229 67 126 226 -332 -543 -845 -402 -124 -812 -265 -564 -295 -705
3648 -705 -19 514 -203 1047 474 74 -14 896 994 -267 -239 -733 -605 -268 -12 -80 -569 -111 3 -148 -37
3669 -37 445 488 -484 -244 40 -186 162 -163 -701 198 228 78 -30 704 168 893 -536 23 63 90 57 49
3691 49 319 531 -666 -253 471 400 -77 675 285 -26 -424 -222 -41 -40 789 490 541 -12 319 836 449
3712D49Q8m97O87q80j29l46M86K66l09J210m29p60L33N10J39l20j269O30k36J116
3732G39j285R76m25K58L35j025K21j26q1r9K67O68l14K76J85k28q24K56k68P49
3752B55Q6p07l56J547k18j223R58k49k07j85M17n08M34O29k98K19n59q10J62L03
3772c10M92p32J92n77Q26M59J99j459M48N94K22r56J62K41J88K87n36k2J26k8
3792a84K69K1P8o56J107p3j83r67n6L92J103m52l30n88N61K47R61j082Q6o65M34
3813B3J534j632J87r27J045O40q75o68L43L89J26O25j563J336N99q69j504P49
3831d42j12M79O33j334L31Q47L78n77m57m64J322n83N30o36P53q02N27k68j21
3850Dm81L44O73m82J98p65N81l14k49O2k97O01j60J118p68o12N03J38l81R38j393
$$ plain form
3712 449 537 40 727 -153 -282 -628 -142 124 -185 1025 596 -164 169 679 818 498 -771 -141 -377 739
3732 739 -546 430 5 263 598 -427 -206 -332 -413 -512 -245 423 109 385 570 342 -482 -226 -494 255
3752 255 341 -366 -722 825 607 -616 342 93 -114 -299 118 -390 44 673 375 594 35 -775 -613 -310
3772 -310 182 -550 -358 -935 -109 350 549 -910 -462 132 354 -602 -440 -199 -11 276 -260 -282 -156 -184
3792 -184 85 106 184 -472 635 562 379 -588 -644 -252 851 399 69 -519 42 289 1250 168 254 -411 23
3813 23 1557 -75 112 -815 230 870 -5 -673 -330 59 185 810 -753 583 1182 313 -1191 -442
3831 -442 -554 -75 558 -776 -445 402 780 203 -254 -718 604 21 551 -85 668 -134 393 125 4
3850 4 -477 -133 540 58 256 -509 72 -242 -491 -429 -726 -125 -285 833 65 -547 -44 94 -287 651 -742
3871g42Q06j280J888l22j18r76M03J180p40K26q75N79Q52p47j328O94J602j016
3889H6P69k77o12K79j26M41j142K54N88k01o37r5L16K19R23n60o69j45N79l16
3909c26R2N30n0k48R02j144l32M19J07P06k36j43j049P38Q91j245l89J010j61
3928G2K34p88k99O9k08J261L07j040K92m16J326q19p69P18l50R99N97k044L2R93
3948A67O82K75j654j39J64M00L69K79R9r99R71j84m38q72m47J656J049j177q99
3967f98L91J61L1p03M02J11L63J16N04k011Q39J119K3j374k56L6Q78J45M62j340
3987h01r31J083N15Q60j283k37J017M24j113L58j151J377M95j01j495k52J239
4004DJ659j309o79K36k24Q44j05j101N57K46Q77o32n76j69l15R9N49o56p27J056
$$ plain form
3871 -742 64 -1216 672 350 232 -744 -341 839 99 325 -550 29 881 134 -1194 -500 1102 86
3889 86 855 578 -34 245 119 560 -582 -328 260 59 -578 -673 -357 -138 785 225 -444 -589 -10 -326
3909 -326 -234 296 246 -2 900 -244 -576 -157 -50 656 420 277 -772 -34 857 -388 -777 233 72
3928 72 306 -482 -781 -712 -920 341 648 -392 -100 -516 810 -9 -778 -60 -410 589 1186 -858 -826 167
3948 167 849 1124 -530 -669 -505 -105 264 543 642 -357 614 430 -8 -880 -1327 329 1378 201 -698
3967 -698 -307 -146 -115 -818 -416 -305 58 174 678 -1333 -494 625 648 -726 -982 -946 -68 77 539 -801
3987 -801 -1732 -649 -134 726 -557 -794 223 647 -466 -108 -1259 118 613 512 -983 -1235 4
4004 4 1663 354 -325 -89 -313 531 426 -675 -118 128 1005 373 -203 -372 -687 -588 -39 -695 -1422 -366
4024c66J440j184j8k57L41p84J939q30j548J208L24P9j485J66L43J436Q28j915
4042b83n02R2K100j067o60j5L30N16N37j200r8J48O22m6j289k3l14K070o88j04
4062A26n10L16J170Q9j974M27P79K19J17j243l54N6J359J9m56J20j539K002P67
4081A490k087k80M82O77J078j768o29J106L87M82j552q0j01J032K18l38j239J295
4099A73M13k13m3p81P08K51O9l03q17M20M90J55p52k35N6J034P57j377m35o24
4119a054J328J395j249q92n28P80K53P61j221n51N47J102n27q92K94q8Q80Q76
4137A214j241j012N79J109j213m55J174m23J320p67o33p54J569J220j119q80k72
4154e84R48M27j24n02j203P19J404q87R9j165M29K177o27j425p1P39J100j350
$$ plain form
4024 -366 1074 -110 -128 -385 -44 -828 1111 281 -1267 -59 265 344 -1141 -975 -632 804 1632 -283
4042 -283 -785 -693 1407 340 -320 -335 -5 511 1048 -152 -250 -102 520 474 -815 -838 -1152 918 230 126
4062 126 -384 -68 1102 1191 -783 -356 423 642 759 -484 -838 -782 577 596 140 260 -1279 723 1490
4081 1490 -597 -877 -395 282 1360 -408 -1037 69 456 938 -614 -694 -795 237 455 117 -1122 173
4099 173 586 373 330 -451 257 508 577 274 -543 -123 367 522 -230 -465 -409 625 1382 5 -430 -1054
4119 -1054 274 1669 420 -472 -1000 -220 33 794 -427 -978 -431 671 144 -748 -454 -542 338 1214
4137 1214 -27 -1039 -460 649 -564 -1019 155 -268 1052 285 -348 -1102 467 1687 568 -312 -584
4154 -584 364 791 667 165 -1038 -319 1085 198 297 -868 -439 1738 1111 -314 -385 354 1454 104
4172A04q32Q9O80M91J43j620K09K45J275l21o61P4Q6J105N01j722o01K18J158
4191F21K45j579M2k41J464p0J46j808L92J672n94r4j721N23J727K38j853O48n73
4210h15J289p4j377K29j59J767j14m79j366qO71J084K94j770l60J196N44r90n15
4229i53l66N61J409n37k080O43K106O9l05j065j25J147J266j498n44j212J749
4246B65N24n76j389J103L91N23q38j561J891M2P08l14j134k30K37L43L64p98p97
4265a246O50P01k35O06j309J86P33r17L89r84J300J832o93j612m26O89J11M56
4283B31j052o71R97O96M88p06k75l69N58J121n17k106J352Q80L05j5j830O5J504
4302F56k2m39n72L86M50J99k77j207L62J507l89r59o83K15O77N18p76l66L82P79
$$ plain form
4172 104 -728 -639 41 532 675 -945 -736 -491 784 463 -198 -124 -38 1067 1568 -154 -755 -537 621
4191 621 866 -713 -671 -912 552 482 628 -1180 -788 884 290 196 -1525 -1002 725 963 -890 -242 -815
4210 -815 474 400 -977 -748 -907 860 746 267 -1099 -1107 -436 648 942 -828 -1188 8 552 -438 -953
4229 -953 -1319 -758 651 114 -1966 -1323 783 852 547 -518 -643 504 1770 272 -272 -1484 265
4246 265 789 213 -1176 -73 318 841 3 -1558 333 375 1083 769 -365 -595 -358 -15 349 -449 -1246
4265 -1246 -596 105 -130 476 -833 -647 86 -831 -442 -1426 -126 1706 1013 -599 -1025 -336 -225 231
4283 231 -821 -1492 -495 201 689 -17 -292 -661 -103 1018 501 -1605 -253 627 932 917 -913 -848 656
4302 656 634 195 -377 9 459 658 381 -826 -464 1043 654 -305 -988 -773 -96 422 -354 -720 -338 441
4322D41Q17j645m63N03O23J081j454m71L72J112N99k103k42k79M41J221k17j250
4340i14Q9J575j79j44j512O89N56O81j063m37k47L82K020q51j390R5J123J238
4358A711p61j764L00Q53Q21m64k034J39J238O98N37k739J234K87J045K35k389
4375a053P34p43J961j142M22j231J063JN4j088P02R77O44p31j109K83Q60N9K8
4394F91j649k04K053k52L92p99j636J526M9L79n14o4M53L05p08k75k3o98K115
4413A141K83j578k4N4P15N06j351J27o25R52J169m01j108k32R85l09o03J12p02
4432h89J486j00k82p4rn66L15K14q51N97K35J09q26L52K31J103Pj778N81j248
4452a393K140po86j80j149J335N18L27k074J230M30J23p31j88J75P43n17n32l3
$$ plain form
4322 441 1258 -387 -850 -347 276 1357 -97 -568 -196 916 1515 -588 -830 -1109 -668 553 336 -914
4340 -914 -825 750 571 427 -1085 -396 160 841 -222 -659 -906 -524 1496 645 -745 -650 473 1711
4358 1711 950 -814 -514 339 1160 696 -1338 -1199 39 737 1274 -1465 -231 56 1101 1336 -1053
4375 -1053 -319 -1062 899 -243 179 -1052 11 12 66 -1022 -320 657 1301 570 -539 -256 604 663 691
4394 691 -958 -1162 891 639 1031 232 -1404 122 171 550 36 -28 425 730 22 -253 -276 -974 1141
4413 1141 1424 -154 -178 -124 591 1097 -254 -127 -752 200 1369 968 -140 -372 613 304 -299 -187 -889
4432 -889 597 497 215 141 132 -434 -119 95 -756 -159 76 185 -641 -289 -58 1045 1052 -726 -145 -1393
4452 -1393 747 740 54 -126 -1275 60 578 905 -1169 61 491 614 -117 -305 -130 613 96 -436 -469
4471d69J16O72q5o2P02q55K45j93k71l33q2R09M48L33k008J62L56J434n54o77
4491b12j076J671k34O7o8m46N54N0n73j92m58J520L15k38q50l13n83J965N46j977
4511e32J34j89O11M78j348LP28Q80p05k24l48M70R23j132m27O45o62Q72R78j201
$$ plain form
4471 -469 -353 319 234 172 874 19 264 71 -200 -533 -615 294 742 1075 -933 -771 -415 1019 465 -212
4491 -212 -1288 383 149 216 148 -298 256 306 -267 -459 -917 603 918 680 -170 -483 -1066 899 1445 -532
4511 -532 -398 -587 24 502 -846 -843 -115 765 60 -164 -512 -42 881 -251 -678 -33 -695 177 1155 -46
$$ [...]
8191D92
##END NTUPLES=NMR FID
##END=
