##TITLE=1H_SA_pyrethernit_oil
 CDCl3, 8 sc, 
 5.4.2019
##JCAMPDX= 6.0         $$ Bruker NMR JCAMP-DX V2.0
##DATA TYPE= NMR FID
##DATA CLASS= NTUPLES
##ORIGIN= UXNMR, Bruker Analytische Messtechnik GmbH
##OWNER= root
$$ XWIN-NMR		Version 3.5
$$ Fri Apr  5 15:50:05 2019 Russian Standard Time (UT+4h)  she@DPX200
##.OBSERVE FREQUENCY= 200.1316
##.OBSERVE NUCLEUS= ^1H
##.DELAY= (6, 6)
##.ACQUISITION MODE= SIMULTANEOUS
##.ACQUISITION SCHEME= undefined
##.AVERAGES= 8
##.DIGITISER RES= 18
##SPECTROMETER/DATA SYSTEM= spect
##.PULSE SEQUENCE= zg30
##.SOLVENT NAME= CDCl3
##.SHIFT REFERENCE= (INTERNAL, CDCl3, 0, 15.7039)
##AUDIT TRAIL= $$ (NUMBER, WHEN, WHO, WHERE, WHAT)
$$ ##TITLE= Audit trail, XWIN-NMR		Version 3.5
$$ ##JCAMPDX= 5.01
$$ ##ORIGIN= Bruker BioSpin GmbH
$$ ##OWNER= she
$$ F:/spectra/data/she/nmr/H-F/1/audita.txt
$$ ##AUDIT TRAIL=  $$ (NUMBER, WHEN, WHO, WHERE, WHAT)
(   1,<2019-04-05 15:48:59.90 +0400>,<she>,<DPX200>,
      <created by zg, POWCHK disabled, PULCHK disabled
       configuration hash MD5:
       00 E9 B6 7A A2 85 ED C7 34 08 36 98 17 FE 4E 26
       data hash MD5: 16K
       E4 A6 8F A9 97 EE CF 24 D1 B3 C5 A0 03 7E 7D E2>)
$$ ##END=
$$ 
$$ hash MD5
$$ 75 C7 8A D1 55 BF A9 89 3A 9F 6D 37 03 96 A3 00
##$RELAX= 
##$RELAX= 
##$RELAX= 
##$RELAX= 
##$RELAX= 
##$RELAX= 
$$ Bruker specific parameters
$$ --------------------------
##$DU= <F:/spectra>
##$EXPNO= 1
##$NAME= <H-F>
##$PROCNO= 1
##$TYPE= <nmr>
##$USER= <she>
##$AMP= (0..31)
100 100 100 100 100 100 100 100 100 100 100 100 100 100 100 100 100 100 
100 100 100 100 100 100 100 100 100 100 100 100 100 100 
##$AQSEQ= 0
##$AQ_mod= 1
##$AUNM= <au_zg>
##$AUTOPOS= <>
##$BF1= 200.13
##$BF2= 200.13
##$BF3= 200.13
##$BF4= 200.13
##$BF5= 200.13
##$BF6= 200.13
##$BF7= 200.13
##$BF8= 200.13
##$BYTORDA= 1
##$CFDGTYP= 0
##$CFRGTYP= 5
##$CHEMSTR= <none>
##$CNST= (0..31)
1 1 145 1 1 1 1 1 1 1 1 1 1 1 1 1 1 1 1 1 1 1 1 1 1 1 1 1 1 1 1 1 
##$CPDPRG= <>
##$CPDPRG1= <>
##$CPDPRG2= <>
##$CPDPRG3= <>
##$CPDPRG4= <mlev>
##$CPDPRG5= <mlev>
##$CPDPRG6= <mlev>
##$CPDPRG7= <mlev>
##$CPDPRG8= <mlev>
##$CPDPRGB= <>
##$CPDPRGT= <>
##$D= (0..31)
0 1.2 0 0 0 0 0 0 0 0 0 0.03 0 0 0 0 0 0 0 0 0 0 0 0 0 0 0 0 0 0 0 0 
##$DATE= 1554464939
##$DBL= (0..7)
120 120 120 120 120 120 120 120 
##$DBP= (0..7)
150 150 150 150 150 150 150 150 
##$DBP07= 0
##$DBPNAM0= <>
##$DBPNAM1= <>
##$DBPNAM2= <>
##$DBPNAM3= <>
##$DBPNAM4= <>
##$DBPNAM5= <>
##$DBPNAM6= <>
##$DBPNAM7= <>
##$DBPOAL= (0..7)
0.5 0.5 0.5 0.5 0.5 0.5 0.5 0.5 
##$DBPOFFS= (0..7)
0 0 0 0 0 0 0 0 
##$DE= 6
##$DECBNUC= <off>
##$DECIM= 24
##$DECNUC= <off>
##$DECSTAT= 4
##$DIGMOD= 1
##$DIGTYP= 9
##$DL= (0..7)
0 120 120 120 120 120 120 120 
##$DP= (0..7)
150 150 150 150 150 150 150 150 
##$DP07= 0
##$DPNAME0= <>
##$DPNAME1= <>
##$DPNAME2= <>
##$DPNAME3= <>
##$DPNAME4= <>
##$DPNAME5= <>
##$DPNAME6= <>
##$DPNAME7= <>
##$DPOAL= (0..7)
0.5 0.5 0.5 0.5 0.5 0.5 0.5 0.5 
##$DPOFFS= (0..7)
0 0 0 0 0 0 0 0 
##$DQDMODE= 0
##$DR= 18
##$DS= 0
##$DSLIST= <SSSSSSSSSSSSSSS>
$$ [...]
##$SUBNAM2= <"">
##$SUBNAM3= <"">
##$SUBNAM4= <"">
##$SUBNAM5= <"">
##$SUBNAM6= <"">
##$SUBNAM7= <"">
##$SUBNAM8= <"">
##$SUBNAM9= <"">
##$SW= 24.9336934301222
##$SWIBOX= (0..15)
0 0 2 0 0 0 0 0 0 0 0 0 0 0 0 0 
##$SW_h= 4990.01996007984
##$TD= 16384
##$TD0= 1
##$TE= 0
##$TE2= 300
##$TE3= 300
##$TEG= 300
##$TL= (0..7)
0 120 120 120 120 120 120 120 
##$TP= (0..7)
150 150 150 150 150 150 150 150 
##$TP07= 0
##$TPNAME0= <>
##$TPNAME1= <>
##$TPNAME2= <>
##$TPNAME3= <>
##$TPNAME4= <>
##$TPNAME5= <>
##$TPNAME6= <>
##$TPNAME7= <>
##$TPOAL= (0..7)
0.5 0.5 0.5 0.5 0.5 0.5 0.5 0.5 
##$TPOFFS= (0..7)
0 0 0 0 0 0 0 0 
##$TUNHIN= 0
##$TUNHOUT= 0
##$TUNXOUT= 0
##$USERA1= <user>
##$USERA2= <user>
##$USERA3= <user>
##$USERA4= <user>
##$USERA5= <user>
##$V9= 5
##$VALIST= <valist>
##$VCLIST= <CCCCCCCCCCCCCCC>
##$VD= 0
##$VDLIST= <DDDDDDDDDDDDDDD>
##$VPLIST= <PPPPPPPPPPPPPPP>
##$VTLIST= <TTTTTTTTTTTTTTT>
##$WBST= 1024
##$WBSW= 4
##$XGAIN= (0..3)
0 0 0 0 
##$XL= 0
##$YL= 0
##$YMAX_a= 297142
##$YMIN_a= -340073
##$ZGOPTNS= <>
##$ZL1= 120
##$ZL2= 120
##$ZL3= 120
##$ZL4= 120
##$ABSF1= 10
##$ABSF2= 0
##$ABSG= 5
##$ABSL= 3
##$ALPHA= 0
##$AQORDER= 0
##$ASSFAC= 0
##$ASSFACI= 0
##$ASSFACX= 0
##$ASSWID= 0
##$AUNMP= <proc_1d>
##$AZFE= 0.1
##$AZFW= 0.1
##$BCFW= 1
##$BC_mod= 2
##$BYTORDP= 1
##$COROFFS= 0
##$CY= 11.3945322036743
##$DATMOD= 1
##$DC= 2
##$DFILT= <>
##$DTYPP= 0
##$F1P= 18.9103706918063
##$F2P= -1.10871071338519
##$FCOR= 0.5
##$FTSIZE= 0
##$FT_mod= 4
##$GAMMA= 1
##$GB= 0.15
##$INTBC= 1
##$INTSCL= 1
##$ISEN= 128
##$LB= 0.24
##$LEV0= 0
##$LPBIN= 0
##$MAXI= 10000
##$MC2= 0
##$MEAN= 0
##$ME_mod= 0
##$MI= 1.114404
##$NCOEF= 0
##$NC_proc= 0
##$NLEV= 6
##$NOISF1= 3.799351
##$NOISF2= 2.8
##$NSP= 1
##$NTH_PI= 0
##$NZP= 0
##$OFFSET= 15.70392
##$PC= 1
##$PHC0= -8862.451
##$PHC1= 29.80028
##$PH_mod= 1
##$PKNL= yes
##$PPARMOD= 0
##$PSCAL= 0
##$PSIGN= 0
##$REVERSE= no
##$SF= 200.130013532006
##$SI= 16384
##$SIGF1= 3
##$SIGF2= 2
##$SINO= 400
##$SIOLD= 16384
##$SREGLST= <1H.CDCl3>
##$SSB= 0
##$STSI= 0
##$STSR= 0
##$SW_p= 3612.71676300578
##$SYMM= 0
##$S_DEV= 0
##$TDeff= 0
##$TDoff= 0
##$TI= <>
##$TILT= no
##$TM1= 0
##$TM2= 0
##$TOPLEV= 0
##$USERP1= <user>
##$USERP2= <user>
##$USERP3= <user>
##$USERP4= <user>
##$USERP5= <user>
##$WDW= 1
##$XDIM= 8192
##$YMAX_p= 0
##$YMIN_p= 0
$$ End of Bruker specific parameters
$$ ---------------------------------
##NTUPLES= NMR FID
##VAR_NAME=  TIME,          FID/REAL,        FID/IMAG
##SYMBOL=    X,             R,               I
##VAR_TYPE=  INDEPENDENT,   DEPENDENT,       DEPENDENT
##VAR_FORM=  AFFN,          ASDF,            ASDF
##VAR_DIM=   8192,          8192,            8192
##UNITS=     SECONDS,       ARBITRARY UNITS, ARBITRARY UNITS
##FACTOR=    0.0002004,     1,               1
##FIRST=     0,             0,               0
##LAST=      1.6414764,     0,               0
##MIN=       0,             -340073,         0
##MAX=       1.6414764,     297142,          0
$$ Real data points
##PAGE= N=1
##DATA TABLE= (X++(R..R)), XYDATA
0@%%%%Qj6J6j6K4l2L2m0N6p2Q8j04J21j45J74k06K41k79L24l75M34m98N68o46
28c43P34q30R36j056J185j326J483j655J841k046K273k522K795l094L426l796
44a995M203m657N170n752O414p177Q073r137J0426j2026J4076j6811K0662k6545
58a5076L6750n9386J97450q9594l03939L28381K02556k23377k47956K03179J85200
69B14188j51377j96934J31362J67928p5167j72568L0309J35117K6850j13471n8020
80f1783P3186Q7907n9482j03071M7097J37137m3080j69338K2743K06134M956k22154
92g9748m1316K23692O6145k09004p8348J96155P6380j92901q5482J84899R1233
103A51705j79782j15388J49280J21850j20135j22379Q6506J10247o7866j05000
$$ plain form
0 0 0 0 0 0 8 -8 8 -8 16 -16 16 -24 32 -40 48 -56 65 -80 94 -112 129 -150 174 -201 233 -265 303 -343
28 -343 391 -439 497 -559 626 -700 783 -872 969 -1077 1196 -1326 1469 -1625 1801 -1995
44 -1995 2208 -2449 2721 -3031 3383 -3794 4279 -4858 5568 -6458 7618 -9193 11469 -15076
58 -15076 21674 -37712 159738 70144 -233795 94586 297142 73765 -174191 28988 214188
69 214188 62811 -134123 -2761 165167 90000 -82568 -52259 82858 109708 -3763 -61783
80 -61783 11403 99310 39828 -63243 -16146 120991 77911 -91427 -68684 137450 142406 -79748
92 -79748 -121064 102628 168773 -40231 -118579 77576 153956 -38945 -124427 60472 151705
103 151705 -28077 -143465 5815 127665 7530 -114849 -28343 81904 14038 -90962
113i0962N1570J06392l1185j13254j114J14103M4213r2296p3184O7122R5083l2849
125D3639r4134J7411R5423q444j00941O45J11678J1689j23548l3917J24046N0857
137I4404j18623o3142J07894O1594j10408o6681J12378P2544j18529r2710J10520
148a0759J08254q9957j14134O5447J09171m3252r2716L4485Q2677k4968p4347
159e0099K0279P7033O03o9621j8250O2418L9739m8452n3051L7417O2383l6759
171B3640q1765L3539J03634k9762j34551R622J54389J3008j66791m0680J62188
182D6471N5378j57686o6695J52284P5339j47037q5167J40876J02721j21080j11107
193a15703R9815J19004p1200j15013N0751J15536k9017j14865J0004J20587J8957
$$ plain form
113 -90962 -39392 67000 35815 -77439 -78553 35550 79763 -12533 -85717 -18595 76488 43639
125 43639 -50495 -33084 62339 53895 -47046 -46401 65277 76966 -46582 -80499 43547 94404
137 94404 -24219 -87361 20533 82127 -28281 -94962 17416 89960 -28569 -121279 -10759
148 -10759 97495 7538 -106596 -41149 68022 24770 -67946 -33461 49216 24248 -50099
159 -50099 -29820 47213 47816 -21805 -40055 22363 62102 13650 -39401 -1984 60399 23640
171 23640 -58125 -24586 79048 49286 -85265 -75643 78746 91754 -75037 -115717 46471
182 46471 101849 -55837 -122532 29752 105091 -41946 -127113 13763 116484 -4596 -115703
193 -115703 -15888 103116 31916 -83097 -32346 83190 54173 -60692 -50688 69899 88856
204H8856j22512n3045J14799Q4466j02487j14484P9757J27687o4758j41521M7743
215e5499J48097l7249j59632K0153J65443j056j68473k0293J62907L9796j49890
226e5696n2685J41692O9771j27128q2151J17371J04531r4373j21662O7839J35569
237A03078l3887j38141K061J34090K4933j25586m8115J14477O3714j07672q4307
248i5355R2261R5469q0989j09557O1503J12169m6457j14449L2930J15918k0801
259D2642j17553Q064J21541J2427j18429l2158J14058N6662r6252p1137Q0420
270B85Q5972n9511r2635M1995R9362k4133j03307M572J02720J3283j00171l1592
282f3160R0059M1290q4915n3119P5254N7465p2997o8104O5239P6604n7610q5968
$$ plain form
204 88856 -33656 -86701 28098 112564 10077 -104407 -24650 103037 38279 -103242 -55499
215 -55499 92598 55349 -104283 -84130 81313 80257 -88216 -108509 54398 94194 -55696
226 -55696 -108381 33311 103082 -24046 -106197 11174 115705 21332 -100330 -32491 103078
237 103078 69191 -68950 -66889 67201 92134 -33452 -81567 32910 96624 -11048 -95355
248 -95355 -3094 92375 11386 -98171 -36668 75501 29044 -85405 -52475 63443 42642
259 42642 -74911 -66847 54694 67121 -51308 -83466 30592 87254 -8998 -80135 285
270 285 86257 26746 -65889 -23894 75468 51335 -51972 -47400 55320 68603 -31568 -63160
282 -63160 26899 68189 -16726 -69845 5409 62874 -10123 -78227 -12988 63616 6006 -79962
294g9962M5753R2751k9974r2212J8863R2132n110q5969j846Q4454J4793p6718
306b3045k2374P1980L3995o1634m0592N1860M6660m5036n4066L5443O0091l0234
318B3048p2732J6096Q0664l791r0191j5645R0873L0901r1031m6460Q5683N7497
330F4912q0172o5453P4898P3939o5904p6375O0309Q0851m9029p8416M4150P9861
342F3571l5963p7629L1269Q0844k0733q2571P948Q2431Q205q1045k9213P0711
354A7825M4534o2610o3337M5784P4694l3768q8898J6183R6728J41j04175j5760
366g2659J06589L2382j05365m3236J05397N5376j00072o2011R9434P3433r1977
377b709q0371Q5438R0795p2253r5410N7357R8031m0502r7218K1738R1862n792
$$ plain form
294 -79962 -34209 58542 28568 -63644 -44781 47351 42241 -43728 -45574 38880 53673 -23045
306 -23045 -45419 26561 60556 -1078 -41670 10190 56850 11814 -42252 -6809 53282 23048
318 23048 -49684 -33588 47076 43285 -46906 -62551 28322 59223 -31808 -78268 7415 64912
330 64912 -15260 -80713 -5815 68124 2220 -74155 -13846 67005 17976 -60440 -16290 63571
342 63571 27608 -50021 -18752 62092 41359 -41212 -33264 49167 57372 -23673 -52886 17825
354 17825 62359 -251 -63588 -17804 56890 23122 -65776 -49593 47135 47276 -56899 -72659
366 -72659 33930 66312 -39053 -82289 23108 78484 -21588 -83599 15835 89268 -2709
377 -2709 -83080 2358 93153 20900 -74510 -17153 80878 40376 -56842 -35104 56758 50966
389E0966q7126j4419P6078K9110o7435m7846N2310N9183m0854p2432K6830Q1257
401D5622j4723r0712L164J00615J2153j05883k4671J12374M3001j09742n5383
412h4185J07559P0314r5998p8734Q6533Q6075p2299q9362N7521Q8372m3646q7212
424e5062K6700P8821j4974p4064Q0O4233R236n8903k2477N0555L3510m3893m7505
437e3743L4817O0634k3058p1498J1925Q1985L299q6179j4559R2198K9641q9781
449b4319l8602Q8915M9458q2255n5017P5310N9733o7297o1253N8932N9489n3836
461I258o0924M5036N7325l9542o0384K7900N7330j9054n7225N938N3251O468m8758
474b3381j7989M2348L1825l3973m0750K6281N3012j5248n7745Q089O5836K967
$$ plain form
389 50966 -36160 -50579 25499 54609 -12826 -60672 -8362 50821 9967 -62465 -35635 45622
401 45622 30899 -59813 -56649 43966 56119 -49764 -74435 37939 80940 -28802 -84185
412 -84185 23374 93688 -2310 -81044 5489 91564 19265 -70097 -12576 75796 32150 -55062
424 -55062 -28362 50459 35485 -38579 -38499 25734 34970 -23933 -46410 4145 37655 -6238 -53743
437 -53743 -18926 41708 18650 -52848 -40923 41062 44361 -41818 -56377 35821 65462 -24319
449 -24319 -62921 25994 75452 -6803 -61820 13490 73223 5926 -55327 3605 63094 9258
461 9258 -51666 -6630 50695 11153 -49231 -21331 35999 16945 -40280 -34342 18909 25377 -23381
474 -23381 -41370 978 32803 -1170 -41920 -15639 37373 22125 -35620 -27531 38305 41272
486D1272o7662q669P1764J6072p4310k1934P5845K7552p7643l5758P5230M0747
498F2506p3193m8809O4899N0680n9942n5296M8050N5151l9640n5978K8554N4816
510C1798j7033n1614P253M9446M539m3999j2535M3166K5130l9753l2866L9219
522B751M7603l3757n9136K9494P1918k0979q3165J0059Q9149P6r5375j4044R3754
535C8348K4157r3469l6918Q5227M4880p8152n4441O5982N8263n4908o0983M3055
547a8959O2927l0857o2557K2206O5778q501o4497k524O6066J8947o2089l0957
559d5017N8845M5131n1768n5146M3482O5636l4726p4601K2792P9225j3553q4531
571d4231j256Q2869J0406q2871k1742P7418K8773p4156l8099O8644M6068o2838
$$ plain form
486 41272 -26390 -35059 36705 52777 -21533 -43467 32378 59930 -17713 -53471 21759 62506
498 62506 -10687 -59496 5403 56083 -3859 -59155 -11105 44046 4406 -51572 -23018 31798
510 31798 14765 -36849 -29596 19850 24389 -19610 -32145 11021 36151 -3602 -36468 2751
522 2751 50354 16597 -42539 -13045 58873 37894 -45271 -35212 53937 54013 -41362 -55406 38348
535 38348 62505 -30964 -67882 17345 62225 -15927 -70368 -4386 53877 -1031 -62014 -18959
547 -18959 43968 13111 -49446 -27240 38538 30037 -34460 -36984 29082 48029 -14060 -45017
559 -45017 13828 58959 7191 -47955 -4473 61163 26437 -48164 -25372 53853 40300 -44231
571 -44231 -45487 37382 47788 -35083 -56825 20593 49366 -24790 -62889 5755 51823 -11015
583a1015n3657N4832O2718m1999o6911L1354P2160j4967o9679L298O9759J1051
595D6944o4692k2091N9984L3968n2805m4344M4068N1995l6537n8774K6011O0839
607D4566k1230o6517J2566O8240q154p4173j180P5681J0777p5438k1675P2036
619A5499L1966o4659l8540N7203M5201m5267m7569L6401N2974k2409n1568J1564
631a9204N1574K174m7279j2143M3534K0047m0862k7492L7543L2885l8224m1897
643c9344L4550M7796l4081n7238K7074O0542k2631o4652J5763O4471j0448o2820
655d1018N387O2509K161n6697p702N2700J6285m3539j9521L7081K5622k7968k7996
668b2696K2382L3876j5423m0136P550M6308R17n2781j3340N3776K1640n6023l2312
$$ plain form
583 -11015 -64672 -9840 52878 10879 -56032 -24678 47482 32515 -37164 -33866 35893 46944
595 46944 -17748 -39839 20145 54113 1308 -43036 1032 53027 16490 -42284 -16273 44566
607 44566 23336 -43181 -30615 37625 29471 -44702 -45882 29799 40576 -34862 -56537 15499
619 15499 47465 -17194 -55734 1469 46670 1403 -46166 -9765 43209 20800 -30768 -19204
631 -19204 32370 34544 -12735 -24878 18656 38703 -2159 -29651 7892 40777 2553 -39344
643 -39344 -4794 43002 8921 -48317 -21243 39299 16668 -47984 -32221 32250 21802 -41018
655 -41018 -35631 26878 29039 -27658 -35360 17340 33625 -9914 -29435 7646 33268 5300 -22696
668 -22696 -314 33562 18139 -21997 -14447 31861 32778 -20003 -33343 20433 42073 -13950 -46262
681d6262N3279L6978n1917m4334M8244M7592m5650n2441L9899N5180l2655n4968
693d7055K6108N5228j6682n0986J1815N0928j834m8413n094M8230J6638m2676
705c793k7330L6834L7454k7901m5570J7287M9319j0313n3943L71N3627N148n6978
718b5788j4517N5175K0721n4276k7996N0445L2515m6217l6121M3543M0043m0026
730b499m3760L8395N1629l1680n5411K5673O1733j4308o1247M856O1022M956n7453
743a8094j2487N2756K0247m7588k9126L9092L4847l1201m2561J7879M3789q608
755A8945m7278k879M6316J0719m8220j8879M9583K8392n0480l6988N0362M7706
767D7299m5761n2610M2204N8092l5117n7142L2980N8229k7894n6692K4462N5795
$$ plain form
681 -46262 7017 43995 -7922 -52256 -4012 43580 -2070 -54511 -14612 40568 7913 -47055
693 -47055 -20947 34281 17599 -33387 -21572 29356 27522 -20891 -25985 22245 38883 -3793
705 -3793 -31123 5711 43165 15264 -30306 -13019 36300 25987 -27956 -27585 26042 31190 -25788
718 -25788 -40305 14870 35591 -18685 -46681 3764 36279 -9938 -46059 -2516 37527 -2499
730 -2499 -46259 -7864 43765 12085 -43326 -17653 44080 29772 -31475 -26619 34403 39359 -18094
743 -18094 -30581 22175 42422 -5166 -34292 4800 39647 8446 -34115 -16236 27553 18945
755 18945 -28333 -31212 15104 25823 -22397 -41276 8307 36699 -13781 -50769 -407 47299
767 47299 1538 -51072 -8868 49224 14107 -43035 -10055 48174 20280 -36412 -11950 43845
779D3845j8903n3356J1346M7608n550m2144j958L4129N391k9129j3975K2244K0241
792A9789j7018l1483P777L9261J786m5994j2940N0272K3050n0061k8608N1318
804G149L5499n0022l7403N1230M2589m7219m4114M4706M6162l7537m4824L2427
816a357M1719k7590m0920K1745L8493j7377l9915O600L7418K099l5172j5092K7598
829a751K3938k1244l1492J3466L6641p188m1244K390M7070M752m8749j0252N1123
842A7460J9425m8231k3121M6767K7907m2804k8851M1133L2665l9718l6475L5599
854A756M0987l0491m5767K0747M5209j4070m5310M895M1088j577l9914m713L7570
867A0410R607l5337j6625L1058K3912k4532k7412J8774L1848j0793l2830P081
$$ plain form
779 43845 24942 -28414 -17068 30540 24990 -17154 -19112 15017 20408 -8721 -22696 -452 19789
792 19789 2771 -28712 -20935 18326 20112 -25882 -38822 11450 34500 -15561 -44169 7149
804 7149 42648 -7374 -44777 6453 49042 1823 -42291 2415 48577 11040 -33784 -1357
816 -1357 40362 12772 -28148 -6403 32090 14713 -25202 -18602 18816 20915 -14257 -29349 -1751
829 -1751 22187 943 -30549 -17083 19558 12370 -28874 -26484 20586 25338 -23411 -33663 17460
842 17460 36885 -11346 -34467 12300 40207 -2597 -31448 9685 42350 2632 -33843 1756
854 1756 42743 12252 -33515 -12768 32441 18371 -26939 -22044 19044 17467 -22447 -27160 10410
867 10410 20017 -15320 -31945 -887 23025 -1507 -28919 -10145 21703 10910 -21920 -14839
879a4839L8469n81m0440n319M5048J5722m6054k4746M4324L2416m0749l7803L5010
892D58L9197l3046m2379K8620M2657k7314m5102K0889M3697j6897m2413J0965
904b0668L8323o496l4775K837L3682K506l0801p942K9810J7411k3105k4108J7659
917e667L2309q747l4119K486L7297L239l9123p759M0056J1917m2533j8164M1416
930A2608K0777m1070k5040L5819K5549l4371k8019L0984K8204k9142l1347K5064
942i984L3650j7516l4735J0417L5502o75l1885m896L0940J2223k6788j6221K5838
955E870K3432k2272k8670J8772L4319j4290l8178Q229L8337m317m0328j275L9584
968A9213L693m1151j0668L9051J5622l7143k2981L1555K7174k5590k9806J9397
$$ plain form
879 -14839 23630 23049 -17391 -22710 22338 38060 -7994 -32740 11584 44000 3251 -34552 458
892 458 39655 6609 -35770 -7150 35507 8193 -36909 -16020 27677 10780 -31633 -20668
904 -20668 17655 11159 -23616 -20779 12903 15409 -15392 -23334 6476 23887 782 -23326 -5667
917 -5667 26642 17895 -16224 -13738 23559 26798 -12325 -20084 19972 31889 -10644 -28808 12608
930 12608 33385 -7685 -32725 3094 28643 -5728 -33747 -2763 25441 -3701 -35048 -9984
942 -9984 23666 6150 -28585 -18168 17334 16659 -15226 -20122 10818 23041 -3747 -19968 5870
955 5870 29302 7030 -21640 -2868 31451 17161 -21017 -12788 25549 21232 -19096 -20371 19213
968 19213 22906 -18245 -28913 10138 25760 -11383 -34364 -2809 24365 -1225 -31031 -11634
980a1634L2163j3101l2476R478L5332k966l4739r86L7050Q110l4481j2799L3881
993A2832J8237l1056k2738K9576K6131k7647l2388K2753L5681j8592m1059R677
1005a8593M1425l679m2028n357L8965J0672l6151j6712L3103K1750k8347k5684
1017c0636K4461L0333j7607l1358J3085L4150o323l3274L200L5167J951l4827
1029a1678n934L4985J2158l4832j7669L1773K2480k9880k8003K5079K9341k2507
1041E313l3965J7010L4221j3585l6757P955L5761k887l5052j643L3229O935k9716
1054a3181r692K8413J5118k3547j7525K0783K3359j4731k5364J0151K8565l931
1066A8418k9814j218K9744N797l0420j0935K9087J3734k9923j9014K7771K0328
$$ plain form
980 -11634 20529 7428 -25048 -15570 19762 16796 -17943 -18929 18121 26231 -8250 -21049 12832
993 12832 31069 13 -22725 6851 32982 5335 -27053 -4300 31381 12789 -28270 -18593
1005 -18593 22832 19153 -22875 -28232 10733 21405 -14746 -31458 1645 23395 -4952 -30636
1017 -30636 -6175 24158 6551 -24807 -11722 22428 16105 -17169 -13969 21198 23149 -11678
1029 -11678 -17612 17373 29531 -5301 -22970 8803 31283 1403 -26600 -1521 27820 5313
1041 5313 -28652 -11642 22579 8994 -27763 -19808 15953 13066 -21986 -23629 9600 16535 -13181
1054 -13181 -22873 5540 20658 -2889 -20414 369 23728 8997 -16367 -6216 22349 18418
1066 18418 -11396 -12614 17130 22927 -7493 -18428 10659 24393 -5530 -24544 3227 23555
1078B3555k7921k3605K5744K4284k4627k7168K2503K8792k0089l0566J7413L2362
1090B0677j1309l2153P531L2355n94k8198l611K6111J0700k1833j3296J7239J8406
1103B2025j2615k1965P086K4414l398k7463k689K8057N022l0848j0364L0276J3824
1116B1362l3176j8224L2067K2334l1762k5846K9523K9495k5844l1126K3342L3529
1128B5674j7658l2549J3955L3759q218l0834M029K9499K307k5944o726K2997J1428
1141B1719k0211j6225J5252J9918j2246k5639N829K8404j925l3129n405L4331
1153A0673J0252l6165j6806L5949K1840l4783k5969L3523L0389k9583l1580K6906
1165e354L5139k1456l4885J8516L6283j2661l4431Q364L3969l022l1167l969K8248
$$ plain form
1078 23555 -4366 -27971 -2227 22057 -2570 -29738 -7235 21557 1468 -29098 -11685 20677
1090 20677 9368 -22785 -15254 17101 16507 -11691 -15302 10809 21509 -324 -13620 3619 22025
1103 22025 9410 -12555 -5469 18945 15547 -11916 -14605 13452 18474 -12374 -22738 7538 21362
1116 21362 -11814 -30038 2029 24363 -7399 -33245 -3722 25773 -71 -31197 -7855 25674
1128 25674 8016 -24533 -10578 23181 14963 -15871 -11842 17657 19964 -5980 -12706 10291 21719
1141 21719 1508 -14717 535 20453 8207 -17432 -11603 16801 14876 -18253 -23658 10673
1153 10673 20925 -15240 -32046 3903 25743 -9040 -35009 -1486 28903 -680 -32260 -5354
1165 -5354 29785 8329 -26556 -8040 28243 15582 -18849 -10485 23484 20462 -10705 -14674 13574
1178A3574Q579k4487j5016J8648J7678j3339k3524O216K5209j562k7564n585K7345
1191F172J0488k7983j4408K6931J8301k5807k0211K6199K3313k4289k3541K4713
1203a22K6761k2646k6386K1726K8829j8639k8933J5774K9262j2306k9023P860
1215g843K6399m711k4913j212K0586M438j8285r032J2116J1490r060j5115M882
1228a0260J6794n72j9755k517K2304P041k2674r181K4823J3701k4088j4931K5669
1241F354J8097k4414j8592K3757K0230k1952k0962K0119K0720j8633k0913J5517
1253f72J9001j4195j9828J0449J7717q074j9092L732J7146L92j6508n623J4694
1266h61J0168j2184j3727J0031J8825o374k0951M508K5267M98k6315k750K8021
$$ plain form
1178 13574 22153 -2334 -17350 1298 18976 5637 -17887 -11671 13538 11976 -15588 -21173 6172
1191 6172 16660 -11323 -25731 1200 19501 -6306 -26517 -318 22995 -1294 -24835 -122
1203 -122 26639 3993 -22393 -667 28162 9523 -19410 -3636 25626 13320 -15703 -7843
1215 -7843 18556 13845 -11068 -12280 8306 12744 -5541 -14573 -2457 9033 -27 -15142 -10260
1228 -10260 6534 5962 -13793 -16310 5994 13035 -9639 -18820 6003 19704 -4384 -19315 6354
1241 6354 24451 37 -18555 5202 25432 3480 -17482 2637 23357 4724 -16189 -672
1253 -672 18329 4134 -15694 -5245 12472 4398 -14694 -10962 6184 6576 -9932 -15555 -861
1266 -861 9307 -2877 -16604 -6573 12252 5878 -15073 -10565 14702 15200 -11115 -13865 14156
1279A4156P537k7837r704K7512J2411k6973j4326K4912J6436k4927k0258K1748
1291F87K1777j9739k5655J4502K5878j0934k7868N759K7458j038k7916m106K7791
1304F596J0033k4498j5046K2213K1282j6618k3009J2988K5998p019k6936M224
1316i792K8362J119k9706n223K9601J0524k9389j6706K6788J9855k5242k3866
1328b3675K0779K5380j9580k8709J5916K9486j2624l1531P058L0964j324k9022
1340a6882j990K6438O415k2261p751K0599J2479j7178j5000J4937K0329r585k2815
1353a2265M255K5485O74k6334n040K5827P642k6926j1964K6332J3909k6458j9056
1366b3919K3098K0759k0217k2209J4735K1079j2102j9032R475J8526p022j7276
$$ plain form
1279 14156 21693 -6144 -15848 11664 24075 -2898 -17224 7688 24124 -803 -21061 687
1291 687 22464 2725 -22930 -8428 17450 6516 -21352 -15593 11865 10827 -17089 -21195 6596
1304 6596 16629 -7869 -22915 -702 20580 3962 -19047 -6059 19939 12920 -14016 -9792
1316 -9792 18570 19689 -10017 -15240 14361 24885 -4504 -21210 5578 25433 191 -23675
1328 -23675 -2896 22484 2904 -25805 -9889 19597 6973 -24558 -17500 13464 12140 -16882
1340 -16882 -18872 7566 13981 -8280 -16031 4568 17047 -131 -15131 -194 20135 10550 -12265
1353 -12265 -8010 17475 18149 -8185 -13225 12602 20244 -6682 -18646 7686 21595 -4863 -23919
1366 -23919 -821 19938 -279 -22488 -7753 13326 1224 -17808 -8333 10193 3171 -14105
1378a4105L832J8919J288j6800m837J5579J0200j1351j1991J0176J4560q510j6421
1391i461P385J9820n985k3253L075K3182p49k3347l314J9726L039j8752l584J6231
1405D013K381j6630l844J5342O159j2968q323J0677R985o127r272M640J1195k080
1419E148j1550J614J5482J754j7616n124J8954J0071j8033j2930J6484J3348j6802
1432H00j4133J6211J3984j7537j7630J5823J8981j3587k1758P774K0910l958j9691
1445a3811M15J8476K156j7719l970J8546R600j6931j3672J6124J8628j1022j9480
1458a2660Q168K1212n201k1108M521K2412l896k4796K32K6293L462k6790j0137
1471a8288K3754J2995k1410j7093J6997J8714j5851k1592J2760K4788q931k8311
$$ plain form
1378 -14105 -10273 8646 9934 -6866 -11703 3876 14076 2725 -9266 910 15470 6960 -9461
1391 -9461 -2076 17744 11759 -11494 -8419 14763 14014 -9333 -12647 7079 10118 -8634 -12218 4013
1405 4013 6394 -10236 -14080 1262 7421 -5547 -13870 -3193 6792 665 -8607 -3967 7228 5148
1419 5148 -6402 -4788 10694 12448 -5168 -10292 8662 18733 700 -12230 4254 17602 800
1432 800 -13333 2878 16862 -675 -18305 -2482 16499 2912 -18846 -11072 9838 5880 -13811
1445 -13811 -13396 5080 7236 -10483 -14453 4093 13693 -3238 -16910 -786 17842 6820 -12660
1458 -12660 -4492 16720 11519 -9589 -5068 17344 13448 -11348 -11116 15177 18639 -8151 -18288
1471 -18288 5466 18461 -2949 -20042 -3045 15669 -182 -21774 -9014 15774 6843 -21468
1483b1468M060K9827K698k7720o177K5766R753k1853j0116K1768J2012j9328j3819
1496a4597J7803J7393j2795j9656P129J9820k655j9068l387J7773N642j8615j0447
1509a5660J8039J3823j8694j9908J5785K3542j2956k6303R555K6834o484k5686
1521a8113N571K5978l430k4737K076K5380K379k2058n157J9078Q358j2977r555
1534g207Q417J0090m436j1218R85J2307J478j4614p178J4611J0737j5085j5640
1547a6753J2885J5636j2085j6618J1673J6353j2667j6645J2923J8474j1868j7829
1559a6521J0481J8697p271j6427P089J5442m699j3373M145J3342k58j3216k525
1572e094J0624N964q647q954N244R438m067j1367J913J1377k348j4372L06J5163
$$ plain form
1483 -21468 -17408 12419 15117 -12603 -18780 6986 16739 -5114 -15230 6538 18550 -778 -14597
1496 -14597 3206 20599 7804 -11852 -4723 15097 12442 -6626 -10013 7760 13402 -5213 -15660
1509 -15660 2379 16202 -2492 -22400 -6615 16927 3971 -22332 -12777 14057 7573 -18113
1521 -18113 -12542 13436 10006 -14731 -12655 12725 15104 -6954 -12111 6967 15325 2348 -7207
1534 -7207 1210 11300 6864 -4354 -3369 8938 10416 -4198 -11376 3235 13972 -1113 -16753
1547 -16753 -3868 11768 -317 -16935 -5262 11091 -1576 -18221 -5298 13176 1308 -16521
1559 -16521 -6040 12657 5386 -11041 -3952 11490 6791 -6582 -2437 10905 10647 -2569 -5094
1572 -5094 5530 11494 2847 -6107 -863 8575 4508 -6859 -4946 6431 4083 -10289 -9983 5180
1586E180Q59j6228l502J6390N015j5696n985J6679P848j5662q248J6297J1709
1599A4656j4629j3345J4157J5844j0662j6251Q919J6620o959j7069N399J7192
1611A3872m165j8571O37J8116J202j8486n269J6123O793j5256r699J2487J1608
1624I392j1177j4184Q689J7108m930j8340J733K0073L808j9572o216K0401J0429
1637A7214j8970j2664J9233J6310j8009j8547J5999K1008j3903k2807J0310K2419
1649A7593p513k3670L021K1557N9k1583n032J8760Q119j5971j2215J2046J4458
1662I629p611j6009M280J7708J23j7901k481J9430P008j8826q825J9446J2507
1675A8478j8320j3388J6951J5799j5386j7549J3431J8305j1736j9788P151J9886
$$ plain form
1586 5180 6039 -10189 -13691 2699 7714 -7982 -13967 2712 10560 -5102 -13350 2947 14656
1599 14656 27 -13318 839 16683 6021 -10230 -1311 15309 8350 -8719 -3320 13872
1611 13872 9707 -8864 -8227 9889 11091 -7395 -12664 3459 10252 -5004 -14703 -2216 9392
1624 9392 -1785 -15969 -7280 9828 4898 -13442 -11709 8364 12172 -7400 -13616 6785 17214
1637 17214 -1756 -14420 4813 21123 3114 -15433 566 21574 7671 -15136 -4826 17593
1649 17593 10080 -13590 -10569 10988 11047 -10536 -15568 3192 11311 -4660 -16875 -4829 9629
1662 9629 2018 -13991 -9711 7997 8120 -9781 -12262 7168 14176 -4650 -13475 5971 18478
1675 18478 158 -13230 3721 19520 4134 -13415 16 18321 6585 -13203 -6052 13834
1687A3834n005j9905j54J7349L378j7299o806J4398R406j2284j2465J0263J4820
1700I530o913j5517L974J8208n68j7950n26J8576L818j7376m822J7250P557j5703
1714d62r592J4060J1268j1904j2982R234J2408p535j3248M978J1620m032j2813
1727i000J710J1552k02j2035k141J0913L719j0257m537J0126O096r062o650R609
1741a59R243p398r834O701J2032m404j1385L453J1827k332j1296J279J1009r09
1755G827j1563p23J0834Q84j1880k981J0584K647j0837m476R769N376j0115o966
1769a1620R115R247p622j0665O099J2347k654j2421J348J3860J896j3054l901
1782h025J4387O931j3515q769J2585J1553j1847j3448R941J4372q507j6431N840
$$ plain form
1687 13834 8829 -11076 -11230 6119 9497 -7802 -14608 -210 9196 -3088 -15553 -5290 9530
1700 9530 2617 -12900 -8926 9282 8714 -9236 -9762 8814 12632 -4744 -9566 7684 15241 -462
1714 -462 -10054 4006 15274 3370 -9612 -378 12030 4495 -8753 -3775 7845 3813 -9000
1727 -9000 -7290 4262 4060 -7975 -10116 797 4516 -5741 -10278 -152 5944 -3118 -9768 -159
1741 -159 9084 1686 -8148 -1447 10585 6181 -5204 -1751 10076 7744 -3552 -2273 8736 7827
1755 7827 -3736 -4459 6375 7259 -4621 -7602 2982 5629 -5208 -9684 85 5461 -4654 -11620
1769 -11620 -2505 6742 -880 -11545 -5446 6901 4247 -8174 -6826 7034 8930 -4124 -8025
1782 -8025 6362 13293 -222 -8991 3594 15147 3300 -10148 -207 14165 5658 -10773 -4933
1795d933J6646m776j8666J572J7490P92j7999m109J5835O987j4110q886J2175
1808a982J0708q798j2008P084J4966l837j5058J250J6954K911j5964o056J6623
1821F793R293j5518j1966J4462J4379j3916j7436J1433J8874r736k1452N843K1214
1834A2267l712k1644n37K0587K275j8900n357J7020Q050j5192r650J2897J2050
1847A0154q672j2696O322J5018k069j4887l55J6109M146j5499o997J5510J0383
1860A6467j4835j3791J2765J5648j1285j8425Q563J8391o965k0432M308J9043
1872I452k267j8849p53J7531J825j5467l421J3621N185j1008n170R474O804o592
1886C65o503N176Q091j938q097R02P939K554q453l761P958N016q053o798O912
$$ plain form
1795 -4933 11713 6937 -11729 -10157 7333 8125 -9874 -13983 1852 8839 -5271 -14157 -1982
1808 -1982 8726 -72 -12080 -4996 9970 6133 -8925 -7675 9279 12190 -3774 -9830 6793
1821 6793 16086 568 -11398 3064 17443 3527 -13909 -2476 16398 6662 -14790 -8947 12267
1834 12267 8555 -13089 -13626 6961 9236 -9664 -15021 1999 10049 -5143 -14793 -1896 10154
1847 10154 1482 -11214 -4892 10126 8057 -6830 -7185 8924 13070 -2429 -9426 6084 16467
1860 16467 1632 -12159 606 16254 4969 -13456 -4893 13498 6533 -13899 -9591 9452
1872 9452 7185 -11664 -12417 5114 6939 -8528 -11949 1672 6857 -4151 -9321 153 6957 365
1886 365 -6138 -962 7129 5191 -2906 -2004 5935 8489 36 -3725 4233 9249 1196 -5602 1310
1901A310P963p895r766O346R827o864j1294N648J1207o094j1717N671J1629m805
1915A166j1542M233J2039k995j0987L075J1202r59r713J232R281P37p701j001
1929a933O732K078n371l058M305L214l391m917J184N230o98p269j598P527K565
1944D600r414n496J0265O632j0871q690J0841J1132j0484j2060J0454J3529q045
1957B393j3706Q317J4878n958j4944O011J4798l757j3787K177J2889k77j2012
1970b978j732R844L603r051o866O645P817n049j1491K166J2178M74j4062m127
1984a2629J4828P037j5090r425J5809J1616j4163j3546J4684J5871j2320j6524
1996a3852J1127J8336p839j8095N842J7966k561j7608j38J5767K890j4845o258
$$ plain form
1901 1310 9273 1378 -8388 -2042 7785 921 -10373 -4725 6482 388 -11329 -5658 5971 1166
1915 1166 -10376 -6143 5896 2901 -8086 -5011 6191 5232 -4481 -3249 6032 6769 -932 -1933
1929 -1933 4799 6877 1506 -1552 2753 5967 2576 -2341 -1157 4073 3375 -3894 -5492 2035 4600
1944 4600 -4814 -10310 -45 6587 -4284 -12974 -2133 8999 -1485 -13545 -3091 10438 2393
1957 2393 -11313 -2996 11882 5924 -9020 -3009 11789 8032 -5755 -3578 9311 9034 -2978
1970 -2978 -4710 5134 8737 -314 -7180 -535 7282 2233 -9258 -7092 5086 5560 -8502 -12629
1984 -12629 2199 9236 -5854 -15279 530 12146 -2017 -15563 -879 14992 2672 -13852
1996 -13852 -2725 15611 7772 -10323 -4481 13485 10924 -6684 -6822 8945 11835 -3010 -9268
2009i268J1740Q508j0305j1363O391J2315m240j3481O14J3432J464j4089l383
2022a1665J3620O089j3530p160J3083J0036j1000j0742J0428J2546p798j2879
2034h972O922J4205m504j4461K334J5397k14j5606k555J4174M257j3091o868J0942
2048A960O340j0024p943P582P964o258r238M053R219j880q815k13Q388K517o808
2063c156l162O998N642n842o417O300Q914m756r867L433J1760k658j1425J735
2077b501J0875j854j1105J358R954j468j0711Q5R374r8r399j195P617Q26o714
2092d956j076N307J638m317k037M223L499j961m338J246O290J163o136j449P148
2107D244K494o547l065Q217L797r852m865R915N736j0425p092Q336P029q362p626
$$ plain form
2009 -9268 2472 10980 675 -10688 -4297 8018 3778 -9703 -9089 4343 5807 -8282 -11665
2022 -11665 1955 8044 -5486 -12646 437 10473 -527 -11269 -841 11705 3907 -8972
2034 -8972 -2050 12155 7651 -6810 -4476 10921 10707 -4899 -7454 6720 10977 -2114 -8982 1960
2048 1960 8300 -1724 -9667 -2085 5879 -379 -9617 -5564 3655 1775 -7040 -7253 1135 3652 -3156
2063 -3156 -6318 680 6322 480 -5937 363 9277 4521 -5346 -1913 9847 7189 -4236 -2501
2077 -2501 8374 6520 -4585 -3227 6727 5259 -5452 -5367 4007 3909 -5490 -6685 932 1758 -4956
2092 -4956 -6032 -725 913 -3404 -5441 -1218 2281 320 -4018 -2772 3518 4681 -1455 -2904 4244
2107 4244 6738 191 -2874 5343 9140 -712 -5577 4338 10074 -351 -7443 893 7922 -440 -8066
2122h066O346P326o212q478M409R008k525r219n98R078L314p226m846P152P060
2137F523o420p598P052J0371o336j0791N906J2810m084j3602K315J3842j287j3541
2151d840k58J2455N15j2886k813J1469M267j0768p947Q170R145n004j1222K205
2165g512J1251K59j1367j650J2752L687j2582n713J4176Q797j2679j0249J2161
2178A331J1842r509j1815Q206J1748o929j1644N335J1740l490j2313m68J1210
2191E244K400j0054o091P603O727o613q216N235Q839m777j0399L441J2429j169
2205D599j3100q99J4120L225j1945l921J1771N397j0197n527J0032P416q285q870
2219f184N719J0457l746j0216j87R588J108r175k781P896K623q630m410P914N265
$$ plain form
2122 -8066 -1720 5606 -606 -9084 -4675 4333 1808 -7411 -8009 1069 4383 -2843 -7689 -537 6523
2137 6523 103 -7495 -443 9928 3592 -7199 -1293 11517 7433 -6169 -3854 9988 8701 -4840
2151 -4840 -5098 7357 7872 -5014 -7827 3642 7909 -2859 -10806 -2636 6509 1505 -9717 -7512
2165 -7512 3739 3998 -7369 -9019 3733 7420 -5162 -10875 3301 12098 -581 -10830 1331
2178 1331 13173 3664 -8151 55 11803 4874 -6770 -1435 10305 6815 -5498 -5966 5244
2191 5244 7644 -2410 -8501 -898 5829 -784 -9000 -3765 5074 297 -10102 -6661 5768 4599
2205 4599 -8501 -9400 4720 7945 -4000 -7921 3850 9247 -950 -6477 3555 10971 2686 -6184
2219 -6184 -465 9992 6246 -3970 -4157 5431 6539 -2636 -5417 2479 5102 -3528 -7938 -24 5241
2234E241q066o497O058P761n092o773M147N797k046n351K653O481j332n754k61
2249c034P131K743n159m751M347O131l116o766K398O613k955q499K862R452l391
2264D006j1245J795J0738j499j0840M12R486j201q671R45Q951o04q292q6P766
2279A661K107n170k350L738L367j349k236R25L131k64l686q57O075K006p496m429
2295d827P634N416q051o785P392O107q966o643Q345P369r384q963Q332R440o546
2310a30r508N377R288l931p782L510Q026j894p680J206Q685J566p420l666P319
2325B966N294m783p049L566P606l265q795K168R172j209j1343j945J1550K835
2339F768j0613o086R122O464q047p054P326P569o380q726O070J0141l793r873
$$ plain form
2234 5241 -2825 -9322 -3264 4497 -595 -7368 -3221 2576 530 -4821 -2168 4313 2981 -2773 -3034
2249 -3034 4097 6840 1681 -3070 1277 7408 4292 -2474 -76 6537 3582 -4917 -2055 7397 4006
2264 4006 -7239 -5444 5294 3795 -7045 -6633 2853 1652 -7019 -6074 2877 2273 -6019 -6105 1661
2279 1661 3768 -1402 -3752 -14 3353 2004 -232 693 3824 3560 -126 -983 5092 7098 -398 -4827
2295 -4827 2807 8223 172 -6613 779 6886 -2080 -8723 -378 6991 -2393 -11356 -3024 6416 -130
2310 -130 -9638 -4261 5027 1096 -6686 -3176 4850 2956 -4724 -3518 5167 6733 -687 -4353 2966
2325 2966 8260 3477 -3572 -6 7600 4335 -4460 -2292 6880 5671 -5672 -7617 3933 6768
2339 6768 -3845 -9931 -809 5655 -2392 -9446 -2120 5449 -931 -9657 -3587 6554 2761 -7112
2353g112K061J0892M71r324j510R484K139p827l078P784M354p254n735N565O640
2368G550m066p744R09P284K20p735k273P019K908p536n322P736O639p177q918
2383a0506O418J0407m675j0304M346J0997k743j0235K520J1186q98j0238p08J0713
2397F280K360q878l913P653L636n672m983L924N075l494o154J141O363n24p445
2412d631k127P136L518p222m986O798N821o524o073O724P997o104q579N846J0016
2427G610m122r029L284R103j171q307J474P275j43p967J49O397Q83o277k273M218
2443A104K815m201m070K825L235k438m489K209M460j482n898R38O330P61o215
2458d116j264O734K494o016k274P221L428p057l193P413M228o075n011N056N521
$$ plain form
2353 -7112 -5051 5841 6312 -3012 -4522 4962 7101 -726 -3804 3980 8334 1080 -4655 910 7550
2368 7550 3484 -4260 -3351 3933 4153 -3582 -5855 1164 4072 -3464 -8786 -1050 5589 -1588 -10506
2383 -10506 -4088 6319 1644 -8660 -4314 6683 3940 -6295 -3775 7411 6513 -3725 -4433 6280
2397 6280 8640 -238 -4151 3502 7138 1466 -3517 407 5482 1988 -4166 -3025 3338 2814 -4631
2412 -4631 -6758 378 3896 -3326 -8312 -1514 4307 -2217 -8290 -1566 6431 327 -8252 -2406 7610
2427 7610 3488 -5541 -2257 6846 5675 -2632 -1158 6117 5974 -1993 -1844 4553 5436 -841 -3114 1104
2443 1104 3919 -282 -4352 -1527 1708 -730 -5219 -3010 1450 -32 -5930 -4992 1338 2099 -4116
2458 -4116 -5380 1354 3848 -2168 -4442 2779 6207 -850 -4043 3370 7598 1523 -3488 1568 7089
2473G089m340n869L340N368l209o396J829N666q69o438j117N633J722n253l002
2488e846M094L396l299m167L441N278k621n108K377O374n28o326O71O666J132
2503E534o695j298O754K289p102k751O936L578o268n498M810N560m266o608K153
2518b872O419k257o474N00O155M60o461j907O088L682n323m716N294N946l594
2533I40o414L669P691k128p871J790R107L03r482j167Q621L126q792m266P639
2548B766M284o663o117N166O439m940p623K934P780j962q123l04P926J196p062
2563d303k796P457M245o385n075O248O757m701o683L624Q323k005q302J417Q732
2578F553k24q551q96Q623J585q983k744P613L425p361n184O084M412n194n707
$$ plain form
2473 7089 2749 -3120 220 5588 2379 -4017 -2188 3478 2609 -3829 -4946 687 2409 -2844 -5846
2488 -5846 -1752 1644 -1655 -5822 -2381 2897 276 -4832 -2455 3919 3391 -2935 -2264 4402 5534
2503 5534 -1161 -2459 4295 6584 -518 -3269 3667 7245 977 -4521 289 5849 1583 -5025 -2872
2518 -2872 3547 1290 -5184 -4684 1471 1931 -4530 -6437 -349 3333 -1990 -6706 -1412 4534 940
2533 940 -5474 -1805 5886 3758 -4113 -2323 6784 7087 -2395 -3562 5059 8185 -607 -4873 2766
2548 2766 7050 387 -5730 -564 5875 935 -6688 -3754 4026 2064 -6059 -6363 1563 2759 -4303
2563 -4303 -7099 358 4603 -1782 -6857 -609 6148 1447 -5236 -1612 6711 4706 -3596 -2179 6553
2578 6553 6329 -2222 -3118 5505 7090 -1893 -4637 2976 6401 -960 -6144 -60 4352 -842 -6549
2593f549M192N666l335o262J601O695j22o066j318O508K560m794l614N183M777
2608E122l833m786L816N694k533n950K116O432j511o621Q28N765q38o209n62N940
2624B870K36n911j595N247J329m986k317L877K440l020k902K671L072j711k387
2639c087J152L721R4l158l71L487J691k985j390K991K382k774k555K474K832k422
2655B082l784J903L543j996m689J678L930j802m587M83M836q47n196L18N121J59
2671A152n116p62N708J310m571j486N102K272l698k629L936L465k118l821J191
2686f5M390J76m382j925M516K121m426l658L582M487m754n666L481O430l691p358
2702f742K392P662k236p493J687P409l98p782N80Q225N98p098q94O667K903n701
$$ plain form
2593 -6549 -2357 3309 -26 -6288 -4687 2008 1886 -4180 -5498 1010 3570 -1224 -4838 345 5122
2608 5122 1289 -3497 319 6013 3480 -2470 -354 6078 4567 -2054 -1226 4539 3701 -2508 -3070 2870
2624 2870 3106 -2805 -4400 847 2176 -2810 -5127 -1250 1190 -1830 -4732 -2061 1011 -700 -3087
2639 -3087 -1935 1786 1880 -1278 -1649 1838 3529 544 -846 2145 4527 1753 -802 1672 4504 2082
2655 2082 -1702 201 3744 1748 -2941 -1263 2667 865 -3722 -3239 1597 750 -4446 -4128 993 1152
2671 1152 -3964 -4726 982 2292 -2279 -3765 1337 3609 -89 -2718 1218 4683 2565 -1256 -65
2686 -65 4325 4501 119 -1806 2710 4831 405 -3253 329 4816 62 -5604 -2123 4307 616 -6742
2702 -6742 -4350 3312 1076 -6417 -4730 2679 2281 -5501 -4921 3304 3902 -3196 -4090 2577 5480 -221
2718b21l064N001M230l292m543K144N208r69o215o32O190J843p273l945O557M446
2734E465o792n728N133O839n535p793M880P832l984q055L000Q607p76q324L64
2749d867P802K058o543k116N708M027n103m413M527N602l101o640J996O573j033
2764D477o975n80O211Q56o316k368N576K825n832m157M738M666l753n497K227
2779c902O098o82n598N16N483N24m715p84N508J918m667k329M741L731l995l972
2795b125L675L533l129l860K184L876k985l589J146L656q66m126l28K484R25j763
2811a292k154J615K058j342k556J589L388o40m019P81M750K68l572m47L988Q89
2827C304l601J16M064m13l815k77L980P1l655q83K924J96k739n37J640q2k043
$$ plain form
2718 -221 -3285 1716 5946 2654 -1889 255 5463 4494 -1721 -2353 3837 5680 -1593 -5538 1019 5465
2734 5465 -1327 -7055 -1922 4917 -618 -8411 -3531 4301 317 -7738 -4738 3869 3093 -5231 -4867
2749 -4867 2935 4993 -1550 -3666 2042 6069 966 -3447 1080 6682 3581 -3059 -1063 5510 4477
2764 4477 -2498 -3078 3133 3989 -2327 -4695 881 3706 -2126 -6283 -1545 3121 -632 -6129 -3902
2779 -3902 2196 1514 -4084 -3568 1915 2439 -2276 -3060 2448 4366 -301 -2630 2111 5842 1847 -2125
2795 -2125 1550 5083 1954 -1906 278 4154 1169 -2420 -1274 2382 1516 -2610 -2938 -454 471 -1292
2811 -1292 -3446 -1831 227 -1115 -3671 -2082 1306 666 -3353 -2572 2178 2446 -1126 -1573 2415 3304
2827 3304 -297 -181 3883 3470 -345 -622 3358 3429 -226 -1109 1815 2011 -728 -1265 375 293 -1750
2844a750n84J007J434j400k244O61K687R70l539m50L477J198l391o56M645J532
2860C597m692j650N283K776m573k936L657L579l560l014K890K519k987l337K047
2875d01L364j235m193j017M206J657m403l204L474L736l326m373L711N487l429
2890E4o327L463P657k165p394J305P806M22o385o91O227J136n553j784M939K874
2906E584m192m165J964M755j468n218n23M955J242n763k400N612K788n890m330
2921g049N945N297n055n858M399O460l069o077L060O202j623n317R59O069k03
2936D140n083j273N183K833m297l606K318M344k130m920R21N204j127n994k14
2951c701N687J143o302k630N363L128m623l403L804L685k702l417K268M678j139
$$ plain form
2844 -1750 -2334 -1327 107 -1293 -3537 -2876 -189 781 -2758 -3208 269 1467 -1924 -2580 2065 3597
2860 3597 -1095 -2745 2538 5314 741 -2195 1462 5041 1481 -1533 1357 3876 889 -2448 -401
2875 -401 2963 1728 -2465 -3482 724 2381 -2022 -5226 -1752 1984 -1342 -5715 -2004 3483 54
2890 54 -6273 -2810 4847 2682 -4712 -3407 4399 4821 -1564 -2255 3972 5108 -445 -2229 2710 5584
2906 5584 1392 -2773 -809 3946 2478 -2740 -3263 1692 2934 -2829 -5229 383 3171 -2719 -7049
2921 -7049 -1104 4193 -862 -6720 -2321 4139 1070 -5007 -1947 4255 2632 -2685 -1726 4343 4140
2936 4140 -943 -2216 2967 5800 1503 -2103 215 4559 2429 -2491 -1570 3634 2507 -3487 -3701
2951 -3701 1986 3129 -3173 -5803 -440 2688 -1935 -5338 -1534 2151 -551 -3968 -1700 2978 1839
2966A839m383N66N234O48m251j649M289K671l950k353L033L004l967l008L360
2981A083L017l246l978K193K960j825k880R01K358j323j709L80J155k4q72l94
2997b204Q11J872n15j599N99K612k19j802K75K969m37l013J208L619j280l918
3013a022R24L809j217l980P33L719k108l672J489L347j977l906J593K947r23l350
3029c594O52K677N4k095L26J662N71n59r49P80K315L15k598p62L526J398k846
3046H73k147L177K548l667l001L553L406m402l897L345L913l090m788K261M294
3061B378j991m953J274M306l56m413l56M569J743m013j724L320L661k383l523
3076b461J874M031l93m204J54M466Q61m314j886M184K319l806l936L252M488l321
$$ plain form
2966 1839 -2544 -1978 3256 3904 -347 -1996 2293 4964 1014 -1339 1694 4698 731 -2277 1083
2981 1083 4100 854 -3124 -931 2029 204 -2676 -1775 583 -740 -2449 -2069 -914 -938 -1810 -2204
2997 -2204 -1393 479 -36 -1635 -1036 1576 1357 -445 -170 2799 2362 -651 557 4176 2896 -1022
3013 -1022 -98 3711 2494 -1486 -753 2966 858 -2814 -1325 2022 45 -3861 -2268 679 -244 -3594
3029 -3594 -2942 -265 -211 -2306 -1980 -318 253 -306 -1255 -475 1840 2155 -443 -1205 2321 3719 873
3046 873 -1274 1903 4451 784 -2217 1336 4742 340 -3557 -212 3701 611 -4177 -1916 2378
3061 2378 387 -4566 -3292 1014 658 -3755 -4111 458 2201 -1812 -3536 -216 3445 1062 -2461
3076 -2461 -587 3444 3051 -1153 -999 3467 4328 14 -1872 2312 4631 825 -3111 141 4629 1308
3092A308n536J968N571j350o547K53O412K08o492j209O577K090o357k316N498
3107G8L535m048l865L747M962k477m265J533M596j00m288r11M070J651l578k617
3123a977K739L280k553m287J161M794j643n297M57N353l31n642m05M932J086m944
3139c277r31M662J288l746j402L727J891k881j167K579K340k105j458J535J865
3154B920p65j765pJ654J1j137j239J028J130j454k333P86J856r06k169J62K278
3171E0n87k544Q58K071n68j920Q59K186K5j795O08J670J7j117P64J373n36j376
3189C8J122J135o24j514L56J328n31j577J64J004l6j436r41J130Q57j716j123
3206b364Q59J735j215j392n0K461M04k396n15K685J745k841j256K892K385k229
$$ plain form
3092 1308 -4228 -2260 3311 1961 -4586 -4333 2079 2287 -4205 -5414 1163 3253 -3104 -5420 78
3107 78 3613 -435 -4300 -553 4409 1932 -2333 -800 3796 3696 -592 -1503 2567 4218 640 -1977
3123 -1977 762 4042 1489 -2798 -1637 3157 1514 -3783 -3326 2027 1696 -3946 -4351 581 1667 -3277
3139 -3277 -4208 454 1742 -2004 -3406 321 2212 -669 -1836 743 3083 978 -480 1055 2920
3154 2920 2155 390 383 2037 2048 911 -328 700 1830 376 -1957 -1171 685 -221 -2390 -2228 50
3171 50 -537 -3081 -2223 -152 -720 -2640 -1781 405 430 -1365 -757 913 930 -187 577 1950 1414 38
3189 38 1160 2295 1671 157 513 1841 1310 -267 -103 901 865 -571 -1512 -382 475 -1241 -2364
3206 -2364 -1505 230 -985 -2377 -2427 34 438 -1958 -2473 212 1957 -884 -2140 752 3137 908
3222I08k550K235L432j759l565J362L992p15m486j04L778M91m177j595L499K300
3238C046l842k900K634K951k126l862J112M036m11l905l38M250J516l935j919
3253c693M140L081k970l452L154M310k325m648J907M974j058n052J52N258K96
3268D074n243j665M754J750m595l235L560L224k958m272K574M126j790m441M48
3283c689M750Q24m716j112M623K336l872k136L366L735k937l306K469L869j581
3298B623m182J263L737j7m255n72L509P78l324k057K719J548k153k688J452K742
3314A123j123l310N46L265j04k781n33K847J220k234p82K405J437k002j300K398
3330A072J354r35j549J019J252k67j159J91N55K13j518l33M81K07p18p60J33M72
$$ plain form
3222 908 -1642 593 4025 2266 -1299 63 4055 3340 -1146 -1250 2528 3019 -1158 -2753 746 3046
3238 3046 -796 -3696 -1062 1889 -237 -4099 -2987 1049 638 -3267 -3605 645 2161 -1774 -3693
3253 -3693 447 3528 558 -2894 260 4570 2245 -2403 -496 4478 3420 -1632 -1480 3778 4074
3268 4074 -1169 -2834 1920 3670 -925 -4160 -600 2624 -334 -4606 -2032 2094 304 -4137 -3689
3283 -3689 1061 1885 -2831 -3943 680 3016 -856 -2992 374 4109 1172 -2134 335 4204 2623
3298 2623 -1559 -296 3441 3424 -831 -1403 2106 2884 -440 -2497 222 1770 -383 -3071 -1619 1123
3314 1123 0 -3310 -2764 501 397 -2384 -2917 -70 1150 -1084 -1866 539 1976 -26 -1326 1072
3330 1072 2426 1491 -58 961 2213 1946 787 978 1533 1746 228 -105 376 583 -135 -895 -762 -290
3348b90l13j006q2P26J78p24J94N53J38p70Q27Q06m55o94J274Q01o10o50P42J458
3368B103r74p10P17J266q07j708P65J363n70j573n55J310M9j384j008J283O89
3385B56j500j299J176J735j186j718Q44K107l00k138L04K518J76k225k96K790
3401A244J191k360j272K830K092k564k354J778L003j782l024N99L664r97m058
3416b010j95L738P67m470j675L879J620l315k345L099K535k275k872J943L314
3431A738q88l116K10L743J067l309j407L144K424k035l304K559L431j974l961
3446a678R77M601j045n098jM876K60n202j056M044J520m278j847L090K298k767
3462a306k272J975K775j148k233K06K637R03j766j445K342K011j450k513J948
$$ plain form
3348 -290 -603 -1609 -1691 -965 -787 -1511 -1317 -764 -626 -1396 -569 237 -218 -912 362 1163 553 -97 645 2103
3368 2103 1129 419 1136 2402 1595 -113 652 2015 1445 -128 -683 627 676 -708 -1716 -433 256
3385 256 -1244 -2543 -1367 368 -818 -2536 -1692 415 115 -2023 -1719 799 975 -1250 -1546 1244
3401 1244 2435 75 -1197 1633 3725 1161 -1193 585 3588 1806 -1218 -619 3045 2048 -2010
3416 -2010 -2205 1533 2300 -2170 -3845 34 1654 -1661 -4006 -907 1628 -647 -3519 -1576 1738
3431 1738 850 -2266 -2056 1687 2754 -555 -1962 1182 3606 1571 -1733 826 4257 2283 -1678
3446 -1678 -701 3900 2855 -2243 -2244 2632 2892 -2310 -3366 678 2198 -2080 -3927 -837 1461 -1306
3462 -1306 -3578 -1603 1172 24 -2209 -2003 634 1537 -229 -1674 668 2679 1229 -1284 664
3477F64K756j497l152J206L512j340l287L61L131m23l057m16K232J17k340o34
3493b167J661J003j740j583J141J159Rj314J94J094J014j136m31J547Q59j256
3509E4j176K058J695j391j569J363R80n07q68J77M90q06q50Q71J25n42j091m3
3527a030O19J80q34k63J46L11l29j03O20L01m70n77J414N93n69q61J435L87l32
3546F38m48J499M13j505q40K305L43j673j036R45J100j071j123N02N29q33p01
3563i56J75J025k5k131o89J769J550j533k271J581K733j095k660J614L128r51
3579A264l455J544L681j33l981K91L104N66k390q56J849Q46j757j553J802J062
3595A884p75k706j31K822N36l052k152K880K144k616k016K465K182k537k480L037
$$ plain form
3477 664 3420 1923 -1229 -23 3489 2149 -1138 -777 2354 1931 -1126 -1542 690 807 -1533 -2167
3493 -2167 -506 497 -1243 -2826 -1685 -526 -517 -1831 -1637 -543 471 -665 -1096 451 1310 54
3509 54 -1122 936 2631 1240 -329 1034 2014 1507 639 816 1306 500 -350 521 646 104 -987 -1030
3527 -1030 -411 -231 -1065 -1328 -1182 -871 -1200 -1303 -683 -382 -852 -1429 -15 578 9 -852 583 970 638
3546 638 190 1689 2102 597 -243 2062 2405 732 -304 641 1741 670 -453 49 578 -255 -956
3563 -956 -781 244 219 -1912 -2601 -832 718 -815 -3086 -1505 1228 133 -2527 -913 2215 1264
3579 1264 -2191 -647 3034 2901 -1080 -789 2315 2881 491 -365 1484 2330 573 -980 822 1884
3595 1884 1109 -1597 -1728 1094 1630 -1422 -3574 -694 1450 -1166 -3182 -717 1465 -1072 -3552 -515
3611e15K970k292k640J328L516p05k578N11K266r0j476l55K036M80j667j736J268
3628C21K559r74l117o65L022R65l401j234L043M40l417o60L268J348k912k180
3644c594K730K419j498k070R29J573r6r35L11J751o4j410k46J756J315j594j939
3661f62Q53K568r10k377p4J926k55k696N75K334j066k206l09K013O36j979m81
3678b110R10P51j56o59O11O24p1o06K57J734m42q36l49J295M21k27j38j05N38
3697A442q55l50J311k01j554l01J128q0p86o69M66q5r11L03R23m71j047k50R37
3716a050J136m84o36J05J165L39j119M54J198q1j269K13K318J28k467m22K240
3733A768O27k074q27J927q6k088l29J845K67j314j463Q92J281q29j362K36O03
$$ plain form
3611 -515 2455 163 -2477 -1149 2367 1662 -916 -405 1861 1771 295 -60 1976 2456 789 -947 321
3628 321 2880 1906 -1211 -1876 1146 2111 -1290 -2524 519 959 -2458 -3118 150 1498 -1414 -3594
3644 -3594 -864 1555 57 -2013 -1084 489 393 -542 -231 1520 1456 46 -200 1556 2871 1277 -662
3661 -662 191 2759 1849 -528 -602 1324 1069 -1627 -1052 1282 216 -1990 -2299 -286 350 -1629 -2110
3678 -2110 -1200 -449 -605 -1264 -653 -29 -100 -706 -449 1285 843 7 -342 953 1374 1147 1009 904 1442
3697 1442 587 237 1548 1347 -207 -508 620 540 -246 -915 -449 -534 -1445 -1142 -219 -690 -1737 -1987 -1050
3716 -1050 86 -398 -1034 -929 236 575 -544 -90 1108 1027 -242 -29 2289 2417 -50 -472 1768
3733 1768 2395 321 -506 1421 1335 -753 -1082 763 1030 -284 -1747 -855 426 -403 -1765 -1529 -926
3750i26N62o82n12J172P67q47j117J022K633j422k160O57L672n74k629J3K713
3767B342N8k922R9K785j90k935o30K334J344k558j752J240J499j011j590K46J545
3784i6J82k163Q9J869J114k054j577J988K131r85k357J075K620l04k417P9L450
3801B644r9k960l05K741P89k675j476J936J639j941j650R78J808j305k433Q10
3817a499J991k48k124l53J851J021k078m17R45J403j095q32J103J885q06j443
3833f96L11K054J77k128j15J778Q94j843p43J467J020k320q88J313J387j641j790
3850a763J021J158o93j185K16J110m16q86j0J391j43j120K64P29M78j12k70M05
3868A74K03L27k97L69J75J88n31k2O27J41p32o74Q01K09n74k41K20m39n59p1N09
$$ plain form
3750 -926 -364 -1046 -1558 -386 381 -466 -1583 -561 2072 650 -1510 -853 2819 2245 -384 -371 2342
3767 2342 2400 -522 -423 2362 2172 -763 -1393 941 2285 -273 -2025 -785 714 -297 -1887 -1641 -96
3784 -96 86 -2077 -1988 -119 995 -1059 -2636 -648 1483 498 -1859 -784 1836 1532 -885 -806 2644
3801 2644 2545 -415 -720 2021 2810 135 -1341 595 2234 293 -1357 -379 1429 124 -2309 -1499
3817 -1499 492 244 -1880 -2233 -382 639 -1439 -1856 -911 492 -603 -1435 -332 1553 747 -696
3833 -696 -385 1669 1846 -282 -397 1381 2275 432 -311 1156 2176 -144 -1032 281 1668 27 -1763
3850 -1763 -742 416 -277 -1462 -1246 -136 -552 -1438 -1448 -57 -200 -1320 -1056 -327 151 39 -231 174
3868 174 377 704 407 776 951 1139 608 586 1213 1354 622 -52 749 958 384 143 363 -76 -635 -706 -197
3889a97j76r97k44J177k7j204L54J012J0p36j22J471K79j027j89J297N93q27l31
3908A16Q81M19n34n31M35Q01m30j289J6J149K14j274p29N99P90q33j503J047J024
3927C68q72j533O96J501k26j647k35K306N19j795r06K150J168j454q47J601J489
3944B283j502j579J385J863o96k065L30J769j2k136o22J428M01j142j220R75J433
3961H93j366k038R50K355p88k102L38K345l69j504l15K027P62j779q91K308J165
3978A991j300j733J756J480o59j767M90J766k92j947l52J773K00j928o53J212
3994C7J090j573j623J232J401r16j795O05J672o7j712q8J652O29j378l97J707
4011D76Q37j141o59R01J376n18j216L05J638o01j231j67R57J88j172n40P80P22
$$ plain form
3889 -197 -373 -1370 -1614 -437 -464 -1668 -1314 -302 -292 -1028 -1150 321 600 -427 -616 681 1274 447 116
3908 116 997 1416 882 351 786 1587 1157 -132 -116 1033 1247 -27 -756 -157 633 -200 -1703 -656 368
3927 368 -504 -2037 -1341 160 -66 -1713 -1948 358 877 -918 -1824 326 1494 40 -807 794 2283
3944 2283 781 -798 587 2450 1754 -311 19 1788 1776 -360 -982 446 847 -295 -1515 -540 893
3961 893 -473 -2511 -1561 794 6 -2096 -1758 587 218 -1286 -1601 426 1188 -591 -1482 826 1991
3978 1991 691 -1042 714 2194 1535 -232 258 2024 1732 -215 -567 1206 1406 -522 -1175 37
3994 37 1127 -446 -2069 -837 564 -352 -2147 -1542 130 63 -1649 -1737 -85 544 -834 -1231 476
4011 476 1313 172 -487 414 1790 1272 56 361 1999 1398 167 0 957 1145 -27 -567 213 935
4029I35j366n72Q60J20o63q31O80O14m13q93M23O47K50p35K40Q12j5l15K55L15
4049C48K27l38J50L09P83p00n1k15N85l6n79o8M99k19r69L2L38K3j216M50N42
4070a05%p28n48P77L01j004L31J055k46r42K36J309k79k46j42J186Mm95l73R49
4090A040J87n79l3L09M63l83p55m26J022O1j173l16Q70j05j099p29J158R36j158
4109g10j142P76J463o79j652R55J456k69j130L28J700J00j522k21J664M60j164
4126D13p03J253J022j242j011O11J427p16j677M86J195k49j721q32J901K6r16
4143g33q82P55J232r57j217P50J509m63j528L77J845L79j756l87K298M20j285
4160C57o34J621Q95j370j599J336J548j361j500Q50J410o33j495K44O86k6r85
$$ plain form
4029 935 -431 -1003 -143 -23 -686 -1517 -837 -223 -636 -1529 -1106 -459 -209 -944 -704 108 93 -222 33 348
4049 348 575 237 387 696 1479 779 728 513 1098 1062 483 415 914 695 -274 -242 96 119 -1097 -647 -105
4070 -105 -105 -833 -1381 -604 -303 -1307 -976 79 -167 -1109 -873 436 157 -89 -231 955 959 464 91 1040
4090 1040 1227 648 615 924 1387 1004 249 -177 845 906 -267 -583 287 182 -917 -1646 -488 448 -710
4109 -710 -1852 -1076 387 -292 -1944 -989 467 198 -932 -604 1096 1196 -326 -547 1117 1577 413
4126 413 -290 963 1985 743 -268 343 1770 1054 -623 -137 1058 809 -912 -1744 157 183 -733
4143 -733 -1615 -860 372 -585 -1802 -1052 457 -6 -1534 -1157 688 1067 -689 -1076 1222 1642 357
4160 357 -277 1344 2239 869 -730 606 2154 793 -707 143 1553 920 -575 -331 355 329 -656
4177f56n93R58J58o63p03N95J142j93j278p4J732O67j974j20J970N30j542p19
4195g63J885O89j256j117J452J065r95j315J000P71r10r95N25n6J66q66j06N63
4213b63k5j48n89K09N26r5r65K83R02K55j280N67Q67K42j223L99J089O47j134
4232B64l6P91K36o12P7K77l76p6l07L26k60m61J53k19J88m18K5O5l32j67K13P3
4254e76R8m08p4O7J164m67o69J95J068J07p57N19O32p7j144N94J256J20r61m81
4274B06K95J06N4o82K62K51k2j013q0R29k43j069j74J150K08j310o20J280O56
4293A84j167o53J659M61p22p28J300Q15n80q13N90J294o22p84j6O90J38m21o60
4312c5O07R65j046j419K89J393k89j808r9J944J0j987K9J583L04j884m36J876
$$ plain form
4177 -656 -1249 -291 -133 -796 -1499 -904 238 45 -1233 -1307 425 1092 -882 -1002 968 1498 -44 -763
4195 -763 1122 1811 555 -562 890 1955 960 -355 645 1416 506 -489 36 -20 146 -720 -826 -263
4213 -263 -288 -436 -1025 -816 -290 -385 -1350 -1067 -165 90 -1190 -623 244 486 -737 -338 751 1398 264
4232 264 228 1019 1255 643 720 997 621 545 238 564 304 -157 -4 -223 -35 -453 -428 -363 -695 -862 -649 -576
4254 -576 -478 -886 -960 -893 271 -196 -865 -670 398 505 -252 267 899 822 -322 272 1528 1648 687 206
4274 206 501 607 661 -21 241 492 470 -543 -623 306 63 -1006 -1180 -30 178 -1132 -1752 -472 184
4293 184 -983 -1636 23 484 -238 -966 334 1149 569 -244 346 1640 1018 234 218 908 1046 625 -35
4312 -35 572 1537 491 -928 -639 754 465 -1343 -1442 502 512 -1475 -1446 137 441 -1443 -1879 -3
4330cO58j578m62J854K88n31p16K88J150K91r72k20P37Q17r96j217J255J212j038
4349H17j631O41J815p98j722l2J709n97j343n03J876J11j822j49J414K60m94p02
4367a150M58J002R7j095K30J323K66j269j49J407L82j218p86J675L81q02j126
4384c74P55Q13q35q44O54N1j40j034J44P67k59p19k0O05J7k97k30L59N00J2o71
4405g46K80R38j76k38l3Q29J68r35M69M61P7o02j40P20p91j90M61p5o17j17L98
4426A41J3o67N0l9K13k93k01J99K5k28m3K67K14M14M6l81K32L91k84K4M72P51
4448A316q97m75P46Q47m91j124K34R52p00o63M14N57l48j053K5P83q0j017l68
4467a342N17N38n8q10j45J041K78q13k95J245O14j244m07J150J301j031q19O33
$$ plain form
4330 -3 655 -923 -1385 469 757 226 -490 -202 948 1239 267 47 784 1601 605 -612 643 1855 817
4349 817 -814 -173 1642 844 -878 -910 799 202 -1141 -1644 232 343 -1479 -1628 -214 46 -448 -1150
4367 -1150 -692 310 407 -688 -458 865 1131 -138 -287 1120 1502 284 -502 1173 1554 752 -374
4384 -374 381 1194 359 -485 169 220 80 -954 -810 -43 -302 -1021 -1041 -436 -419 -716 -946 -587 -87 -75 -746
4405 -746 -466 472 296 58 25 854 1022 87 556 1017 1094 492 352 1072 281 91 552 477 -140 -257 141
4426 141 154 -513 -463 -502 -289 -582 -783 -584 -559 -787 -830 -563 -349 65 111 -270 -38 353 69 93 565 1316
4448 1316 419 -56 690 1537 1046 -78 156 1108 408 -255 159 716 368 -685 -660 123 43 -974 -1342
4467 -1342 -825 -287 -345 -1155 -1300 -259 19 -794 -1089 156 770 -474 -881 269 1570 539 -280 353
4485C53R46o18o18M48O50k47r04J04P12J26j145o78Q75N99p64j085K35J504n77
4504h4j127k51J489l0j160j13J885K55j873l07J690Q40j306o31J137R45m75r98
4522a14L62J396n10j537K03J330R0j420m70R27N98q07j478P64J367q26j347K12
4540a260J298Rj229K74Q73M17j549k5R81R58r48m74J122P08r25m08M74R37l5j290
4560i2R3Q95Pn61m86K62L72k62n49M57K12n33n74k12Q10l0o78j13M47J76k84k53
4582h96N08M23k68l51L43L82K83l77K38K16L28o7j99R9j42K25K6m28J25Kk11N1
4604C10l80%L9m37j90L7M19k92l00k83P10r6n6J69J6L56j60q5L97L98q77M58O7
4627B20L25M81m59j12K29K09k38o72K32N13k91o58j43J056n81q87J21P43j62o13
$$ plain form
4485 353 1299 681 63 511 1161 914 10 114 826 952 -193 -871 4 603 -161 -1246 -1011 493 -84
4504 -84 -1211 -1462 27 -3 -1163 -1276 609 864 -1009 -1316 374 1214 -92 -723 414 1359 884 -114
4522 -114 248 1644 1134 -403 -200 1130 1220 -200 -670 257 855 48 -1430 -666 701 -125 -1472 -1260
4540 -1260 38 47 -1182 -908 -35 382 -1167 -1192 -211 747 -201 -675 447 1155 230 -178 296 1233 1198 -92
4560 -92 1 896 903 342 -144 118 490 228 -321 136 348 -185 -759 -971 -161 -191 -869 -982 -535 -359 -643 -896
4582 -896 -388 35 -233 -584 -241 141 424 47 285 501 829 762 563 662 520 745 771 343 468 470 259 310
4604 310 -70 -70 -31 -468 -658 -621 -202 -494 -794 -1077 -367 -463 -519 -350 -334 22 -138 -223 174 572 -305 153 220
4627 220 545 1026 567 455 684 893 655 -17 215 728 437 -221 -364 692 111 -776 -655 88 -74 -687
4647f87j29K93L41n34p99J195L47m25q81J083R81k25j143J20J096K52n97n28Q26
4666E86O31n54j115J007Q99q84j078L67J242k99j502l53J475j9j137n16Q31M91
4684G2q83n60O37J305r69j077O92J366J61j257l91J668r2q17o35J576P69r01j051
4703c87R40R38j81j347R9Q65K68j416k38Q53L91j311q33J005N59m40j205P36P45
4722D1j29j188J80Q96K70p69JR15M18q30l07Q91O74o13k75L09P15j00j208M59
4742C50O11j95j019R0L95M84m72q52L33M25l85m77RL51K7l86J85%J62j09o8K69
4764b72O20j5l80J72K40J72m88M25J80J27k87j11J69L28k67j86j83J99J18o70
4784a09L99m08J51j81J75m66k08L93k60k63M4M44J8l80J40N70k88q8O6K78J26
$$ plain form
4647 -687 -816 -523 -182 -716 -1515 -320 27 -398 -1279 -196 785 560 -583 -463 633 885 288 -240 586
4666 586 1217 663 -452 555 1454 570 -508 -141 1101 802 -700 -1053 422 403 -734 -1250 -419 72
4684 72 -811 -1371 -734 571 -398 -1475 -783 583 744 -513 -904 764 672 -145 -780 796 1565 664 -387
4703 -387 553 1491 1310 -37 62 927 1195 -221 -459 394 785 -526 -1359 -354 205 -235 -1440 -704 41
4722 41 -88 -1276 -1096 -200 70 -699 -698 217 635 -195 -502 389 1063 450 175 484 1199 1099 -109 350
4742 350 961 766 -253 -163 232 716 244 -608 -275 150 -235 -712 -703 -352 -325 -711 -526 -526 -364 -473 -541 -272
4764 -272 348 333 -47 125 365 537 49 474 654 781 494 383 552 880 613 427 244 443 561 -109
4784 -109 290 -118 33 -148 27 -439 -647 -254 -514 -777 -733 -289 -271 -651 -511 59 -229 -317 -251 27 153
4805A53r8K80k9J18j40M0R1K04N25n59q13M40N44q60m87L82P70m31j081K78J053
4826C80n99r49K35J175k31r19q5Q02M85o49l37P37M23l09k10J31P98J46r59pO85
4847G43L38j025m81Q43N99l47j261Q79P22n92j076J51R96l40j311R0R16J99n28
4866d85m78R15L19p43q80J309O51l49r89L62R07mp52l59J304N02r84l6N85N28
4886A323r18q25R07K39p9q87j77J151n08p15k53L55O97j095m46O48Q43q25m82
4905a047K66J198k69r72M37R14r3o25n0Q90Nm49j22R1O27l65m04n5L79K66n73
4926D9M1p2L49m22o69L48L05q2o85K06M13J55j026M4N69K94n18K02P10l78l5N6
4948a46O12k90j55L59l66J29P04j84k47n02P68K48p74q1J22L26q07K36R3o9p1
$$ plain form
4805 153 55 335 306 424 284 324 415 619 1144 585 -228 212 756 -104 -591 -209 561 130 -951 -673 380
4826 380 -219 -1168 -933 242 11 -908 -993 -191 294 -355 -692 45 468 159 -51 80 878 1024 65 58 743
4847 743 1081 56 -425 418 1017 670 -591 288 1010 418 -658 -507 489 149 -1162 -1072 -156 43 -485
4866 -485 -963 -48 271 -472 -1352 -43 608 259 -730 -368 539 535 -217 -576 728 1230 246 210 795 1323
4886 1323 405 -420 487 726 647 -240 -417 734 226 -489 -742 -387 310 -785 -1231 -583 260 -565 -1047
4905 -1047 -781 417 148 -824 -387 527 434 -191 -241 649 654 205 83 174 801 436 32 -23 356 622 49
4926 49 90 18 367 -55 -724 -376 -71 -153 -838 -632 -219 -64 -1090 -1046 -477 -183 -701 -499 211 -167 -202 -146
4948 -146 466 176 21 380 14 143 847 663 416 -86 682 930 156 75 197 523 -284 -48 45 -24 -95
4969i5n04K66J64k89O4P9j32N3O05p05o4M91K84k91r1M84K37p32K14O63M61q64
4991B98l19P14j37L15o48J51N3j39n51j74O57K20n95j187J033N25m63q04R1Q44
5011a16P2o67K79O98j44q45J12Q33N90n46q04P50M55J08q20kQ77K1r34K37O31
5032G85L37j102l45M29J016q31j130K77J220k92j636Q44O53k50p00j76J123j17
5050A05r13j9Q33L56M5p56J72Q57j5p49K0M87P90r02o75J308L92j502k51L42P37
5071F62k02j221M00R93p37p85P32K48j03o33l98N77M95l53k32L18K49L13q17L66
5091a28O21p1m59J21O60K10j020O8N53P57j011l48N49n3k7o37J70N84k53j17o90
5112e21L48L59n78m29L46L73l39q5k02O53m0q8m13O20J14j66K03M48m48K17J48
$$ plain form
4969 -95 -599 -333 -169 -458 -394 -315 -447 -394 211 -494 -558 -67 217 -74 -165 319 556 -176 38 701 1162 298
4991 298 -21 693 556 871 223 374 427 288 -263 -437 220 440 -155 -1342 -309 216 -247 -1051 -960 -116
5011 -116 -44 -711 -432 266 122 -723 -611 222 812 266 -538 212 667 775 -45 -47 830 851 -83 154 785
5032 785 1122 20 -325 104 1120 289 -841 -564 656 364 -1272 -428 225 -25 -725 -901 222 105
5050 105 -808 -827 6 362 407 -349 -177 680 665 -84 -64 423 1213 311 -364 944 1336 -166 -417 -75 662
5071 662 460 -761 -361 632 -105 -890 -158 90 -13 -646 -1044 -467 28 -325 -557 -239 10 323 -494 -128
5091 -128 493 422 -37 84 744 954 -66 2 555 1312 301 -47 502 449 422 -215 -45 539 286 169 -521
5112 -521 -173 186 -392 -821 -475 -102 -441 -526 -728 -75 -115 -203 -616 4 118 -48 155 603 155 372 520
5133E20k95K50LK71k83m34M36K8l00m42N77k05m11j40M63J82n45r6K0K09j62j98
5155e52L30j28m7L89j80k09O63j34o56K80O68J76m23k27P02J3p59K46M14J66n54
5176A78m56Q54J6l15o31J54J54L0l99j02p9O54m73m70K45O77j53p20L46P31Oq33
5198e86J75Q29K44o98j56N06O33l52o85M84N22l56q78K75R06J29j027j46K57M31
5218E07m99p64K79J029o91r00K35J086k87r22M19N83R6o68j42Q15L50m59p5L81
5238C73K95k05p91M64P00j1o73m98J052L6q30j50O24N5p31m35R04L21m49r04M90
5259c63M73l46q75P32M37j98n02J31L00L20m81o8L38M82j07j83p9M08J44j62r8
5280C03K18J16n21n0J25L87m63l81Q6Q1R1m77p2K88L31n36l6K65ok54K00Q7LM42
$$ plain form
5133 520 225 475 478 749 466 32 468 496 196 -246 331 126 -285 -425 38 220 -325 -421 -401 -192 -354 -552
5155 -552 -222 -350 -397 -8 -188 -397 266 132 -524 -244 424 600 177 -50 652 665 -94 152 566 732 178
5176 178 -278 576 592 277 -354 -200 -46 -16 -415 -517 -596 58 -415 -885 -640 37 -116 -836 -490 241 247 -586
5198 -586 -411 418 662 -36 -192 314 947 595 -90 394 916 560 -318 -43 863 992 -35 -181 76 507
5218 507 8 -756 -477 552 -139 -1039 -804 282 -5 -927 -508 75 171 -497 -639 176 526 67 -8 373
5238 373 668 463 -328 136 836 825 152 -346 706 742 -88 -238 386 441 -290 -725 179 500 51 -853 -363
5259 -363 110 -236 -1111 -379 58 -140 -642 -511 -211 109 -372 -440 -102 380 273 90 11 419 563 401 303
5280 303 521 637 116 66 191 578 115 -266 -180 -99 -8 -485 -557 -269 62 -474 -510 -245 -251 -505 -305 -218 -215 227
5304B27k59k18K85K88k60o9kM84J04k48R5K55l77J36n12L73K97m56l12N5O59k76
5326B69m29J13k64K85k41qJ77N1j21k13n0K18R0n9j77K11j5L50k24k32Q58k54
5348C35r0l25O93j84j47p55R18J27l15n35L72K95J9o97p5M57L2r49N87j27J94
5369a70l01l42L43Q17k29o25Q6O91K21r63J96P48J09q35K42M38N28q22o17J051
5389E66J85l88o72N18L99k52q38K45O78k73n38j11K49N79r66r7K81N41l97n15
5409h06K64L25L18m67j63Q70k4p13M85Q5L95l29j97L36K08l19m95K36P66k59o51
5430a35J92K61L2n94j10N73l8n24k65K34Q8J05n73K91M9M41o53J34N31J82m32
5451b11j15K47R19o53k80J1P82k1q49M35N71l76j99j55j8O59n86j29pJ95m64k65
$$ plain form
5304 227 -32 -250 35 323 63 -6 -8 476 580 332 427 682 305 441 -71 302 599 143 -169 -114 545 269
5326 269 -160 -47 -311 -26 -267 -275 -98 -47 -168 -381 -431 -213 -123 -182 -359 -148 -163 187 -37 -269 589 335
5348 335 245 -80 613 429 282 -473 445 572 257 -278 94 389 408 -289 -364 93 125 -824 -237 -364 -170
5369 -170 -471 -813 -470 347 118 -507 -421 270 491 -472 -276 472 581 -254 -12 426 954 132 -485 566
5389 566 751 363 -309 209 608 356 -482 -237 441 168 -370 -481 -232 347 -619 -716 -435 106 -291 -806
5409 -806 -542 -217 101 -366 -529 341 317 -396 89 174 569 240 43 379 587 268 -227 9 775 516 -135
5430 -135 57 318 350 -244 -354 219 181 -343 -608 -374 -286 -181 -754 -463 -414 27 -626 -492 39 221 -211
5451 -211 -326 -79 840 187 -93 -82 700 679 -170 265 836 460 261 106 88 747 161 32 25 220 -244 -509
5473e09K10L28k12Pj72j1n4mj82J10J38K74j78o3P09k20j36N1L08o6r3J28k21
5496A42M13k94o8K76k23j09J90j00k08j69L19l73J20l46K41k44j19L05J40n7l07
5517d71j1K65J36p0Q5K19J45l13m2L16M9m5j48J50K43K45l73n68O60J54n70j93
5539a37q9M83k45j74j4N97m62o73L55N75o83k44J94K92L31k64l76N52o2mk86K79
5561e5M69J20r15R34M5J16n23j64N91N8n68j41L25K17o4p53J95K92k25l64J46
5582b64N6J43n31j45M13K06j14m65M41N08j85m54J67O13n4n74K02N16L7k24l33
5603d1K37N99o44j09M93k9j07o71J39M04j13k25k75K18k0l01l01O05J88o65k42
5624h60M41O44l41k90k6K98K31k98l5M90K53n86L2L58J03K55k96L8L2n5k15J46
$$ plain form
5473 -509 -299 29 -183 -176 -348 -359 -413 -417 -599 -489 -351 -77 -255 -318 391 171 35 86 394 328 235 363 142
5496 142 555 261 193 469 246 137 327 227 19 -150 169 -204 -84 -430 -189 -433 -552 -247 -107 -164 -471
5517 -471 -482 -217 -81 -151 -66 153 298 -15 -57 259 308 263 115 265 508 753 380 -188 472 626 56 -137
5539 -137 -226 257 12 -162 -176 421 -41 -714 -359 216 -467 -711 -517 -225 106 -158 -534 18 -44 -48 -334 -55
5561 -55 414 534 -381 553 598 714 191 27 618 676 108 -33 292 509 445 -308 -113 179 -46 -410 -264
5582 -264 -208 -65 -596 -741 -328 -122 -236 -701 -260 248 63 -391 -224 389 335 -239 -37 479 516 292 -41
5603 -41 196 795 151 42 535 506 399 -272 -133 271 158 -67 -342 -124 -144 -445 -746 -141 47 -618 -860
5624 -860 -419 225 -116 -406 -432 -134 97 -201 -236 254 507 -79 -47 311 414 669 373 411 443 388 173 319
5646C19k68L55n86k10O01j6m04k01M64j53k86k23J52L28p8j48L92j2j97j17L78
5667I0K54l29K10R9l57K24L44m31j7R4K91j44n81M98j20K12l16J21M1n18J55k75
5689d55o0L18R0O8n55K9M17j58k51K08J74m1K37k5J27O8k42k21P24Ll29k06K67
5712A87L04R9k79o4R2J06k66k05R3K47l32l09L56J89n76J49l0K48j66q4k70K88
5734b23J30m74K89J10L38m04O8L38L54j43k30j42N71J87q08K45J61K66o64J56
5754A25J80K00p68P7l8K96j92l18J07K8m9k10L88N3J08p65L41M60L79p25k61M13
5776a71L94J1k53r1N24K4p55M57M56p8n83O8O42j55p25j32O46J4k65j33l36M88
5798D7k55k60J72M3K87j33m98M27R3K97q32P0R06m83L27j52M62l15m5O7J77J24
$$ plain form
5646 319 51 406 -180 -390 211 195 -209 -410 54 -99 -385 -608 -456 -128 -206 -354 38 26 -171 -288 90
5667 90 344 15 225 324 -33 191 535 104 87 181 472 328 -253 245 125 337 21 142 183 -335 -180 -455
5689 -455 -515 -197 -107 -39 -594 -565 -148 -306 -557 -349 -175 -216 21 -4 123 191 -51 -272 452 455 126 -80 187
5712 187 491 590 311 247 339 445 179 -26 67 314 -18 -327 29 218 -358 -209 -239 9 -157 -241 -511 -223
5734 -223 -93 -567 -278 -168 170 -234 -166 172 526 383 153 11 582 769 -39 206 367 633 -31 125
5754 125 305 505 -263 -186 -224 72 -120 -438 -331 -303 -352 -562 -174 -121 -13 -778 -437 23 402 -323 -584 -171
5776 -171 223 234 -19 -110 414 438 -317 140 596 518 -65 3 645 490 -235 -367 279 293 28 -105 -441 47
5798 47 -208 -468 -296 -253 34 -99 -597 -170 -77 220 -612 -542 364 -119 208 56 518 203 158 225 402 526
5820E26m98L13k45R9L71l65j83O1r0P0l2j02P1l26M3J54M03m96j85J81K53n17
5842d94n6M09j5j57J42K45j75M09j45k04J93o7J93r0J22l02K81J0j9k15M50k95
5864B20m07M85m16L46m25Q7l92M02l66J78m2J8O8J85j25l9J00L66m39J83J23J18
5886B28l25K87K06K47l35o4l7M00j40l65K85K9M1m35J3j54K40l36qN0P2j34l54
5909e89J73L86l98j46J01P67l7o15M32K44j34n81J42L69K75Ln36Q19k91p4k78
5930C2K23L03j22m74k6M50j28l68l79M96L32m78l01J10L78j75j08J74K30k64j66
5951b61kL93p0j41%l8M83k59m2J91J09J76m82L18J02j51j75J8K20j23j65m10O07
5974B98m61j18l01K30J83J7o84L32L37k75J31k40K46M72k78O1j5j10J07m2J24
$$ plain form
5820 526 28 341 96 195 566 201 18 79 -11 59 27 -75 -4 -330 -287 -133 270 -226 -411 -230 23 -494
5842 -494 -550 -141 -156 -313 -171 74 -101 308 163 -41 152 85 278 188 310 8 289 299 280 65 515 220
5864 220 -187 298 -118 228 -197 -110 -502 -100 -466 -288 -330 -312 -244 -59 -184 -223 -123 243 -196 -13 110 228
5886 228 -97 190 396 643 308 244 207 607 467 102 387 416 457 22 35 -119 121 -215 -223 -173 -101 -235 -589
5909 -589 -416 -30 -428 -574 -473 294 257 -358 74 318 184 -397 -255 114 389 392 -144 675 384 310 32
5930 32 255 558 436 -38 -64 386 258 -110 -489 7 339 -139 -440 -330 48 -127 -235 -61 169 -95 -261
5951 -261 -263 130 60 -81 -81 -119 364 105 63 254 363 539 57 375 477 326 151 169 389 266 101 -309 298
5974 298 -163 -281 -582 -352 -169 -152 -836 -504 -167 -442 -311 -551 -305 167 -111 -50 -65 -175 -68 -110 14
5995A4M81q7m42K69k36J47j70J21J89l8j62J38k94L35J1m79Lj0K59J27o22K05
6017b41M43k22k43J92p2m3k4k55N15m2n0J60J4k2j16J25O8J73k40K48N4r6k52
6040G4p7L11k87K09l15L01j23j74K1Oj61p4O8N2k01K27K40l48qj09P3N05k28J9
6064Aj63L37r6j3L7J80p9o1l34L94p9l64M9N99j12o3l66Q9L41n7n72m3M48k0n58
6089e05K21Kl1R0k85M08O38p42k63M36J18l05j49K96M86p3j68m82Q21ok55q5j4
6112A53J05o7j27l74M57j82k02J66q7L09m30k37M81k8j1l95L68m0J34j97oL56
6134A46Q1m42J57N9K40l02K13O9K13l60J36j89L85k54q4K49K33l31l17k49L30
6155a7L76m74k82L04k3j70j32N6M12m21j58K57K73K63k27l69M42kN1r9Rj02K20
$$ plain form
5995 14 495 408 -34 235 -1 146 -24 97 286 248 86 224 -70 265 276 -203 -200 -210 49 176 -446 -241
6017 -241 202 -20 -263 -71 -143 -186 -210 -465 50 8 -42 118 132 110 -6 119 187 360 120 368 422 326 74
6040 74 -3 308 21 230 -85 216 93 -81 -60 -54 -215 -289 -221 -169 -370 -143 97 -251 -259 -368 -295 210 -18 1
6064 1 -162 175 79 66 103 283 204 143 -191 203 124 -240 -191 408 296 233 -133 -44 297 240 -332 -375 73 53 -505
6089 -505 -284 -282 -313 -223 -508 -100 538 -204 -467 -31 87 -218 -367 -71 415 342 174 -308 513 507 252 167 153
6112 153 258 191 64 -310 147 -35 -237 -71 -158 151 -279 -516 -35 -63 -74 -469 -101 -141 -7 -204 -210 146
6134 146 227 -215 -58 1 241 -61 152 221 434 74 210 21 406 152 68 317 550 219 -98 -347 -17
6155 -17 359 -115 -397 -93 -116 -286 -418 -362 50 -371 -529 -272 1 264 37 -332 110 108 159 60 69 -33 187
6178A87n3K10o8j5k56k2J69L02j91l2l9ol68J70K16j43l9j91r3kJ15j47k29K91
6202b34K51k87J33p7l0K85j26J55J38l06j30J45j36L35K99k36k19J4L08j41J8
6223A59k06Q8l0M2j09Q7j9j76Q4L8L1j42J55m50K50J70l71L44j59K22J05k32K70
6246A51j30n0K63N3j16K81m53L07K80l21j68K09k68L67j87l02K4N1J0k88J20K5
6268a42r9l48N71n7o9n05M27K71j06PP6p3K10l11jK52J95j13j31l74M27P8K01
6291C86l55qM36l13l52J68L96l05k63K44k65J86l13Q3L41k87K70l38J44K04j20
6312f1j82J84K53L7m22M3L82l4j40R5J68L37n03o8J09K2j41J88K8J62k75m30J81
6335f7L3j52k71k21M97K44p20O31k79N26m70l3M06p6r2L2j62K21J5p7L59j43R3
$$ plain form
6178 187 134 344 276 261 5 -17 152 454 263 231 192 186 -182 -12 204 61 22 -169 -262 -264 -149 -296 -525 -234
6202 -234 17 -270 -137 -214 -244 41 -85 70 208 -98 -228 -83 -219 116 415 179 -40 -26 282 141 159
6223 159 -47 41 11 53 -56 31 12 -164 -80 -42 -11 -153 2 -448 -198 -28 -399 -55 -214 8 113 -119 151
6246 151 21 -29 234 287 171 452 -1 306 586 265 97 306 38 405 218 -84 -60 -9 1 -287 -167 -142
6268 -142 -241 -589 -18 -75 -144 -649 -222 49 -57 -50 26 -47 163 -148 -149 103 298 185 54 -320 107 185 386
6291 386 31 23 459 146 -206 -38 358 53 -210 34 -231 -45 -358 -275 66 -221 49 -289 -145 59 -61
6312 -61 -243 -59 194 231 -191 -148 234 200 60 155 323 660 157 89 198 220 79 267 295 457 182 -248 -67
6335 -67 -34 -186 -457 -678 -181 63 -657 -26 -305 221 -249 -282 124 48 -44 -12 -174 47 62 -15 344 201 294
6358B94o0k19K54J93k52j5%n5J11m19M85l18j70j08NN3J95k68L10k78J89J78r9
6381Fm32M27J30k28Q0o3K43k36j08L55j69L96k92l1l4M02k53J46j09N1j48j55
6403b2J94j79Q6j97k7J50J97k2m6k98NL36k07k98Q5M05j93k68K52p8K26m2L3J45
6427B37p7m9k25L49J34N0l9m76K87J83n09K10r1R5k74J11O06o60m6j54K47L08
6449B17o82K27k6M4L00k42K33k94K76k69j78O00k98J96l12J60L54j89l42K17M59
6470D51J02o16P4K33J19l43j09N28l08n93M6K86N03k91j98J5N7k0qn10P15j71
6492c8p5Lr9M91p8m53L98K74j30k07k04M87O2l38N4K90j53l3j02j94K55L55o09
6515d4j51N31l62k41l43Q90o3k34m24O16j26m47o9M66j24J27M9K90l06j02j96
$$ plain form
6358 294 234 15 269 462 210 195 195 140 251 -168 317 -1 -171 -279 -274 -221 -26 -294 16 -262 -73 105 6
6381 6 -426 1 131 -97 -17 -80 163 -73 -181 174 5 401 109 78 44 446 193 339 230 281 133 -22
6403 -22 172 -7 79 -118 -145 5 202 180 134 -164 -159 177 -30 -328 -243 162 -31 -299 -47 -125 101 59 92 237
6427 237 160 111 -114 235 369 419 380 -96 191 374 -135 75 -16 79 -195 -84 522 -138 -184 -338 -91 217
6449 217 -465 -238 -264 -220 80 -162 71 -223 53 -216 -394 206 -92 104 -208 -48 306 117 -225 -8 451
6470 451 553 -63 11 244 363 20 -89 439 131 -462 -416 -130 373 82 -116 -101 -44 -64 -72 -582 133 -38
6492 -38 -113 -110 -209 282 204 -249 149 423 293 86 -118 369 431 93 147 437 284 251 149 -45 210 565 -44
6515 -44 -195 336 -26 -267 -610 280 217 -17 -441 175 49 -398 -467 -1 -125 2 51 341 35 -67 -263
6536b63N08K50n57L10m08M4J81J02j60j05K74J99n26K42Pk33l43K03K89j9j67
6557a72j24J10L24l54j97J26n1N81j14l09M02K9j99k0J30k95K97O5k14M14m88
6578e9k4R2N6K83l81K95p1k73R9L3l16K15j5KL6j45J61J37m78K34L9j25L47l70
6602b28K65K91k02l79K50J90l3l1j03L30j02m23N01j08R0j13l27L09J21l11j44
6623a57k5l6K12l99J58K80K07l23l82J92M54l10m10L58N06r7k33k37J79M38m23
6644d8L0R2R5L04q42L16L48Mm02J37K37k72k25K61L29k32k59k78N00P5k52J26
6666D4m21K83K4j59K42K86k29k52j6J2L45j62k14K0O98o56n2p2O10l92J50l30
6688b41M48Oj1k89O9K19j20j05K03k4m1l12j02N13j80k75J33R3m4L2Km40O62n71
$$ plain form
6536 -263 245 495 -62 248 -160 -116 65 167 7 -98 176 375 -151 91 98 -135 -478 -275 14 -5 -172
6557 -172 -296 -186 138 -216 -413 -287 -338 243 129 -180 222 251 52 32 162 -133 164 229 15 429 -59
6578 -59 -83 9 65 348 -33 262 191 -82 17 50 -266 -51 -66 -64 -28 -173 -12 125 -353 -119 -80 -205 142 -228
6602 -228 37 328 126 -253 -3 187 154 123 20 350 248 -175 326 218 308 195 -132 177 298 -13 -157
6623 -157 -182 -218 -6 -405 -247 33 240 -83 -465 -273 181 -129 -539 -181 325 228 -5 -242 -63 375 -48
6644 -48 -18 74 169 473 -369 -53 295 299 -103 34 271 -1 -226 35 364 132 -127 -405 95 170 -82 44
6666 44 -377 -94 -70 -229 13 299 70 -182 -198 -186 159 -3 -217 -197 501 -155 -207 -279 331 -61 89 -241
6688 -241 207 213 202 -87 -18 201 81 -24 179 155 114 -198 -300 213 33 -242 -109 -16 -60 -28 -26 -466 196 -375
6712c75K63M38j76q7M6L6j58J30n48N91L82j23j53k30Q4R0o3k00q1L06m02j72
6734d02O4K5J46j99K77K14l77J25l84P9J74o4P9L91o4N6J14n3m70M50P7M3J5j01
6758B15J65l27K09R6l92L1o6l8j85J71J17J67q0k88M0j28J55j57K26m58J07K46
6780a74J52m93K75j15N75n29K05K09J43q4l32Q3J84J86j40j44K20jr1O8m5J78
6802C30p55L47j69L83k11k62M14R2k64M5k12L65k13J5rj48J20j58pL42p0J71Q
6825A54l98M82l12l0q4O9M76l57K19J3K45p6n65J8K42M8k42n2M32m00N8l23K95
6848h8m2l78K54j96L76J74l69N45j78J84m41K35j54L27J82j81M7l9l64P4n0K44
6870A62K59o05J86J93N6q7l94J72L45o28J34J23m4O2j29m5L03q0K8j25J21M5P5
$$ plain form
6712 -375 -112 326 150 63 109 145 -13 117 -431 160 542 419 266 36 120 210 147 -53 -134 172 -230 -402
6734 -402 -338 -313 -167 -366 -89 125 -252 -127 -511 -432 -258 -322 -243 148 84 140 254 201 -269 181 258 301 316 215
6758 215 380 53 262 358 -34 -3 -69 -107 -292 -121 -4 163 83 -205 -165 -293 -138 -295 -69 -527 -420 -174
6780 -174 -22 -515 -240 -355 220 -309 -104 105 248 164 -168 -85 99 285 145 1 221 220 129 197 152 330
6802 330 -425 -78 -247 136 -75 -337 77 169 -95 -50 -262 103 -110 -95 -104 -252 -132 -290 -297 45 -25 146 154
6825 154 -244 238 -74 -104 -188 -119 357 0 219 232 477 401 -164 -146 96 144 -98 -150 282 -118 -60 -383 -88
6848 -88 -130 -508 -254 -450 -74 100 -269 276 98 282 -159 76 -78 249 431 250 297 258 -106 -32 -82 162
6870 162 421 -184 2 195 251 164 -230 -58 287 -341 -207 -84 -128 -66 -195 -240 63 -17 11 -114 7 52 127
6893A27Q9q7k6j00r6J15j25J26K41l72L62j92P9j87Q6j09lO9Q8J96m35J34J48
6916A28l60J23J17l91K83q6L17j47l06J42L23j80J77l69L33Q5k87L73k3K48j67
6937C33m39K01j50K43k23lj01R5n4n2r7J87J53l39L1L64l74OO1j41K72j71j81
6960c79M92J54o67L87j2p3K62k36K06K94k82j68L67k20q7l47L81J4Q1l02K09q0
6982fJ39n1k8L7o5k4Mrl5J66m53J65J34j54J80n6R0Q8j91K5o1K75n8k94J03K69
7008A90J8j52l8K87pq9j49n9M10k32k96K04P6j86j13q4N3L68k40k08K94j61j2
7031a26k85O51k86j65k46J44M03k53K89j58J49l9j25J53J14K60l83m80O05Q9r6
7052B15j60j77kL3j87N07l51K4j12j13O7L12Mk44J66k46L09p9J1j48J40j86K97
$$ plain form
6893 127 216 129 103 3 -93 22 -103 23 264 -108 254 62 141 -46 40 -69 -72 -3 85 281 -154 -20 128
6916 128 -232 -109 8 -383 -100 -186 131 -16 -322 -180 143 -37 140 -229 104 189 -98 275 252 500 333
6937 333 -106 95 -55 188 -35 -38 -139 -44 -98 -150 -247 -60 93 -246 -215 149 -225 -219 -158 -299 -27 -198 -379
6960 -379 113 267 -400 -13 -25 -98 164 -72 134 428 146 -22 345 125 38 -309 72 86 167 -135 74 -6
6982 -6 133 82 54 91 26 2 6 -3 -38 128 -325 -160 -26 -180 0 -56 34 122 -69 -44 -105 170 112 -182 -79 190
7008 190 208 56 18 305 298 209 60 1 411 179 -117 87 163 -23 -136 -220 -167 201 -39 -247 47 -114 -126
7031 -126 -411 240 -46 -211 -457 -313 90 -163 126 -32 117 78 -47 106 220 480 97 -383 222 311 215
7052 215 55 -122 -124 -91 -278 229 -122 -98 -210 -323 -256 56 60 -184 -18 -264 45 -34 -23 -171 -31 -217 80
7075H0k60J08L2J94J12k27J62k78L5J19O2j42j19J94J7n6J87k95k79K13k13K10
7097a44M3j01K6m3M3k5j00M2K25n4K0j53M34k53p4RJ35Q9q7J32j86R7K15l79J96
7122A07k7J4j43L47l60J06j09K01k60r6M1J28k00J92m9K13n30L29j04K66l08J77
7144f5J84j76k4p2L53o8K93k42k35L02n1k29J54Q7j27K6l06K94j27pj92L8J87
7167cm9k58K40L8q3J85n61L49p4J72k07r2L52J86o05M82mJ71j38m39O89J03m55
7190aN4K8Q5K54n09K55j06K0l85K89q3J54j26j48k8J14k58J38n0M04M1j72j45
7213a75r4K43m05M92J51r5l46K6K73J29l92J04J9L25l2m11M38j03P7l03j97j23
7235c99N01m6p1j09R5l26L15j62J87j74p1Q3L73m90J72P3M6J61k46J81k40K58
$$ plain form
7075 80 -180 -72 -40 154 266 39 201 -77 -42 77 139 -3 -122 72 89 33 220 -75 -354 -141 -354 -144
7097 -144 -101 -202 -176 -219 -176 -201 -301 -259 -34 -88 -68 -221 213 -40 -114 -105 30 119 32 164 -22 75 290 -89 107
7122 107 80 94 -49 298 -62 44 -65 136 -124 -220 -179 -51 -251 -59 -108 105 -425 -96 -200 66 -242 -65
7144 -65 119 -57 -81 -153 200 132 425 183 -52 250 199 -30 124 211 84 110 -196 98 -29 -36 -228 -190 -3
7167 -3 -52 -310 -70 -32 -115 70 -491 -142 -216 -44 -251 -343 9 195 -410 72 68 239 101 -338 351 454 -1
7190 -1 53 81 166 420 -89 166 60 80 -305 -16 -99 55 -71 -219 -247 -133 -391 -253 -303 101 142 -30 -175
7213 -175 -269 -26 -431 61 212 117 -229 -203 70 199 -193 -89 -70 255 223 -188 250 147 224 -79 -276 -399
7235 -399 102 56 -15 -124 -29 -355 -40 -202 -15 -189 -260 -177 196 -294 -122 -49 -3 158 -88 93 -147 111
7257A11j23K31l45l9M69l35O5j65L13j08l02NL15l35p4K74J54n34P1L65j21K24
7279A16l07M6k15Q14l47k88J70O3j26N3Q3k45K99J75k40j10M21q5k89R1l3J5J90
7302B51k42PM0o9n6q7M57n73L12r7J48k89K65k19m36Q83j59k65j18K7K08K36m43
7325b19m4L08j3J52j25K52j48j91j05J46K98l85P2k32L33j21J71l07L50k22m65
7346d95K80J74r3k5O4J41J67k37J45k4k93p7K94K3J1k8M0q0P0j11n9Q0K04J1J22
7371C04m93K90J94l70j73L30q1N6J30j84n3J13m36M22m64N19r8k05J75M4j29J5
7393i4L41l36q6N6J92J18j31k14K46JJ93l80J8L29L3J56l07l8j8J65k74K48k40
7416b2J98N8l12O6Q7k34j26N1M50k75J5J57P8k76K69k46J93R1l41Q2j8J37j29
$$ plain form
7257 111 -12 219 -126 -165 304 -31 34 -131 182 74 -228 -223 92 -243 -317 -43 111 -423 -352 13 -108 116
7279 116 -191 -145 -360 454 107 -181 -11 52 -74 -21 62 -183 116 291 51 -59 362 277 -12 79 46 61 251
7302 251 9 16 56 -13 -69 -156 301 -272 40 -57 91 -198 67 -152 -588 295 136 -129 -247 -220 -12 224 -219
7325 -219 -263 45 32 184 59 311 163 -28 -133 13 311 -74 -2 -234 99 -22 149 -158 192 -30 -495
7346 -495 -215 -41 -134 -159 -95 46 213 -24 121 97 -196 -273 21 44 55 27 67 -13 57 -54 -113 -33 171 182 304
7371 304 -189 101 295 -75 -248 82 1 57 187 3 -50 63 -373 49 -415 104 6 -199 -24 20 -109 -94
7393 -94 247 -89 -175 -119 73 191 60 -154 92 93 286 -94 -76 253 286 442 135 97 79 244 -30 218 -22
7416 -22 176 234 -78 -12 75 -159 -285 -234 216 -59 -44 113 191 -85 184 -62 131 222 -119 -37 -55 82 -47
7439d7K77j43J57Mk79K19R6k25N8k15J92J28m24J31j43J52j6r6Rm4k9J26N4k38
7463b96J44J47n4O8K02l67P6J30j03J07J93k58J51q6MN9J20L6oK08m15Q7l93K71
7487B5j01j16L13J65k31K9m7P3j80n5J8k29N24l54J30M8r4J43k12J87J34k61J40
7510D9J89k22k08O1K78K09k32r5l04N72k14J46j24j36L15p0j99j85L07m05K97
7531B9j27R4J13k05M1J18M5k10N4l7L54j97l54r1M50j17j07L22KJ5l28QJ46M39
7555D57l17p2O4k37N9J83j82Q5J7n9J4K05j37k25J38k98J05M0J51k85L52o8J86
7578A76K26j92k83K8J11J89j99M2k95K67Q9Q6k43o1K46l2k74j29K96mj76l59M94
7601CN3j83J16M0j34j44K04k68L30J28j89Q9kN2Rr0j65K68k13P3K84j27M07o02
$$ plain form
7439 -47 230 87 244 248 -31 188 284 59 117 -98 94 222 -202 -71 -214 -62 -78 -174 -165 -209 -238 -112 -58 -296
7463 -296 -152 -5 -59 9 211 -156 -80 50 -53 54 247 -11 140 54 58 117 237 273 267 475 60 147 -246 25
7487 25 -76 -192 121 286 55 84 37 110 -70 -125 -107 -336 188 -166 -36 12 -82 61 -151 36 170 -91 49
7510 49 238 16 -192 -131 147 356 124 29 -275 297 83 229 105 -31 284 214 15 -170 137 -268 29
7531 29 -98 -4 109 -96 -55 63 108 -102 -48 -85 269 72 -282 -373 77 -40 -147 175 177 192 -136 -128 18 457
7555 457 140 68 132 -105 -46 137 -45 40 57 -2 12 217 80 -145 -7 -305 -200 -160 -9 -294 58 -10 176
7578 176 402 210 -73 -45 66 255 56 98 -197 70 159 245 2 -59 187 155 -119 -248 48 44 -132 -491 3
7601 3 56 -127 -11 29 -105 -249 -45 -313 17 145 -44 45 43 95 104 14 -151 117 -96 -23 261 134 541 -61
7625f1K25P2l36J0j41M04o1k1l40L73q0l30J83k07K40k28M11r2k56j4K16m2M3
7648c2l20L72l34L14M00n33K15K0R2n1L49j22j82k28J97J91o4o9l37M02k85j16
7670a21J65l84K57k09M8J9J56O9j02j6rj61N19n0l06J37Q9M7l7O5l85L09Nk39
7694a34J57O9K88k42L0J52k31j6j82J13n2R9j9P7k39K18k47k30J67K84j02k81
7716c21l4K08J24q2p1L41j89M1J03k19J08J9j31L14J17j37M7l21J86k00K46k58
7738a09L03p3j09j36J87M1j47L4q6J84q6j12K75l31L49j25k05K77l54M59p8J63
7760C21k49r1J00k6K26j94p1J72j03L15m72J06j23L74k32j45K59J6j51j70K11
7781G3L7M5l20Q1J07J1J96l64j88rK30k32K09K93K04n32J62J52P6m36j4O99k10
$$ plain form
7625 -61 164 236 -100 -90 -231 173 112 91 -249 124 44 -286 -103 -310 -70 -298 113 21 -235 -249 -33 -75 -32
7648 -32 -352 20 -314 0 400 -133 82 102 194 143 492 370 188 -40 157 348 284 215 -122 280 -5 -121
7670 -121 44 -340 -83 -292 -244 -225 -69 0 -102 -118 -127 -288 231 181 -125 12 101 148 111 176 -209 100 105 -134
7694 -134 23 92 380 138 168 320 89 73 -109 4 -48 51 32 109 -130 88 -159 -389 -222 62 -40 -321
7716 -321 -355 -147 -23 -105 -176 165 -24 17 120 -99 9 28 -103 211 328 191 238 -83 103 -97 149 -109
7738 -109 194 121 12 -124 63 104 -43 -9 -95 89 3 -109 166 -165 184 59 -146 131 -223 236 158 321
7760 321 72 -19 81 55 281 87 16 188 85 400 -72 34 -89 285 53 -92 167 183 32 -138 73
7781 73 110 155 -165 -84 23 34 230 -134 -322 -331 -101 -333 -124 169 373 -159 3 155 231 -205 -219 480 270
7804B70j47l25K8K41l26L58l51J71K27L4l81K93k66j9K85r6mJ43l23L96o25K62
7826a55L42m24N05l41m9J2K34o8Mj4L0j42n6K12j56K65k09K15l9j01j93K79j75
7849b4k69L34p6J9p3n3k2j11J7J36N3J38o0m95O97j14j50M5K11J11j28j86l03
7872c03L71M3k6R4J25k50M2qL31n89J09l09K53K23Q8k45k7N3J72J6l68K90O0K0
7896A65n46L24J46Q0k78j03O4K9l03N47k5J35r4J32o1r8k72K49L26m23J07j43
7918d2M3k57N85l85l48N11j98P5J24KJ73j90j69K8L10r9l76j58L91J40l0j15O7
7941H2J5j30R5L21k47j00J01j26K94r4Pk87K17O2m23L96j86R9m2m0o2j1r7L8l77
7966d95K51J93K04j8k59K3J16J21j23j74j7l0L29R2m95J94J86J77k69J74R3k89
$$ plain form
7804 270 123 -202 -174 67 -259 99 -252 -81 146 180 -201 92 -174 -193 92 -4 -8 135 -188 208 -417 -155
7826 -155 187 -237 268 -73 -122 -110 124 56 60 46 76 -66 -122 90 -66 199 -10 205 166 65 -128 151 -24
7849 -24 -293 41 -35 -16 -89 -142 -164 -275 -258 -122 -69 69 9 -486 211 97 -53 -8 203 314 186 0 -303
7872 -303 68 111 85 179 304 54 96 88 419 -170 -61 -370 -117 106 194 -51 -78 -25 147 163 -205 85 145 165
7896 165 -381 -57 89 169 -109 -212 -148 -119 -422 125 100 235 141 273 212 114 -158 91 417 -6 101 -42
7918 -42 1 -256 329 -56 -404 107 -91 -16 108 110 283 93 -76 -48 262 163 -213 -371 20 160 130 15 82
7941 82 97 -33 62 383 136 36 137 11 305 211 218 -69 148 210 -213 183 -3 96 54 14 -48 -59 -156 -118 -495
7966 -495 -244 -51 153 135 -124 -101 15 136 13 -161 -178 -208 121 213 -282 -88 98 275 6 180 273 -16
7988a6j42M74j68j94L07n08N8M58l36kKm6K79j40j35J7j07kM80k18p9j21L32j78
8012A5j60K52Nj45K74k15K02l24J94k24MJ11j42K22k95M08j63J5K8p7P1J21l57
8035a80j7J40J62l65K0K20J7Q3J17P2j96j13M3q4l6J55K76l85J63j14K15l25J11
8058b1j38K21K45j44k6m79L23l8L27l05k9O4M03m12J40k09R7j05j45K34K96k0
8080B79n08J23l0K31j04m76Q44q0k74L5j75K27j40j8k28M24j1j91R9K80l63k45
8102c01K12m83L67M66l53p4L42n3Q2k61L2m8j61o5K63R5m59M39R0k75J81q2J71
8125A25j18K6N9o1r4M8m6j75K87J18K04o77K49K00J3o1j61j05J33p6k09K67K41
8148A87j25J80k12K11l04q6k17N03K6m00J03j19O64l45k80L82j56p1k0J5l6J68
$$ plain form
7988 -16 -158 316 148 -46 261 -247 -189 269 -67 -69 -67 -113 166 26 -109 -92 -199 -201 279 61 -18 -139 193 15
8012 15 -145 107 112 -33 241 26 228 -96 98 -126 -122 -11 -153 69 -226 182 19 34 62 -15 56 177 -180
8035 -180 -197 -57 105 -260 -240 -20 -3 80 197 269 73 -40 3 -81 -117 38 314 -71 92 -22 193 -132 -21
8058 -21 -159 62 307 163 137 -342 -19 -57 270 -35 -64 0 403 -9 131 -78 19 -86 -231 3 299 279
8080 279 -229 -106 -136 95 -9 -485 359 279 5 40 -135 92 -48 -66 -294 130 119 -72 27 307 -56 -301
8102 -301 -89 -572 -205 261 -92 -166 176 123 205 -56 -24 -72 -233 -298 -35 60 -399 40 130 -145 36 -46 125
8125 125 7 33 92 31 -63 -15 -61 -236 51 169 373 -304 -55 145 158 97 -64 -169 -36 -112 -321 -54 187
8148 187 62 242 30 241 -63 -149 -366 137 163 -237 -134 -253 411 66 -214 168 12 -59 -79 -64 -100 68
8170F8k4m23N08k48J36m6J09q8l00J3N37m19J68J35k67L13J34l45n8J02Q4
$$ plain form
8170 68 44 -379 129 -119 17 -29 80 -8 -308 -295 242 -177 -9 126 -141 172 306 -39 -97 5 89
8191H9
$$ Imaginary data points
##PAGE= N=2
##DATA TABLE= (X++(I..I)), XYDATA
0@%%%%%%%Qj6J6j6J6k1K9l2M0m8N6o9P8q9J04j21J42j63J85k12K41k71L06l45
31a82L88m35M86n44O05o70P45q28R15j013J124j246J379j526J695j885K100k350
49a242K641k985L399l911M562n419O602q347J1181j6537L0031j20660k39388L40804
63G31K29239k56841k35938K22957K13204j67841j90976J49351J81499r8836j71288
74a24739N7808J55920M153j24619m0534R3117P7272o4324r3174N2119J20334m6841
86F6492j52439L3553J89393j0791k17076k4721K24604N4095k18400p5858K00044
97F8896P5629j96465q1749J87128Q6007j84680j03933J66447J20611j34112j22554
108a18775J02945J17841p4668j05918O0750J05997m2156j08744J7634J16388K3477
$$ plain form
0 0 0 0 0 0 0 0 0 8 -8 8 -8 8 -13 16 -16 24 -24 32 -37 41 -48 56 -65 77 -86 99 -113 128 -143 163 -182
31 -182 206 -229 257 -287 318 -352 393 -435 480 -533 591 -655 724 -802 893 -992 1108 -1242
49 -1242 1399 -1586 1813 -2098 2464 -2955 3647 -4700 6481 -10056 19975 -100685 -340073 731
63 731 229970 -26871 -262809 -39852 173352 5511 -185465 -36114 145385 46549 -124739
74 -124739 -66931 88989 93142 -31477 -72011 21106 98378 34054 -59120 -7001 113333 66492
86 66492 -85947 -52394 136999 126208 -90868 -115589 109015 163110 -55290 -131148 68896
97 68896 144525 -51940 -133689 53439 139446 -45234 -149167 17280 137891 3779 -118775
108 -118775 -15830 102011 27343 -78575 -17825 88172 46016 -62728 -45094 71294 94771
119I4771j04389o0137Q0544Q5864m9814r6705K1870R2514j4100r9057L165J04298
131E8824L082j20498k3096J24042M2131j22334n9294J12025O2577j08238o3299
142i4078J11382O9398j15859q0730J17500J02392r9950j11843P8923J14013n1933
153C9215r9564L8467Q7505k8750p7021K3575P5081j1340p4863j0509O5380K7194
165E4370n6827m9042M0250N6464l7649p1731L4652R0975l2928j18959K0634J45348
177G5557J582j61731k7106J66453N0304j58962o0531J56595P2610j48175p8238
188a11642J45954R5008j31409j07475J11036J16309q5726j17754O0118J14082
198H8501m0773j14942J8793J16622K184j23854l7181J18240O8433j11331j01268
$$ plain form
119 94771 -9618 -69755 10789 96653 46839 -49866 -27996 64518 50418 -48639 -45474 58824
131 58824 61906 -58592 -81688 42354 84485 -37849 -97143 14882 77459 -30779 -94078
142 -94078 17304 86702 -29157 -109887 7613 110005 10055 -101788 -22865 91148 39215
153 39215 -60349 -21882 65623 36873 -40148 -16573 58508 47168 -27695 -38204 27176 54370
165 54370 -2457 -51499 -11249 45215 7566 -64165 -29513 61462 28534 -90425 -69791 75557
177 75557 77139 -84592 -111698 54755 105059 -53903 -114434 42161 114771 -33404 -111642
188 -111642 34312 129320 -2089 -109564 1472 117781 32055 -85699 -25581 88501
198 88501 47728 -67214 -48421 68201 70385 -53469 -90650 27590 96023 -15308 -116576
209a16576R0625J21544p1594j34834N6484J45498m2202j52695L0348J64338j0571
220H0365j66525p591J67471L1624j55476m5426J46740O1826j34125p5809J22590
231B5664R3027j07383j14322Q1057J28574n1910j39237J5822J35610J1393j31284
242e2989l8730J19257N4703j11979p4704J00388R0209q5965j02556P2139J12504
253H2277n2492j12699M0664J16412k5980j14838J5945J20615K354j20341k1204
264f9287J17505M5157j05884o5057Q8606P8526p1449r0946M9703R5113l4602j02368
276f4983J3805J01974L588j02696k3824R4950L6677q7838m7643Q0016N5547p3285
288a3712o2003P0818P3121o0659p9932N3768R0996l7035r2047K5556R2830j1666
$$ plain form
209 -116576 -25951 95593 23999 -110835 -54351 91147 48945 -103750 -73402 90936 80365
220 80365 -86160 -93751 73720 105344 -50132 -95558 51182 113008 -21117 -96926 25664
231 25664 118691 11308 -103014 -21957 106617 54707 -84530 -68708 66902 78295 -52989
242 -52989 -91719 27538 82241 -29738 -104442 -4054 86155 190 -102366 -30227 82277
253 82277 29785 -82914 -42250 74162 48182 -66656 -50711 69904 72258 -48083 -69287
264 -69287 48218 93375 -12509 -77566 11040 89566 18117 -72829 -23126 71987 37385 -64983
276 -64983 -51178 50796 54384 -48312 -72136 22814 59491 -28347 -75990 4026 59573 -13712
288 -13712 -75715 -4897 68224 7565 -72367 -18599 72397 35362 -56685 -31129 61701 50035
300E0035q8481J691Q5278Q355q1687j9400P3988K7189o8034l8849N5288M2838
312D8211m9656n1860L9701N6002l3735o6957K3690P6987j0426q5853n128R1845
324C2821K4476r0599l8271Q9822N3720q2170o0424P8453P0724o9673p4505O3364
336b262P9300n4272q0328M6556P8787m0404p9461L3117P7965k7447q3060J3294
348c8215Q1925j350q3585k0003P5838L6595o7184n4576N4761O9724l9575q1132
360f6777K5737R4607o946r9674p132J06721K5456j05093l7088J05867N0163j02186
372a6345n8408R9888O7332r6159p7430Q8774Q4831q0381r4181O4194R5745m9894
384B7966r9159L0327R4057j4621r0340m734Q1306K1732p2035l8341O0376N4165
$$ plain form
300 50035 -38446 -36755 48523 56878 -24809 -44209 29779 56968 -11066 -49915 5373 48211
312 48211 -1445 -53305 -13604 42398 8663 -58294 -34604 42383 31957 -53896 -59024 32821
324 32821 57297 -33302 -71573 18249 71969 -10201 -70625 7828 78552 8879 -65626 -2262
336 -2262 77038 22766 -57562 -11006 67781 27377 -52084 -18967 58998 31551 -51509 -38215
348 -38215 43710 42360 -41225 -61228 14610 51205 -15979 -70555 -15794 53930 14355 -66777
360 -66777 -41040 53567 46621 -53053 -60185 46536 71992 -33101 -70189 35678 85841 -16345
372 -16345 -74753 25135 92467 -3692 -81122 7652 92483 12102 -82079 -17885 77860 27966
384 27966 -71193 -40866 53191 38570 -51770 -56504 24802 46534 -25501 -63842 -3466 50699
396E0699m5820o5117L4768P8293j9353q5213J0127R6806N312j02773j7692J10157
408E0194L4202j11821m9674J08786O3345j03153p5499R0520Q1887q0893q9345
419h1451O4251Q8197n1421q9671L4593Q2676k0950p6876P821O9127N018o0731
431b9417j5467N5789K8017m5912l9552L9950N5032k7905o5081J8568P7623m008
443D7637q3709q645Q9274K2464r1448l4880Q9144M3563q6229n3762P7993N6421
455F7823p2355o1649O2193N9239n7235o0628M8668N8826m2489n8484L4250N9686
467C7845k3136n6365J3006N6658J267n0191j1280M6442K5711l7351l5775L1214
479a955M7374k0998n5101J1305O1825l264o7184o694O8916J1502p3951k0184P4472
$$ plain form
396 50699 4879 -60238 -25470 52823 33470 -51743 -41616 55190 60502 -42271 -59963 50194
408 50194 84396 -27425 -77099 31687 95032 -8121 -83620 6900 88787 7894 -81451
419 -81451 -17200 70997 19576 -70095 -35502 47174 26224 -50652 -42831 26296 31314 -29417
431 -29417 -44884 10905 38922 -6990 -46542 -6592 48440 20535 -44546 -25978 51645 47637
443 47637 -36072 -44717 44557 67021 -24427 -59307 29837 73400 -12829 -66591 11402 67823
455 67823 -4532 -66181 -3988 55251 -1984 -62612 -13944 44882 2393 -56091 -21841 37845
467 37845 14709 -41656 -28650 28008 29275 -20916 -32196 14246 39957 2606 -33169 -1955
479 -1955 45419 24421 -30680 -19375 42450 39186 -27998 -34692 34224 45726 -28225 -48409 26063
492B6063K3725p7993l1766P5605L7771p4971m5078O9286M9424o2170n3156N5015
504h245N6520m3095n4901L4604N6635k1402n2359J3071N1023m20m6171q437M4008
517B0831J8615m1348k9130L9182L9829l7595n4216L0758O4966k6616p9151J5014
529c8861Q5626n718r3375p529R4784J9078r4284l0413Q9942M1692q2000m8965
541g0023P2869N7467n9597n8239M9381O3120l6089o1632K6380O5567j5485o5360
553c1641L180O5806J0223o4967k5143N9837L7554n5844n1192M6248O0176m0537
565A3700p1200K8098P6386j8752q2398N521Q4030O186q2477j6060Q0412K6686
577E0132p5428l2602P2395M2629o5138m8656N9706N9675m8118o4547L6990P0121
$$ plain form
492 26063 49788 -28205 -59971 15634 53405 -21566 -66644 2642 52066 -10104 -63260 -8245
504 -8245 48275 5180 -49721 -15117 41518 20116 -32243 -19172 31851 31431 -14740 -23177 20831
517 20831 39446 -1902 -31032 8150 47979 10384 -43832 -13074 51892 25276 -53875 -38861
529 -38861 46765 41047 -52328 -59857 34927 54005 -40279 -70692 19250 60942 -21058 -70023
541 -70023 2846 60313 716 -57523 -8142 54978 18889 -42743 -16363 49204 33719 -31641
553 -31641 -28461 37345 47568 -17399 -42542 17295 54849 -995 -52187 -5939 54237 13700
565 13700 -57500 -29402 46984 28232 -54166 -48645 35385 41571 -40906 -56966 23446 50132
577 50132 -25296 -57898 14497 57126 -8012 -56668 3038 62713 14595 -49952 -12962 57159
589E7159k2281p1444Q578O9364K942o7919j7239O1417K7441n7477m0590M8017
601b032M7926m1363n6208L0948N9386k4340o3632J7528O7722j0595p0657M755
613d0562P5720O735p5291j5090P4603K7688o7826l4311O1244M2677n1102m6089
625d1604M1338N0404k9604n2790J6028N1597n072n1142q273M4720J5299m3059
637a2158k4243L8536K9252l8537l7774L6532M4845l5034n2263L1058N9747k4717
649A5244o1475K0154O5441j2251o2479R108O2852o68n9410m537N5376J2031m8418
662i032j7864M0200K2123l2697k7113K4401K9642j9811l7709J0762M2331m477
674B0756n0207p479N2842J7958n5615k7155N4565L5138n2423m0390N1013M6458
$$ plain form
589 57159 34878 -36566 -27988 41376 44318 -23601 -40840 20577 48018 -9459 -50049 -2032
601 -2032 45894 4531 -51677 -20729 38657 14317 -49315 -31787 35935 25340 -45317 -40562
613 -40562 35158 41893 -33398 -48488 26115 53803 -14023 -48334 12910 55587 4485 -41604
625 -41604 -266 50138 20534 -32256 -16228 35369 30297 -20845 -29118 15602 30901 -12158
637 -12158 -36401 2135 31387 -7150 -44924 -8392 36453 1419 -50844 -19786 39961 15244
649 15244 -46231 -26077 39364 27113 -35366 -26258 36594 35926 -23484 -28021 27355 39386 -9032
662 -9032 -26896 13304 35427 2730 -24383 18 29660 9849 -27860 -17098 25233 20756
674 20756 -29451 -36930 15912 33870 -21745 -48900 5665 40803 -11620 -52010 -997 45461
686D5461m6291m9135M3349N4731l5300n4092K9834N5817k0705n3055J4695N0975
698C6284p018n0350j152M7992R798m6467k2621L9056L1948l3144m2989K1619M7310
711C0266j5051n1665M722N4000K561n5238r486N6832J8016n4257k3785N2817L1297
724D1029m7871l3736M5919L8543m1301m1073M0258M7685l5422n3252K8860N8805
736D8444k0640o2128Q761O0848p09n9691r522N3760J5726n0832k5329M3053L1579
749C3320l5997l8914K4480M3570j3482m4926L200M7343P439m6638j3450M9536
761A5481K4801m9740l1793N1127M3049m8166n0112M4362N5800l8812n8324L3502
773h825N8043l1565n8071K6000N5573k2768n5856J4728N0091q992m5313J185L7495
$$ plain form
686 45461 -830 -49965 -6616 48115 12815 -41277 -11443 44374 23669 -29386 -14691 36284
698 36284 29266 -21084 -22236 25756 35554 -10913 -33534 5522 37470 4326 -38663 -17044 30266
711 30266 15215 -36450 -31728 22272 24833 -30405 -39891 16941 34957 -19300 -43085 9732 41029
724 41029 -6842 -40578 5341 43884 2583 -38490 1768 49453 14031 -39221 -10361 48444
736 48444 27804 -34324 -25563 35285 34576 -25115 -34637 19123 34849 -15983 -41312 1741 33320
749 33320 -2677 -41591 -17111 26459 12977 -31949 -28749 18594 26033 -20605 -34055 15481
761 15481 40282 -9458 -41251 9876 52925 4759 -45353 -991 54809 15997 -42327 -8825
773 -8825 49218 17653 -40418 -14418 41155 18387 -37469 -22741 27350 18358 -26955 -25770 11725
786A1725M080l1932r351K5765J6967j9553k5124J3510L6052k413m2329o818M9400
799A9979J9274m9583k5928N1254L2512n0600l6397N0702L9794m9606m3745M5488
811C144M4921m2088m6095L3734M2886l1324m1778K4463L8894k0199l9849J1967
823b1324L9049j693l6385r020L2407K0031k3529k7829J8152L5320r679l7906N229
836a7177M4752J713m7888p109N0493J5009n0381k1475M7369K5100m5055k8902
848c3551M1461K9750m1408l5187L7226L8293l3813m4280K5212M5323j7424m5329
860c3727R887M2742l387l9513q49L9309P906l5910j2401L3643K1527k7403k5444
873b3620K2583L0050j4473l1909R296L5219m438l9811k809M2817R682m7051k0125
$$ plain form
786 11725 15805 -16127 -25478 287 17254 -2299 -27423 -13913 22139 19726 -22603 -29421 19979
799 19979 39253 -10330 -36258 14996 47508 -3092 -39489 11213 51007 1401 -42344 3144
811 3144 48065 5977 -40118 -6384 36502 5178 -36600 -12137 26757 6558 -33291 -21324
823 -21324 17725 16032 -20353 -29373 3034 23065 -464 -28293 -10141 25179 15500 -22406 -17177
836 -17177 27575 29288 -18600 -25709 24784 39793 -10588 -32063 15306 40406 -4649 -33551
848 -33551 7910 37660 -3748 -38935 -1709 36584 2771 -41509 -16297 29026 11602 -33727
860 -33727 -23840 18902 15515 -23998 -24847 14462 22368 -13542 -25943 7700 29227 1824 -23620
873 -23620 -1037 29013 14540 -17369 -8073 27146 22708 -17103 -19912 22905 32587 -14464 -34589
886c4589M4610K7829m3347l6014L7345L8470l4671m1350L1243M1673k8200m3248
898d0249K4841M4861j8211m2832J3907M1457p421l6083M937L5086L05l1889m355
911a5646L0402J3168k6643k1260K0881K7925j3891l4132M855L5562j05l8514o719
924b4117L8733R157m2113j5138M2018J8549m1092k3368L8359K6069l5057k5898
936c3898L2714K8344k9281k8471K7428L3310k0954l3683J4965L5697n211l3391
948a2431k254L1758Q027k8719j4399K5973J9105k5020k6508K0484L0892j7726
960I182l6978J0737L8039o672l9823P81M0011K283m0034o953M0437J3682l7825
973a3133j9232L5282K6025k7899k8459K3252L1632j5418l1819J1668L4142o534
$$ plain form
886 -34589 10021 37850 -5497 -41511 -4166 34304 -367 -41717 -10474 31199 2999 -40249
898 -40249 -15408 29453 11242 -31590 -17683 23774 16353 -19730 -14793 20293 20598 -11291 -15646
911 -15646 14756 27924 1281 -19979 902 28827 14936 -19196 -14341 21221 21116 -17398 -24117
924 -24117 14616 23773 -18340 -33478 8540 27089 -14003 -37371 988 27057 -8000 -33898
936 -33898 -1184 27160 -2121 -30592 -3164 30146 9192 -24491 -9526 26171 20960 -12431
948 -12431 -14685 17073 25100 -3619 -18018 7955 27060 2040 -24468 -3984 26908 9182
960 9182 -27796 -17059 20980 14308 -25515 -24734 15277 17560 -22474 -29427 11010 24692 -13133
973 -13133 -32365 2917 28942 1043 -27416 -4164 27468 12050 -19769 -8101 26041 19507
985A9507l4312R81L4962M954l5945j1409L3530J5362l3537k1154L0652K3196k9406
998b619l0145K5108L4002k1646l8739J4331M1730o423m1254j467M1616Q863l7368
1011a4011j2966L5194K0029k9967k3485K6948K8805k1107l0620J5860L2450r770
1023A7360l3576M485L3636j067l5556m775L4745Q634l6424j5488L3387J9734l1498
1036f403k5776K7089K8786k3851l1675J9772L4199j5053l4490J1000L7060m905
1048A5753l4775J609L4838M622l0832p853K9173J2920k6058j6614K2560K0297
1060B5640j8261k4907J2069K6799p889k9638K01K9211L216l0443r245K9461J1829
1073A8043k9873j5984K8711J9726k7932k1620K7123K4697k4850k5354K4588K8313
$$ plain form
985 19507 -14805 -13824 21138 26092 -9853 -21262 12268 27630 -5907 -27061 3591 26787 -2619
998 -2619 -32764 -7656 26346 4700 -34039 -19708 22022 15599 -25655 -27122 14494 23357 -14011
1011 -14011 -26977 8217 28246 -1721 -25206 1742 30547 9440 -21180 -5320 27130 17360
1023 17360 -16216 -11731 21905 20838 -14718 -19493 15252 23886 -12538 -28026 5361 25095 -6403
1036 -6403 -32179 -5090 23696 -155 -31830 -12058 22141 7088 -27402 -16402 20658 15753
1048 15753 -19022 -17413 17425 22047 -8785 -16638 12535 25455 -603 -17217 5343 25640
1060 25640 7379 -17528 -5459 21340 13451 -16187 -15986 13225 16441 -14002 -23247 6214 18043
1073 18043 -11830 -27814 897 20623 -7309 -28929 -1806 22891 -1959 -27313 -2725 25588
1085B5588k0939k8808J9247L2030j3923l2160R959L2381l766l0145j978K7341
1097A4827O595k4456j2476J8498J5891j6010k1035R488K2651n904k6391M8K7561
1110I287L490k9650p303L0977J2120l1556j5332L3383K0401l1115k3791L1646
1122B557K8819k8070k9814K4793L2869j9788l3369J6173L3037j1270l2162N301
1134a0924K9805j422k8624m282K3854Q550k2243j4685J7049J7929j4271k2855
1146b2119Q629K7313l693l1032j559L4244Q555l5434j2895L6951J9718l4541k3094
1159b8957L4548K8344l0946l0013K8073L3475k4308l4946K0248L5055j6393l5801
1171b1621J0176L3849o607l3080p57K9594M970k7094j1611K1058J6602j6310k1330
$$ plain form
1085 25588 4649 -24159 -4912 27118 13195 -18965 -9006 23375 19609 -10536 -12514 14827
1097 14827 21422 -3034 -15510 2988 18879 2869 -18166 -8678 13973 8069 -18322 -18274 9287
1110 9287 12777 -16873 -24176 6801 18921 -12635 -27967 5416 25817 -5298 -29089 2557
1122 2557 31376 3306 -26508 -1715 31154 11366 -22003 -5830 27207 15937 -16225 -10924
1134 -10924 18881 17459 -11165 -15447 8407 16957 -5286 -19971 -2922 15007 736 -22119
1146 -22119 -13490 13823 10130 -20902 -22461 11783 20338 -15096 -27991 8960 28678 -5863 -28957
1159 -28957 5591 33935 2989 -27024 1049 34524 10216 -24730 -4482 30573 14180 -21621
1171 -21621 -11445 22404 15797 -17283 -18040 11554 16524 -10570 -22181 -1123 15479 -831 -22161
1184b2161J0471K4281l291k6193k005K8270Q333k7048j1861K7972J6941k5992
1196b283j8459K6370K1658k4432k3487K4659K4941k3775k6802K1799K7146k0646
1208F689k9402J6881K8890j5144k9713R936K6800o315k6421J509K2597K663j9283
1221a0313o357J5546J0509j0387j2807P810J6199j860j7776l60K0923N452k1921
1234e342p836K4144J1506k4411j4145K4452J6343k5334j8798K3641J9218k3750
1246c12k1213K0318K0759k0063k1582J6792J9749j4948j9952J2570J8736r087
$$ plain form
1184 -22161 -11690 12591 9300 -16893 -18898 9372 17705 -9343 -21204 6768 23709 -2283
1196 -2283 -20742 5628 27286 2854 -20633 4026 28967 5192 -21610 189 27335 6689
1208 6689 -22713 -5832 23058 7914 -21799 -11863 14937 8622 -17799 -16290 6307 8970 -10313
1221 -10313 -16670 -1124 9385 -1002 -13809 -5999 10200 8340 -9436 -9796 11127 16579 -5342
1234 -5342 -13178 10966 22472 -1939 -16084 8368 24711 -623 -19421 4220 23438 -312
1246 -312 -21525 -1207 19552 -511 -22093 -5301 14448 -500 -20452 -7882 10854 1767
$$ [...]
8191A14
##END NTUPLES=NMR FID
##END=
