##TITLE=1H_SA_pyrethernit_dry
 CDCl3, 8 sc, 
 5.4.2019
##JCAMPDX= 6.0         $$ Bruker NMR JCAMP-DX V2.0
##DATA TYPE= NMR FID
##DATA CLASS= NTUPLES
##ORIGIN= UXNMR, Bruker Analytische Messtechnik GmbH
##OWNER= root
$$ XWIN-NMR		Version 3.5
$$ Fri Apr  5 15:45:48 2019 Russian Standard Time (UT+4h)  she@DPX200
##.OBSERVE FREQUENCY= 200.1316
##.OBSERVE NUCLEUS= ^1H
##.DELAY= (6, 6)
##.ACQUISITION MODE= SIMULTANEOUS
##.ACQUISITION SCHEME= undefined
##.AVERAGES= 8
##.DIGITISER RES= 18
##SPECTROMETER/DATA SYSTEM= spect
##.PULSE SEQUENCE= zg30
##.SOLVENT NAME= CDCl3
##.SHIFT REFERENCE= (INTERNAL, CDCl3, 0, 15.7039)
##AUDIT TRAIL= $$ (NUMBER, WHEN, WHO, WHERE, WHAT)
$$ ##TITLE= Audit trail, XWIN-NMR		Version 3.5
$$ ##JCAMPDX= 5.01
$$ ##ORIGIN= Bruker BioSpin GmbH
$$ ##OWNER= she
$$ F:/spectra/data/she/nmr/H-F/1/audita.txt
$$ ##AUDIT TRAIL=  $$ (NUMBER, WHEN, WHO, WHERE, WHAT)
(   1,<2019-04-05 15:44:46.76 +0400>,<she>,<DPX200>,
      <created by zg, POWCHK disabled, PULCHK disabled
       configuration hash MD5:
       00 E9 B6 7A A2 85 ED C7 34 08 36 98 17 FE 4E 26
       data hash MD5: 16K
       6F 7A 0D 21 96 EC B1 11 2F 1E 52 A9 C1 61 F9 2C>)
$$ ##END=
$$ 
$$ hash MD5
$$ 71 2B 22 C2 46 83 59 03 0F 04 9C C0 77 58 4D 53
##$RELAX= 
##$RELAX= 
##$RELAX= 
##$RELAX= 
##$RELAX= 
##$RELAX= 
$$ Bruker specific parameters
$$ --------------------------
##$DU= <F:/spectra>
##$EXPNO= 1
##$NAME= <H-F>
##$PROCNO= 1
##$TYPE= <nmr>
##$USER= <she>
##$AMP= (0..31)
100 100 100 100 100 100 100 100 100 100 100 100 100 100 100 100 100 100 
100 100 100 100 100 100 100 100 100 100 100 100 100 100 
##$AQSEQ= 0
##$AQ_mod= 1
##$AUNM= <au_zg>
##$AUTOPOS= <>
##$BF1= 200.13
##$BF2= 200.13
##$BF3= 200.13
##$BF4= 200.13
##$BF5= 200.13
##$BF6= 200.13
##$BF7= 200.13
##$BF8= 200.13
##$BYTORDA= 1
##$CFDGTYP= 0
##$CFRGTYP= 5
##$CHEMSTR= <none>
##$CNST= (0..31)
1 1 145 1 1 1 1 1 1 1 1 1 1 1 1 1 1 1 1 1 1 1 1 1 1 1 1 1 1 1 1 1 
##$CPDPRG= <>
##$CPDPRG1= <>
##$CPDPRG2= <>
##$CPDPRG3= <>
##$CPDPRG4= <mlev>
##$CPDPRG5= <mlev>
##$CPDPRG6= <mlev>
##$CPDPRG7= <mlev>
##$CPDPRG8= <mlev>
##$CPDPRGB= <>
##$CPDPRGT= <>
##$D= (0..31)
0 1.2 0 0 0 0 0 0 0 0 0 0.03 0 0 0 0 0 0 0 0 0 0 0 0 0 0 0 0 0 0 0 0 
##$DATE= 1554464686
##$DBL= (0..7)
120 120 120 120 120 120 120 120 
##$DBP= (0..7)
150 150 150 150 150 150 150 150 
##$DBP07= 0
##$DBPNAM0= <>
##$DBPNAM1= <>
##$DBPNAM2= <>
##$DBPNAM3= <>
##$DBPNAM4= <>
##$DBPNAM5= <>
##$DBPNAM6= <>
##$DBPNAM7= <>
##$DBPOAL= (0..7)
0.5 0.5 0.5 0.5 0.5 0.5 0.5 0.5 
##$DBPOFFS= (0..7)
0 0 0 0 0 0 0 0 
##$DE= 6
##$DECBNUC= <off>
##$DECIM= 24
##$DECNUC= <off>
##$DECSTAT= 4
##$DIGMOD= 1
##$DIGTYP= 9
##$DL= (0..7)
0 120 120 120 120 120 120 120 
##$DP= (0..7)
150 150 150 150 150 150 150 150 
##$DP07= 0
##$DPNAME0= <>
##$DPNAME1= <>
##$DPNAME2= <>
##$DPNAME3= <>
##$DPNAME4= <>
##$DPNAME5= <>
##$DPNAME6= <>
##$DPNAME7= <>
##$DPOAL= (0..7)
0.5 0.5 0.5 0.5 0.5 0.5 0.5 0.5 
##$DPOFFS= (0..7)
0 0 0 0 0 0 0 0 
##$DQDMODE= 0
##$DR= 18
##$DS= 0
##$DSLIST= <SSSSSSSSSSSSSSS>
$$ [...]
##$SUBNAM2= <"">
##$SUBNAM3= <"">
##$SUBNAM4= <"">
##$SUBNAM5= <"">
##$SUBNAM6= <"">
##$SUBNAM7= <"">
##$SUBNAM8= <"">
##$SUBNAM9= <"">
##$SW= 24.9336934301222
##$SWIBOX= (0..15)
0 0 2 0 0 0 0 0 0 0 0 0 0 0 0 0 
##$SW_h= 4990.01996007984
##$TD= 16384
##$TD0= 1
##$TE= 0
##$TE2= 300
##$TE3= 300
##$TEG= 300
##$TL= (0..7)
0 120 120 120 120 120 120 120 
##$TP= (0..7)
150 150 150 150 150 150 150 150 
##$TP07= 0
##$TPNAME0= <>
##$TPNAME1= <>
##$TPNAME2= <>
##$TPNAME3= <>
##$TPNAME4= <>
##$TPNAME5= <>
##$TPNAME6= <>
##$TPNAME7= <>
##$TPOAL= (0..7)
0.5 0.5 0.5 0.5 0.5 0.5 0.5 0.5 
##$TPOFFS= (0..7)
0 0 0 0 0 0 0 0 
##$TUNHIN= 0
##$TUNHOUT= 0
##$TUNXOUT= 0
##$USERA1= <user>
##$USERA2= <user>
##$USERA3= <user>
##$USERA4= <user>
##$USERA5= <user>
##$V9= 5
##$VALIST= <valist>
##$VCLIST= <CCCCCCCCCCCCCCC>
##$VD= 0
##$VDLIST= <DDDDDDDDDDDDDDD>
##$VPLIST= <PPPPPPPPPPPPPPP>
##$VTLIST= <TTTTTTTTTTTTTTT>
##$WBST= 1024
##$WBSW= 4
##$XGAIN= (0..3)
0 0 0 0 
##$XL= 0
##$YL= 0
##$YMAX_a= 173189
##$YMIN_a= -274405
##$ZGOPTNS= <>
##$ZL1= 120
##$ZL2= 120
##$ZL3= 120
##$ZL4= 120
##$ABSF1= 10
##$ABSF2= 0
##$ABSG= 5
##$ABSL= 3
##$ALPHA= 0
##$AQORDER= 0
##$ASSFAC= 0
##$ASSFACI= 0
##$ASSFACX= 0
##$ASSWID= 0
##$AUNMP= <proc_1d>
##$AZFE= 0.1
##$AZFW= 0.1
##$BCFW= 1
##$BC_mod= 2
##$BYTORDP= 1
##$COROFFS= 0
##$CY= 11.3945322036743
##$DATMOD= 1
##$DC= 2
##$DFILT= <>
##$DTYPP= 0
##$F1P= 18.9103706918063
##$F2P= -1.10871071338519
##$FCOR= 0.5
##$FTSIZE= 0
##$FT_mod= 4
##$GAMMA= 1
##$GB= 0.15
##$INTBC= 1
##$INTSCL= 1
##$ISEN= 128
##$LB= 0.24
##$LEV0= 0
##$LPBIN= 0
##$MAXI= 10000
##$MC2= 0
##$MEAN= 0
##$ME_mod= 0
##$MI= 1.114404
##$NCOEF= 0
##$NC_proc= 0
##$NLEV= 6
##$NOISF1= 3.799351
##$NOISF2= 2.8
##$NSP= 1
##$NTH_PI= 0
##$NZP= 0
##$OFFSET= 15.70392
##$PC= 1
##$PHC0= -8861.802
##$PHC1= 30.60028
##$PH_mod= 1
##$PKNL= yes
##$PPARMOD= 0
##$PSCAL= 0
##$PSIGN= 0
##$REVERSE= no
##$SF= 200.130013532006
##$SI= 16384
##$SIGF1= 3
##$SIGF2= 2
##$SINO= 400
##$SIOLD= 16384
##$SREGLST= <1H.CDCl3>
##$SSB= 0
##$STSI= 0
##$STSR= 0
##$SW_p= 3612.71676300578
##$SYMM= 0
##$S_DEV= 0
##$TDeff= 0
##$TDoff= 0
##$TI= <>
##$TILT= no
##$TM1= 0
##$TM2= 0
##$TOPLEV= 0
##$USERP1= <user>
##$USERP2= <user>
##$USERP3= <user>
##$USERP4= <user>
##$USERP5= <user>
##$WDW= 1
##$XDIM= 8192
##$YMAX_p= 0
##$YMIN_p= 0
$$ End of Bruker specific parameters
$$ ---------------------------------
##NTUPLES= NMR FID
##VAR_NAME=  TIME,          FID/REAL,        FID/IMAG
##SYMBOL=    X,             R,               I
##VAR_TYPE=  INDEPENDENT,   DEPENDENT,       DEPENDENT
##VAR_FORM=  AFFN,          ASDF,            ASDF
##VAR_DIM=   8192,          8192,            8192
##UNITS=     SECONDS,       ARBITRARY UNITS, ARBITRARY UNITS
##FACTOR=    0.0002004,     1,               1
##FIRST=     0,             0,               0
##LAST=      1.6414764,     0,               0
##MIN=       0,             -274405,         0
##MAX=       1.6414764,     173189,          0
$$ Real data points
##PAGE= N=1
##DATA TABLE= (X++(R..R)), XYDATA
$$ [...]
2174c09J792j23j914J12J934L58r65n21Q06J22p96KN51O0j014o34N80L83m41l15
$$ -309 1483 1360 -554 -442 1492 1850 885 364 1170 1292 496 498 1049 1109 95 -539 41 424 -17 -332
2194c32q11KL10M8j87j42J36k47P5Q35K62p63m90J187Q43o79k63Q01N19q28l95
$$ -332 -1143 -1141 -831 -783 -970 -1112 -976 -1223 -1148 -313 -51 -814 -1304 -117 726 47 -216 585 1104 276 -119
2215a19J679O78j776j069J479R23o13j115m7J163k37j184k71K22N09n35j568N79
$$ -119 1560 2238 462 -607 872 1795 1182 67 20 1183 946 -238 -509 -287 222 -313 -1881 -1302
2233a302J747n81k273K51J961L87j262o85J784K32j036J70J229M32j296J56J252
$$ -1302 445 -136 -2409 -2158 -197 190 -1072 -1757 27 259 -777 -607 622 1054 -242 -86 1166
2250A166K90q71j05O90J70m23Q7j04K76o09o16L2Q87n15j087p56R98N97p40j145
$$ 1166 1456 585 480 1170 1340 917 1004 900 1176 567 -49 -17 870 355 -732 -1488 -490 107 -633 -1778
2270a778O79J028q12j253J017J662r58j641R53K233l09j423K9J446N25o40n72
$$ -1778 -1099 -71 -883 -2136 -1119 543 -415 -2056 -1103 1130 821 -602 -573 873 1398 758 186
2287A86P35Q54o26q66L59P28p4j317n90J154O94j232r56K77R20q29o22M12J54
$$ 186 921 1775 1149 283 642 1370 1296 -21 -611 543 1237 5 -951 -674 246 -583 -1205 -793 -639
2306f39n78k22N55M92p56K10M03j03K06K82L99j9N3n1N76L79m87J30j38K51J75
$$ -639 -1217 -1439 -884 -392 -1148 -938 -535 -638 -432 -150 249 230 283 232 808 1187 700 830 692 943 1118
2327A118k23m29O2K46k07n04r2L71m55q22K12P70l06j215M27M55n8j000K15Q68
$$ 1118 895 466 528 774 567 63 -29 342 -113 -935 -723 47 -259 -1474 -1047 -592 -650 -1650 -1435 -567
2347e67L31o41K72L79M38k72j03L40K95J41j68M72J93n99Q3O12j6l59p51K72Q23
$$ -567 -236 -877 -605 -226 212 -60 -163 177 472 613 445 917 1110 511 594 1206 1190 831 80 352 1175
2368A175k27j171n20J184j02j195o14R60L86j214k15L90J223o92j186Q23J140
$$ 1175 948 -223 -743 441 339 -856 -1470 -510 -124 -1338 -1553 -1163 60 -632 -1818 -995 145
2385A45N3j147K0J565J81q13k26R91P88j283j72O67J300p51j459L43J093K99j791
$$ 145 198 -949 -929 636 817 4 -222 769 1557 274 102 769 2069 1318 -141 202 1295 1594 -197
2404a97n58J239L16j400o26J180N25j368q34R57J091j225j201R59R07k14j084
$$ -197 -755 484 800 -600 -1226 -46 479 -889 -1723 -766 325 -900 -2101 -1142 -235 -449 -1533
2421a533L40J185K45q37J00J062P62r91l55P10Q64n70n59l1J003J04j122n12J022
$$ -1533 -1193 -8 237 -600 -500 562 1324 333 -22 688 1552 982 423 392 1395 1499 377 -135 887
2440H87N06j792n15R01K88q83r36R66P52j027r25Q29Q63m85p23J79J156j30n75
$$ 887 1393 -399 -914 -13 275 -608 -1544 -578 174 -853 -1778 -949 -86 -571 -1294 -1115 41 -89 -664
2459f64j27J233J65m60l68Q70L74M7p40M71P02k05p53j09J001n10j300j3J330
$$ -664 -791 442 607 147 -221 649 1023 1070 330 801 1503 1298 545 436 1437 927 -373 -386 944
2478I44m28r95m18J009j64q61m97R72P0o61l72P22N7q9m6kP10L16n94M83o5N63
$$ 944 516 -479 -897 112 -52 -913 -1410 -438 -368 -1029 -1401 -679 -622 -711 -757 -759 -49 267 -327 156 91 654
2500F54l8q5L86L00m32n02O08L84n24l59K90j68k01k70J41M40j149l66N83J76
$$ 654 616 531 917 1217 785 283 891 1275 751 392 682 514 313 43 184 624 -525 -891 -308 -132
2520a32m12q57O08L44o11m35N51Q56j22m96j4J195r5m92q2R35N01p63n62R83O68
$$ -132 -544 -1401 -793 -449 -1060 -1495 -944 -88 -210 -706 -720 475 380 -112 -194 741 1242 479 -83 900 1568
2541A568o58m58L02N93j54j608L26J081l79p75k51O96l55o71m09P70M45j018l48
$$ 1568 910 452 754 1347 1193 -415 -89 992 613 -162 -413 283 -72 -743 -1152 -382 63 -955 -1303
2560a303M69P63q68p09R70J300p09q52Q00J142m80q46P0K127j54j617J31R15N62
$$ -1303 -834 -71 -939 -1648 -678 622 -87 -939 -139 1003 523 -323 -253 1874 1720 103 234 1149 1711
2579A711r17j214J230O72n63j354j97J284O4j561o80J539L99j214j230J183J283
$$ 1711 794 -420 810 1482 919 -435 -632 652 716 -845 -1525 14 413 -801 -2031 -848 435
2596D35j034j364N23J561K85j591J66J545r2n76j00J045O35q04m66O63N71m82
$$ 435 -599 -1963 -1440 121 406 -1185 -1019 526 434 -142 -242 803 1438 634 168 831 1402 920
2614I20m31J80K82Q8p94j24O59O5j348m60R45K04j166n7R30J41j060p45R56Q97
$$ 920 489 669 951 1039 245 121 780 845 -503 -963 -18 186 -980 -1037 -107 34 -1026 -1771 -815 82
2634H2r85m20O11J189q71m66P91Q11j28q64M32Q52L82j169q5M98O29m93o67L54
$$ 82 -903 -1323 -712 477 -394 -860 -69 742 614 -250 182 1034 1416 247 162 660 1289 796 129 483
2654D83L57p2j026j8O38j52o19n83O87j7n03j92K6k48M45rK51L1n91M53N75J4
$$ 483 840 768 -258 -276 362 210 -409 -992 -305 -322 -825 -1017 -991 -1239 -794 -803 -552 -521 -1112 -659 -84 -70
2676g0m65N91P65n1m74J75J094m07n81k91N25P23p87n37K30L43k97r47r9J079
$$ -70 -535 56 821 770 296 471 1565 1158 577 286 811 1534 747 210 440 783 486 -461 -560 519
2696E19l52j037m98P11J051j010j526Q01J609p91j400P71J331j61j067N81J074
$$ 519 167 -870 -1368 -657 394 -616 -2142 -1341 268 -523 -1923 -1152 179 18 -1049 -468 606
2713F06n4m80k61Q26M97j86l27M49K61o74m99M10O21k61q40K86M24o56j132K5
$$ 606 552 72 -189 637 1134 948 621 1070 1331 657 158 568 1189 928 88 374 798 142 -990 -965
2733i65J239J63j722n74J641M13j531l38J258J054j332q98J164R73n94n17M72
$$ -965 274 437 -1285 -1859 -218 195 -1336 -1674 -416 638 -694 -1592 -428 545 -49 -566 -94
2750i4O87O26j185n0J091J73k83p43L33J131o88j175p8J459k47j456j36J036r2
$$ -94 593 1219 34 -16 1075 1248 965 222 555 1686 998 -177 -255 1204 957 -499 -635 401 309
2769C09j078j37O24J01j542O62Q84j29p84j27R51J68l51J83N89J5Kj42M81K64
$$ 309 -769 -906 -282 -181 -1723 -1061 -177 -306 -1090 -1217 -266 -98 -449 -266 323 338 340 198 679 943
2789I43N6p87L02N69L47r12l69O87L37p37p27P03K45r38j032J381O55j423p75
$$ 943 999 212 514 1083 1430 518 149 836 1173 436 -291 412 657 -281 -1313 68 723 -700 -1475
2808a475O79O90n67q6j29N81k89l59N9N32M04l28J7N13Q57m47p58M98O72J97j064
$$ -1475 -796 -106 -673 -759 -888 -307 -596 -955 -896 -364 40 -288 -271 242 1099 652 -106 392 1064 1261 197
2829A97M41R59q52r03L36J140n99r89J40P17j50q38n18O89%r03j41P78Q2m10o46
$$ 197 638 1597 745 -158 178 1318 719 -270 -130 587 437 -401 -919 -230 -230 -1133 -1274 -496 -414 -824 -1470
2850a470P58P26pj017K55P02N27k83m61O29O07q07r1J011L99q34n95Q77N60r52
$$ -1470 -712 14 7 -1010 -755 -53 474 191 -270 359 966 159 68 1079 1478 644 49 926 1486 534
2870E34o35O37m4o12j75L78o6k94q72M06O97j96n76o92M93P60q9j278Q52J721
$$ 534 -101 536 492 -120 -295 83 17 -277 -1149 -743 -46 -242 -818 -1510 -1017 -257 -346 -1624 -772 949
2890I49r98j111J055Q41J4j291K99J292M66j287j8R85m62o31L37P53j08r66l58
$$ 949 -49 -1160 -105 736 750 -541 -242 1050 1516 229 211 1196 734 103 440 1193 1085 119 -239
2909b39M54J09P3j311N5N06M88q88q07J198J42q44J2R68M47j247j03J339O52q71
$$ -239 215 324 397 -914 -859 -353 135 -753 -1560 -362 -220 -1064 -1052 -84 363 -884 -987 352 1004 133
2929A33o76Q92O09p47k99R83M88q79q16M90R81j91m92o73N70P13p89j056K28P91
$$ 133 -543 349 958 211 -88 895 1383 504 -312 178 1159 968 476 -197 373 1086 297 -759 -531 260
2949B60l78j214L71J341n81j569L90J172K66j411J91J025q8l10M15N92J01n49
$$ 260 -118 -1332 -961 380 -201 -1770 -1380 -208 58 -1353 -1162 -137 -225 -535 -120 472 573 24
2967B4J78Q58k98p4r4P8k19N11k97q5l55N47m11o14O26Qr15m95Q58K87j206k02
$$ 24 202 1060 762 688 594 672 453 964 667 582 227 774 363 -251 375 383 -532 -1027 -169 118 -1088 -1290
2989a290Q38M56j304O2J044J63p30k92R02M26l23l0J25L82k70J30J75K9L59l2
$$ -1290 -452 4 -1300 -1238 -194 -31 -761 -1053 -151 275 -48 -78 47 429 159 289 464 493 852 820
3009H20o17M42P62p07p16O98M04m14j134k1P39m41q40M65Q59j025r38O09J366
$$ 820 203 645 1407 700 -16 682 1086 672 -462 -483 256 -185 -1025 -560 299 -726 -1664 -1055 311
3028C11q91n86M10O99k08n13K16O97P4p8k93K52P98K5j012L30R61L04j454n39
$$ 311 -580 -1166 -756 -57 -265 -778 -562 135 209 131 -162 90 888 913 -99 231 1192 1496 42 -497
3048d97J678k3r02j114J211P35j256p78P92K26m34j147N05J009l89j052L39N22
$$ -497 1181 1158 256 -858 353 1088 -168 -946 -154 72 -362 -1509 -1004 5 -384 -1436 -1097 -575
3066e75K19j92k83M24P56k34q22N99J062k14r07M24P82L24q24J7M92l0j147K20
$$ -575 -356 -548 -831 -407 349 115 -707 -108 954 740 -167 257 1039 1363 539 556 1048 1018 -129 91
3086I1R76m00j086j38R02M7q99m64P81mm53n78O25L61l34l91OJ085n8p75J14Q40
$$ 91 1067 667 -419 -557 345 392 -507 -971 -190 -194 -647 -1225 -600 -239 -573 -964 -958 127 69 -706 -592 248
3108B48J45m47l82R74J28j45k99L65Q18o74n33L72J71j09n76J82L29l28m18K0
$$ 248 393 -54 -436 538 666 521 222 587 1405 731 198 570 741 632 56 238 567 239 -179 -159
3128a59J09l36k76m37O57N1n07k99P72J34n30j36O31O23p26l66J154N19m98q40
$$ -159 -50 -386 -662 -1099 -442 -391 -898 -1197 -425 -291 -821 -957 -326 297 -429 -795 359 878 380 -460
3148d60P56R80o39m29M00M22j20p44K64M91j50k62r83K03P87k73j146J17Q33p3
$$ -460 296 1276 637 208 608 1030 910 166 430 921 771 509 -474 -271 516 243 -903 -786 47 -26
3168b6j138L9J333l02q83l5Q01N39o33n03P56J32n4k44K92N98o2l26J25P00l70
$$ -26 -1164 -1125 208 -94 -977 -1012 -211 328 -305 -808 -52 80 26 -218 74 672 610 284 409 1109 739
3189G39j13l62O14R5p97k80N30po96l89M24L87n03o78K80N49m62o71Q08L87O3
$$ 739 626 264 878 973 176 -104 426 419 -277 -666 -242 145 -358 -1036 -756 -207 -669 -1340 -532 -145 -82
3210h2r25K53Q92O8n74J91N04K03k7l83P38NK8m31J08L23J94o23m59O67K8m74
$$ -82 -1007 -754 138 206 -368 -177 327 530 503 120 858 863 891 460 568 891 1085 462 3 670 698 224
3232B24l41N76j51p76j59O61K02r85k15N60N0n02OL26L09m29Q9M05L23n10K15
$$ 224 -117 459 308 -468 -627 34 236 -749 -964 -404 -354 -856 -850 -524 -215 -644 -555 -150 173 -337 -122
3253a22K73K59K87m84j1N36r0n5k17L90J47m52l02K8M63k51p34J01P11m68j036
$$ -122 151 410 697 213 202 738 648 593 376 766 913 461 159 187 650 399 -335 -234 477 9 -1027
3274a027J23P90l64m08J13O48k91l56j05R39j58k05l32M58O35m28M8K85N43m63
$$ -1027 -904 -114 -478 -886 -773 -125 -416 -772 -877 62 -96 -301 -633 -175 460 32 80 365 908 445
3294D45j89N1M03J56m31p8O11j34p17k34L79R5n01n19M00L16m27q34O51K90k24
$$ 445 256 307 710 866 435 357 968 834 117 -117 262 357 -144 -663 -263 53 -374 -1208 -557 -267 -491
3315d91o05R8J076k77o44K17L98J26j72j28L10R65k45p24O25P00p72k59M04L60
$$ -491 -1096 -998 78 -199 -843 -626 -228 -102 -274 -402 -92 873 628 -96 529 1229 457 198 602 962
3335I62r4q54J22L80K72q63l26N43L2p97k57N71M23p59l54N61K22j08o33k09J502
$$ 962 868 14 136 516 788 -75 -401 142 174 -623 -880 -309 114 -645 -999 -438 -216 -324 -957 -1166 336
3356C36k66p38q7O56O10k05o33Q88M33m58m19O13K27l43k55O4L15k15l14jR6j01
$$ 336 70 -668 -755 -99 511 306 -327 561 994 536 117 730 957 614 359 423 738 523 209 208 304 203
3378B03p5o22J52M22o90J01m89O79k98k87J48M01R5p42J77O97K23l10N7N54L1
$$ 203 128 -494 -342 80 -610 -509 -998 -319 -617 -904 -756 -355 -260 -1002 -825 -128 95 -215 -158 396 427
3399D27m40N66M13o47K08L8K14j87Ol77k2O4J32j24j07k02J50l30n70M68M5k84
$$ 427 -13 553 966 319 527 565 779 592 598 221 199 263 395 271 164 -38 112 -218 -788 -320 -275 -559
3421e59j64J43K39m15Q4L66l38K63K14K92r3o30M78R74k64m80J39M66k11j37J65
$$ -559 -723 -580 -341 -756 -672 -306 -644 -381 -167 125 32 -598 -120 854 590 110 249 715 504 367 532
3442E32L7M87q16p4J70J91J31p60o8o8L09m53k71K82M20n05o54M53R00q42m18
$$ 532 569 1056 240 166 336 527 658 -102 -170 -238 71 -382 -653 -371 49 -456 -1110 -657 243 -599 -1017
3463a017N82O89l78n39M13P08p2j30R5j28N0M98m84K16L47L2l38j33Q1N15n63
$$ -1017 -435 254 -124 -663 -250 458 386 256 351 223 273 771 287 503 850 882 544 411 492 1007 444
3484D44q69O13K11p06l79O28K05p39n24J022K19j007k82O37L27m10l0N73J42J25
$$ 444 -425 188 399 -307 -686 -58 147 -592 -1116 -94 125 -882 -1164 -527 -200 -610 -640 -67 75 200
3504B00m24J62O70J23l25k84J02Q82J19j307O6J118J0r38p4L78L22j140M7L34
$$ 200 -224 -62 608 731 406 122 224 1106 1225 -82 -16 1102 1112 174 100 478 800 -340 -293 41
3524D1K02j050m1Q56k99j37l76L4J34J46K31l1n99N91O2J0K20M90K66q89P3N48
$$ 41 243 -807 -848 8 -291 -428 -804 -770 -636 -490 -259 -290 -889 -298 -236 -226 -6 484 750 -139 -66 482
3546D82N4j71K36J39j26l79K92K03q35k85M30K34l86k08k06M9j98N5K64j00l59
$$ 482 536 365 601 740 614 235 527 730 -105 -390 40 274 -112 -320 -526 -477 -675 -620 -356 -456 -815
3567h15J73j76J25K36J23P1r7K73K20j01k90O88J79n12K13N43M6o97l0M86n0k65
$$ -815 -642 -818 -693 -457 -334 -263 -360 -87 133 32 -258 430 609 97 310 853 899 202 172 658 608 343
3589C43k08L10k86j71K02k6o22j00L77k39R3j55M6j77j23J76K16L8k35M82k36
$$ 343 135 445 159 -12 190 164 -458 -558 -181 -420 -327 -482 -436 -613 -736 -560 -344 -306 -541 -59 -295
3610b95j48P39J34k71m6K42J78j95k64P19l04m55O05M09n04k92l48O68q0l50m6
$$ -295 -443 296 430 159 113 355 533 338 74 793 489 34 639 1048 544 252 -96 572 492 142 96
3631I6O0o17O9J11m06Q9r3K11m97M04J85J38n94K37N73L03q21N59K44r5K64J47
$$ 96 156 -461 -392 -281 -687 -598 -691 -480 -977 -573 -388 -250 -844 -607 -34 269 -552 7 251 156 420 567
3653E67M35m70m27O65L55m82j36k1l2J14j93k70k67J53k11l15q9L58J61j76p76
$$ 567 1002 532 105 770 1125 643 507 486 454 568 375 105 -162 -9 -220 -535 -624 -266 -105 -281 -1057
3674a057N98M47n37m77Q91P8l50J5L50L84n06J81L63M0M28m51r0K25l85N99j49
$$ -1057 -459 -12 -549 -1026 -135 -57 -407 -392 -42 342 -164 17 380 420 848 397 307 532 147 746 597
3695E97m06M12k3l54q5K25k2p45LO25K01q50j41M0O7n01N6P17l95j76L84J85l5
$$ 597 191 603 580 226 141 366 344 -401 -398 227 428 -422 -563 -523 -456 -957 -901 -184 -579 -755 -371 -186 -221
3718b21J14N9Nm7P03n6n63L31J66K36m76M0O01K9q61M9N40j43l89j2J4n59J58
$$ -221 -107 -48 -43 -90 613 557 -6 325 491 727 251 291 892 921 60 109 649 506 117 105 119 -440 -282
3741b82l7m8m5l24K88j19j85K92P7j21j5M33P2j40NK72L89n02J67K62J69k89L59
$$ -282 -319 -367 -412 -736 -448 -567 -752 -460 -383 -504 -519 -86 -14 -154 -149 123 512 10 177 439 608 319 678
3764F78K00l63J8j38J69p7m01r6K86l89l9L16n47j86K27N0k70j31L8M87j5q07
$$ 678 878 515 533 395 564 487 86 -10 276 -113 -152 164 -383 -569 -342 -292 -562 -693 -655 -168 -183 -990
3786i90L04O25l68J89J22j04K0L13O2j16L92O39p78J00L1L61n43m36P80J16p24
$$ -990 -686 -61 -429 -240 -118 -222 -202 111 173 57 449 1088 310 410 441 802 259 -177 603 719 -5
3807ej02N30K8k54p97M72J7O3n10k23O39j42l21k97O26L00N1m84Q2M63j80J66
$$ -5 -107 423 451 197 -600 -128 -111 -48 -558 -781 -142 -284 -605 -902 -276 24 75 -409 -327 136 -44 122
3829A22l69N76O62o65k95M11P29q23j64M79K36m45l58J52K9j62m32M34j40j17
$$ 122 -247 329 991 326 31 442 1171 348 184 663 899 454 96 248 277 115 -317 117 -23 -140
3849a40k43K3l84L86j0k77J19l6L20k71Q8K09J7k39L88J23J21j72J6N22j09j41
$$ -140 -383 -360 -744 -358 -368 -645 -526 -562 -242 -513 -425 -216 -199 -438 -50 73 194 22 38 560 451 310
3871C10K7J08k2K26l92j84L76k51k45j7j91M38k90l18N3K15m0o14K16K44m02J93
$$ 310 337 445 423 649 257 73 449 198 -47 -64 -255 183 -107 -425 -372 -157 -197 -811 -595 -351 -753 -560
3893e60l76P74P9j26K28k77N14r1j74J03L51k61J67j0J95m33O45l36J6j82J0K39
$$ -560 -936 -162 -83 -209 19 -258 256 165 -9 94 445 184 351 341 536 103 748 412 428 246 256 495
3915D95m04l06M38l00J05l68j18M25l21j03M1m58R7L40M1Q4q2K36j8Q7L53n9k44
$$ 495 91 -215 223 -77 28 -340 -458 -33 -354 -457 -416 -874 -777 -437 -396 -312 -394 -158 -176 -89 264 205 -39
3938c9LL17N02l63p7P5J62N1n64M50R7j06m57J00rM0l70J12l5m0l62l2l0K90k44
$$ -39 -36 281 783 420 343 418 580 631 67 517 614 508 51 151 142 182 -188 -76 -111 -151 -513 -545 -575 -285 -529
3963e29l8j92L91j36M84K7m96O69l84N03k73K86j03k80N09J02P2j57K30k47L13
$$ -529 -567 -759 -368 -504 -20 7 -489 180 -204 299 26 312 209 -71 438 540 612 455 685 438 751
3984G51n66K04j11k1k24m87L69K13m24j49l0L74n77j44N04J42o14L79o9M04J3
$$ 751 185 389 278 257 33 -454 -85 128 -296 -445 -475 -101 -678 -822 -318 -176 -790 -411 -480 -76 -63
4005f3j61J13j37L69q5j76L70L28p0K3K45k7k29l75L57J62k89l41o3L29l27m96
$$ -63 -224 -111 -248 121 36 -140 230 558 488 511 756 729 500 125 482 644 355 14 -49 280 -47 -543
4027e43K84K67k95n27O37K5l5k84j89L25Q5J25n72N13L97l11P9J40J60J51j58
$$ -543 -259 8 -287 -814 -177 -152 -187 -471 -660 -335 -250 -125 -697 -184 213 -98 -19 121 281 432 274
4048B74j87J94K48m66K99M35k17j79l81M14J59l13n0k88r1L18l75k49J17O0r1
$$ 274 87 281 529 63 362 797 580 401 20 434 593 280 230 -58 -149 169 -206 -455 -338 -278 -369
4069c69o22Q17n3m7m54M48K69l39K17j37M39r3J01J1K28J49k88k24P38l05k56
$$ -369 -991 -174 -227 -274 -728 -280 -11 -350 -133 -270 169 76 177 188 416 565 277 53 791 486 230
4090B30j00N32j84j54o4j3j73J40n71K71p2k26KLJ66l68R4L3J1j52K88k70N3J90
$$ 230 130 662 478 324 260 247 74 214 -357 -86 -158 -384 -382 -379 -213 -581 -487 -454 -443 -595 -307 -577 -524 -334
4114c34L50J66n5n9M5J42k46M95l12K42k09K17k2p29O98m4K49k94m23M60m19k28
$$ -334 16 182 127 68 113 255 9 504 192 434 225 442 420 -309 389 345 594 300 -123 337 -82 -310
4136c10k81N09m23n1kL59j02m09k86O95J18m1k25O61j05j93K03J83j68J97m3P6
$$ -310 -591 -82 -505 -556 -558 -199 -301 -710 -996 -301 -183 -224 -449 212 107 -86 117 300 132 329 286 362
4158C62J13J92l14j01J07K80k65l1q8J25n39k52L84L10n39j57%J08j36j93J47
$$ 362 475 667 353 252 359 639 374 343 255 380 -159 -411 -27 283 -256 -413 -413 -305 -441 -634 -487
4179d87J29Pj63R9J45q1J18J13R9L43J34k51k64K10M30l94J4N51k52l89J00M54
$$ -487 -358 -351 -514 -415 -270 -351 -233 -120 -21 322 456 205 -59 151 581 187 201 752 500 111 211 665
4201F65L21j057p8N57q1n34Q4j85k6q5r0M71n76J41J87J13k64M0M28l14j23L75
$$ 665 986 -71 -149 408 327 -207 -123 -308 -334 -419 -509 -38 -614 -473 -286 -173 -437 -397 31 -283 -406 -31
4223c1N3j16N00L96o42j46J53M66k42l77J26N55m59j3q4M08o19q9L65j98m18k
$$ -31 22 -94 406 802 160 14 167 633 391 14 140 695 236 223 139 547 -72 -161 204 6 -412 -414
4245d14l3J22j6l29J33r4L75J5K1l56K58K29N2q2J68K01j9k98M61M37p42M16q3
$$ -414 -447 -325 -341 -670 -537 -631 -256 -241 -220 -576 -318 -89 -37 -119 49 250 231 -67 394 831 89 505 422
4268D22O2l93L40J32m3k60j14L51l72J5k64J45n5k56j4j25j37L95Rn46L20N64
$$ 422 484 91 431 563 520 260 146 497 125 140 -124 21 -34 -290 -304 -429 -566 -171 -162 -708 -388 176
4290A76n47k04O9O76j06l57J22L01J10r6R8L74k35k48J76M43n96l2Qr0K21Qo1
$$ 176 -371 -575 -506 170 64 -293 -171 130 240 144 242 616 381 133 309 752 156 124 132 42 263 271 210
4313B10n5m79L12m10j9n3O17n90l76J69O03R9p03O23n0j43J09N6N9J60K60j48
$$ 210 155 -324 -12 -422 -441 -494 123 -467 -843 -674 -71 28 -675 -52 -102 -245 -136 -80 -21 139 399 251
4335B51J24J71k14p7J03K8l73K52l0J02K04n50j37M62m4n73m3M15n1n26q2L46
$$ 251 375 546 332 255 358 386 13 265 235 337 541 -9 -146 316 272 -301 -344 71 20 -506 -588 -242
4357b42j49j87L10K84l35l86L95K04p6K64mK04n23M65J43r5j61K65K78k66P1k22
$$ -242 -391 -578 -268 16 -319 -705 -310 -106 -182 82 78 282 -241 224 367 272 111 376 654 388 459 237
4379B37M04k76q8J69n89j66K79M55m73k39M17k60j51m88N62k5k24o30R51J60m56
$$ 237 641 365 277 446 -143 -309 -30 425 -48 -287 130 -130 -281 -769 -207 -232 -456 -1086 -135 25 -431
4400d31L54jJ19J82j21J9j2K60J29l40J53O11j36n84J70p1J55m40K35J50o28Q0
$$ -431 -77 -78 41 223 102 121 109 369 498 158 311 922 786 202 372 301 456 16 251 401 -227 -147
4422a47L5M47p04q8K36o7j33j80N16O8m32R0n9K91k26P8m6J84L65n4r1L3J84N31
$$ -147 -112 335 -369 -457 -221 -288 -421 -601 -85 -17 -449 -359 -418 -127 -353 -275 -321 -137 228 174 83 116 300 831
4446H31m40l64L93K80m37j07N04j5o66n2K94K76p58j04J51K11m21k14N89l18k8
$$ 831 391 27 420 700 263 156 660 645 -21 -73 221 497 -261 -365 -214 -3 -424 -638 -49 -367 -395
4467c95r5P3O9K0m3K2J92jK04J58J7K1j84J65k2L48K81o06J98L12k31m51lM37
$$ -395 -490 -417 -348 -328 -371 -349 -157 -158 46 204 221 242 58 223 201 549 830 224 422 734 503 52 49 486
4491D86l92P8k02N5K88o51k6J47P6j98k76J81P6L51j78k33K22L56m09q6L68J56
$$ 486 94 172 -30 25 313 -338 -364 -217 -141 -339 -615 -434 -358 -7 -185 -418 -196 160 -249 -335 33 189
4513A89J02j97L04j5o9R7m4p1o3K31n5p9K4k84K22m70K87j20o3n58M68J14l99
$$ 189 291 94 398 383 314 411 367 296 233 464 409 330 354 70 292 -178 109 -11 -74 -632 -164 -50 -449
4536d49K5K4r5P5J43j55K44j05kL88n0k13J31R5K02m4K25J68k68k77K14J27k39
$$ -449 -424 -400 -495 -420 -277 -432 -188 -293 -295 93 43 -170 -39 56 258 214 439 607 339 62 276 403 164
4559A64N3J59O4o7l11k7J29n3k34m42K69p5k03R6j89N22l8p17K45M49K3K67n70
$$ 164 217 376 440 373 62 35 164 111 -123 -565 -296 -371 -574 -478 -667 -145 -183 -900 -655 -206 -183 84 -486
4582d86K68L33j75J48j53M49n8J06k17K19J63n55L7J5N8j90J39O8j5j61m66L67
$$ -486 -218 115 -60 88 -65 384 326 432 215 434 597 42 79 94 152 -38 101 169 154 -7 -473 -106
4604a06J91j66n3m37O01n07j30K58N51j62m69M4K92L41l80J28Q2M95k82j11j1
$$ -106 85 -81 -134 -571 30 -477 -607 -349 202 40 -429 -385 -93 248 -132 -4 78 573 291 180 169
4625A69J20L24m03j76O55r5m21J6l8K11l13p1K6J14m48J12l22L37j51o2J15K32
$$ 169 289 613 210 34 689 594 173 189 151 362 49 -22 4 118 -330 -218 -540 -203 -354 -416 -301 -69
4647f9l12J86j86J60M1nj13L85j94J37J81l26L09L5mM24j49l51L61j82O6o4j48
$$ -69 -381 -195 -381 -221 -180 -185 -298 87 -107 30 211 -115 194 229 225 649 500 149 510 328 394 330 182
4670A82p3j40k71J69R9K7k93O3L5P1l71M6J89L7l07M3r1J97K89p0MK88r0K53M6
$$ 182 109 -31 -302 -133 -34 -7 -300 -237 -202 -131 -502 -456 -267 -230 -537 -494 -585 -388 -99 -169 -165 123 33 286 332
4695C32j20K0r5j46K86K03r4j40J34L7K3l10j42J19p5j88l97N41n7l45O7n6L1
$$ 332 212 232 137 -9 277 480 386 246 380 417 440 130 -12 107 32 -156 -553 -12 -69 -414 -347 -403 -372
4718c72m3J18o4J33O4j25J83j87M06J51k14j5K76n4m12K92K93Q5m11j15L86r6
$$ -372 -415 -297 -361 -228 -164 -289 -106 -293 113 264 50 35 311 257 -155 137 430 515 104 -11 375 279
4740B79p3q7K43p5k44R0k2r6j55j01J04p4j91O4k11J91j7j37k08P28L7j95j85
$$ 279 206 119 362 287 43 133 111 15 -140 -241 -137 -211 -402 -338 -549 -358 -375 -512 -720 8 45 -150 -335
4763c35L47N1l5o0K45P7LJ11M5J61l98N1L1n5K18l85jJ09j21m17K33k69j6p8K51
$$ -335 12 63 28 -32 213 290 293 404 449 610 212 263 294 239 457 72 71 180 59 -358 -125 -394 -410 -488 -237
4788b37J16p4J56n31K47l5L54k52k65L51J57l95N01K2J17j19K13j62N7k5K90j35
$$ -237 -121 -195 -39 -570 -323 -358 -4 -256 -521 -170 -13 -408 93 115 232 113 326 164 221 196 486 351
4810C51m8K9r7p2lJ1o2q2n0j32j19l91J71L35r2J7j44J45q7o0j9K27l14L33J26
$$ 351 303 332 235 163 160 171 109 27 -23 -155 -274 -665 -494 -159 -251 -234 -378 -233 -320 -380 -399 -172 -486 -153 -27
4835b7J47Q2L9K13L4n21P80l82k45K00k43J91Qo6J7Q4n24P4J10k52M65n03j5N0
$$ -27 120 202 241 454 488 -33 747 365 120 320 77 268 276 210 227 311 -213 -139 -29 -281 184 -319 -334 -284
4859b84K13l15q3J94k36L62j67J60n6N1k8l1K70M68l70J76r8K61p2o9L14j12n35
$$ -284 -71 -386 -469 -275 -511 -149 -316 -156 -212 -161 -189 -220 50 518 148 324 226 487 415 346 660 548 13
4882A3M67m5j92K94l12m52L0O84l69m60p3K15k04l14K11P28m45j73nL15r2o1K39
$$ 13 480 435 243 537 225 -227 -197 487 118 -342 -415 -200 -404 -718 -507 221 -224 -397 -402 -87 -179 -240 -1
4905aK34l64K35j38j9K35j52J30P1J91J93k95l76K62K69l70m75L79M89m35l82
$$ -1 233 -131 104 -34 -53 182 30 160 231 422 615 320 -56 206 475 105 -370 9 498 63 -319
4926c19O08l34j07k37L59k24K22m69JK23K01j02j24j8J68J53q0r2j0N84m33K43
$$ -319 289 -45 -152 -389 -30 -254 -32 -501 -500 -277 -76 -178 -302 -320 -152 1 -79 -171 -181 403 -30 213
4948B13M00M0o56k33N71M04l60p8J86k96n7j94K56j68k54K85n09K66K6j24J42
$$ 213 613 653 -3 -236 335 739 379 301 487 191 134 -60 196 28 -226 59 -450 -184 -158 -282 -140
4969a40l41J89J17L4l72J18L41l73p8O52M0n22j66R74j97k29L07j64J24j30J19
$$ -140 -481 -292 -175 -141 -513 -395 -54 -427 -505 147 187 -335 -501 473 276 47 354 190 314 184 303
4990C03J31k79l4K59k45j75Q6J72j69p8o5j52O9m28M38pm56K10P1J41j57K73K25
$$ 303 434 155 121 380 135 -40 46 218 49 -29 -94 -246 -177 -605 -167 -174 -630 -420 -349 -208 -365 -92 133
5013A33k50k37L49K83n52J51M95N0l40K16N21o65J65J66K0k2o44L64M2k06m68
$$ 133 -117 -354 -5 278 -274 -123 372 422 82 298 819 154 319 485 505 483 -161 203 245 39 -429
5034d29L45p4Q2O4mn12K9m5L75k03L1K01l34K69O7J07k50Q6L65K74k57j21R9J64
$$ -429 -84 -158 -76 -12 -16 -528 -499 -544 -169 -372 -341 -140 -474 -205 -138 -31 -281 -195 170 444 187 66 165 329
5058C29q9L23j70k12j53JK13l6QJ55n68oK02K07l21n36N51m9k44J28J51j43l16
$$ 329 240 563 393 181 28 29 242 206 214 369 -199 -205 -3 204 -117 -653 -102 -151 -395 -267 -116 -259 -575
5081e75O7M69P9l17P7J87q1M1K03K78l22J4L72J4j94M7r2l08L67j35p0j7kK58
$$ -575 -508 -39 40 -277 -200 -13 -94 -53 150 428 106 120 492 506 312 359 267 -41 326 191 121 104 102 360
5105C60l67j13j43l0jm78N04K16k27k97J87R3K68k13J19Q2j20m4N56k83l9K76
$$ 360 -7 -120 -263 -293 -294 -772 -268 -52 -279 -576 -389 -296 -28 -241 -122 -40 -160 -204 352 69 30 306
5127C06k14J96j16O49q05K48j34J92n69M64k9k70K93k68O0K00k65j20J36l15L15
$$ 306 92 288 172 821 16 264 130 322 -247 217 188 -82 211 -57 3 203 -62 -182 -46 -361 -46
5148d6k95j4K59o7P7k05J38l9J36J93l61J50J63p5Jk7K51J03j86K53n1o9j8m4
$$ -46 -341 -355 -96 -163 -86 -291 -153 -192 -56 137 -224 -74 89 14 15 -12 239 342 156 409 358 289 271 227
5172B27J75m81K31J6k70O0j37j15J2k00M14M4l16J67m53J30J7L0Q50o91K07o4
$$ 227 402 -79 152 168 -102 -42 -179 -294 -282 -482 -68 -24 -340 -173 -626 -496 -479 -449 401 -290 -83 -147
5194a47L99j11m87N66m4r3K19J34p9k16l7K95k66PK86l30k76M57j39k57l99O03
$$ -147 252 141 -346 220 176 83 302 436 357 141 104 399 133 140 426 96 -180 277 138 -119 -518 85
5216H5m36o9J88k12L35l12k93L49K48k68N5O4K4q9M09k21k07N03k67M82J00k79
$$ 85 -351 -420 -232 -444 -109 -421 -714 -365 -117 -385 -330 -266 -242 -331 78 -143 -350 153 -114 368 468 189
5238A89J1M2K16k11K06j09J4l19L39k1n13R4j76n7J74k46O7j11J8j02L79K0Nm4
$$ 189 200 242 458 247 453 344 358 39 378 357 -156 -62 -238 -295 -121 -367 -300 -411 -393 -495 -116 -96 -91 -135
5262a35n63L92J33K45m17M55j53Q2m6L04nk11M1Q5J86k23Oj77P8J82j9l8m68L70
$$ -135 -698 -306 -173 72 -345 110 -43 39 -7 297 292 81 122 207 393 170 176 -1 77 259 240 202 -266 104
5286A04j94j04O6j68j61J1K25J51j30k00m05M42J8M17m93L64K3m2Q3r3K80l9J15
$$ 104 -90 -194 -128 -296 -457 -446 -221 -70 -200 -400 -805 -363 -345 72 -421 -57 -34 -76 7 -86 194 155 270
5309B70K61j25n68L04k7K04J68l65m3L21k99k25l5K62j93j97J97N0j1j42j28O8
$$ 270 531 406 -162 142 115 319 487 122 79 400 101 -124 -159 103 -90 -287 -90 -40 -51 -193 -321 -253
5331b53J72l97K91J7j5L09l32Q3L14l63M89l94J5L02M3L4l3l5K11j93R5l01MO6
$$ -253 -81 -478 -187 -170 -185 124 -208 -125 189 -174 315 -79 -64 238 281 315 282 247 458 265 360 59 63 129
5355A29n7j68J5K09l79p1J59j31j02J94k57L04k24M5K21J63k48n3L63j11j87J43
$$ 129 72 -96 -81 128 -251 -322 -163 -294 -396 -202 -459 -155 -379 -334 -113 50 -198 -251 112 1 -186 -43
5377d3K46l48O00j74J16r5K81m30J44K0l10J78n5j59M6P3m5M7j6l72j18Q6J82
$$ -43 203 -145 455 281 397 302 583 153 297 317 7 185 130 -29 17 90 45 92 76 -296 -414 -328 -146
5400a46k22Q0k59M44j9j98K42k19K03K34j81K06N0k42J01L08M8k53J65Q1N4j64
$$ -146 -368 -288 -547 -103 -122 -320 -78 -297 -94 140 -41 165 215 -27 74 382 430 177 342 423 477 313
5422C13j13N18n62l58L50j63J68j28l07L45k62j43L53l56j2p9J28m0M60m3l54
$$ 313 200 718 156 -202 148 -15 153 25 -282 63 -199 -342 11 -345 -357 -436 -308 -348 112 69 -285
5443b85j43L57J07m5J1j38K61K05j91j96L98L45n40K99j80N3l62K64j30M6j90
$$ -285 -428 -71 36 -9 2 -136 125 330 139 -57 341 686 146 445 265 318 -44 220 90 136 -54
5464e4j12K21j1k79J51n6j29J66k10P2O2L5m5l6J45J66n66K54K80K49K41p02J1
$$ -54 -166 55 44 -235 -84 -140 -269 -103 -313 -241 -179 -144 -189 -225 -80 86 -480 -226 54 303 544 -158 -147
5487a47K42J6K64O2j95j08J10n1J61k2k78Q2R7k20m19J63K25Op5m3k09N6R6p8
$$ -147 95 111 375 437 242 134 244 193 354 332 54 136 233 13 -406 -243 -18 -12 -87 -130 -339 -283 -187 -265
5511b65l11N26k98j02K80O4K19j22R2n5K42j38k4j79M70m55L26j2O1o1o1j60J86
$$ -265 -576 -50 -348 -450 -170 -106 113 -9 83 28 270 132 108 -71 399 -56 270 258 319 258 197 37 223
5534B23j37l10K66K3r8N4l01n2J93m66Q2K18L33k31j46L58k78J01K84k36J66j84
$$ 223 86 -224 42 65 -33 21 -280 -332 -139 -605 -523 -305 28 -203 -349 9 -269 -168 116 -120 46 -138
5556a38K66J63k40L03j67P1PJ48k24J77k40K99l21k7O5j5k13K06j48j8q9k49O6
$$ -138 128 291 51 354 187 258 265 413 189 366 126 425 104 77 142 127 -86 120 -28 -46 -135 -384 -318
5579c18J59K54m80PL2K49l33L16j28J69k49M30j21q0M58l97K91M2J03l88L94j08
$$ -318 -159 95 -385 -378 -346 -97 -430 -114 -242 -73 -322 108 -13 -93 365 -32 259 301 404 16 410 302
5601C02P5Q1j85j31N8k54K51j60l22K77k99nL6J51%l0o2k94K64R3j88K9J23K95
$$ 302 377 458 273 142 200 -54 197 37 -285 -8 -307 -312 -276 -125 -125 -155 -217 -511 -247 -154 -342 -313 -190 105
5625A05%nJ02k93L85N1j59J91m9j12j72J51L62l89j52q1N49n5o90L27j0q5r8K83
$$ 105 105 100 202 -91 294 345 186 377 328 216 44 195 557 168 16 -65 484 429 -261 66 56 -29 -127 156
5649A56k04J0n25L72j93L59k42M0m2K58j51J8J53J55j37O09p81Q2J35J88j77j68
$$ 156 -48 -38 -563 -191 -384 -25 -267 -227 -269 -11 -162 -144 9 164 27 636 -145 -63 72 260 83 -85
5671h5K50J24j10j90J45j98p7L26j77j25K16P4k05m46K93Q9k63J18J40k39N2K11
$$ -85 165 289 179 -11 134 -64 -141 185 8 -117 99 173 -32 -478 -185 -96 -359 -241 -101 -340 -288 -77
5693g7j68n1K3K61J60j18m33M26j1K13l20K35L55k08m2J69j4r5m36L06k20J20
$$ -77 -245 -296 -273 -12 148 30 -403 23 12 225 -95 140 495 287 245 414 400 305 -131 175 -45 75
5715G5O3j34k91m1M0K69k9p9N7J00m68J92J67n25L70Q1N48n91m3K16j89N97l09
$$ 75 138 4 -287 -328 -288 -19 -48 -127 -70 30 -438 -246 -79 -604 -234 -153 395 -196 -239 -23 -212 385 76
5738G6J92m75K09M76l58J13N2j78j9P3P6J63m08J00o4K9j98j66M77k87j8o7J24
$$ 76 268 -207 2 478 120 233 285 107 88 161 237 400 -8 92 28 57 -141 -307 170 -117 -135 -202 -78
5761g8o2q4qJ99k43j62j4L60N9L5L67m11O9J29J67q2k07M8M8R7k26l6J99J60k98
$$ -78 -140 -224 -232 -33 -276 -438 -452 -92 -33 2 369 -42 27 156 323 241 34 82 130 227 1 -35 164 324 26
5786B6J41k77J36jj91j03K35Lj22j31J81p4k25K74n2K11j48k41L15J97k11J31
$$ 26 167 -110 26 25 -166 -269 -34 -31 -153 -284 -103 -177 -402 -128 -180 31 -117 -358 -43 154 -57 74
5808G4O1j04K30j79L51j3j82J59j58k59J83j4J31l53R4L75n00j48J41J48l72j7
$$ 74 135 31 261 82 433 420 238 397 239 -20 163 149 280 -73 21 396 -104 -252 -111 37 -335 -352
5830c52L7N52m42j04L8k0K40K0p0j74N88n53L55j44R0j22J20J11J12j55P0j90
$$ -352 -315 237 -205 -309 -271 -291 -51 -31 -101 -275 313 -240 115 -29 61 -61 59 170 282 127 197 7
5852GJ41K70J31m47J64j65k2j16K52j83j30M4k62K69j67j5Q6j03j68Q1L39K3r3
$$ 7 148 418 549 102 266 101 79 -37 215 32 -98 -54 -316 -47 -214 -229 -143 -246 -414 -333 6 29 -64
5875f4J2j52J38L06l26K30P6L04l56J54k63o7M8M36j75k51N4L8L6o1O0k30k48
$$ -64 -52 -204 -66 240 -86 144 220 524 168 322 59 -8 40 476 301 50 104 142 178 117 177 -53 -301
5898c01M45j66j32r0r3M35m69j22N07m1Q9k34j50M21p4j75N2k3J82k4J43L39j62
$$ -301 144 -22 -154 -244 -337 98 -371 -493 14 -27 62 -172 -322 99 25 -150 -98 -121 61 37 180 519 357
5921C57k63J59O0l6l3K9Q2k33j01j7k4j38J31k08J35L23m02J43L7r0l05K25J29
$$ 357 94 253 313 277 244 273 355 122 21 4 -20 -158 -27 -235 -100 223 -179 -36 1 -89 -394 -169 -40
5944d0l24K57K17k17M36m63J65J85k80K38j53J79j08K09k48K4K24K8r1m9j29k7
$$ -40 -364 -107 110 -107 329 -134 31 216 -64 174 21 200 92 301 53 77 301 329 238 189 60 33
5966C3k9j9o4j83j37M68j92J65m60n4K53j7q4M6j63K58j10J57J14q7M68j34k17
$$ 33 4 -15 -79 -262 -399 69 -123 42 -418 -472 -219 -236 -320 -274 -437 -179 -289 -132 -18 -105 363 229 12
5989A2K15j33k7l75M20J82j90LL20k85l8k01Q4J3J33K24m34j67K40k33K90o58
$$ 12 227 94 67 -308 112 294 104 107 427 142 104 -97 -13 0 133 357 -77 -244 -4 -237 53 -605
6011f05K63O2R1k07K15J47r4l21K64j8K88j06J47J83K6j69j90J46OJ15n6O9n4
$$ -605 -342 -280 -189 -396 -181 -34 -128 -449 -185 -203 85 -21 126 309 335 166 -24 122 128 243 187 256 202
6034B02K2J37k90R5J5j80j42O0K8m57M60r3r4m2j14L84m5j86j99J07O06p1q0j53
$$ 202 224 361 71 166 181 1 -141 -81 -53 -510 -50 -143 -237 -279 -393 -9 -54 -240 -439 -332 274 203 123 -30
6058c0K43P3l01J01J77J13k00nl8K05p6j16O0j31K41l48Rl51L15j95N7K34K6j90
$$ -30 213 286 -15 86 263 376 176 171 133 338 262 146 206 75 316 -32 -23 -374 -59 -254 -197 37 63 -127
6082a27l47L56r1j12J18j53j29O0j4J72K69p6k09J40l7K29K57l2l7j17j02J40
$$ -127 -474 -118 -209 -321 -203 -356 -485 -425 -439 -267 2 -74 -283 -143 -180 49 306 274 237 120 18 158
6104A58k2M52j66l5l23Q4m39K79Pj88L67k27k29oj47j8K39J37j64m01O49k25P6
$$ 158 136 588 422 387 64 148 -291 -12 -5 -193 174 -53 -282 -288 -435 -453 -214 -77 -241 -642 7 -218 -142
6127a42L3K01K8j85J51R3j8K06n2j4o2K09k23ok59l2K23R5k04j48L03k28j73N2
$$ -142 -109 92 120 -65 86 179 161 367 315 301 239 448 225 219 -40 -72 151 246 42 -106 197 -31 -204 -152
6151a52J84n3J19j56J64n30L00j84K47J9R8j20K5o9j53L04K33j53o2J66j66J08
$$ -152 32 -21 98 -58 106 -424 -124 -308 -61 -42 56 -64 -39 -108 -261 43 276 123 61 227 61 169
6173A69J55L8k49K11k91L82m23J6K02k98J68m4j02L4j35K08m34L19j54K08k39
$$ 169 324 362 113 324 33 415 -8 8 210 -88 80 36 -66 -32 -167 41 -393 -74 -228 -20 -259
6194b59j32K12M2K26j53k01L12j59J06J50j06J40mj59K33N1k66O9J35o5j76K58
$$ -259 -391 -179 -137 89 -64 -265 47 -112 -6 144 38 178 174 15 248 299 33 102 237 172 -4 254
6216B54k59K21k26J21j62j21J74l14K77k24M00k85j85J47q5Q1n3j39M58J09j05
$$ 254 -5 216 -10 111 -51 -172 2 -312 -35 -259 141 -144 -329 -182 -267 -186 -239 -378 80 189 84
6237H4j0k28J34J05K79l50J51L8l22L82m2j17k4M6Jk5j84j39K37n9J47l98L63
$$ 84 74 -154 -20 85 364 14 165 203 -119 263 221 104 80 126 127 102 -82 -221 16 -43 104 -294 69
6260F9L4J36m94j16L37j31J4j64K50J62k04L3K06j52Q5k3J0j57L69J01l68K27
$$ 69 103 239 -255 -371 -34 -165 -151 -315 -65 97 -107 -74 132 -20 65 42 52 -105 264 365 -3 224
6282B24p9J49j5j52J59k26k73J40K50m85L18k26j13K94l97J17R1JQ1Nq9L49j85
$$ 224 145 294 279 127 286 60 -213 -73 177 -308 10 -216 -329 -35 -432 -315 -224 -223 -142 -137 -226 123 -62
6305f2J81o32L10M43n68K21mL6L51j22o8j40M1L09j53j70L23J3P6l97m2J95k98
$$ -62 119 -513 -203 240 -328 -107 -111 -75 276 154 86 -54 -13 296 143 -27 296 309 385 -12 -54 141 -157
6328a57oo3R3L6L39n51K38n4M0J07j17j53RJ96m4J18J74j96Q7Qj36O0Oj1K75J97
$$ -157 -163 -226 -133 -97 242 -309 -71 -125 -85 22 -95 -248 -239 -43 -87 31 205 9 96 104 -32 28 34 23 298 495
6354D95n46J10j92K88j28l1J24j04n0j66kJ46J16k41j7N6%O6K5Q8k46p5M4qK6
$$ 495 -51 59 -133 155 27 -4 120 16 -34 -200 -202 -56 60 -181 -198 -142 -142 -76 -51 37 -209 -284 -240 -248 -222
6379b22m8K4K4Q6K59q7k5L92m93K68L09k26p3N8jj01j22J96r9k15J04j77J42n5
$$ -222 -270 -246 -222 -136 123 36 11 403 -90 178 487 261 188 246 245 144 22 218 119 -96 8 -169 -27 -82
6403h2l40M01J49l90jm7k2K16p9J86J76m66M19P1n95M10K85j42N2r2K13J37k28
$$ -82 -422 -21 128 -262 -263 -310 -332 -116 -195 -9 167 -299 120 191 -404 6 291 149 201 109 322 459 231
6426B31r1M98o26J70m9j49J2L25kl83o1J26j73M57m97J64j65k64q6M36lj03J6
$$ 231 140 638 12 182 133 -16 -4 321 319 -64 -125 1 -172 285 -212 -48 -213 -477 -563 -127 -130 -233 -217
6449b17K00k6j2J31J89n51L33J9p3q8%L57j75k49N19J41k63j87K51K04l88n4n4
$$ -217 -17 -43 -55 76 265 -286 47 66 -7 -95 -95 262 87 -162 357 498 235 48 299 503 115 61 7
6472Gj3l92L55J95l82r4L36K81l36n0l21M31k62K0O4K20J37k09J47J74k43J12
$$ 7 -6 -398 -43 152 -230 -324 12 293 -43 -93 -414 17 -245 -225 -161 59 196 -13 134 308 65 177
6494A77Mm1o9K18k2j19M8q5K48k26O7n36L46M9J00ll33N4J97K2j71k74J04K56
$$ 177 181 140 71 289 267 148 196 111 359 133 200 -336 10 59 159 156 -177 -123 74 96 -75 -349 -245 11
6518A1o85P88k10J27m0l65L26J88j80Q9o9J61j03K42j74j75M12l20L27k3j34j59
$$ 11 -674 114 -96 31 -9 -374 -48 140 -40 49 -20 141 38 280 106 -69 343 23 350 327 193 34
6540C4L92k73j47k66n9O13k54k29J80jk10j39k45N83J5j65J75o5J2j8K8K33J02
$$ 34 426 153 6 -260 -319 294 40 -189 -9 -10 -220 -359 -604 -21 -6 -171 4 -61 -49 -67 -39 194 296
6563B96m47J53J13q9O7J62O2l72M45m5j10K8j20J01n57N61J06n31J10r9L41m15
$$ 296 -151 2 115 26 93 255 317 -55 390 345 235 263 143 244 -313 248 354 -177 -67 -166 175 -240
6585b40k6J12K57m37J65L10m8r1j97L46j46q1m0K30j79l3K10j53P7R2L47k13k53
$$ -240 -266 -154 103 -334 -169 141 93 2 -195 151 5 -76 -116 114 -65 -98 112 -41 36 128 475 262 9
6608IJ22k38L32r3J2m4j67j35J92Q8l72K81j85K66m74L64r8K17j49L8k44J84R7
$$ 9 131 -107 225 132 144 100 -67 -202 -10 78 -294 -13 -198 68 -406 -42 -140 77 -72 -34 -278 -94 3
6631Cn5m8n5K66Rk45K61k8o8L34r9O0m49J60M60l80k0O5l53K82n23K64K04J0k39
$$ 3 -52 -100 -155 111 120 -125 136 108 40 374 275 335 -114 46 506 126 106 171 -182 100 -423 -159 45 55 -184
6656a84kJ83r7l6Oj7k28K0M24j27n9q3K51l42K66K43m7r1n8J91j76K0J26L39k57
$$ -184 -186 -3 -100 -136 -130 -147 -375 -355 69 -58 -117 -200 51 -291 -25 218 171 80 22 213 37 57 183 522 265
6681B65l77K97j78J91m0l02K84Nk14K00m35M22k96K18k74jL13p8j71rM5N7l25
$$ 265 -112 185 7 198 158 -144 140 145 -69 131 -304 118 -178 40 -234 -235 78 0 -171 -180 -135 -78 -403
6704d03L68J5K51k30J20k04K7J29J88j92l4n3n8K11k19k11L79L57o47J78J10l05
$$ -403 -35 -20 231 1 121 -83 -56 73 261 69 35 -18 -76 135 -84 -295 84 441 -206 -28 82 -223
6726b23O2j8K59m98J87L9K94k99J49k29L28K9r4l49L23L60k26J16J95k39r2J20
$$ -223 -161 -179 80 -418 -231 -192 102 -197 -48 -277 51 80 -14 -363 -40 320 94 210 405 166 74 194
6748A94Jj50Q7j02L3J75m4j64p7K03J41n42N78n0k36J21k60Q3j59Q4j23L21l97
$$ 194 195 45 132 30 63 238 194 30 -47 156 297 -245 333 283 47 168 -92 -9 -168 -84 -207 114 -283
6771b83nR8J47k25M23j58j87L93j34o1lK5K80j12J41k22R9k90K28J88j15r6R3
$$ -283 -288 -190 -43 -268 155 -3 -190 203 69 8 5 30 310 198 339 117 216 -74 154 342 227 131 224
6794B24j75j27K78l66J88k14n7N4K98k94N8J55k50j9m7L94p8R4j73j57O7oJ80
$$ 224 49 -78 200 -166 22 -192 -249 -195 103 -191 -133 22 -228 -247 -294 100 22 116 -57 -214 -147 -153 27
6817B7j65N42Nj14R3k95K50n0K79l87n6k18Q5j36k09M50j35L25p7l64lk02j27
$$ 27 -138 404 409 295 388 93 343 293 572 185 129 -89 -4 -140 -349 101 -34 291 214 -150 -153 -355 -482
6840d82K20K66j05p6n4K32r1J12k01J88n3K08q0J98J4k12J31k36J76P3p9r5j67
$$ -482 -262 4 -101 -177 -231 1 -90 22 -179 9 -44 164 84 282 296 84 215 -21 155 228 149 54 -113
6863a13J02J45j16M6m1L0j63oN3j38j32K21J08n14N14j82J18j75m6L17j85J68
$$ -113 -11 134 18 64 23 53 -110 -116 -63 -201 -333 -112 -4 -518 -4 -186 -68 -243 -289 28 -157 11
6885A1L8mJk37K39O7K09k88K48j67K73j75M6j29j87J78p5k01M22n1l69p1O6J03
$$ 11 49 45 46 -191 48 115 324 36 284 117 390 215 261 132 -55 123 48 -153 269 218 -151 -222 -156 -53
6909e3l85L79j95J05J95l89M0j7K22J16J07L7m36M4N8J13q1K76O8q0j7j01J86
$$ -53 -438 -59 -254 -149 46 -343 -303 -320 -98 18 125 162 -274 -230 -172 -59 -140 136 204 124 107 6 192
6932A92J22j80pj52O9n6k48j1j00K06M05k75j45m3r3n1P5P2r4K58l29K86l19N66
$$ 192 314 134 127 -25 44 -12 -260 -271 -371 -165 240 -35 -180 -223 -316 -367 -292 -220 -314 -56 -385 -99 -418 148
6956A48j94p7J18J35K94l27k2j8M7j60L83k47r8j26J92K81l69K53m28L66L7n66
$$ 148 -46 -123 -5 130 424 97 75 57 104 -56 327 80 -18 -144 48 329 -40 213 -215 151 188 -378
6978c78M07j40j14J19R6j62K90m04J06N0J98n2K7M2j11J10m62M54J22m39N88l52
$$ -378 29 -111 -225 -106 -10 -172 118 -286 -180 -130 68 16 43 85 -26 84 -378 76 198 -241 347 -5
7000eJ98p7K25j34r0J82K3j58n6k69k7K06j99J17k23J71J48k28j64L16K74m74
$$ -5 193 116 341 207 117 299 322 164 108 -161 -188 18 -181 -64 -287 -116 32 -196 -360 -44 230 -244
7022b44J03K51k84L9j4P9r3P2P1m1L17j23o9K95j95m5K52L3m5r6k24m1K20q3j9
$$ -244 -141 110 -174 -135 -149 -70 -163 -91 -20 -61 256 133 64 359 164 119 371 404 359 263 39 -2 218 135 116
7047A16n3n1J73m71K75L29k70J31n03q8q0L96J45l9l86M29l23K84j27L4K20j45
$$ 116 63 12 185 -286 -11 318 48 179 -324 -412 -492 -96 49 10 -376 53 -270 14 -113 -79 141 -4
7069dr4L89l80N24l6j54j70J26J43k35o2j68K37l19L02r6j09l0N2p9p4J68r8J1
$$ -4 -98 291 -89 435 399 245 75 201 344 109 47 -121 116 -203 99 3 -106 -136 -84 -163 -237 -69 -167 -156
7093a56J47j11m0J1J13K29m8J28j89k39O8NM19m39RL99M3k23k41J85L13l99K98
$$ -156 -9 -120 -160 -149 -36 193 145 273 84 -155 -87 -82 337 -102 -93 306 349 126 -115 70 383 -16 282
7116B82j74J81m50K63m8p6K59m72j3m8K10J89m06k62L93l1j76J30J03j76L03L28
$$ 282 108 289 -161 102 54 -22 237 -235 -248 -296 -86 103 -303 -565 -172 -203 -379 -249 -146 -322 -19 309
7138C09O9k74k57J67L34l36l39N16L73j94k58J27j77j5K8N5m55M56K13k07k21
$$ 309 378 104 -153 14 348 12 -327 189 562 368 110 237 60 45 73 128 -327 129 342 135 -86
7159h6l84nK38M5j39L53j80K75k03j94J87J98m4k37K38l1J71j95K00P2j08j5o5
$$ -86 -470 -475 -237 -192 -331 22 -158 117 -86 -280 -93 105 61 -176 62 31 202 7 207 279 171 156 91
7182I1J14Ok07p8j29L79k33L65j02k99K80m44K85p3j68J50P3o3k13K03O8J27l14
$$ 91 205 211 4 -74 -203 176 -57 308 206 -93 187 -257 28 -45 -213 -63 10 -53 -266 -63 5 132 -182
7205a82K52k69K57j56L29m33M83k91M07k72J80j95jK60k51Q8K3n5k60L22O6M5
$$ -182 70 -199 58 -98 231 -202 281 -10 397 125 305 110 109 369 118 206 229 174 -86 236 302 347
7227C47l6m90L70J49n85L38m34J5K05k8j01L97m04J95k54K92K96o1k07L1M7J2
$$ 347 311 -179 191 340 -245 93 -341 -326 -121 -149 -250 147 -257 -62 -316 -24 272 211 4 35 82 94
7249I4N5k05J84J98m3k37kL80j60N3j65r9j86j%J52rk13J73q3P8j24o1l07L56
$$ 94 149 -56 128 326 283 46 44 424 264 317 152 53 -133 -134 -134 18 9 -204 -31 -114 -36 -160 -221 -528 -172
7274a72j68L1M19l35J1K16J72L23n46J73k6R4R7j19oj07P1J8L20Pm82J56Q9o0
$$ -172 -340 -309 110 -225 -214 2 174 497 -49 124 98 192 289 170 164 57 128 146 466 473 -9 147 236 176
7298A76km85K85k50J11R4p8k6L4L7K31l74N4K17q4j10R9J36K7K97m67l70O44j29
$$ 176 174 -311 -26 -276 -165 -71 -149 -175 -141 -104 127 -247 -193 24 -60 -170 -71 65 92 389 -78 -448 196 67
7322F7l92N95N0j34r7J65j15r0J51j75J23p2l31J97J1j30L11m26j3M20m97L42
$$ 67 -325 270 320 186 89 254 139 49 200 25 148 76 -255 -58 -47 -177 134 -292 -305 115 -382 -40
7344d0l02Q0l2J59j85Nq1L28q9K46M5j58L03l23J77k05K33K40l27Q8rk2j01L5
$$ -40 -342 -262 -294 -135 -320 -315 -396 -68 -157 89 134 -24 279 -44 133 -72 161 401 74 162 153 131 30 65
7368F5L7l50j47N51l61J28O0p4M03o04K18Kq1m43L80J19J31r4J22k34L21k76j96
$$ 65 102 -248 -395 156 -205 -77 -17 -91 312 -292 -74 -72 -153 -596 -216 -97 34 -60 62 -172 149 -127 -323
7391c23J09L02N5k67K83pK49k27N5mj75J92r2j23j28K78k68j44J20r0j92K12L60
$$ -323 -214 88 143 -124 159 152 401 174 229 225 50 242 150 27 -101 177 -91 -235 -115 -205 -397 -185 175
7414A75k56Oj41nK7p4P6J87j72M7J83J59l33L5N98o35J29K60q1N8p2l02J94k9
$$ 175 -81 -75 -216 -221 -194 -268 -192 -5 -177 -130 53 212 -121 -86 512 -123 6 266 185 243 171 -131 63 34
7438C4j85J38R7j32K47k32J58j41k97P0K50k30j33K08p2L08k27J30k58K91j44
$$ 34 -151 -13 84 -48 199 -33 125 -16 -313 -243 7 -223 -356 -148 -220 88 -139 -9 -267 24 -120
7459a20OJ53j45l6J95Q8j93L30L8j20M4j33J28k49j02J99R5p4n4J89k86p0p2J37
$$ -120 -114 39 -106 -142 53 141 -52 278 316 196 240 107 235 -14 -116 83 178 104 50 239 -47 -117 -189 -52
7483e2L54l28k28J73J10k36Q2O1L61Ll22J62j33j91K38k67K50J44o0J10k39L13
$$ -52 302 -26 -254 -81 29 -207 -125 -64 297 300 -22 140 7 -184 54 -213 37 181 121 231 -8 305
7505C05j29r2r8J71k9pJ00j37l55L31l6k88K43K07l57k93K81j08K75l54J09L24
$$ 305 176 84 -14 157 128 121 221 84 -271 60 24 -264 -21 186 -171 -464 -183 -291 -16 -370 -261 63
7527F3l54P9j36M23j10J10RK48j8m34K79j75j2L85p1l00qK29n3j43o6QJ02j10
$$ 63 -291 -212 -348 75 -35 75 84 332 314 -120 159 -16 -28 357 286 -14 -22 207 154 11 -55 -47 55 -55
7551e5j8P0l7k56J47J87j77J55J6qr0k50N74n24J63J88l8j94L05j40J71k87J69
$$ -55 -73 -3 -40 -296 -149 38 -139 16 32 24 -66 -316 258 -266 -103 85 47 -147 158 18 189 -98 71
7574G1J79j99Q7l46K41O3K25k53k55N3J81k1K8j78m7J24m7J6j79p1K03J42l89
$$ 71 250 51 138 -208 33 96 321 68 -187 -134 47 26 54 -124 -171 -47 -94 -78 -257 -328 -125 17 -372
7597c72M42j68J80l17J3J35J13K2N3p8J2K26J03l55k38L33L34k28j3q6O4J13n
$$ -372 70 -98 82 -235 -222 -87 26 48 101 23 35 261 364 9 -229 104 438 210 197 111 175 288 283
7620B83k49j1j27J74k13k42K61o5k29J17J63o0N1r5o2K32p3Q3j8m0J98j17K1K
$$ 283 34 23 -104 70 -143 -385 -124 -189 -418 -301 -138 -198 -147 -242 -304 -72 -145 -62 -80 -120 78 -39 -18 -16
7644a6J3J74K60l03P5l13K68k01k06N20j51k97J07R2n6K83l23K7J5K36q6j21k80
$$ -16 -3 171 431 128 203 -110 158 -43 -249 271 120 -177 -70 22 -34 249 -74 -47 -32 204 118 -3 -283
7667b83O5q8L59k28J82m3P6j16r2J81J04j12K12l10M0K50j33m5K2M4N7n6r8K18
$$ -283 -218 -306 53 -175 7 -36 40 -76 -168 13 117 5 217 -93 -53 197 64 19 41 85 142 86 -12 206
7691B06k74J49oJ22j14K30m0k89ok75M52m91j10K00l4K50j11j66K89j43J29k2
$$ 206 -68 81 75 197 83 313 273 -16 -22 -297 155 -336 -446 -246 -280 -30 -141 -307 -18 -161 -32 -54
7713e4M52m72J28K5M5m24N00K09k90J18n6r3K43jl16K3R9N0k43J3j50Q0J44m91
$$ -54 398 -74 54 79 124 -300 200 409 119 237 181 88 331 330 14 37 136 186 -57 -44 -194 -114 30 -461
7737d61L70j7M7k15N0O7k6j94K41o2K02j04R1K50j0l3j10j42j2P0K46m70M8J91
$$ -461 -91 -108 -61 -276 -226 -159 -185 -379 -138 -200 2 -102 -11 239 229 196 86 -56 -68 2 248 -222 -174 17
7761A7N6M3p9K76l24q0J87J92j01m01R1J04p7j0K71k96lk1p7K75J62l21K24j96
$$ 17 73 116 37 313 -11 -91 96 288 187 -214 -123 -19 -96 -106 165 -131 -134 -155 -232 43 205 -116 108 -88
7785h8M03J58m35NK7j13L1L02n4n8N4j75N2J50l27K53L8J22m95L42j02l46k80
$$ -88 315 473 38 43 70 -43 -12 290 236 178 232 57 109 259 -68 185 223 345 -150 192 90 -256 -536
7808e36M40L8k51J27k85J1L81j18L23j62J60Q2j01L29m76j07N8Q3K50o8L5J19
$$ -536 -96 -58 -309 -182 -467 -456 -75 -193 130 -32 128 210 109 438 -38 -145 -87 -4 246 178 213 332
7830C32j00k67K51p2j41J94m59K63J28n14L12m9L4Q2j99K18n0j22n1K05m5q1J31
$$ 332 232 -35 216 144 3 197 -262 1 129 -385 -73 -122 -88 -6 -205 13 -37 -159 -210 -5 -50 -131 0
7853@k46K99Q8k76J98j37M6J45j30K48j67p5L1R6Q6J05j34j50K75p0m45L8M48
$$ 0 -246 53 141 -135 63 -74 -28 117 -13 235 68 -7 24 120 206 311 177 27 302 232 -213 -175 273
7876B73j39l63J18l4k38L85j96K63l99K93r2K16j20j50m8K93k23K9K51j67j77
$$ 273 134 -229 -111 -145 -383 2 -194 69 -330 -37 -129 87 -33 -183 -231 62 -161 -132 119 -48 -225
7897b25K48K55j32o7K30k97p1K67m5m47K64J80j79m17M58n5j07j52J30mL77l87
$$ -225 23 278 146 79 309 12 -59 208 163 -284 -20 160 -19 -436 22 -33 -140 -292 -162 -166 211 -176
7919a76O5J31k33l9K7J98k66L23P5lj31O4k4NM4J85j25j1K16k29K34j17Q3l80
$$ -176 -111 20 -213 -252 -225 -27 -293 30 105 102 -29 35 11 16 60 245 120 109 325 96 330 213 296 -84
7943h4L50n25K28O2j62q7L91k94Q1P7L7k7P3K5k34K1o4J25K41Rl38N6K61k86L81
$$ -84 266 -259 -31 31 -131 -218 173 -121 -40 37 74 47 120 145 -89 -68 -132 -7 234 243 -95 -39 222 -64 317
7968C17P0j38k92J5N3j13K00Q4j33K82k48K6l11J35J50j07q3L9j02j67M8R9J64
$$ 317 387 249 -43 -28 25 -88 112 196 63 345 97 123 -188 -53 97 -10 -93 -54 -156 -323 -275 -176 -12
7991a2J75l76j73J60m2L7K10M3r3K15N2p4q2R1J02qj64j14L2J37j80L4J07k68
$$ -12 163 -213 -386 -226 -268 -231 -21 22 -71 144 196 122 40 131 233 225 61 -53 -21 116 -64 -30 77 -191
8015a91K77n5k34L07k33J11r6j00R2K33m70K01K12k50L63j61J27j23m3L86n92
$$ -191 86 31 -203 104 -129 -18 -114 -214 -122 111 -359 -158 54 -196 167 6 133 10 -33 353 -239
8036b39N7J19p8L62l2J12r0R1k27j35J37R9OL7l67J93j49K5K35k33N1j32K22l82
$$ -239 -182 -63 -141 221 189 301 211 302 75 -60 77 176 182 219 -148 45 -104 -79 156 -77 -26 -158 64 -318
8060c18l2J59N3J95q9J76p1j93J65N7k59J0J58k0L34j71j19K86k94k10J90J00
$$ -318 -350 -191 -138 57 -32 144 73 -120 45 102 -157 -147 11 -9 325 154 35 321 27 -183 7 107
8082A07P0k83R3J72N8l48Q0K00m6pk33P7j88N8k31M38k91N6O61n55n7J95J94k68
$$ 107 177 -106 -13 159 217 -131 -51 149 103 96 -137 -60 -248 -190 -421 17 -274 -218 443 -112 -169 26 220 -48
8106d8J01N6J21k8j45jm4M1J81rP9k5O0m32M43k26j01O8j58J01j75J85mk48L20
$$ -48 53 109 230 202 57 56 12 53 234 225 304 279 339 -93 350 124 23 91 -67 34 -141 44 40 -208 112
8131A12j55J7K02k22J29l46M07m4m8j46k00L89J81m94Q4N0K0J39q6J68J00k49
$$ 112 -43 -26 176 -46 83 -263 144 100 52 -94 -294 95 276 -218 -134 -84 -64 75 -11 157 257 8
8153Hp8k06M41j71Q3K6j12L14J68k75l42J05l5J5n5M7R0j3m57M11j39N6p3n4J28
$$ 8 -70 -276 165 -6 77 103 -9 305 473 198 -144 -39 -74 -59 -114 -67 23 10 -447 -36 -175 -119 -192 -246 -118
8178a18k27J06J89J51m9J05j38k5K29l0om37L04
$$ -118 -345 -239 -50 101 52 157 19 -6 223 193 187 -250 54
8191E4
$$ Imaginary data points
##PAGE= N=2
##DATA TABLE= (X++(I..I)), XYDATA
0@%%%%%%%%qJ1j1J6j6J6k4L2l5M3n2O0p2Q6r6J08j24J44j66J86k10K39k70L03
$$ 0 0 0 0 0 0 0 0 0 -8 3 -8 8 -8 8 -16 16 -19 24 -28 32 -40 46 -50 58 -66 78 -88 98 -112 127 -143 160
32A60l37L77m23M71n21N77o42P11p88Q73r66J071j186J316j464J631j823K048
$$ 160 -177 200 -223 248 -273 304 -338 373 -415 458 -508 563 -623 693 -771 860 -963 1085
50A085k316K639l039L547m214N136o502Q725j2924K3526r4641j95427K50212J59707
$$ 1085 -1231 1408 -1631 1916 -2298 2838 -3664 5061 -7863 15663 -78978 -274405 -24193 135514
64A35514j84996j43732J56298J17843q8447o9778P0363N0296j7585k5252j6541
$$ 135514 -49482 -193214 -36916 80927 -7520 -77298 -6935 43361 25776 524 -16017
75a6017q073L9383J9082n7651l0087P2807L4510p4941l0627Q5897L2182q3456
$$ -16017 -24090 15293 34375 -23276 -53363 19444 53954 -20987 -51614 34283 66465 -16991
87a6991k8991Q0954K1368q0344k1951P2177J5033o6453j1744N5401J629m7591
$$ -16991 -45982 34972 56340 -24004 -45955 26222 41255 -25198 -36942 18459 20088 -27503
99b7503R352M6265j5555m5849J4760M3514q366l6809r62K4610R046j1688j5942
$$ -27503 -18151 28114 12559 -33290 -18530 24984 16618 -20191 -21153 3457 12503 815 -15127
112a5127J349K7185J1485l7020k3030M9121M0521n2311n1863N3749O2304m7222
$$ -15127 -13778 13407 24892 -12128 -35158 13963 54484 2173 -49690 4059 66363 19141
124A9141o3216M2303N8850m0581n9483K8067M9226k4811m6408J3751M0037n62
$$ 19141 -44075 -1772 57078 16497 -42986 -14919 34307 9496 -36912 -23161 16876 16314
136A6314k8471o903K0137J4787r310j8061J804J6011l5j7844J3K0672L076j9093
$$ 16314 -12157 -19060 1077 15864 6554 -11507 -9703 6308 6273 -11571 -11558 9114 12190 -6903
150f903o98J8958l88j7851L763J7842q116j9907J0085K4174q276k4576R614K9022
$$ -6903 -7601 11357 10969 -6882 -3119 14723 6607 -13300 -3215 20959 12683 -11893 -2279 26743
164B6743o874l3945l359L0741P343l2397j8457K5113K3047k3035k8691K0849L9365
$$ 26743 19869 -14076 -17435 13306 20649 -11748 -30205 -5092 17955 -5080 -33771 -12922 26443
177B6443j0556m4267P12M6490R401m4855j6679M2488K2060m0178k4854M0624L3283
$$ 26443 15887 -28380 -27668 18822 28223 -16632 -33311 9177 31237 -8941 -33795 6829 40112
190D0112l3660l3653K8820L6453k1357l7740J2834L3323p866l4955k093L1848
$$ 40112 6452 -27201 1619 38072 16715 -21025 -8191 25132 17266 -17689 -19782 12066
202A2066R204l0092j6644K7979K3303k5773l1436K1385L5464j7548l9884J0436
$$ 12066 21270 -8822 -25466 2513 25816 43 -31393 -10008 25456 7908 -31976 -21540
214b1540M1492l943l8919J577L9563M553l6584q366L3938J2519k9621j5316K4770
$$ -21540 19952 16009 -22910 -21333 18230 22783 -13801 -22167 11771 24290 -5331 -20647 4123
227D123J6472j8089j4967J6629J6055j2441j8452P071K0098l766k5280m801K5355
$$ 4123 20595 2506 -12461 4168 20223 7782 -10670 -3599 16499 12733 -12547 -17348 8007
240H007Q422k8999j5167L0760K0520l1886k6065L1052K8118k9247l0046K7194
$$ 8007 16429 -12570 -27737 3023 23543 -8343 -34408 -3356 24762 -4485 -34531 -7337
252g337L0532k2203k8926J9551K9288j0138k4327O640K2804k20k1111n534J8380
$$ -7337 23195 992 -27934 -8383 20905 10767 -13560 -6920 15884 15664 -5447 -10981 7399
265G399J1548j5826j9312J0315K2963n776k5046J563K6244J222k7304n374K4534
$$ 7399 18947 3121 -16191 -5876 17087 11311 -13735 -12172 14072 15294 -12010 -17384 7150
278G150P100k4178j0280K1173J0815j9144j0587J8751J1059j6523j0310J4264
$$ 7150 14250 -9928 -20208 965 11780 -7364 -17951 800 11859 -4664 -14974 -710
290g10R220j3546q695J2880J0369r207q528R781J2720m032j1738J556J3361k02
$$ -710 8510 -5036 -13731 -851 9518 311 -8217 1564 14284 10252 -1486 70 13431 13229
304A3229j7523n345J7499P347k1565j3280K1924J7486k2597k0401K0777K3201
$$ 13229 -4294 -9639 7860 15207 -6358 -19638 2286 19772 -2825 -23226 -2449 20752
316B0752k0290k5989J6687K5407j2217k6380Q624K5399k719k0623j49J8718N281
$$ 20752 462 -25527 -8840 16567 4350 -22030 -13406 11993 9274 -11349 -11498 7220 12501
329A2501j4250r805J1248J3392p525j5364M702J8281j841j9534J850K1400L90
$$ 12501 -1749 -11554 -306 13086 5561 -9803 -5101 13180 11339 -8195 -6345 15055 15445
342A5445k3062j747K2160P21k3308l140K1754J837k2857m982K1576O661j9570
$$ 15445 -7617 -9364 12796 13517 -9791 -12931 8823 10660 -12197 -17179 4397 11058 -8512
355h512r747J6838J2590j3719j6420J0617K0591l630k2299p78K5987R804k3548
$$ -8512 -18259 -1421 11169 -2550 -18970 -8353 12238 8608 -13691 -14469 11518 21322 -2226
368b226j3039K3745J8370k2296k3132J8448K4885j6360k6151J2053K4875j0690
$$ -2226 -15265 8480 26850 4554 -18578 -130 24755 8395 -17756 -5703 19172 8482
380H482k2722P649K0888o465k0167L480J6414k680j4905l1J2313K811r465n117
$$ 8482 -14240 -6591 14297 7832 -12335 -8855 7559 4879 -10026 -10057 2256 5067 -4398 -9515
394i515P702Q411m173j1065K193J2426J92j4947q61J8584L574j8593m072K1958
$$ -9515 -1813 6598 2425 -8640 -6447 5979 6171 -8776 -9637 8947 12521 -6072 -10144 11814
408A1814P768k1542q629K1345R601k1712j2828J7767J2753j6288j5379J0492J4601
$$ 11814 19582 -1960 -10589 10756 20357 -1355 -14183 3584 16337 49 -15330 -4838 9763
421I763o565j4235J355J1910K920j1327o573R518R534o520j0625N968J3072l392
$$ 9763 3198 -11037 -9682 2228 5148 -6179 -12752 -3234 6300 -220 -10845 -4877 8195 4803
435D803j1961M619J2870m203j3341L942J2999m312j3182M808J3220m550j2128
$$ 4803 -7158 -2539 10331 6128 -7213 -3271 9728 5416 -7766 -2958 10262 5712 -6416
448f416N341J3571m614j3223L043J2439m971j3333J333J2169r70j2478k218J0653
$$ -6416 -1075 12496 7882 -5341 -2298 10141 5170 -8163 -6830 5339 4369 -8109 -10327 326
462C26M883q596o953N955Q643k890j1105J26J3566M728j2975o705J4253J0855
$$ 326 5209 -3387 -10340 -4385 4258 1368 -9737 -9611 3955 8683 -4292 -10997 3256 14111
476A4111j1624j1840J1881J4471j0757j5397P528J4481n549j4271L232J2132k779
$$ 14111 2487 -9353 2528 16999 6242 -9155 -1627 12854 7305 -6966 -3734 8398 5619
489E619j1036L49Q822r3q611j805O570J311o780k860P371M620p174o194Q226R401
$$ 5619 -5417 -5068 3754 3661 -4950 -6755 -185 1126 -5654 -8514 -1143 3477 -3697 -9891 -1665 7736
505G736p996j0747Q239J3537p285j5646N971J8691k776j8447K84K0010L988j8267
$$ 7736 -260 -11007 -2768 10769 3484 -12162 -6191 12500 9724 -8723 -8439 11571 15559 -2708
519b708o140J5526Q387j3382j2549Q876J2591o249j4838J632J3763J345j4009
$$ -2708 -8848 6678 15065 1683 -10866 -1990 10601 4352 -10486 -8854 4909 6254 -7755
532g755n067J2943P203j1691r889R761J1780p551j1858P058J2917l516j1600L025
$$ -7755 -12822 121 7324 -4367 -14256 -4495 7285 -266 -12124 -5066 7851 4335 -7265 -4240
546d240J2350K7j0336j470R350K291q379k501Q556L705r325n377Q369O496r554
$$ -4240 8110 8137 -2199 -3669 5681 7972 -407 -2908 5648 9353 28 -5349 3020 9516 -38
561c8q657Q180Q447r190j1007Q422J3031p204j3642M409J4075j997j4125K04J2711
$$ -38 -8695 -515 7932 -1258 -12265 -3843 9188 1984 -11658 -7249 6826 4829 -9296 -9092 3619
576C619J963j1406l188R270N609o002n289N675P220k141p576P27R517K091j0318
$$ 3619 5582 -5824 -9012 258 5867 -135 -5424 251 7471 5330 -2246 -1519 7998 10089 -229
591b29m859R798N464r834q027R186P726r512r101Q841P600q172p868N858O357
$$ -229 -5088 4710 10174 340 -7687 1499 9225 -287 -9388 -547 7053 -1119 -8987 -3129 3228
606C228o317n060O169M387n720m981O823O631m166p013K581R216J100q726l936
$$ 3228 -3089 -8149 -1980 2407 -3313 -8294 -1471 5160 994 -6019 -3438 5778 6878 -1848 -5784
621e784R527P626q179j0093P470J2128o231j4339M024J4296k561j5568j84J4498
$$ -5784 3743 11369 3190 -6903 567 12695 6464 -7875 -3851 10445 7884 -7684 -7868 6630
635F630M41j2709p33J0841L70j0294j663Q511K262q536l945N483N001k772m620
$$ 6630 7071 -5638 -6371 4470 4840 -5454 -7117 1394 3656 -4880 -8825 -3342 1659 -1113 -5733
650e733J905O247P04n269jP015J654o973j793Q424L368r106m841R267N985r207
$$ -5733 -3828 2419 3123 -2146 -2147 4868 6522 -451 -2244 6180 9548 442 -4399 4868 10853 1646
666A646q666Q215Q904r232j2100P992J3000o807j5598K712J6527K00j5182k820
$$ 1646 -7020 1195 10099 867 -11233 -3241 9759 2952 -12646 -9934 6593 6793 -8389 -11209
680a1209J2771O055j1057p184J0181Q325p743r794O725J1979m318j1570K515J2549
$$ -11209 1562 7617 -3440 -10624 -443 7882 139 -9655 -2930 9049 4731 -6839 -4324 8225
694H225J99j1737j316J0934K831j0083m231R389N518q915q066O985Q986n493j0514
$$ 8225 8424 -3313 -4629 6305 9136 -947 -5178 4211 9729 814 -7252 -267 8719 3226 -7288
709g288K271Q903k043r639L35Q639L1r123o76R777L528q374m453Q554P704n648
$$ -7288 -5017 3886 1843 -7796 -7461 1178 1209 -7914 -8590 1187 4715 -3659 -8112 442 8146 2498
725B498p948M205R110k409r440J471J0220J25j0880j861J0607L710j0134n690
$$ 2498 -5450 -1245 7865 5456 -3984 -2513 7707 7832 -3048 -4909 5698 9408 -726 -6416
739f416Q083N822p554n955N897N068o450n127N721N973n919p178L468P217k343
$$ -6416 1667 7489 -65 -6020 -123 4945 -1505 -6632 -911 5062 -857 -8035 -4567 2650 307
754C07o038Q16N568j14m410P31O447J062o399k086P593M220o431n559O760O155
$$ 307 -5731 -4915 653 539 -3871 -3140 3307 4369 -2030 -4116 3477 7697 1266 -4293 2467 8622
770H622o049o777N361P403m724q656L065P880k007r595j559P856L270p716n506
$$ 8622 2573 -4204 1157 8560 3836 -4820 -1755 6125 4118 -5477 -7036 820 4090 -3626 -9132
785i132N335O919m157o268M128P149l145p534K264R581r52r475LR093K477q068
$$ -9132 -3797 3122 -1035 -7303 -3175 3974 829 -6705 -4441 5140 4188 -5287 -5284 3809 6286 -1782
801a782j884Q019L006q111l275Q634N315q958o761P031P692n770r223L762Q237
$$ -1782 -3666 4353 7359 -752 -4027 4607 9922 964 -5797 1234 8926 3156 -6067 -2305 5932
816E932l398r360R79R442n84j0224k254R672N240r250p216Q148J0003n389j0031
$$ 5932 2534 -6826 -5847 3595 3011 -7213 -9467 205 5445 -3805 -11021 -2873 7130 1741 -8290
831h290M323J1625j738j1386K01J2303K339j1771m165J0954O583q486q018N476
$$ -8290 -3967 7658 5920 -5466 -5265 7038 9377 -2394 -6559 4395 10978 2492 -5526 -50
845e0Q134l767q730J416P504p11q148j358P663K272q296l441P299M341o793m369
$$ -50 8084 4317 -4413 -2997 4507 3796 -4352 -5710 1953 4225 -4071 -7512 -213 4128 -2665 -7034
861g034N408M275n025l366M906M677m028n059L965O724j541o460J127P063J6o777
$$ -7034 -1626 2649 -2376 -5742 -836 3841 -187 -5246 -1281 5443 3902 -2558 -1431 5632 5648 -1129
877a129k45O912J283q015k379P148L475o906m888L768N527l175o812R80O361j85
$$ -1129 -1374 5538 6821 -1194 -3573 3575 7050 144 -4744 -976 4551 1376 -5436 -4456 1905 1720
893A720o251j385N967K355n757k520N429L459m301l349L172L925j150k277J598
$$ 1720 -4531 -5916 51 2406 -3351 -5871 -442 3017 -1284 -4633 -1461 2464 1314 -963 635
908F35K030o23j434J599K361j429l058P97L439j234m862L15N307j466o693N65
$$ 635 2665 2042 608 2207 4568 3139 81 878 4317 3083 -1779 -1464 3843 2377 -4316 -3751
924c751P610m31q374j737Q535K081p349m542O241N387m634n680K725O882n65o782
$$ -3751 3859 3428 -4946 -6683 1852 3933 -3416 -7958 -1717 3670 -964 -6644 -3919 2963 2398 -4384
940d384k66P780K669o898l603P048N316n641n488M780O442m196o341L293N451
$$ -4384 -4650 3130 5799 -1099 -4702 2346 7662 2021 -3467 1313 7755 3559 -2782 511 5962
955E962k924p028J870N979j781o543J98N569m25n615m41N393J167n160k179N070
$$ 5962 3038 -3990 -2120 3859 2078 -4465 -4267 1302 877 -4738 -5179 214 1381 -3779 -5958 -888
971h88M113l948n300L559P742j699q398J025R933J166r972k389J0606L677j0552
$$ -888 3225 -723 -6023 -2464 5278 3579 -4819 -3794 6139 7305 -2667 -5056 5550 9227 -1325
986a325n607J0366O974r477p956P021Q238n072r329K836Q682j229r081k008P847
$$ -1325 -6932 3434 10408 931 -7025 -4 8234 3162 -6167 -3331 5351 4122 -4959 -6967 880
1001H80K998p169m770M785O666l629p194L002P754m27p593R12P725Q80o480j32
$$ 880 3878 -3291 -8061 -3276 3390 -239 -7433 -4431 3323 2896 -4697 -3785 3940 4820 -1660 -1792
1017a792O689J307o573j068N769J447n840k464N242K456n737l084M341L145l768
$$ -1792 4897 6204 -369 -1437 4332 5779 -61 -2525 2717 5173 -564 -3648 693 3838 70
1032G0m950K441N186j150o097o85O119J715o439l323P065M686o932n147O381P076
$$ 70 -4880 -2439 2747 1597 -4500 -5185 934 2649 -3790 -7113 -48 4638 -2294 -7441 -1060 6016
1048F016n385o592M983P181k839o870J971O766k31n171j027M521J759l461l279
$$ 6016 631 -5961 -978 6203 3364 -3506 -1535 5231 5000 -171 -1198 3323 5082 1621 -1658
1063a658K778K864k840l875J595L196k444l503J233K898j544l867J407M290j039
$$ -1658 1120 3984 1144 -2731 -1136 2060 -384 -3887 -2654 244 -1300 -5167 -3760 530 -509
1078e09l875J354M338N3l703R4M482J240l795q05L345J873l319k171L158K498
$$ -509 -4384 -3030 1308 1361 -2342 -2248 2234 3474 -321 -1126 2219 4092 773 -1398 1760 4258
1094D258k479l633K161L945j359m672J35M872N13n744k121N596J962n974l518
$$ 4258 1779 -1854 307 4252 2893 -1779 -1644 3228 3741 -2003 -4124 1472 3434 -2540 -6058
1109f058M838L518m633l972M311L901l215l622L452M028k219l111K143M484j246
$$ -6058 -1220 2298 -2335 -6307 -1996 1905 -1310 -4932 -1480 2548 329 -2782 -639 3845 2599
1124B599l936P84M661K64m478r57M837J693m707l755M466L963m598n410M123N408
$$ 2599 -1337 -553 4108 4372 -106 -1063 3774 5467 760 -2995 1471 5434 836 -4574 -451 4957
1140D957m325o667K465O945k188p084N36O681J007o504j928O096M088m344m835
$$ 4957 632 -6035 -3570 3375 1187 -5897 -5361 1320 2327 -4177 -6105 -9 4079 -265 -5100
1155e100L245P001k381o193Q68P128O75o764k002P107L252o787l617O419M172
$$ -5100 -1855 5146 2765 -3428 -2560 4568 5243 -1521 -3523 3584 6836 49 -3568 2851 7023
1170G023o050n096N255N368o181o159M406N668m167o446K611O367j964n902P7
$$ 7023 973 -4123 1132 6500 319 -5840 -1434 4234 67 -6379 -3768 2599 635 -5267 -5190
1185e190O666J045n078k281M496L843l255m101K155O059r96n812L50O530P68n759
$$ -5190 1476 2521 -2557 -4838 -342 3501 246 -3855 -1700 4359 3363 -2449 -2099 4431 5199 -560
1201e60j559N998J841n840k389M750J974m374k633L050K179l338k347J645J979
$$ -560 -2119 3879 5720 -120 -2509 2241 4215 -159 -2792 258 2437 -901 -3248 -1603 376
1216C76j456k460P20K554m77j971qK183J446k106j181K740K033k936j990L647
$$ 376 -1080 -3540 -2820 -266 -743 -2714 -2722 -539 907 -1199 -2380 360 2393 -543 -2533 1114
1232A114L103l323l009L423M229l478m438L382M757l078n180K204M804k769m752
$$ 1114 4217 894 -2115 1308 5537 2059 -2379 1003 5760 2682 -2498 -294 4510 1741 -3011
1247c011R15L607j220l116n5K293M37k098p83J424J367r93j539P61K850k09k998
$$ -3011 -2096 1511 291 -2825 -2880 -587 -150 -2248 -3031 -1607 -240 -1233 -2772 -2011 839 630 -2368
1264b368Q29L798K59l842J57M947j53m620j0N206O6n229o74N562O13n715j720
$$ -2368 -1539 2259 2518 -1324 -1167 3780 3627 -993 -1003 4203 4269 -960 -1634 3928 4541 -1174 -2894
1281b894M262K455m669l440L007M054k524n299J102N908P22o418k682O350M310
$$ -2894 1368 3823 -846 -4286 -1279 2775 251 -5048 -3946 1962 2684 -3734 -6416 -66 4244
1296D244n839n216N538O608m236o953M040Q213k796p589K471P916r47o736n61
$$ 4244 -1595 -6811 -1273 5335 1099 -5854 -1814 6399 3603 -3986 -1515 6401 5454 -1282 -1843
1311a843N666J069m581k444L278K133l052l030J224L042j373l643J98L889O33
$$ -1843 3823 4892 311 -2133 1145 3278 226 -2804 -1580 1462 89 -3554 -3356 533 1166
1326A166m432j131M617J461m116j824N456J898n359k700O346L439m786m146M797
$$ 1166 -3266 -4397 220 1681 -2435 -4259 1197 3095 -2264 -4964 1382 4821 35 -4111 686
1341F86M819l440m161K358M452j525m269P9M869M12n066k287M324K537l416m552
$$ 686 5505 2065 -2096 262 4714 3189 -1080 -1001 3868 4280 -786 -3073 1251 3788 372 -4180
1357d180K402M524k526n149J379N227j043n498O64N316L56m367p64M081J271j927
$$ -4180 -1778 2746 220 -4929 -3550 1677 634 -4864 -4200 1116 1472 -2895 -3659 422 1693 -234
1373b34p18K270P55j799J95J901N18k129o58J526J106j428j597N56J775j200k486
$$ -234 -952 1318 2073 274 469 2370 2888 759 101 1627 2733 1305 -292 264 2039 839 -1647
1390a647P43K368m55m276J5N066N1n151j579M852K075m488j878L578K619l145
$$ -1647 -904 1464 1009 -3267 -3252 1814 1865 -3286 -4865 -13 2062 -2426 -4304 -726 1893 -1252
1406a252k331L145K863j454l025O92M357P43l608q79K908K302l346j966K807K087
$$ -1252 -3583 -438 2425 971 -2054 -1362 2995 3738 130 -749 2159 4461 1115 -851 1956 4043
1422D043l738k907L454L128l892l981K513L751l122l944L097L098k686l793L050
$$ 4043 305 -2602 852 3980 88 -3893 -1380 2371 -751 -4695 -1598 1500 -1186 -4979 -1929
1437a929M043j641m820J527M777K95m038r25M047K346k953l009K772M611k495
$$ -1929 2114 473 -4347 -2820 1957 2252 -1786 -2711 1336 3682 729 -2280 492 5103 2608
1452B608n707J644P251n23p942j444P857K522p444l668O603L030o109l745M564
$$ 2608 -3099 -1455 5796 5273 -2669 -4113 3744 6266 -1178 -4846 1757 4787 -1322 -5067 -503
1467e03L841m358m775K910M523j269m058l54M218J374k896j545L194K789k693
$$ -503 3338 -1020 -5795 -2885 1638 369 -3689 -4043 175 1549 -1347 -2892 302 3091 398
1482C98l333L604M613k870n454K366O245j681o408J863N351j348o297J461O357
$$ 398 -2935 669 5282 2412 -3042 -676 5569 3888 -2520 -657 4694 3346 -2951 -1490 4867
1497D867k049o384M31N118L50m392j824K747K188k225j997R17K668L05l232q99
$$ 4867 2818 -3566 -3135 1983 2333 -2059 -3883 -1136 1052 -1173 -3170 -2253 415 720 -2512 -3411
1513c411M074K770m378l166M798M115l870m248M184M123l337l827M044K851l605
$$ -3411 663 3433 -945 -4111 687 4802 932 -3316 868 4991 1654 -2173 1871 4722 1117
1528A117l311L187K861k536l131J312J666j164j100J03M83l09r39o34J046J402
$$ 1117 -2194 993 3854 1318 -1813 -501 1165 1 -1099 -996 -513 -822 -1761 -2395 -1349 53
1544E3j401k286J392L320l28l320O45L942p80l132J484L947j046m683J224M911
$$ 53 -1348 -3634 -2242 1078 750 -2570 -1925 2017 1237 -1895 -411 3536 2490 -2193 -969 3942
1560C942k97m232k74L826J06l366j33K376o38k441o67K372L01j532j755N59J813
$$ 3942 3645 -587 -861 2965 3071 -295 -428 1948 1310 -1131 -1798 574 875 -657 -2412 -1853 -40
1577d0l57j986m20K570N13k566n22L503J086l988j176M833K363m610j948M158
$$ -40 -397 -2383 -2803 -233 280 -2286 -2808 695 1781 -2207 -3383 1450 3813 -797 -2745 1413
1593A413K866l338k692L038K932k429l339J833L378j193l699m76L421J160m115
$$ 1413 4279 941 -1751 1287 4219 1790 -1549 284 3662 2469 -1230 -1706 1715 2875 -1240
1608a240k254L127K484l332l392K374M261k439m369J400N298n86m625K95M434
$$ -1240 -3494 -367 2117 -1215 -4607 -2233 2028 -411 -4780 -3380 1918 1332 -3293 -2998 1436
1623A436R47l657k23L377J104l174p91L119J722l224j861K601K382j872l355J039
$$ 1436 2383 -1274 -1497 1880 2984 -190 -981 2138 3860 636 -1225 1376 3758 1886 -1469 -430
1639d30L222q35l679n97M007N00m470j902M106K730m287l483L780L386k709l868
$$ -430 2792 1957 -1722 -2319 1688 2188 -2282 -4184 -78 2652 -1635 -5118 -1338 2048 -661 -4529
1655d529K933L137j470l450J644L726L20l862j07M106J336k987k061K558L137
$$ -4529 -1596 1541 71 -3379 -1735 1991 2311 -1551 -1658 2448 3784 797 -1264 1294 4431
1670D431k505l154J090L274j049m105J004L428j348l821M73L372p99k994O8L455
$$ 4431 1926 -1228 -138 3136 2087 -2018 -1014 2414 1066 -2755 -2282 1090 291 -2703 -2635 820
1686H20l27l343k94L337J023l281r28K634K160k133k065K133K812j150k377O89
$$ 820 493 -2850 -3144 193 1216 -2065 -2993 -359 1801 -332 -2397 -264 2548 1398 -979 -290
1702b90K899L16l495m50L455J760l808k444L338K410l131l278K076K891k130l391
$$ -290 2609 2925 -570 -1020 2435 4195 387 -2057 1281 3691 560 -2718 -642 2249 119 -3272
1718c272J257L211p94l894O36K773L34k442m19K242Q36r91j052J815J319j060
$$ -3272 -2015 1196 402 -3492 -2856 -83 251 -2191 -2610 -368 468 -523 -1575 240 1559 499
1734D99r84J297J628j009k170J519K228j362k255P52L020j232l721J204K889k65
$$ 499 -485 812 2440 1431 -739 780 3008 1646 -609 143 3163 1931 -1790 -586 2303 2038
1750B038m265K46L114K56l217j229K837J439k580k180J990K169n40k744pL401
$$ 2038 -2227 -1981 1133 1389 -1828 -3057 -220 1219 -1361 -3541 -1551 618 78 -2666 -2673 728
1766G28M44k343r03K901J886k301j904K422K911k221k406J414K988j935k411J103
$$ 728 1172 -1171 -2074 827 2713 412 -1492 930 3841 1620 -786 628 3616 1681 -730 373
1782C73K074j380k328L18K187j274j899M84J646k83j992j18J818L86j819p64J528
$$ 373 2447 1067 -1261 -943 1244 -30 -1929 -1445 201 -82 -2074 -2192 -374 12 -1807 -2571 -1043
1799a043J966j462k608K188L049j173l089J131M111j09m152Q7M190O80l870j736
$$ -1043 923 -539 -3147 -959 2090 917 -2172 -1041 3070 2961 -1191 -1104 3086 3766 -104 -1840
1815a840L664J829l172k005K119J888j815k687N74K004j9k189j168K158J332j952
$$ -1840 1824 3653 481 -1524 595 2483 668 -2019 -1445 559 540 -1649 -2817 -659 673 -1279
1831a279j772J427K096j095j980J081K929j188j932J230K110l55k130J061K290
$$ -1279 -3051 -1624 472 -623 -2603 -1522 1407 219 -1713 -483 1627 1272 -858 203 2493
1846B493r07j858Q32K218r68j920M99J617o82j668j52J310J51j758q81J231J092
$$ 2493 1586 -272 560 2778 1810 -110 389 2006 1324 -344 -496 814 965 -793 -1674 -443 649
1863F49j121k064L88K631n28k707j69L210N50k667l22K508J190j785j287K330
$$ 649 -472 -2536 -2148 483 -45 -2752 -2921 289 839 -1828 -2150 358 1548 -237 -1524 806
1879H06J730k066r03J635J315j419j280J077R25p06j156N75R94q12j148r6Q76
$$ 806 2536 470 -433 1202 2517 1098 -182 895 1820 1114 -42 533 1527 715 -433 -529 347
1896C47o2j433r62J671L97j500j126J636J486j388j870J614K275j003k480J537
$$ 347 285 -1148 -2110 -439 -42 -1542 -2668 -1032 454 -934 -2804 -1190 1085 82 -2398 -861
1912h61K670k43k771P91K842L73k989n04K673J530k981j657K380J569j897k142
$$ -861 1809 1566 -1205 -414 2428 2801 -188 -692 1981 3511 530 -1127 1253 2822 925 -1217
1928a217Q93J970m69k728l54K288P38k886q80K232J188j883j655J698K065j437
$$ -1217 -324 1646 1177 -1551 -1905 383 1121 -1765 -2645 -413 775 -1108 -2763 -1065 1000 -437
1944d37j960J335K531r11k084P38K793N5k413r0K368Q02k164r70K078Q76j403
$$ -437 -2397 -1062 1469 558 -1526 -788 2005 2060 -353 -443 1925 2727 563 -407 1671 2547 1144
1961A144j737J174J615j814j643O14J545o19k132J4J708K02j955n38J123J098
$$ 1144 -593 581 2196 382 -1261 -647 898 279 -1853 -1839 -131 71 -1884 -2422 -1299 -201
1977b01o94j132J235J267j43j542P42J669k79j069p4J815l61r68K50J159Q6j553
$$ -201 -895 -2027 -792 475 332 -1210 -468 1201 922 -147 -221 1594 1233 265 515 1674 1760 207
1995B07k72K051q21j508J12J022O4j618KP35Lj506K03N50K01o91m77R6R17J18
$$ 207 -65 1986 1165 -343 -231 791 855 -763 -761 -26 -23 -1529 -1326 -776 -575 -1266 -1743 -1647 -730 -612
2015f12p03J94Q02Q99r46m89J508J114j014j519K043J235j371j110J146J217j496
$$ -612 -1315 -1121 -319 580 -366 -855 653 1767 753 -766 1277 2512 1141 31 1177 2394 898
2032H98j285J020Q69j163j306R97Q91j333j088J195L18p02q12M08J70L50o28m18
$$ 898 -387 633 1502 339 -967 30 921 -412 -1500 -305 13 -689 -1501 -1093 -923 -573 -1201 -1619
2050a619O86J240q15j617J143K465L0k869k1L148O34k828j82K687L34k490m87
$$ -1619 -933 307 -508 -2125 -982 1483 1513 -1356 -1377 1771 2405 -423 -605 2082 2416 -74 -561
2067e61K533M06k282q39J098J011q59j243n58J054M19q63q10M35J002o45j845
$$ -561 1972 2378 96 -743 355 1366 507 -736 -1294 -240 179 -684 -1494 -1059 -57 -702 -2547
2084b547R81K304r63j834O05K286m30j298Q76J206k62j408R94J690j100j131N10
$$ -2547 -1566 738 -225 -2059 -1454 832 402 -896 -20 1186 924 -484 510 2200 1100 -31 479
2101D79J577l00j303k9M77K5o58n12M21M84q53j317K58J562J76k116j144K322
$$ 479 2056 1756 453 424 901 926 268 -244 177 661 -192 -1509 -1251 311 487 -1629 -2773 -451
2119d51L88j351j060J507J260j073q45J400J293r14r78J088J110k82m99m1K44
$$ -451 -63 -1414 -2474 -967 293 -780 -1625 -225 1068 154 -824 264 1374 1092 593 552 796
2136G96P32q6o03j80L40l89p66N95K57o17r84K49O49l54q91J37N71o10j60O97
$$ 796 1528 1442 839 659 999 610 -156 439 696 79 -905 -656 -7 -361 -1252 -1115 -544 -1154 -1314 -617
2156f17M57r59p79J325Q97l68r86K78J430M0l78j08Q43O30q90j137J466J306q20
$$ -617 -160 -1119 -1898 -573 324 -44 -1030 -752 678 718 340 232 1075 1705 815 -322 1144 2450 1630
2175A630j847k50K091J48j677q17J095L26r95p76Q02or50j78O97k8k15Oj25k37
$$ 1630 -217 -467 1624 1772 95 -722 373 699 -296 -1072 -270 -276 -1226 -1404 -707 -735 -950 -944 -1069 -1306
2195a306P21Q5q8K38l6L59J15Q36K11j006L2R69P37p51o26N32M56j351l8J061
$$ -1306 -585 -500 -588 -350 -386 -27 88 924 1135 129 161 1130 1867 1116 490 1022 1478 127 89 1150
2215A150M22j826j225J314J293j219j589J25J823p45n26l23K78Q99j004q43J304
$$ 1150 1572 -254 -1479 -165 1128 -91 -1680 -1555 268 -477 -1003 -1326 -1048 -149 -1153 -1996 -692
2232f92J300k81j790L56K276K70j546m40J520N95j502M28R31N77j592m79J440
$$ -692 608 327 -1463 -1107 1169 1439 -107 -547 973 1568 66 494 1425 2002 410 -69 1371
2249A371K87j488k15K8L53o10k13O31p71m74j29m7R09m34p83J8R33R57n86j113
$$ 1371 1658 170 -45 -17 336 -274 -487 144 -627 -1101 -1230 -1277 -368 -802 -1585 -1567 -634 323 -263 -1376
2269a376Q58J302q90r74J332J436q82j239O42K038n19j678p3J676o4r15q43O59
$$ -1376 -518 784 -106 -1080 252 1688 806 -433 209 2247 1728 50 -23 1653 1589 674 -169 490
2287D90N78q32q48K02N99K9j489l61J115K05m71j276P65J035k69p41N99L54l32
$$ 490 1068 236 -612 -410 189 218 -1271 -1632 -517 -312 -783 -2059 -1294 -259 -528 -1269 -670 -316 -648
2306f48n7N42N49l58j09P52L20j45J4K84J34k96k57N08m44j54r2l49k9J55m59
$$ -648 -705 -163 386 28 -81 671 991 846 860 1144 1278 982 725 1233 789 635 543 194 165 320 -139
2327a39j67n74L51k30o41K25N88l13k47L60O23m63l45J90J138P6r37K53R32q6
$$ -139 -306 -880 -529 -759 -1400 -1175 -587 -900 -1147 -787 -164 -627 -972 -782 356 432 -505 -252 680 594
2347E94n07M59O25k24o35P16l60N83n72J72j09J87o64l16L97K04p62p38Q5N29
$$ 594 87 546 1171 947 312 1028 668 1251 679 851 742 929 265 -51 346 550 -212 -950 -865 -336
2367c36K02j553M2J290j8j053j12J186K49m94m99R69Q03p92o30R89J177l44j177
$$ -336 -134 -1687 -1645 -355 -373 -1426 -1538 -352 -103 -597 -1096 -127 676 -116 -746 243 1420 1076 -101
2386a01M92J083P0j120k75Q80J87n37j092Q27P05m40j750j17J675k45j752k67
$$ -101 391 1474 1544 424 149 1029 1216 679 -413 414 1119 679 -1071 -1188 487 242 -1510 -1777
2404a777J278N27j386n55J296P59j075j061J404J308p75j096J168R99j25j148
$$ -1777 -499 28 -1358 -1913 -617 142 -933 -1994 -590 718 -57 -1153 15 1014 889 -259
2420b59O43R58q6q01k6Q84L60j022n24O68O86q77j041J1J223q61q12m59J479k48
$$ -259 384 1342 1256 455 429 1313 1673 651 127 795 1481 604 -437 -426 797 -64 -876 -1335 144 -104
2440a04j386k51J144O04j142m34Q67J010o46p52O73J400p82l39L33R35k47k34
$$ -104 -1490 -1741 -597 7 -1135 -1569 -702 308 -338 -1090 -417 983 201 -138 195 1130 883 649
2458F49j02P62J09p66k99M94N30r86k95M14P2k34o52k16P29m73j069R3R18K2j486
$$ 649 547 1309 1418 652 353 847 1377 391 96 510 582 348 -304 -520 209 -264 -1333 -1240 -322 -300 -1786
2479a786J10J114L04q30l4Q49L60m86k88P30O18k86l91R13P8J65m18Q1K63j85
$$ -1786 -1676 -562 -258 -1088 -1122 -273 87 -399 -687 43 661 375 -16 897 975 1140 722 803 1066 881
2499H81K30o02k41K88r3m24n8J88k84m40j03K55n05O6M01k64l92k67O88P02j059
$$ 881 1111 509 268 556 463 39 -19 169 -115 -555 -658 -403 -908 -842 -441 -705 -1097 -1364 -676 26 -1033
2520a033j32Q73R27l64n23O75L63L97j337L81J028K60r84RQ72K24j093q84R56
$$ -1033 -1165 -292 635 271 -252 423 786 1183 -154 227 1255 1515 531 540 1412 1636 543 -341 615
2539F15L64p67q86K61Q27n46r38J64M68J21r32k95J230J05q89n0R05K46n53j78
$$ 615 979 212 -674 -413 414 -132 -1070 -906 -438 -317 -1249 -1544 -314 -209 -1098 -1148 -243 3 -550 -728
2559g28Q82L52m98m73J141Q86n77r79O38J142n48j624O59J298k05j596q8J306
$$ -728 154 506 8 -465 676 1562 985 6 644 1786 1238 -386 273 1571 1366 -230 -318 988
2577I88m5j461q38P66J097o81j682K71J538L27j645l54J359J047j304j164J310
$$ 988 943 -518 -1356 -590 507 -174 -1856 -1585 -47 280 -1365 -1719 -360 687 -617 -1781 -471
2594d71J553q63j398R74J654l74j649Q47J453j81j334j2J019J15r09n52O28M25
$$ -471 1082 219 -1179 -205 1449 1075 -574 273 1726 1545 211 199 1218 1333 424 -128 500 925
2612I25q78o45J01P16l13j242O62N57j53j024k42J064L71j318L00R28M47r22l65
$$ 925 47 -598 -497 219 -94 -1336 -674 -117 -270 -1294 -1536 -472 -101 -1419 -1119 -191 256 -666 -1031
2631a031J467N68o78n44O41J102o67q04M19J047n41o28j53J163l82r00k24O86
$$ -1031 436 1004 326 -218 423 1525 858 54 473 1520 979 351 198 1361 979 79 -145 541
2649E41K72o43q51jO67j36q42n5M66L93r23n58J195L57p83O68j41K90j25L78O03
$$ 541 813 170 -681 -682 -15 -151 -993 -1048 -582 -189 -1112 -1670 -475 -118 -901 -233 -374 -84 -209 169 772
2670G72k23j98J42N83k72p31N29O07n8q22J90M64k63q49l91Q92J70r38n42J28
$$ 772 549 351 493 1076 804 73 602 1209 1151 329 519 983 720 -129 -520 372 542 -396 -938 -810
2690h10P63k99p43r4O51L04o07o43J291M77n50j288J272J659j133j211Q47J331
$$ -810 -47 -346 -1089 -1183 -532 -228 -835 -1478 -187 290 -260 -1548 -276 1383 250 -961 -114 1217
2708A217j40j070L84Q02J37r87K86O57k96n97j18J55K18n53k95q4j6pj184N92
$$ 1217 1077 7 391 1193 1330 343 629 1286 990 393 275 430 648 95 -200 -284 -300 -307 -1491 -899
2728h99Q22O0j812K80R95Q03j371m21J747N96j266m52J322R57j249m61J183Q08
$$ -899 -77 -17 -1829 -1549 -554 249 -1122 -1543 204 800 -466 -918 404 1361 112 -349 834 1642
2746A642r04q48O34J011l80p30n61O40N48r61l61J89P56o01j606L98J396l55j281
$$ 1642 738 -110 524 1535 1155 425 -136 504 1052 91 -270 -81 675 74 -1532 -1134 262 -93 -1374
2765a374m81J473L52j165j63J038N3m53O9J222j27j042L93Q59P94q51n1R9M05
$$ -1374 -1855 -382 -30 -1195 -1358 -320 -267 -720 -651 571 444 -598 -205 654 1448 597 546 645 1050
2784A050m08PN5L44l38j46l41K46L35r60p98O30P37j160o55J155J83j042k17J011
$$ 1050 642 649 704 1048 710 564 223 469 804 -156 -954 -324 413 -747 -1402 -247 -64 -1106 -1323 -312
2804c12L85r30o46J038P88o28n19N95P13l71j57L82Q88k50m41q5N21M20k61j410
$$ -312 73 -857 -1503 -465 323 -305 -824 -229 484 113 -44 338 1226 976 535 450 971 1391 1130 -280
2824b80O09O85k20j136K76K97l18p59J70R49n54j280L20J239o2j190PP31j62q8
$$ -280 329 1014 794 -342 -66 231 -87 -846 -676 273 -281 -1561 -1241 -2 -64 -1254 -1247 -516 -678 -766
2844g66j07Q62J86n81J1L99R97l08n88N1R52N84j240k10O25O04j224k37J283j11
$$ -766 -873 -11 175 -406 -395 4 1001 693 105 156 1108 1692 452 242 867 1471 247 10 1293 1182
2864A182j333p82R75L36o36q97O47K75r49J10O88o9j75l72J59R65N1p19m37J306
$$ 1182 -151 -933 42 378 -258 -1155 -508 -233 -1182 -1072 -384 -453 -628 -1000 -841 124 175 -544 -981 325
2884C25P98q47m93N36J022m97q87P30R51p90j126N50J140r0j452l20R61k78p68
$$ 325 1123 276 -217 319 1341 844 -43 687 1638 848 -278 272 1412 1322 -130 -450 511 233 -535
2903e35P4M02l26n94j38P36O1k27o65J29R50M7k29n97Q19K70k56m06J342K91j134
$$ -535 -461 -59 -385 -979 -1117 -381 -320 -547 -1212 -1083 -133 -86 -315 -912 -93 177 -79 -485 857 1148 14
2924A4n69J848L32r14j024J364L90r04q05O85L64p14o76L23J046o99q09m75Q61
$$ 14 -555 1293 1625 711 -313 1051 1441 537 -268 417 781 67 -609 -286 760 61 -748 -1223 -362
2943c62O69o50r06J27Q20Kq35r7J306q0j293R45J174K78j399L4J008N22q04r1
$$ -362 307 -343 -1249 -1122 -302 -300 -1135 -1232 74 -6 -1299 -354 820 1098 -301 -267 741 1263 459 368
2963C68O79l84n06O64J26m98k13pk15p8N26k97p82L9K68l26k84L70M50r15k11
$$ 368 1047 663 157 821 947 449 236 229 14 -64 462 165 -617 -578 -310 -636 -920 -550 -100 -1015 -1226
2984a226R08K03r49j44J287L87q93j94J274j15q19O7R87M87n05q86O15M78k86
$$ -1226 -318 -115 -1064 -1208 79 466 -427 -621 653 538 -281 -214 773 1260 755 -131 484 962 676
3003F76j76l03L86k53p4k93k03L72q9p20N0Q63n64j166N93R44m44r14O48O76o64
$$ 676 500 197 583 330 256 -37 -240 132 43 -677 -627 236 -328 -1494 -901 43 -401 -1315 -667 9 -655
3024f55m77Q14J356n99j018M99J055j86q19J47R31J0p09p0M40O57q52q46L41Q97
$$ -655 -1132 -318 1038 439 -579 -80 975 789 -30 117 1048 1058 349 279 719 1376 524 -322 19 916
3044I16J23j806m59J245P72j714q27J454K93j236l28J128P16p31j122J127J135
$$ 916 1039 -767 -1226 19 791 -923 -1750 -296 -3 -1239 -1567 -439 277 -454 -1576 -449 686
3061F86m02p58j4Q55L43m46m19O03L78J36p16M50Q23o97o46q2Q56l46o19j4Q08
$$ 686 284 -474 -488 367 710 264 -155 448 826 962 246 696 1519 822 176 94 950 604 -15 -29 779
3082G79n81j108K76Q19m71p37j1O74K2o27n7L84L48m35J04M28L27k08m60N18R56
$$ 779 198 -910 -634 185 -286 -1023 -1034 -360 -338 -965 -1022 -638 -290 -725 -621 -193 134 -74 -534 -16 940
3103I40r0o22J09M13N70r94k98O36J59n97nK5N60q83k78K44L75l23n65J44j01
$$ 940 850 228 337 750 1320 326 28 664 823 226 221 246 806 -77 -355 -111 264 -59 -624 -480 -581
3124e81l06l0J18K3r8J18NN59L90m20j85O03L81m32k52N87L89n48k84Q07K60p99
$$ -581 -887 -917 -799 -776 -874 -756 -751 -192 198 -222 -407 196 577 145 -107 480 869 321 37 844 1104 305
3146C05n35O12R85j025o17J36O99j10j064l2O48J20r01j71J80M93m33l33k53J401
$$ 305 -230 382 1367 342 -275 -139 560 450 -614 -646 2 122 -779 -950 -770 -277 -710 -1043 -1296 105
3166A05j59o20p0R96J21o47q8R04O90j170k66J030K42n10l14O58n3L6p40K89L36
$$ 105 -54 -674 -744 252 373 -274 -362 542 1232 62 -204 826 1068 558 244 902 849 885 145 434 770
3187G70m22m96k02L21J74n67m12L62K8L9p88N69P20o25n77N22R04k56p95P13O83
$$ 770 348 -148 -350 -29 145 -422 -834 -472 -444 -405 -1193 -624 96 -529 -1106 -584 320 64 -731 -18 665
3208F65j41q16L66Q84N3o06K6N38j27j94k52K26J57o2q59N2K44j78l24m19M64
$$ 665 524 -292 74 958 1011 405 431 969 842 648 396 622 779 717 -142 -90 154 -24 -348 -767 -303
3229c03J43n20m14Q78k76j08k65L27M12k81j44L50N27n94L6M20L13j16l48O50
$$ -303 -160 -680 -1094 -216 -492 -600 -865 -538 -126 -407 -551 -201 326 -268 -232 188 501 385 37 687
3249F87J14j99P0p4K95m05k56N0M22k18j70o14R9M84o11k84K67K28m02l48J10
$$ 687 801 602 672 598 893 488 232 282 704 486 316 -298 -199 285 -326 -610 -343 -115 -517 -865 -755
3270g55K95J37q19K74L96J85k66J69N94R9j04l49Q37J25n39q5R06j98k73q6q3
$$ -755 -460 -323 -1142 -868 -472 -287 -553 -384 210 309 205 -144 693 818 279 194 1100 902 629 543 460
3291D60M10m37o3l79J88j01j73p31P24O8n66n12N10P45q69l12N97N83p14n32J095
$$ 460 870 433 370 -9 179 78 -95 -826 -102 -34 -600 -1112 -602 143 -726 -1038 -441 142 -572 -1104 -9
3312iK32m04%L50P88o91k90J89N74o0l85K06K32J73k57k89q0L99P0o14m05O82
$$ -9 223 -181 -181 169 957 266 -24 165 739 679 294 500 732 905 648 359 279 678 748 134 -271 411
3334D11j89j018J53O49o8j142KQ78K58p90l02M77K43K31k86J94O90l55k38L80
$$ 411 222 -796 -643 6 -62 -1204 -1202 -324 -66 -856 -1158 -681 -438 -207 -493 -299 391 36 -202 178
3354A78Q25j08p00L7Q13J18r11j92P74J45o17m60J12P03m25p73R9O40k34r32K05
$$ 178 1003 895 195 232 1045 1163 252 60 834 979 362 -98 14 717 292 -481 -382 258 24 -908 -703
3375g03N48l29k40k94K51O23j35m68M20M43q6K7n25R51p3l13J83N66o2m57K06
$$ -703 -155 -484 -724 -1018 -767 -144 -279 -747 -327 116 30 57 -468 483 410 97 280 846 784 327 533
3396E33O9K02o37L00j7k04j33j17j77J76k27k56k1j29K71r8l31K67J80l60j57
$$ 533 602 804 167 467 450 246 113 -4 -181 -5 -232 -488 -509 -638 -367 -465 -796 -529 -349 -709 -866
3417h66O41J44l26N8M3P43m78l1K96L30k18j12L97m36O5K86L24j43o44K69O00
$$ -866 -225 -81 -407 -349 -306 437 -41 -72 224 554 336 224 621 185 250 536 860 717 73 342 942
3438I42p90m09M26o1m35j93K17J59k54j43%j04M76M6n31k87P16L85j03p58L96
$$ 942 152 -257 169 108 -327 -520 -303 -144 -398 -541 -541 -645 -169 -123 -654 -941 -225 160 57 -701 -305
3459c05N11k75n06Q81Q67p57m77N51O37l2p30pK28L3k71J6l52J2o0k41m3O2N9
$$ -305 206 -69 -575 306 1173 416 -61 490 1127 1095 365 358 586 619 348 364 12 24 -36 -277 -320 -258 -199
3482a99l26p14Q92j73K15j021R37O57j161m9J401Np08k55P95N77o30N4J50M60
$$ -199 -525 -1239 -347 -520 -305 -1326 -389 268 -893 -942 459 464 -244 -499 296 873 243 297 447 907
3502I07m11J65l39K50L00l25n91M7P32m20n94l85J045j2j067l34N98J58n49l52
$$ 907 496 661 322 572 872 547 -44 3 735 315 -279 -664 381 369 -698 -1032 -434 -276 -825 -1177
3522a177J185j43r86L21M26N33o38L17J80k49L31N73n12j22M65O4j42J93K73n3
$$ -1177 8 -135 -1121 -800 -374 159 -479 -162 18 -231 100 673 161 39 504 568 426 619 892 839
3542H39n45k04O65L08j527J02P81n43l85M55L7l34o74N93O1j88k81K95N1R1O1
$$ 839 294 90 755 1063 -464 -362 419 -124 -509 -54 -17 -351 -1025 -432 -371 -559 -840 -545 -494 -403 -342
3563c42KK70k92L06Q1K44J79K54j06n21K23N46j69m88j61Q33l38k70L54k42m37
$$ -342 -340 -70 -362 -56 25 269 448 702 596 75 298 844 675 187 26 859 521 251 605 363 -74
3584g4p8L25k84k69k85M63n79L5L66J1m61K44R5K55m13J73L06lN0K39K23K66l19
$$ -74 -152 173 -111 -380 -665 -202 -781 -746 -380 -369 -830 -586 -491 -236 -649 -476 -170 -173 -123 116 339 605 286
3607B86J33n8J41Jo6jq7N11k28l20P8L07k46n79j46L56j75l44RQ4R6k44m37L10
$$ 286 419 361 502 503 437 436 349 860 632 312 390 697 451 -128 -274 82 -93 -437 -428 -344 -248 -492 -929 -619
3631f19K34j12L93j79k21j0M51K2K86P5n5j94J91N76j74j01j72L66o1n08N29q8
$$ -619 -385 -497 -104 -283 -504 -514 -63 -41 245 320 265 71 262 838 664 563 391 757 696 188 717 629
3653F29n20k55P4K07ln93K33k67M4J7j22n0k13N69n74j83N84L74k48j35O53M00
$$ 629 109 -146 -72 135 132 -461 -228 -495 -451 -434 -556 -606 -819 -250 -824 -1007 -423 -49 -297 -432 221 621
3675F21o50k31Q86nm47l9M32N5l73L1M02K7k91m31P9K88K21m20n25r9K61O6m1
$$ 621 -29 -260 626 621 174 135 567 622 249 280 682 709 418 -13 66 354 575 155 -370 -469 -208 -142 -183
3698a83l97K60j62m26O1M72Q9k07l39m6R09o29M99N06l90j80L25L45O3l04J48
$$ -183 -580 -320 -482 -908 -847 -375 -286 -493 -832 -878 31 -598 -99 407 17 -163 162 507 570 266 414
3719D14n6K38M18q6p96J54J72k53j89l65L17N87j189j92N31J87p22j7N18k19K38
$$ 414 358 596 1014 928 132 286 458 205 16 -349 -32 555 -634 -826 -295 -108 -830 -847 -329 -548 -310
3740c10m23M02o6K35j68M72k13q6K68L11k04M93j43k7o44R16J95r80M80l2J2j32
$$ -310 -733 -331 -397 -162 -330 142 -71 -157 111 422 218 711 568 541 -103 813 1008 28 508 476 488 356
3762C56P9l62k41K85m19k5j20K6J45l34J11k81P39l75k98R3L51k61K83qL99M4
$$ 356 435 73 -168 117 -302 -327 -447 -421 -276 -610 -499 -780 -41 -416 -714 -621 -270 -531 -248 -256 143 187
3784A87n22N53M60m32Q9q3L95j35Q2j52l07M96l41j58J00J19m79Q4l14K56J67
$$ 187 -335 218 678 246 335 252 647 512 594 442 135 631 290 132 232 351 -128 -44 -358 -102 65
3805F5n98j66N04Lk37n23J93O40K5m86J05L60K15j09n2J37M64l4k06LL45K23o13
$$ 65 -533 -699 -195 -192 -429 -952 -759 -119 -94 -580 -475 -115 100 -9 -61 76 540 506 300 303 648 871 258
3828B58M1M55J25m37m20N65L20r50j61K79j23J08o52J34L37k17m01L9L42J65m50
$$ 258 299 754 879 442 22 587 907 -43 -204 75 -48 60 -592 -458 -121 -338 -739 -700 -358 -193 -643
3849f43l3J94M97q7m02L63L49J6mj58M86K02l75k52M92L03n42j37J93O0j89l40
$$ -643 -676 -482 15 -72 -474 -111 238 254 250 92 578 780 405 153 645 948 406 269 462 522 333 -7
3871gn2M70r38L28j3k6O3l02K4P2m2k88R4L8L25k47N8J46L85j59%J40J49M56n33
$$ -7 -59 411 -527 -199 -212 -238 -175 -477 -453 -381 -423 -711 -617 -579 -254 -501 -443 -297 88 -71 -71 69 218 674 141
3896A41J06M09k42Mj51r5K45m5o0j60j07K12m21N7k05NL1j74J18j70L5j2M3q8
$$ 141 247 656 414 418 267 172 417 372 312 152 45 257 -164 -107 -312 -307 -276 -450 -332 -502 -467 -479 -436 -524
3920e24K75m7M2j89J91K40J43r1K39k8J59P0m30N8M03j10O7j3j02K03p19K92j7
$$ -524 -249 -296 -254 -443 -252 -12 131 40 279 251 410 480 50 108 511 401 468 455 353 556 -163 129 112
3943A12K49Q9m47k89n2J62m30J94j37J4O0j45J6J25k88N89k56K16L3j45K99K45
$$ 112 361 450 3 -286 -338 -176 -606 -412 -549 -535 -475 -620 -604 -479 -767 -178 -434 -218 -185 -330 -31 214
3965B14j47L4J29J8J69j36lM62l26k52Q5J28J09m22k46N87j46m04n21M71O9J05
$$ 214 67 101 230 248 417 281 278 740 414 162 247 375 484 62 -184 403 257 -147 -668 -197 -128 -23
3987b3m65j43J33J99j51k08K73N3O0K04K35k28q6K32L0N87l66o5J06p7j46o9N08
$$ -23 -488 -631 -498 -299 -450 -658 -385 -332 -272 -68 167 -61 -147 85 115 702 336 271 377 300 154 85 593
4010E93R6k4j06k50m77M68l02Q6l02j86J06j40J29L7k61O8l11L87J2l41J43M72
$$ 593 689 665 559 309 -168 300 -2 84 -218 -404 -298 -438 -309 -272 -533 -465 -776 -389 -377 -718 -575 -103
4032a03pk70L24K04J85k66L61lL21l25k66K20j06M22n53n8M69J1m14m20N89k21
$$ -103 -110 -380 -56 148 333 67 428 425 746 421 155 375 269 691 138 80 549 560 146 -274 315 94
4054I4k68j33j88L79j19m20R4K54o6N8l6j08K10j99Q4K72R3lm6N7M80K1n01L36
$$ 94 -174 -307 -495 -116 -235 -655 -561 -307 -373 -315 -351 -459 -249 -448 -364 -92 1 -2 -48 9 489 510 9 345
4078C45M03j36m64M67m6j21k6j27k73J33j38j94L74l44O4l05K33q7Rl06Q2J26
$$ 345 748 612 148 615 569 448 422 295 22 155 17 -177 197 -147 -83 -388 -155 -242 -233 -539 -457 -331
4100c31j22k17J40K61K47n6K8L53j25J8oL46K2R6l98j09J14j60R7K00J66m16l7
$$ -331 -453 -670 -530 -269 -22 -78 -50 303 178 196 190 536 558 654 256 147 261 101 198 398 564 148 111
4123A11mJ38l17m20L88j74J10l8j25LJ18m31n2K97J34m52L30L33J78r6j44L70
$$ 111 107 245 -72 -492 -104 -278 -168 -206 -331 -328 -210 -641 -693 -396 -262 -714 -384 -51 127 31 -113 257
4145B57Q8o5j61K20j61J89K05J7J4Qj66K4k32J77l28k20J0J37j59k67J39J09l64
$$ 257 345 280 119 339 178 367 572 589 603 611 445 469 237 414 86 -134 -124 13 -146 -413 -274 -165 -529
4168e29j52N2L89l90k7L40J0K00l83J90N74j28r4L70k46O0k7QK08L23m10Q7k93
$$ -529 -681 -629 -240 -630 -657 -317 -307 -107 -490 -300 274 146 52 422 176 236 209 217 425 748 338 425 132
4191A32K41J79m02j81l9L96n26j02L39L3m60k12L08L51m91j9k07K98j24N1O42
$$ 132 373 552 150 -31 -70 326 -200 -302 37 70 -390 -602 -294 57 -434 -453 -660 -362 -486 -435 207
4212B07n22K32q3J60J53K26N9J35m81K42N26m88O4L03k06n51O4O86m32r04L30
$$ 207 -315 -83 -166 -6 147 373 432 567 86 328 854 366 430 733 527 -24 40 726 294 -610 -280
4233b80M97k12o81K37L55k24Q8k60K54l51q6M45j34J33K5jK01q8J97N5N3K69q4
$$ -280 217 5 -676 -439 -84 -308 -220 -480 -226 -577 -663 -218 -352 -219 -194 -195 6 -82 115 170 223 492 408
4256D08J60m07L05M05n51k36L13L41q12j15M32J33m87k52N14j47n63k09M03K87
$$ 408 568 161 466 871 320 84 397 738 -74 -189 243 376 -111 -363 151 4 -559 -768 -365 -78
4276g8m29J16J7k0j26N1L7J24N70k60J09k17O97m65k88K07P64M3o81RO25l81k47
$$ -78 -507 -391 -374 -394 -520 -469 -432 -308 262 2 111 -106 591 126 -162 45 809 852 171 180 805 424 177
4299A77K99k40K03p61L36K74n48P9Nk86J58K67m73j45J29M14l19r9R9K00o8o1
$$ 177 476 236 439 -322 14 288 -260 -181 -176 -462 -304 -37 -510 -655 -526 -112 -431 -530 -431 -231 -299 -360
4321c60K51M17j94j23J20J49J31m39R06j91n43J10K10J09n71p3M12j44J86j96
$$ -360 -109 308 114 -9 111 260 391 -48 858 667 124 234 444 553 -18 -91 321 177 363 167
4341A67j99k07J11r0k40P1k3o8p9M9PL5j34L00M5K18j06R5K80l2Q2k40M54k05
$$ 167 -32 -239 -128 -218 -458 -387 -410 -478 -557 -508 -501 -466 -600 -300 -255 -37 -143 -48 232 200 282 42 496 291
4365B91KK14m6P9l4j08j96k60M40j05o9p3m65J19j65L36qm75j28L55K4k76mL53
$$ 291 293 507 461 540 506 398 202 -58 382 277 208 135 -330 -211 -376 -40 -48 -523 -651 -296 -272 -548 -552 -199
4389a99J64l56j39P05J91l18l9J99J56j2R4k77K95j29j59K79m00L08n8K5k74L85
$$ -199 -35 -391 -530 175 366 48 9 208 364 352 446 169 464 335 176 455 55 363 305 330 56 441
4411D41l49k68k05N20k90q9n8L42k39k66J76K78n10l24N02P9L2M46j02j64Q7L7
$$ 441 92 -176 -381 139 -151 -240 -298 44 -195 -461 -285 -7 -517 -841 -339 -260 -228 218 116 -48 39 76
4433G6J86j54M27nk82J15J28n8m05J92J89m4j89k72L35q2n30j15O98m4m73m40
$$ 76 262 108 535 530 248 363 491 433 28 220 409 365 176 -96 239 157 -373 -488 210 166 -307 -747
4455g47O11J3m93r5M79l03K09k90J30N47j97J46l29P76j43j03o0R4M24l45j55
$$ -747 -136 -123 -616 -711 -232 -535 -326 -616 -486 61 -136 10 -319 457 314 211 151 245 669 324 169
4476A69K34J66l54k09J76L61rr64L52L10m81r2L46j31l06Q3O1j38O1J7lr7M4M31
$$ 169 403 569 215 6 182 543 534 -430 -78 232 -249 -341 5 -126 -432 -349 -288 -426 -365 -348 -351 -448 -404 27
4500B7p4N7k63O24n1r6j46L47J78m69J47M8M6j37K44j1k65k64M91k61m22O2M2
$$ 27 -47 10 -253 371 320 224 78 425 603 134 281 329 375 238 482 471 206 -58 433 172 -250 -188 -146
4523a46j38K26k45L7m38L02R7l29n6J07L22k00M32j26J27Q3O6J7J75k73L63J5
$$ -146 -284 -58 -303 -266 -704 -402 -305 -634 -690 -583 -261 -461 -29 -155 -28 55 121 138 313 40 403 418
4545D18O8l45P6O1k5m49N90J02j78k45J05k45K11l89Q4j12K62m24j01J94L0j3
$$ 418 486 141 217 278 253 -196 394 496 318 73 178 -67 144 -245 -161 -273 -11 -435 -536 -342 -312 -325
4567c25p0J72L10l08k01J73M21j00o4J52M6P3l37J12J84Q9J91n77M31O5k3k77
$$ -325 -395 -223 87 -221 -422 -249 172 72 8 160 206 279 -58 54 238 327 518 -59 372 437 414 137
4589A37k10M68n80L6J4j34J61k96j92N18j52k09l28L67J35P7m28M17Q8k8l79K47
$$ 137 -73 395 -185 -149 -135 -269 -108 -404 -596 -78 -230 -439 -767 -400 -265 -188 -616 -199 -111 -139 -518 -271
4611b71N88n17N75l25K90q1K60k15j20J65q7K99n11L32j85j25Lj88J8l46K19k25
$$ -271 317 -200 375 50 340 259 519 304 184 349 262 561 50 382 197 72 75 -113 -95 -441 -222 -447
4633d47J87J74n29K76K67j92k10J24NK62k20J90Q8k9L42o4P1j65K05m18K92M10
$$ -447 -260 -86 -615 -339 -72 -264 -474 -350 -345 -83 -303 -113 -25 -54 288 224 295 130 335 -83 209 619
4655F19l93J36j21p2N1M6j19l7j92K20n17M25o6k07rL26o09n4K18K5k42J80M23
$$ 619 226 362 241 169 220 266 147 110 -82 138 -379 46 -20 -227 -236 90 -519 -573 -355 -330 -572 -392 31
4678C1J85k63j21L55J87k11j06L79j11r5J71j52R8kK0N9j81K63m04M8Pk43k2j69
$$ 31 216 -47 -168 187 374 163 57 436 325 230 401 249 347 345 365 424 243 506 102 150 157 -86 -108 -277
4702b77NJ32J82o28j8L12J79k07r9J03K98J3n35L07Q5O9j29j5O03l8m59K08J10
$$ -277 -272 -140 42 -586 -604 -292 -113 -320 -419 -316 -18 -5 -540 -233 -148 -79 -208 -223 380 342 -117 91 201
4725B01L09l03P1J85j54J01n80M13K80k57l21p0Q5J20m41J70K86j27o44K03L68
$$ 201 510 207 278 463 309 410 -170 243 523 266 -55 -125 -40 80 -361 -191 95 -32 -676 -473 -105
4746a05m44L96k46K49K65k98j52P8O73P4m49oL26j23j54K23K03J23j96j81l3j5
$$ -105 -549 -153 -399 -150 115 -183 -335 -257 416 490 41 35 361 238 84 307 510 633 437 256 223 208
4768B08j05J60J5r8m52J91j70o2L37k20O0J3l71k3J53m9K5K63m60L82L88ok00
$$ 208 103 263 278 180 -272 -81 -251 -313 24 -196 -136 -123 -494 -517 -364 -413 -388 -125 -585 -203 185 179 -21
4791b1J39M01l78p5J64J49j87J97r2J35j23l13L56j70nj07k8k81J30J80m57J68
$$ -21 118 519 141 66 230 379 192 389 297 432 309 -4 352 182 177 70 42 -239 -109 71 -386 -218
4813b18K82k75k28j26P8k1J50M14m72L41k22LJ89J27L1L06P4j64n3k3kK89k52
$$ -218 64 -211 -439 -565 -487 -508 -358 56 -416 -75 -297 -294 -105 22 53 359 433 269 216 193 191 480 228
4836B28J08R3m60L20m6p6J85m32J90j09j35l03K67j15m31N06j65K08k78O5J54
$$ 228 336 429 -31 289 243 167 352 -80 110 1 -134 -437 -170 -285 -716 -210 -375 -167 -445 -380 -226
4857b26O2K13j80R1K27l85M02l18J49M23nk20L4M22k91m07J30K68k99J64l44L07
$$ -226 -164 49 -131 -40 187 -198 204 -114 35 458 453 233 267 689 398 -9 121 389 90 254 -90 217
4879B17j55k60N17o75l7L12j51l22J63l6M02m86m8M83P7q9J6K59m97M76J10K20
$$ 217 62 -198 319 -356 -393 -81 -232 -554 -391 -427 -25 -511 -559 -76 1 -88 -72 187 -310 166 276 496
4901D96k68k59K4M52j89mj86K4K45j2J52m83P2J44Rn51N45j00l58k77L70K14k94
$$ 496 228 -31 -7 445 256 252 66 90 335 323 475 -8 64 208 217 -334 211 111 -247 -524 -154 60 -234
4924b34K1n5J20k73J8qM29o5m4k6OL00j65J7K15k24K06K27l62J79K05o2m78J81
$$ -234 -213 -268 -148 -421 -403 -411 18 -47 -91 -117 -111 189 24 41 256 32 238 465 103 282 487 425 -53 128
4948A28L58p03q7M28j67J11n14J62J20p3k7L93m53j1mK92k20l40M99k95K3M20
$$ 128 486 -217 -304 124 -43 68 -446 -284 -164 -237 -264 129 -324 -335 -339 -47 -267 -607 -108 -403 -380 40
4970D0K93l67roN15J36n91K00N70o59J03J26pj34k10K97J10l63j05Rj38j10M56
$$ 40 333 -34 -43 -49 466 602 11 211 781 122 225 351 344 210 0 297 407 44 -61 -52 -190 -300 156
4993A56l02p3q2K83m67j95O16N2l63j0J29J34J78m03O10k65j8L20j90J32K24j34
$$ 156 -146 -219 -301 -18 -485 -680 -64 -12 -375 -385 -256 -122 56 -347 263 -2 -20 300 110 242 466 332
5015C32j03k1j5L24k15n54K36L06l49j31k17K66n5%k09R5N1k46J94K10k94L8q5
$$ 332 229 208 193 517 302 -252 -16 290 -59 -190 -407 -141 -196 -196 -405 -310 -259 -505 -311 -101 -395 -357 -442
5038d42J26L13N3r3o9M4l1K93j77K98L29l91j11K59K98o60K94j50j97P2k15K63
$$ -442 -316 -3 50 -43 -112 -68 -99 194 17 315 644 253 142 401 699 39 333 183 -14 58 -157 106
5060A06j35l06O8M8K23q3l43R6o3J55k39Pn0K10L00K76n84N62j43k33l9L71K41
$$ 106 -29 -335 -267 -219 4 -79 -422 -326 -389 -234 -473 -466 -516 -306 -6 270 -314 248 105 -128 -167 204 445
5083D45k18o0L69r3k06K13P9o95J85L39k73K4lj02j76O7J79k9n05J39j16L87k74
$$ 445 227 167 536 443 237 450 529 -166 19 358 85 109 106 4 -172 -105 74 45 -460 -321 -437 -50 -324
5106c24O7J29J35n99N98K01k62k54M57J70m8k48o2O3k3J16L76j13j33J6K2r1j08
$$ -324 -257 -128 7 -592 6 207 -55 -309 148 318 270 22 -40 23 0 116 492 379 246 262 284 193 85
5129H5J83j21k17K2J45N0k00l07M38l04n6lL66m64R5J60j3k52K17M82l69K50R
$$ 85 268 147 -70 -48 97 147 -53 -360 78 -226 -282 -285 81 -383 -288 -128 -141 -393 -176 306 -63 187 196
5152A96K34j86j16N0K36R4J47m58N8J38M7m4m64L17l88L57l95k30M33J30n73q
$$ 196 430 244 128 178 414 508 655 197 255 393 440 396 -68 249 -139 218 -177 -407 26 156 -417 -425
5174d25QR6l1k07K45L8K69k41m4O0K82J80k59N5M8J89j04Jk53M76j28q9K71j38
$$ -425 -417 -321 -352 -559 -314 -276 -7 -248 -292 -232 50 230 -29 26 74 263 159 160 -93 383 255 166 437 299
$$ [...]
8191D7
##END NTUPLES=NMR FID
##END=
