##TITLE=1H_SA_pyrethernit_dry'
 DMSO+CCl4, 108 sc, 
 8.4.2019
##JCAMPDX= 6.0         $$ Bruker NMR JCAMP-DX V2.0
##DATA TYPE= NMR FID
##DATA CLASS= NTUPLES
##ORIGIN= UXNMR, Bruker Analytische Messtechnik GmbH
##OWNER= root
$$ XWIN-NMR		Version 3.5
$$ Mon Apr  8 15:31:31 2019 Russian Standard Time (UT+4h)  she@DPX200
##.OBSERVE FREQUENCY= 200.1315
##.OBSERVE NUCLEUS= ^1H
##.DELAY= (6, 6)
##.ACQUISITION MODE= SIMULTANEOUS
##.ACQUISITION SCHEME= undefined
##.AVERAGES= 108
##.DIGITISER RES= 18
##SPECTROMETER/DATA SYSTEM= spect
##.PULSE SEQUENCE= zg30
##.SOLVENT NAME= DMSO
##.SHIFT REFERENCE= (INTERNAL, DMSO, 0, 15.7039)
##AUDIT TRAIL= $$ (NUMBER, WHEN, WHO, WHERE, WHAT)
$$ ##TITLE= Audit trail, XWIN-NMR		Version 3.5
$$ ##JCAMPDX= 5.01
$$ ##ORIGIN= Bruker BioSpin GmbH
$$ ##OWNER= she
$$ F:/spectra/data/she/nmr/H-F/1/audita.txt
$$ ##AUDIT TRAIL=  $$ (NUMBER, WHEN, WHO, WHERE, WHAT)
(   1,<2019-04-08 15:28:53.34 +0400>,<she>,<DPX200>,
      <continue with go, POWCHK disabled, PULCHK disabled
       configuration hash MD5:
       00 E9 B6 7A A2 85 ED C7 34 08 36 98 17 FE 4E 26
       data hash MD5: 16K
       0D 82 79 64 D1 D8 F8 93 AA 7F 5D 2E 2D B8 8B 9E>)
$$ ##END=
$$ 
$$ hash MD5
$$ 6B 11 B9 D4 74 24 F1 54 58 C5 82 A6 18 C5 47 1E
##$RELAX= 
##$RELAX= 
##$RELAX= 
##$RELAX= 
##$RELAX= 
##$RELAX= 
$$ Bruker specific parameters
$$ --------------------------
##$DU= <F:/spectra>
##$EXPNO= 1
##$NAME= <H-F>
##$PROCNO= 1
##$TYPE= <nmr>
##$USER= <she>
##$AMP= (0..31)
100 100 100 100 100 100 100 100 100 100 100 100 100 100 100 100 100 100 
100 100 100 100 100 100 100 100 100 100 100 100 100 100 
##$AQSEQ= 0
##$AQ_mod= 1
##$AUNM= <au_zg>
##$AUTOPOS= <>
##$BF1= 200.13
##$BF2= 200.13
##$BF3= 200.13
##$BF4= 200.13
##$BF5= 200.13
##$BF6= 200.13
##$BF7= 200.13
##$BF8= 200.13
##$BYTORDA= 1
##$CFDGTYP= 0
##$CFRGTYP= 5
##$CHEMSTR= <none>
##$CNST= (0..31)
1 1 145 1 1 1 1 1 1 1 1 1 1 1 1 1 1 1 1 1 1 1 1 1 1 1 1 1 1 1 1 1 
##$CPDPRG= <>
##$CPDPRG1= <>
##$CPDPRG2= <>
##$CPDPRG3= <>
##$CPDPRG4= <mlev>
##$CPDPRG5= <mlev>
##$CPDPRG6= <mlev>
##$CPDPRG7= <mlev>
##$CPDPRG8= <mlev>
##$CPDPRGB= <>
##$CPDPRGT= <>
##$D= (0..31)
0 1.2 0 0 0 0 0 0 0 0 0 0.03 0 0 0 0 0 0 0 0 0 0 0 0 0 0 0 0 0 0 0 0 
##$DATE= 1554722553
##$DBL= (0..7)
120 120 120 120 120 120 120 120 
##$DBP= (0..7)
150 150 150 150 150 150 150 150 
##$DBP07= 0
##$DBPNAM0= <>
##$DBPNAM1= <>
##$DBPNAM2= <>
##$DBPNAM3= <>
##$DBPNAM4= <>
##$DBPNAM5= <>
##$DBPNAM6= <>
##$DBPNAM7= <>
##$DBPOAL= (0..7)
0.5 0.5 0.5 0.5 0.5 0.5 0.5 0.5 
##$DBPOFFS= (0..7)
0 0 0 0 0 0 0 0 
##$DE= 6
##$DECBNUC= <off>
##$DECIM= 24
##$DECNUC= <off>
##$DECSTAT= 4
##$DIGMOD= 1
##$DIGTYP= 9
##$DL= (0..7)
0 120 120 120 120 120 120 120 
##$DP= (0..7)
150 150 150 150 150 150 150 150 
##$DP07= 0
##$DPNAME0= <>
##$DPNAME1= <>
##$DPNAME2= <>
##$DPNAME3= <>
##$DPNAME4= <>
##$DPNAME5= <>
##$DPNAME6= <>
##$DPNAME7= <>
##$DPOAL= (0..7)
0.5 0.5 0.5 0.5 0.5 0.5 0.5 0.5 
##$DPOFFS= (0..7)
0 0 0 0 0 0 0 0 
##$DQDMODE= 0
##$DR= 18
##$DS= 0
##$DSLIST= <SSSSSSSSSSSSSSS>
$$ [...]
##$SUBNAM2= <"">
##$SUBNAM3= <"">
##$SUBNAM4= <"">
##$SUBNAM5= <"">
##$SUBNAM6= <"">
##$SUBNAM7= <"">
##$SUBNAM8= <"">
##$SUBNAM9= <"">
##$SW= 24.9337058887773
##$SWIBOX= (0..15)
0 0 2 0 0 0 0 0 0 0 0 0 0 0 0 0 
##$SW_h= 4990.01996007984
##$TD= 16384
##$TD0= 1
##$TE= 0
##$TE2= 300
##$TE3= 300
##$TEG= 300
##$TL= (0..7)
0 120 120 120 120 120 120 120 
##$TP= (0..7)
150 150 150 150 150 150 150 150 
##$TP07= 0
##$TPNAME0= <>
##$TPNAME1= <>
##$TPNAME2= <>
##$TPNAME3= <>
##$TPNAME4= <>
##$TPNAME5= <>
##$TPNAME6= <>
##$TPNAME7= <>
##$TPOAL= (0..7)
0.5 0.5 0.5 0.5 0.5 0.5 0.5 0.5 
##$TPOFFS= (0..7)
0 0 0 0 0 0 0 0 
##$TUNHIN= 0
##$TUNHOUT= 0
##$TUNXOUT= 0
##$USERA1= <user>
##$USERA2= <user>
##$USERA3= <user>
##$USERA4= <user>
##$USERA5= <user>
##$V9= 5
##$VALIST= <valist>
##$VCLIST= <CCCCCCCCCCCCCCC>
##$VD= 0
##$VDLIST= <DDDDDDDDDDDDDDD>
##$VPLIST= <PPPPPPPPPPPPPPP>
##$VTLIST= <TTTTTTTTTTTTTTT>
##$WBST= 1024
##$WBSW= 4
##$XGAIN= (0..3)
0 0 0 0 
##$XL= 0
##$YL= 0
##$YMAX_a= 1318960
##$YMIN_a= -2853075
##$ZGOPTNS= <>
##$ZL1= 120
##$ZL2= 120
##$ZL3= 120
##$ZL4= 120
##$ABSF1= 10
##$ABSF2= 0
##$ABSG= 5
##$ABSL= 3
##$ALPHA= 0
##$AQORDER= 0
##$ASSFAC= 0
##$ASSFACI= 0
##$ASSFACX= 0
##$ASSWID= 0
##$AUNMP= <proc_1d>
##$AZFE= 0.1
##$AZFW= 0.1
##$BCFW= 1
##$BC_mod= 2
##$BYTORDP= 1
##$COROFFS= 0
##$CY= 11.3945322036743
##$DATMOD= 1
##$DC= 2
##$DFILT= <>
##$DTYPP= 0
##$F1P= 18.9103706918063
##$F2P= -1.10871071338519
##$FCOR= 0.5
##$FTSIZE= 0
##$FT_mod= 4
##$GAMMA= 1
##$GB= 0.15
##$INTBC= 1
##$INTSCL= 1
##$ISEN= 128
##$LB= 0.24
##$LEV0= 0
##$LPBIN= 0
##$MAXI= 10000
##$MC2= 0
##$MEAN= 0
##$ME_mod= 0
##$MI= 1.114404
##$NCOEF= 0
##$NC_proc= 0
##$NLEV= 6
##$NOISF1= 3.799351
##$NOISF2= 2.8
##$NSP= 1
##$NTH_PI= 0
##$NZP= 0
##$OFFSET= 15.70392
##$PC= 1
##$PHC0= -8843.472
##$PHC1= 3.400259
##$PH_mod= 1
##$PKNL= yes
##$PPARMOD= 0
##$PSCAL= 0
##$PSIGN= 0
##$REVERSE= no
##$SF= 200.130013532006
##$SI= 16384
##$SIGF1= 3
##$SIGF2= 2
##$SINO= 400
##$SIOLD= 16384
##$SREGLST= <1H.CDCl3>
##$SSB= 0
##$STSI= 0
##$STSR= 0
##$SW_p= 3612.71676300578
##$SYMM= 0
##$S_DEV= 0
##$TDeff= 0
##$TDoff= 0
##$TI= <>
##$TILT= no
##$TM1= 0
##$TM2= 0
##$TOPLEV= 0
##$USERP1= <user>
##$USERP2= <user>
##$USERP3= <user>
##$USERP4= <user>
##$USERP5= <user>
##$WDW= 1
##$XDIM= 8192
##$YMAX_p= 0
##$YMIN_p= 0
$$ End of Bruker specific parameters
$$ ---------------------------------
##NTUPLES= NMR FID
##VAR_NAME=  TIME,          FID/REAL,        FID/IMAG
##SYMBOL=    X,             R,               I
##VAR_TYPE=  INDEPENDENT,   DEPENDENT,       DEPENDENT
##VAR_FORM=  AFFN,          ASDF,            ASDF
##VAR_DIM=   8192,          8192,            8192
##UNITS=     SECONDS,       ARBITRARY UNITS, ARBITRARY UNITS
##FACTOR=    0.0002004,     1,               1
##FIRST=     0,             0,               0
##LAST=      1.6414764,     0,               0
##MIN=       0,             -2853075,        0
##MAX=       1.6414764,     1318960,         0
$$ Real data points
##PAGE= N=1
##DATA TABLE= (X++(R..R)), XYDATA
0@%%%%%%%j08K16k16K16l24M32n40O48p56R71j169J377j610J835k143K482k829
24a518L278l791M331m921N589o326P147q044R028j0114J1298j2600J4031j5589
38h201J7307j9202K1278k3563K6079k8869L1985l5460L9351m3773M8838n4676
50b8906O1494o9597P9433r1656J07324j28248J57814k03100K82062m59096J576700
61A284224n08168k799696J300307J678587J7650j292425O7259M47107j46584o03641
71e55380J75456L44605J48504o2567j1581l54629j58751M47448N84161k77250
81B80016n79408O9319N50689r022l95790j2931L17436r3519l07011R3034L27953
92B40766j32992l67755Q3746L87328p0456m16705J3553M64825P5688m70284k13162
$$ plain form
0 0 0 0 0 0 0 0 0 -108 108 -108 108 -216 216 -324 324 -432 539 -630 747 -863 972 -1171 1311 -1518
24 -1518 1760 -2031 2300 -2621 2968 -3358 3789 -4255 4773 -5341 5957 -6643 7388 -8201
38 -8201 9106 -10096 11182 -12381 13698 -15171 16814 -18646 20705 -23068 25770 -28906
50 -28906 32588 -37009 42424 -49232 58092 -70156 87658 -115442 166620 -292476 1284224
61 1284224 776056 -2023640 -723333 955254 972904 -319521 -252262 194845 48261 -555380
71 -555380 -379924 -35319 113185 50618 39037 -315592 -474343 -26895 557266 280016
81 280016 -299392 -230073 320616 311594 -84196 -97127 220309 126790 -180221 -87187 240766
92 240766 107774 -259981 -176235 211093 140637 -276068 -262515 202310 277998 -192286 -405448
103d05448M21033L56534k56065m04060P3783L53297N5629k50287j13683J55886
113a3381J34541p1135j37949j5813J00824P7326l8261r9085j5848Q5942L7077
124D4238p3798j5398J23283M3916j71715j06810J91427J84805j72638k48985J36178
135f5497L14148p5370l70827m0442L46827J31485k92758k04825K02359K19667
145A64767j21224k18361M7910K05724L0115j51304p5511R6924J12716j3289r2149
156a3682k2270P8292M9733o7433q5412M5103J10228k1896j39792j5095J57799
167G5575N8485j90256j35591J87506K26852j51403l28568N1008L88973Q7070l89442
178a19791k26369L20892L36579j97365l82205N7322L74246R5937k74337j80845
$$ plain form
103 -405448 15585 372119 116054 -288006 -214223 139074 194703 -55584 -169267 -13381
113 -13381 121160 50025 -87924 -103737 -2913 74413 36152 -62933 -78781 7161 44238
124 44238 -29560 -44958 78325 122241 -49474 -156284 35143 219948 47310 -201675 -65497
135 -65497 248651 173281 -197546 -237988 108839 240324 -52434 -257259 -54900 164767
145 164767 43543 -174818 -126908 78816 108931 -42373 -117884 -20960 91756 78467 -13682
156 -13682 -35952 42340 92073 24640 -60772 -15669 94559 72663 -67129 -82224 75575
167 75575 134060 -56196 -191787 -4281 222571 71168 -257400 -206392 182581 269651 -119791
178 -119791 -346160 -25268 311311 113946 -268259 -210937 163309 259246 -15091 -195936
188a95936J38252J96238r381j53637q5052P1568J22673K124j28785p3232J00038
199a5130J11828n4652j14811J9196R1984j6933p1849L3017Q4034m3506j02814
210g9636L8382J20516l5625j58388P357J97733N5808k04581j36352J73442K07078
221A85734j03616k38869K6406K45097N9329k15626j29827J57956J74454p8570
231H2468j75065Q440J40516K6076j11192l9754R1631N3037p7352o7644N7800P8892
243F7853m8721j12851J3814J43861M3444j62117j26327J41021K16416p3886k78276
254a75769k3210L01930J35804k74862k32473K09928L10943j02650l34601j1191
264a96151L11015J17804k37183j88978J50165K20156n0126k26180m7632J92405
$$ plain form
188 -195936 -57684 138554 129173 -24464 -109516 -37948 84725 86849 -41936 -115168 -15130
199 -15130 96698 42046 -72765 -53569 38415 21482 -50367 -17350 66684 23178 -79636
210 -79636 -41254 79262 43637 -114751 -107394 90339 146147 -58434 -194786 -21344 185734
221 185734 82118 -156751 -130345 114752 174081 -41545 -171372 -13416 161038 82468
231 82468 -92597 -84157 56359 82435 -28757 -68511 23120 76157 -1195 -68839 -11039 67853
243 67853 19132 -93719 -79905 63956 107400 -54717 -181044 -40023 176393 102507 -175769
254 -175769 -198979 102951 238755 -36107 -268580 -58652 252291 149641 -184960 -196151
264 -196151 114864 232668 -4515 -193493 -43328 176828 126702 -99478 -147110 45295
274D5295J24378j41546j92131N9192K12413J4181k12840q2668J89050J36430j53148
285a394j75883J06780K00074m7872j88797K3818K00132J6848j97604n7559J94801
296G3344J11998j70056j66682J17956J96845o4911k22943j2834K12571Q1618j83848
307b6942j49320J14904J79745m0841j70666j1687J51520O0913j23377r6032Q0336
318c1447J21489l0946j28451k1495J20100O4593j02542j09543P5929J52182k7042
329H2827j75085k3731J88574R1633j65681j38524J33431J67688j00876j95520
339a35264M8264J96949l140j91954m4860J60354P3771j25463r0877Q9120J07422
350H4322m7479j08174M192R8425L4820p3313o0385M7768P7037k7097r6698j040
$$ plain form
274 45295 169673 28127 -164004 -104812 107601 121782 -91058 -173726 15324 151754 -1394
285 -1394 -177277 -70497 129577 81705 -107092 -83274 116858 133706 -63898 -121457 73344
296 73344 185342 15286 -151396 -33440 163405 98494 -124449 -137283 75288 156906 -26942
307 -26942 -176262 -61358 118387 77546 -93120 -104807 46713 107626 -15751 -111783 -31447
318 -31447 90042 59096 -69355 -90850 29250 93843 -8699 -118242 -42313 109869 82827
329 82827 -92258 -115989 72585 164218 -1463 -139987 -6556 161132 60256 -135264
339 -135264 -87000 109949 106809 -85145 -130005 30349 104120 -21343 -112220 -23100 84322
350 84322 36843 -71331 -67139 31286 66106 -7207 -67592 -19824 57213 30116 -66582 -67622
362f7622J17343N1728j10042r2559R1725J32708n5971j60425Q209J75057N2368
373A42519j69010j25500J17842J68500n2184j83847k2963J58468P7144j20280
383i311j12981P1626J34451j1559j19569l2257R2616N5490n9638o1413M1139O7553
395E6147k2420p3830P519P6757J2128p7873l6091P4402N8827o9858q5349N3864
407b5777J14235k2800j33186j8956J28719O0478j13716r4514Q4622J22449m6043
418E5511j40330j0474J26594N9256r1850r2735M2263J05934N135q8995l8665P2679
430D323O8658m1300q1039J2503P9109J3320p2901j9377P0121K5080q1021m8849
442g1373Q0334P6654o9995j08939M6233J33157j3068j56639l9349J56867J02913
$$ plain form
362 -67622 49721 101449 -8593 -101152 -9427 123281 67310 -93115 -84906 90151 142519
373 142519 -26491 -151991 -34149 134351 82167 -101680 -124643 33825 110969 -9311
383 -9311 -122292 -50666 83785 72226 -47343 -79600 13016 68506 8868 -52545 -11406 56147
395 56147 33727 -40103 -32584 44173 56301 -21572 -57663 16739 75566 5708 -79641 -25777
407 -25777 88458 65658 -67528 -86484 42235 102713 -11003 -105517 -20895 101554 55511
418 55511 -84819 -95293 31301 90557 -1293 -94028 -51765 54169 59304 -29691 -68356 4323
430 4323 72981 31681 -49358 -36855 42254 55574 -17327 -36704 33417 58497 -22524 -71373
442 -71373 8961 85615 15620 -93319 -47086 86071 73003 -83636 -122985 33882 136795
453A36795j32858j56749P5761J89587p568j88425n0212J71341J09780j29289j50865
464a32702P0598J68514n394j51359m8697J19093Q1139q0664r9185L7377J07521
475F6241j851r8706l2976Q3333N4290p0071p4808N7943R2498m6637j21803J7122
487g5425J45278K8686j50967q1831J39479J37107j00811j80901M1251K07021L9425
498A48312j93932j18086J46386J70369p0934j88312k486J75780O5719j40798j07286
509a15268R4237J29727m3572j28422J463J06070J4379r7275l3600Q6417M6264
520F0420q2468o4933O8357Q4310m9153r7848K9661J21708P475j23224m9242J13806
532A8869R6752q0482j27602L2490J40879J6802j42528p2104J16430J20736o8628
$$ plain form
453 136795 3937 -152812 -77051 112536 104968 -83457 -133669 37672 147452 18163 -132702
464 -132702 -62104 106410 101016 -50343 -99040 20053 101192 20528 -78657 -41280 66241
475 66241 64390 -34316 -67292 16041 70331 260 -74548 -16605 75893 29256 -92547 -75425
487 -75425 69853 98539 -52428 -134259 5220 142327 41516 -139385 -98134 108887 148312
498 148312 -45620 -163706 -17320 153049 82115 -106197 -108683 67097 132816 -7982 -115268
509 -115268 -21031 108696 65124 -63298 -61835 44235 58614 -38661 -72261 14156 60420
520 60420 -22048 -86981 -18624 65686 16533 -81315 -51654 70054 77529 -45695 -94937 18869
532 18869 115621 35139 -92463 -59973 80906 97708 -44820 -116924 -494 120242 51614
543E1614j47794O049J45632M8518j20842q8009Q2459J10511m4507j18910N317
554f9962J12166K7098r9041n1553Q3664O4282p1834p7945O3695J04256m2266j22989
566h0429J0711J37938L3276j29918p5490J10031J13482p2847j43215J9568J48908
577G2015L7078j32919r2323R0045J21198m2224j29471p298J24310N1231j00213
588h571q8504N8103J04652j3509j00178k1390Q2163M8828o1734o8752L7237Q4451
600E2796p255q0198j2360P4003L4655o8195m2172O8485O1787o8553q9145M6396
612b9756J06929k0132j21315j8967J15663N7527j00973r9005O0883J26108j059
623G5903j23858n1384R5375R3592n1804j03998O719J01767K7770q6022m9245O1331
$$ plain form
543 51614 -96180 -90131 55501 104019 -16823 -104832 -22373 88138 43631 -75279 -69962
554 -69962 42204 69302 -29739 -81292 2372 66654 -5180 -83125 -19430 84826 42560 -80429
566 -80429 -69718 68220 101496 -28422 -103912 6119 119601 46754 -96461 -76893 72015
577 72015 109093 -23826 -116149 -26104 95094 52870 -76601 -83899 40411 91642 -8571
588 -8571 -97075 -38972 65680 52171 -48007 -69397 12766 61594 -140 -68892 -31655 52796
600 52796 45541 -34657 -47017 26986 61641 -6554 -48726 19759 81546 12993 -76152 -29756
612 -29756 77173 57041 -64274 -83241 32422 89949 -11024 -110029 -49146 76962 75903
623 75903 -47955 -99339 -3964 89628 37824 -66174 -59455 42312 70082 -15940 -65185 -3854
635c854O3932l8655n8515K4785N4902k0789n5205J5482O3188m842o7207k0217
647d6995O3691L7626n4290o2180L1139P6482J035q6318m1212P7776Q1639m5722
659C2671j05702O832J17687L5060j12694p4620R2106J12578n6574j30371J0635
670g2392J30790L0541j16761o2761R2487Q9173o0019j03671K5432J07590R742
681G0151j02444l5824Q7935N5867p8270p5582O1658R0768m0934j04880J0061J07418
693D5924J7762j01571n1408Q6757Q2359n5271j02111K0318J13478K8011j01257
704a7009o8891P8015J03740l8155j21992q019J21034N2250j05661r3998P0607
715b8079J16249l1775j26506r515J19458M7402j01343p5686P6001Q8008m7367
$$ plain form
635 -3854 60078 21423 -37092 -12307 42595 21806 -33399 -17917 45271 40429 -26778 -46995
647 -46995 16696 54322 32 -62148 -31009 45473 46508 -39810 -81022 -3246 78393 32671
659 32671 -73031 -66199 51488 86548 -26146 -100766 -8660 103918 47344 -83027 -72392
670 -72392 58398 88939 -27822 -90583 1904 91077 31058 -72613 -47181 60409 70151
681 70151 -32293 -68117 19818 75685 -2585 -78167 -16509 74259 33325 -71555 -61494 45924
693 45924 63686 -37885 -89293 -2536 79823 24552 -77559 -57241 56237 84248 -17009
704 -17009 -85900 -7885 95855 57700 -64292 -72311 48723 100973 -4688 -98686 -28079
715 -28079 88170 56395 -70111 -79626 39832 87234 -14109 -89795 -13794 74214 26847
726B6847r3739K1692Q8038l370q0906j0023P9184K7947p0140m6764O3481O5619
738F7866m2633q1946K2558R5818J0090j00257n2514Q8982Q5854o1288j16120K2858
750f0732J26856J5014j25481n8517J06678R6933p4377j20194L2445J26289J0249
761G5163j16286m5022R6038P6373o5174r4859K6083R7332J4045q3806m4177O2029
773b261O5977l7295p8736J1593Q5423J7062q6187m2617P7606O5823o2116q5013
785g0741M3617R7539j8915j08521j1849J03091L8089q9758o4808O6549P9431l9337
797B4387q6642J0538Q9034K1905p5936m4233N5043O4819l0288o7515Q257O5308
809C4677J1589o0250l4679M7710M9137k4635n7135J653N4007J6243m9973l2529
$$ plain form
726 26847 -66892 -45200 42838 39468 -41438 -51461 27723 55670 -14470 -61234 2247 67866
738 67866 25233 -56713 -34155 61663 71753 -28504 -81018 7964 93818 32530 -83590 -60732
750 -60732 66124 81138 -44343 -102860 3818 100751 26374 -93820 -61375 64914 75163
761 75163 -41123 -86145 9893 86266 21092 -73767 -47684 49648 63693 -20113 -64290 -2261
773 -2261 63716 26421 -52315 -40722 44701 61763 -24424 -67041 10565 76388 14272 -70741
785 -70741 -27124 70415 51500 -57021 -68870 34221 72310 -17448 -82256 -15707 63724 24387
797 24387 -62255 -51717 37317 59222 -16714 -60947 -5904 58915 28627 -38888 -30631 34677
809 34677 46266 -13984 -48663 -953 48184 23549 -33586 -31933 22074 38317 -11656 -44185
821d4185L9758M8257k6803n9374P390O2916Q784o1566k3056N7374L7642n2880
833e743n3424M0244O9175j6694p4504m809P4643L0768o6932n2144M9599P4716
845F4895k1542q1330j1930P3519L6111n8878n5142L6561O1946j4363o6596r584
857d6333O2024K8385n0774m3820L9530N4496k5890o2964J2133P0703P818p1548
869b6240l1175O6870N0866n1878o6343L2320P7896q204p7565k3608P5469N2252
881G0660n4855p4229K2474Q3911Q409q2274m0629P0384O7155m9718r1294J5788
893e4218R8269K0026r0754n1123P4847P6724n1838r3330K4601R9390Q218r3187
905c2375l5715P7975N7423o0237o8837M0766Q0582j6841q2409r071P8457L0372
$$ plain form
821 -44185 -4427 43830 17027 -42347 -34957 27959 36743 -24823 -47879 9495 47137 -5743
833 -5743 -59167 -18923 50252 33558 -40946 -45755 28888 59656 -7276 -59420 -9821 64895
845 64895 43353 -37977 -49907 23612 59723 845 -54297 -17736 44210 29847 -36749 -46333
857 -46333 15691 44076 -6698 -50518 -10988 43508 17618 -45346 -33213 37490 45308 -26240
869 -26240 -57415 9455 60321 8443 -57900 -25580 52316 44112 -33453 -57061 18408 70660
881 70660 15805 -58424 -35950 47961 56370 -25904 -66533 3851 71006 21288 -70006 -54218
893 -54218 44051 64077 -26677 -77800 -2953 73771 21933 -71397 -46796 52594 60812 -32375
905 -32375 -68090 9885 67308 7071 -61766 -21000 59582 42741 -39668 -48739 29718 60090
917F0090o3335m8989M7286O0003l0073o9339L857O6267J8711n9318l7411M0286
929a1965M8742j9363n6061P33N7094K0401m8631l8000L8848N3627k3900n9486
941c7961J1125O5860K390o8246j6132P0076L1531o9257m7507N9384O2836m6890
953A7209p7862K6272Q7891l936r0752k8647Q2237O0350o2698q2606L1305R5730
965E4493L521r6111m1435Q4169P3720n4817r3591J9837R6958J8893q7446m4736
977f6545O7799O7727m2819p7514J3152Q1241J0059p3650l1901O1205M6147m9161
989E740n9850L2083P0520j3310p4963q771P4227K9802o8933n1245N3803P0914
1001F0017l2394q4611L533Q7454K8560p8709n5544O1459P7873l1189q8893k045
$$ plain form
917 60090 -3245 -52234 -4948 55055 24982 -44357 -40500 25767 44478 -14840 -52251 -11965
929 -11965 36777 17414 -38647 -37914 19180 39581 -9050 -47050 -8202 45425 21525 -37961
941 -37961 -26836 39024 41414 -26832 -42964 27112 58643 -10614 -58121 1263 64099 17209
953 17209 -60653 -34381 53510 49574 -41178 -69825 12412 72762 10064 -72542 -41237 54493
965 54493 58014 -38097 -79532 4637 78357 23540 -70051 -50214 46744 65637 -21809 -66545
977 -66545 1254 68981 26162 -51352 -38200 43041 53100 -20550 -52451 8754 54901 5740
989 5740 -54110 -22027 48493 35183 -39780 -48551 25676 55478 -13455 -64700 -10897 60017
1001 60017 27623 -56988 -53455 33999 62559 -16150 -71694 -10235 67638 36449 -52444 -54489
1013e4489Q9863L6546p2146o6080M8376Q1831j8121q6481j2630P7559L6432o0946
1025b86n3870L5417N9399j4436n7609l760M6657J5305l6867k0876K8706K5540
1037B3320j9418k7601J2768K8989k214l1361k055L1769J3483l0555k7403K3715
1049f563L9145j0630m6162o982M8083K4591m2044m5696L2270O2425j2833p0246
1061c4642j4197O7487L6130n8504n4927M3173O3509k3436o8721Q30O5077J7406
1073C9185n2408k7834M3479L4922k7193m0295J8728M2755m735m4390q783M1108
1085A4539K2819l4186m0999K4388N1751p154o0501j8160N8820M3383m7896o2826
1097e6022K4734P7268k0p8831l0520O9390N8554n2063p7512K4426Q6972Q334q3445
$$ plain form
1013 -54489 35374 71920 -226 -66306 -17930 63901 45780 -40701 -53331 24228 60660 -286
1025 -286 -54156 -18739 40660 26224 -31385 -35145 11512 26817 -10050 -30926 -2220 23320
1037 23320 3902 -23699 -10931 18058 15844 -15517 -17572 14197 27680 -2875 -30278 -6563
1049 -6563 32582 21952 -24210 -31192 16891 41482 -562 -46258 -13988 48437 35604 -34642
1061 -34642 -48839 18648 54778 -3726 -58653 -15480 48029 24593 -44128 -43298 21779 39185
1073 39185 -13223 -41057 2422 37344 10151 -30144 -11416 31339 26604 -17786 -26569 14539
1085 14539 37358 3172 -37827 -13439 38312 31158 -29343 -47503 11317 54700 6804 -56022
1097 -56022 -31288 45980 45960 -32871 -63391 5999 64553 12490 -65022 -40596 46376 54710 -28735
1110b8735l4748P0870N7869n1284p1133K4305Q1819L754p4294k9545N9952M5661
1122E4491m3970n6310K6413N8234q392o0222j0639N2938K6641m7259l7366L5795
1134i646N1010k2546o1018N699O7608J8107o5762l8414N4584N5026l6988o7445
1146d9785J4749P3961P905o5699k8673N1759M5082l4129n0886J5130N2548L894
1158C5856n0374k0952L8559L2763k8233m2041J3569M3714l837m5602q163M7531
1170A2790K0408m5075l2675M4121M7551l5371n8391K2003O9831k007p6629k1230
1182e4674P3261M7706o0441o9469L6755Q2936p405q5960j8536P4040M5686n7845
1194F054o2376L3443O8607q149p1442j0595O2708K8877n3561m5511L6686N7898
$$ plain form
1110 -28735 -63483 7387 65256 13972 -57161 -32856 48963 52717 -21577 -51122 8830 54491
1122 54491 10521 -45789 -19376 38858 30466 -29756 -40395 12543 39184 -8075 -45441 -9646
1134 -9646 41364 18818 -42200 -36501 31107 49214 -16548 -54962 -378 54648 17660 -49785
1146 -49785 -35036 38925 46830 -18869 -47542 4217 49299 15170 -35716 -20586 31962 35856
1158 35856 -14518 -35470 3089 35852 7619 -34422 -20853 22861 19024 -26578 -34741 12790
1170 12790 33198 -11877 -44552 -431 47120 11749 -46642 -24639 45192 43185 -33444 -54674
1182 -54674 18587 66293 5852 -63617 -26862 56074 48669 -37291 -55827 18213 63899 6054
1194 6054 -56322 -22879 45728 37579 -33863 -44458 18250 47127 -6434 -51945 -15259 42639
1206D2639j5955o4191o064O3006K9235n4037m7941L8554O6310j5479p3460r969
1218d7352P1005L4385n8281n5602M2126O8958j9814p5170n703P3609K6661o1375
1230f553m8743M3167N9780k3615o4517J265O2587J6542n1850l2430L6785M3010
1242C5428k2119m4144Q549M5692M479l9982j4244L5416K3769k9004k9523K0797
1254d886L5757j2400l8747k021M0497J1440l5866k8143K7385L7714j2019m5432
1266b6721k422M2779J9473l7464l3255K6343M4061j1668m9440m351M6569K1278
1278C5182m1370l1690K9744M2729j6472m6503K361M5677J3261m0064k2197L1317
1290A975L3225k3447m1905J2226M7336J200m8942j7221M7071L1873m2163m7302
$$ plain form
1206 42639 26684 -37507 -43571 19435 48670 -5367 -53308 -14754 51556 36077 -37383 -47352
1218 -47352 23653 58038 -243 -55845 -13719 55239 35425 -39745 -45448 28161 54822 -6553
1230 -6553 -55296 -12129 47651 24036 -40481 -39216 23371 39913 -11937 -44367 -7582 35428
1242 35428 13309 -30835 -22286 23406 27885 -12097 -26341 9075 32844 3840 -25683 -4886
1254 -4886 30871 18471 -20276 -22297 18200 29640 -6226 -34369 -6984 30730 18711 -26721
1266 -26721 -29143 13636 33109 -4355 -37610 -11267 32794 21126 -28314 -32665 13904 35182
1278 35182 -6188 -37878 -8134 34595 18123 -28380 -26019 19658 32919 -7145 -29342 1975
1290 1975 35200 11753 -30152 -17926 29410 30610 -18332 -35553 11518 43391 1228 -46074
1302d6074K8979N8226j0046o6771j3441O3049L7417n1871n5619L2393O7966o029
1314C8179p0135j8480O1774M4685m2551n9109J8153O5173Q708o0632l1511M6231
1326D85M8297k6536n9138K194O0133J7907n4102l7942M3247M7323k7304n5045
1338d0481J1928N5275L446n2773j6531M6865K8593m0068l3469L1701M1554k0010
1350A6030m5330O420N0357N122m6840k0384M2095L1470l0357m3542J6194M7844
1362B9079P92m4155k0516L6933L2297k5344l9419J1312M3920J879m2627j5737
1374c1586L6800K4769k9453l4582K2566L9271j1546m4872J650M5181J1164l9537
1386a0175k4900L6823L6630k8916m5678J7724N5076k209n8250j6319N6957L3198
$$ plain form
1302 -46074 -17095 41131 31085 -35686 -49127 13922 51339 -532 -56151 -23758 44208 38179
1314 38179 -31956 -50436 11338 56023 13472 -45637 -27484 37689 46397 -14235 -45746 485
1326 485 48782 22246 -36892 -34698 25435 43342 -10760 -48702 -5455 41868 14564 -40481
1338 -40481 -28553 26722 30168 -22605 -39136 7729 36322 -3746 -37215 -5514 36040 16030
1350 16030 -29300 -22880 27477 32599 -14241 -34625 7470 38940 8583 -34959 -18765 29079
1362 29079 29871 -14284 -34800 2133 34430 9086 -30333 -19021 24899 26778 -15849 -31586
1374 -31586 5214 29983 530 -34052 -11486 27785 16239 -28633 -26983 18198 29362 -10175
1386 -10175 -35075 1748 38378 9462 -36216 -18492 36584 34375 -23875 -40194 16763 49961
1398D9961m9740n0884L2928O5224j1484p3481j5064O7652M1281n4740n9277L0140
1410b7484P0736m18p1165k5263N9877M6748m1117n9586K0128O2312K826n8496
1422b0902j7878M8534L1016l6835l9459K6330M4822j1946m7871j783M2980J6252
1434C3260l7705k8887K6345L6523j4739m1103l569M3502J4957l4609k8989K8408
1446f606L8176j6986m5370N317M7779R905m3125k4405L6433L4632k4853m0786
1458b9889J2116M2559K317l9426j4480L0376K4520k2457k6210J2579L0029q671
1470A3363l0428j91K7959Q758k9736j5428K7694K1690k2046k9553J1861L7697
1482B1640j105l5743j2458K9671K8128k2370l3063Q935L7785O504l7718k0475
$$ plain form
1398 49961 221 -50663 -17735 47489 36005 -37476 -52540 15112 56393 1653 -57624 -27484
1410 -27484 43252 42834 -28331 -53594 6283 53031 11914 -47672 -27544 34768 37594 -20902
1422 -20902 -38780 9754 40770 3935 -35524 -9194 35628 23682 -24189 -25972 17008 33260
1434 33260 -4445 -33332 -6987 29536 14797 -26306 -29875 13627 28584 -6025 -35014 -6606
1446 -6606 31570 14584 -30786 -25469 22310 32215 -10910 -35315 1118 35750 10897 -29889
1458 -29889 -17773 24786 27103 -12323 -26803 3573 28093 5636 -20574 -7995 22034 13363
1470 13363 -17065 -17256 10703 19461 -10275 -25703 1991 23681 1635 -27918 -16057 21640
1482 21640 20535 -15208 -27666 2005 30133 7763 -25300 -16365 21420 27924 -9794 -30269
1494c0269L2151L2572k1653m1823R073M5068N298m3953k1988L5787L5645k4626
1506A1282m4556J0414M6524N133m3933k1048L7245L1443k6432m0129J4025M4838
1518B4806L35m5030j3923M2419K7797l1695l9124K0656M7660l166m9893j5400
1530c4558M5174L1678l4627m3079J5861M8116K611m7834k1625M0021L3567k3821
1542A1484m3963Q369M6937N072m2808k0092L6223L2307k7747l8363J5405M1192
1554B4016j547m1338p344L6879J9504l0313k7656K0416L4591j0773l6094j168
1566b0827L6590J1051l5118k1658L1637K9426k4362l9505J5198M3865q43m5767
1578b0313j3337L9472K7607k8978l7135J5720M1600k202l8986j2766L4657K2428
$$ plain form
1494 -30269 1882 34454 12801 -29022 -19949 25119 30417 -13536 -35524 263 35908 11282
1506 11282 -33274 -22860 23664 28797 -15136 -36184 1061 32504 6072 -34057 -20032 24806
1518 24806 25141 -19889 -33812 8607 36404 4709 -34415 -13759 33901 30735 -19158 -34558
1530 -34558 10616 42294 7667 -35412 -19551 28565 31176 -16658 -38283 1738 35305 11484
1542 11484 -32479 -24110 22827 27899 -14909 -35001 1222 33529 5782 -32581 -17176 24016
1554 24016 22469 -18869 -26213 10666 30170 -143 -27799 -7383 27208 16435 -19659 -20827
1566 -20827 15763 26814 -8304 -29962 1675 31101 6739 -32766 -17568 26297 25454 -20313
1578 -20313 -33650 5822 33429 4451 -32684 -16964 24636 22434 -16552 -29318 5339 27767
1590B7767k4401k9424J6095L2751n214l4314l265L5591J2491l1188k3650K5773
1602i88L2176j8930l9340O822M3748O929m5260k1439L8501L4566l0406m3874J5844
1615b1651N0908k374n0831j5402M7105L1879l5198m3911J9742N1544j094n1162
1627b0445j6049M5034L2813l2516m3930J8525M5572j745m4513j2654L8817K1769
1639C0678l2445k6593K0747L5173j4938l6677L926L8615O686l7655j7566L1057
1651A008K8302k1579l6227R510L6990O931l4379j9995K8092K9254j5822l4170
1663b2085L185L8314R304l6483k0303K9967K8267j8818l7150Q966L9778J389l8979
1676a4648j3102L3736J8349k4488k6641J8669K7780p722l0225r6L0222O677k7394
$$ plain form
1590 27767 3366 -26058 -9963 22788 17574 -16740 -20005 15586 28077 -3111 -26761 -988
1602 -988 31188 12258 -27082 -20260 23488 30417 -14843 -36282 2219 36785 6379 -37495 -21651
1615 -21651 29257 26883 -23948 -39350 7755 39634 4436 -39475 -19733 31811 30717 -20445
1627 -20445 -36494 8540 41353 8837 -35093 -16568 29004 27259 -17254 -29908 8909 30678
1639 30678 -1767 -28360 -7613 27560 12622 -24055 -20129 18486 25172 -12483 -30049 1008
1651 1008 29310 7731 -28496 -18986 18004 24935 -9444 -29439 -1347 27907 12085 -22085
1663 -22085 -18900 19414 28718 -7765 -28068 1899 30166 11348 -25802 -16836 22942 24331 -14648
1676 -14648 -27750 5986 24335 -153 -26794 -8125 19655 11933 -18292 -18388 11834 18511 -8883
1689h883j3692K4128K2012j8527k9692J0344L5475J088l4608j3430L0314K5773
1701C0302k1718l2883Q668L8050L900l3560k1583K7989K7811j5845l2902J575
1713b0196L4002J0918l1520k2177K3318K9809j2744l2611J359L4587Q685k9622
1725f192j7619K3972K3496j5172k7703N709K8682K419k8337q467K4989J6953k0980
1738A750k4263J4493L1607o695l5397o405L6012J8693l0007l0703K0095L7682
1750B6862p496l9744q534L6899K0470k7071k8384J5700L2096l075k9475r804K5955
1763D399J7455j7210k3886J1003K4113P08k6720q899K5792J6615k1511k1929J4322
1776e748K7070r715k8849m58L0921N218k9003j1594K4307K0630k2279k5685J3644
$$ plain form
1689 -8883 -22575 1553 23565 5038 -24654 -14310 21165 22253 -12355 -25785 4529 30302
1701 30302 8584 -24299 -15631 22419 26319 -7241 -28824 -835 26976 11131 -21771 -20196
1713 -20196 13806 24724 -6796 -28973 -5655 24154 11410 -21201 -19842 14745 23430 -6192
1725 -6192 -23811 161 23657 8485 -19218 -13509 15173 17592 -10745 -19212 5777 22730 1750
1738 1750 -22513 -8020 23587 16892 -18505 -24910 11102 29795 -212 -30915 -10820 26862
1750 26862 19366 -20378 -28912 7987 28457 1386 -26998 -11298 20798 17723 -11752 -21556 4399
1763 4399 21854 4644 -19242 -8239 15874 16582 -10138 -19037 6755 23370 1859 -20070 -5748
1776 -5748 21322 11607 -17242 -17700 13221 18439 -10564 -22158 2149 22779 500 -25185 -11541
1789a1541L4758o699l7143o481L8671K0078l2659l1730K2415M1253q116m5542
1801b2736o119M2184K0755l2549l1848K1920L5509q304l7044m694L4994J4587
1813B6655k9105k4431J9547L0400r602l2094j006L0544J2671k9529j9876K2451
1825c375K8531j4050l4017M410L6614O341l6341j4227L0035K7343k4362l4491
1837b7589J4032L9624j242m1590j2089L6983K3990k7614l5256J5838M0302l298
1849B2091l9146j0371L4611K0183k6872k7882J7158L0878q346l0135j616K9322
1861I875J0006k5609j5958K0816K2070j3426k6686O038K8289K362k5748j2528
1873b0499K4655J7504j6595k2949Q087K7020j686k6048q234K3635J4734k0479
$$ plain form
1789 -11541 23217 16518 -20625 -27106 11565 31643 -1016 -32746 -10331 30922 22806 -22736
1801 -22736 -28855 13329 34084 1535 -30313 -8393 27116 18812 -18232 -22926 12068 26655
1813 26655 -2450 -26881 -7334 23066 13464 -18630 -19636 10908 23579 -5950 -25826 -3375
1825 -3375 25156 11106 -22911 -18501 18113 24454 -11887 -26114 3921 31264 6902 -27589
1837 -27589 -13557 26067 24825 -16765 -28854 8129 32119 4505 -30751 -14913 25389 22091
1849 22091 -17055 -27426 7185 27368 496 -27386 -10228 20650 12304 -17831 -19447 9875
1861 9875 19881 -5728 -21686 -870 21200 7774 -18912 -12874 15415 17777 -7971 -20499
1873 -20499 4156 21660 5065 -17884 -9797 17223 15537 -10511 -18745 4890 19624 -855
1885h55k1382J3875K6355o583k8312j849K8074R313k2613j8189J8863K2934q241
1898A1390k8387K915K7908O022k6322j5264K2926K3914j6551l0684P477L3048
1910A8392N828l4792j8141K9191K8895k0396l4736O014L9092P136l6369j8517
1922b8403K6516K8218j7554l1183N512K9862O045k6021j4547J9945J9158r316
1934H232k1826k81K3343Q551j9505j5819J5035K0788p503k4990N12K5039O114
1947A7690k3151j3409K0618J6269j4519k3083R358K5446k954k4855n572K5574
1959G412J0665j9669k1096J6166K4804m860k8240m209K6018J4705k0653k0451
1971a9408J1268K4663r14k6248o082K1209J3423j4570j7918P799K0075l587j8732
$$ plain form
1885 -855 -22237 -8362 17993 11410 -16902 -18751 9323 18636 -3977 -22166 -3303 19631 11390
1898 11390 -16997 -14082 13826 19848 -6474 -21738 1188 25102 8551 -22133 -14656 18392
1910 18392 24220 -10572 -28713 478 29373 8977 -25759 -19745 19347 26483 -9886 -28403
1922 -28403 -1887 26331 8777 -22406 -16894 12968 19013 -7008 -21555 -1610 17548 8232
1934 8232 -13594 -13875 9468 18019 -1486 -17305 -2270 18518 11015 -13975 -13463 11576 17690
1947 17690 -5461 -18870 1748 18017 3498 -19585 -10227 15219 12265 -12590 -18162 7412
1959 7412 18077 -1592 -22688 -6522 18282 13422 -14818 -19027 6991 21696 1043 -19408
1971 -19408 -8140 16523 15609 -10639 -16721 4488 17911 3341 -14577 -6778 13297 9710 -9022
1984i022k763J6913N655j3327j0892J0310J4728p478j6757K621J9960L041k1949
1997h960o566K0290J3578j7557k0564J2888K5825l789l1330m130L1890J2833k5769
2010a361k4997J9957L1178p854l5390m522L0994K0074k7678k7554J6285L3603
2022B2735n091l4201q998L1956J8652k5524k3357J6019K7678r610k7445K40K9505
2035A2559N028k2462j5890K0678K0531j3229k6109P118K7539L793k8408j2130
2047b0982K3140K2011j7182k8053P264L2646K496l2794j3077K7386K3982j9997
2059F840l1684Q862L2779M009l1283j4515K5981K2006j5534k9393R093K8108J005
2072A6274k6027o627K1937J1385j9226j4112J6340J6804j2221j9710Q735K0336
$$ plain form
1984 -9022 -11785 5128 10783 -2544 -13436 -3126 11602 4124 -12633 -10012 9948 12989 -8960
1997 -8960 -15526 4764 18342 785 -19779 -6891 18934 15145 -16185 -20315 11575 24408 -1361
2010 -1361 -26358 -6401 24777 16923 -18467 -22989 8005 28079 401 -27153 -10868 22735
2022 22735 17644 -16557 -25555 6401 25053 -471 -23828 -7809 19869 10259 -17186 -16946 12559
2035 12559 17587 -4875 -20765 -87 20444 7215 -18894 -11776 15763 19556 -8852 -20982
2047 -20982 2158 24169 6987 -21066 -13802 18844 21340 -11454 -24531 2855 26837 6840
2059 6840 -24844 -15982 16797 20806 -10477 -24992 989 22995 7461 -21932 -12839 15269 16274
2072 16274 -9753 -16380 5557 16942 -2284 -16396 -56 16748 4527 -15183 -6448 13888
2084A3888k496k2840j036K0814P570j9231j5747J4995K1846p760k4286k315K4463
2097G865R983j9204k0466J5168K4575k903k9208n863K6645J6807k1189k3154J4026
2110f918K6432m633k9273k320K5629J1998k3242j7791J7661K1435j0826k4209
2122a6057K759K4864L784k3341j1537K0711J6370j4188k1514O019K5120L586k3980
2135g404j2905J9337K1937j2785k6921L958K8147N966k5465j5615J9497K2394
2147B0141j0577k4944K621K2886N603k0900j1233J5539J5068q785j7443M598J5843
2160H417J382j5331n727J3587Q487q875j4154O885J5347k548j4775n451J7296
2173D540J0774j4518j5950J0125K0378l188k2876n364K1791J1480j6377j8200
$$ plain form
2084 13888 11392 -11448 -12484 8330 15900 -3331 -19078 -4083 17763 10003 -14283 -16598 7865
2097 7865 17848 -1356 -21822 -6654 17921 15018 -14190 -20053 6592 23399 2210 -20944 -6918
2110 -6918 19514 14881 -14392 -16712 8917 20915 -2327 -20118 -2457 18978 8152 -16057
2122 -16057 -13298 11566 15350 -7991 -19528 1183 17553 3365 -18149 -12130 12990 16576 -7404
2135 -7404 -20309 -972 20965 8180 -18741 -14783 13364 19330 -6135 -21750 -2253 20141
2147 20141 9564 -15380 -12759 10127 15730 -5170 -16403 -864 14204 5419 -12024 -7426 8417
2160 8417 9799 -5532 -11259 2328 10815 1940 -12214 -5329 10018 7470 -7305 -12756 4540
2173 4540 15314 796 -15154 -5029 15349 12161 -10715 -16079 5712 17192 815 -17385
2185a7385J1235K2641m399k3031l286J9873Q554j5888j2887J2371J3811p863j4269
2198a0523L293J5237n06j2859j837J0606N529r193r200O599J2224k525j4507l264
2212a0926J5347R535j1462j7942P329K2956j431k3376q683K3411J7324j8974k5350
2225b2242J1407K9957k072l0495o716K6836J4283k1371k1898J4261K5149n161
2237A1938k4289m100K4692Q416k0347j4821J6487J8486p611k3250L578K2150M626
2250A5955k1350j1697J8684J8205j2382k4704M667K6747O218k7609j5703K1888
2262a081K3713j5772k6799L612K9802N986k6217j5155K0097K2611j2520k4484
2274a6207K416K4278N587k0415j1136J6431J4534j1325j5895O688J5387k107j5849
$$ plain form
2185 -17385 -6150 16491 12092 -10939 -14225 5648 14202 -1686 -14573 -2202 11609 3746 -10523
2198 -10523 -7230 8007 7501 -5358 -7195 3411 8940 -253 -9453 -2854 9370 6845 -7662 -10926
2212 -10926 4421 13956 2494 -15448 -8119 14837 13406 -9970 -18653 4758 22082 3108 -22242
2225 -22242 -10835 19122 17050 -13445 -20161 6675 20958 -413 -22311 -8050 17099 11938
2237 11938 -12351 -16451 8241 16657 -3690 -18511 -2024 16462 8851 -14399 -10821 11329 15955
2250 15955 -5395 -17092 1592 19797 7415 -17289 -12622 14125 20343 -7266 -22969 -1081
2262 -1081 22632 6860 -19939 -16327 13475 19461 -6756 -21911 -1814 20797 8277 -16207
2274 -16207 -13791 10487 16074 -4341 -15477 954 15488 4163 -11732 -5044 10343 8236 -7613
2287g613j441J3732O648j2876j0550J0886J4397p555j9163N223J9298K235k2347
2300i126q689K1675J5376j8266k0714J1946K3441k582k4999m406K3327J0572j9547
2313a992j4974J2678J8716n241j9039M1J8685M200j4940j2031J2693J4967p470
2326F293j7091N76J8597N180j7929j3118J6289J7309q083k3904K95K7719O258
2339A8391k2656j6161J8166K2668j1343k5490K023K6405O124k4296j3242J8766
2351f45J8508j1758k1030M553K0376L826j8931r512J5434J3015j2305j4663O504
2364f628J6901q4j7018o620J5816J0922j1952j4849O467J6630J038j7402o330
2377a3109J4876J1670j0050j6250M985J6979J094j5187o759J2345J2669r373j3612
$$ plain form
2287 -7613 -9054 4678 11326 -1550 -12100 -1214 13183 5628 -13535 -8312 10986 13221 -9126
2300 -9126 -17815 3860 19236 970 -19744 -7798 15643 13061 -11938 -16344 6983 17555 -1992
2313 -1992 -16966 -4288 14428 9187 -9852 -9811 8874 13074 -1866 -13897 -1204 13763 6293
2326 6293 -10798 -10222 8375 13555 -4374 -17492 -1203 16106 8023 -15881 -15586 12133 18391
2339 18391 -4265 -20426 -2260 20408 9065 -16425 -14402 12003 18127 -6169 -19411 -645
2351 -645 17863 6105 -14925 -10372 10004 13830 -5101 -14613 821 13836 1531 -13132 -6628
2364 -6628 10273 10189 -6829 -13449 2367 13289 1337 -13512 -7045 9585 10623 -6779 -13109
2377 -13109 1767 13437 3387 -12863 -7878 9101 10195 -4992 -11751 594 13263 3890 -9722
2390i722M966J1707R65j2458l438J0345N643q574q133O572R855m298j1488O96
2404g362J2679K944j2278p824J2950J1392r156j5667N138J8311j17j8161n869
2417a3020J6223J1598j2068j6912P569J7225k59j5995o144J3978R320r202j1007
2430h694L900J1563m59j0536m124J0038O456q502r054Q585J0711n229j4828R69
2444i204J6746M581j8325r027J6953J6563j0976k4048K932K5233P525k3533j7615
2457b2195J9156K4588j0260k8197j136K8147J2300k5080j9358J6928K3908q692
2469A0109k3345j361K2241R756j9412j2737J1811J5941o995j6309K345J6270R23
2482I237j3803n810J2915Q478r819j2610O687J6474k713j7826m016J8406J0160
$$ plain form
2390 -9722 -4756 6951 7916 -4542 -7980 2365 8008 -566 -8699 -2127 7728 3430 -8058 -7362
2404 -7362 5317 8261 -4017 -11841 1109 12501 3345 -12322 -7184 11127 11010 -7151 -13020
2417 -13020 3203 14801 2733 -14179 -6610 10615 10356 -5639 -11783 2195 11515 2313 -8694
2430 -8694 -4794 6769 6310 -4226 -8350 1688 8144 -358 -9412 -827 9884 4655 -10173 -9204
2444 -9204 7542 12123 -6202 -15229 1724 18287 7311 -16737 -13805 11428 18953 -4580 -22195
2457 -22195 -3039 21549 11289 -16908 -18044 10103 22403 -2677 -22035 -5107 18801 10109
2469 10109 -13236 -14597 7644 17400 -2012 -14749 -2938 13003 6008 -10301 -7956 8314 9237
2482 9237 -4566 -10376 2539 11017 1198 -11412 -4725 11749 9036 -8790 -12806 5600 15760
2495A5760j5184j8427R995K0782K1k2132p966J9924J3856j3912j7808P742J8462
2508A1113j879j5039m102J2575P512j0028q200P442R731o062j1110M898J1433
2521H284l132j3115j24J5639M272j6038q650J2651J6109q647k1759K002K3362
2534A0854O157k1540j4336J5373K0777p598k2911k399K2487R851j6813j5097R516
2547e679J9582m801j5827n423J6466P019j1539r912Q240J1193m895j3034J910
2560f700J3509J903j5878m306J4194J1687j5032j4621R225J8988j539k2410m484
2573a5464K0218J3367j5380k0797P555K4769N54k1542j1474J8602J7585j1172
2585F821j9989K740J7490M712j3052r067P988J1022m488r009j447Q780J955n318
$$ plain form
2495 15760 576 -17851 -7856 12926 12947 -9185 -17151 2773 16629 2717 -15091 -7349 11113
2508 11113 9234 -5805 -9907 2668 10180 152 -8048 -606 9125 3063 -8047 -3149 8284
2521 8284 5152 -7963 -8087 7552 11824 -4214 -12864 -213 15896 7249 -14510 -12508 10854
2534 10854 17011 -4529 -18865 -3492 17285 9687 -13224 -15623 6864 16715 -98 -15195 -5679
2547 -5679 13903 9102 -6725 -12148 4318 11337 -202 -10114 -1874 9319 4424 -8610 -6700
2560 -6700 6809 8712 -7166 -11472 2722 14409 -623 -15244 -6019 12969 11430 -10980 -15464
2573 -15464 4754 18121 2741 -18056 -10501 14268 14822 -6720 -18194 408 17993 6821
2585 6821 -13168 -10428 7062 11774 -1278 -10345 -2357 8665 4177 -4832 -6279 2501 4456 -862
2599h62m502N188M987o522l626O414O878p610r309L933J2948P67j4816n480J4073
2614B461J2212j1875j5022J169J9389N904j7001j1702J1605J5435l213j7933k380
2627a0951J4073P603r711r646L693J1960j862r575r96P546K438p684j246P311
2641B953L002r720m490J0027Q401r332j1556N501J4981r90j5945o877J4367J5739
2655A6061j1232j8664K286K0811P420j9046j5235J1381K1204k822k2699n531J9186
2668C120J3398j3493j6745O122J7813l49j5620n783J3433P411q993r102O112J2297
2682I621o361j1094K852J2439J8j4117l776J3735R588j3733j3413R930J8278m963
2696I004j8783l387J6998J2241j3795j8252P793K0631k97j8547q546J5019J3128
$$ plain form
2599 -862 -5364 -176 4811 -1711 -5337 1077 7955 345 -8964 -5031 7917 8684 -6132 -11612 2461
2614 2461 14673 2798 -12224 -11055 8334 14238 -2763 -14465 -2860 12575 9362 -8571 -10951
2627 -10951 3122 10725 1014 -8632 -4939 7021 5159 -4416 -5412 2134 4572 -3112 -4358 2953
2641 2953 5955 -3765 -8255 1772 10173 841 -10715 -5214 9767 8777 -7168 -14045 322 16061
2655 16061 4829 -13835 -11549 9262 16682 -2364 -17599 -6218 14986 12164 -10535 -16066 3120
2668 3120 16518 3025 -13720 -7598 10215 9866 -5754 -11537 1896 9307 314 -8788 -2676 9621
2682 9621 3260 -7834 -4982 7457 7475 -6642 -10418 3317 12905 -828 -14241 -4311 13967 9004
2696 9004 -9779 -13166 3832 16073 2278 -15974 -8181 12450 12153 -6394 -14940 79 13207
2709A3207p467j6995L596J4522K331j0775o234P246Q204o444q135M658P838k679
2723B873q914K369J0073k94j2699j426J2392O874j2269j2550R157J6787k736j8959
2737i322l557J9653R259j4591j7356Q554K0470k040j9760n179J6592J0716j2019
2750A420j2721N199J5628j876j3404k950J1627N798q816p836P098R732o316r270
2764f687Q14J2091J295j1726o249J1820J0817r946j3835M939J6725J099j5855
2777d698r151J3967J3935q766j8009J740J9769M467j6112r380R399J4028o447
2790D742j2081m22J2938K920j0170m980O502P948n897p457K878R153j996r527
2804e449j018J0202M331j2023o216R387J1336o326j3811K743J3742L899j3573
$$ plain form
2709 13207 5740 -11255 -7659 6863 9194 -1581 -7815 -569 7635 1191 -6944 -2286 5552 2873
2723 2873 -6041 -3672 6401 6107 -6592 -8018 4374 11248 -1021 -13571 -4414 12373 9637 -9322
2737 -9322 -12879 6774 16033 1442 -15914 -7360 13110 11070 -8690 -13869 2723 13439 1420
2750 1420 -11301 -6102 9526 7650 -5754 -8704 2923 8721 -95 -7931 -833 8899 2583 -6687
2764 -6687 -5873 6218 7513 -4213 -10462 1358 12175 2229 -11606 -6667 10058 11157 -4698
2777 -4698 -13849 118 14053 5287 -12722 -10982 8787 13254 -2858 -12238 -2839 11189 4742
2790 4742 -7339 -7761 5177 8097 -2073 -7053 -551 7397 1500 -5957 -3079 6074 4078 -5449
2804 -5449 -6467 3735 8066 -3957 -10173 -786 10550 4224 -9587 -6844 6898 10797 -2776
2817b776p541R861J1825n559j4195Q37J1000N758q911j0088P198J0897j027j3267
2831e988j664Q813O146o569p142M219Q056l197p811J315Q102N04q343k609Q561
2846B393N520r165o894O879J0441l739j3844j450J5756O462j2592j2230R742J4388
2860A1667l713j5180l056J5001N828j0574j0675N921J2599l22j1597m285R598
2873A212O007o467p077J798R934q62q507k207Q623K942p349o672P944R140n160
2888C299j1774K434J3652J184j2689o234J2178J0359r313j3441L573J5927J990
2901A1145j4802r158J0572J2495l681j4730N56J2159M702j1559q221Q802J0623
2914H903n605j0174K784J0356j79j0474j492R082L992j0741l850Q424Q033p392
$$ plain form
2817 -2776 -10317 -456 11369 5810 -8385 -7548 3452 9210 299 -9789 -2591 8306 7279 -5988
2831 -5988 -7652 1161 7307 738 -6404 -2185 5871 2674 -5137 -3822 4280 4784 -3559 -6168 2393
2846 2393 7913 -1252 -8146 -1267 9174 5435 -8409 -9859 5897 12359 -233 -12463 -2721 11667
2860 11667 7954 -7226 -10282 4719 10547 -27 -10702 -4781 7818 7496 -4101 -8386 1212
2873 1212 7219 752 -6325 -4527 5407 4545 -3962 -6169 2454 5396 -1953 -8625 -681 8459 3299
2888 3299 -8475 -6041 7611 8795 -3894 -10128 2050 12409 3096 -10345 -6772 9155 11145
2901 11145 -3657 -12815 -2243 10252 6571 -8159 -7603 4556 9258 -2301 -10522 -1720 8903
2914 8903 3298 -6876 -4092 6264 6085 -4389 -5881 3201 7193 -3548 -7398 1026 9059 1667
2928A667j0524L216J2171R15j2623l636R555J0354p380j2862J556J3048L516j1362
2942b389p966R146J0615o072j1939J798J2423K562r613p020Q745P932o716r267
2956g761L418J1999n75j2848k745J3043M779j1128q842Q774J2717o028j5199K674
2970g722J4497M594j4110q970J0299J3007o717j3488j265J4514O297j1576j0823
2983a1463P174J2401k132j2379j637J0873N451q693p122O344P501l833p330J017
2997c828P773M99q269k128P735N626p409o793M388R960k032j3403N25J0631O101
3012I376r785r860O861J2692k898j2733l975J2338Q486q707j0760L736J2719K01
3026G691j1544l045Q237O356o039p229L630P807l040o303J065O254j105p206k15
$$ plain form
2928 1667 -8857 -5641 6530 7445 -5178 -8814 741 11095 3715 -9147 -7591 5457 8973 -2389
2942 -2389 -10355 -1209 9406 3334 -8605 -6807 5616 8178 -1435 -8455 290 8222 1506 -7761
2956 -7761 -4343 7656 7081 -5767 -8512 4531 9310 -1818 -10660 -1886 10831 4803 -10396 -7722
2970 -7722 6775 11369 -2741 -11711 -1412 11595 4878 -8610 -9875 4639 10936 -640 -11463
2983 -11463 -4289 8112 5980 -6399 -8036 2837 8288 -405 -7527 -1183 6318 2485 -4845 -3828
2997 -3828 3945 4444 -3825 -5953 1782 7408 -1 -6794 -2406 7554 5522 -7881 -7356 3275 9376
3012 9376 -409 -10269 -3408 9284 6386 -6347 -10322 2016 10502 1795 -8965 -5229 7490 7691
3026 7691 -3853 -6898 1339 7695 1656 -5573 -1943 5864 2824 -3479 -2414 3840 2735 -4471 -4686
3041d686P366K656p400o041N422J0058l786r859j403J0196N819p374q883M706
3055c209J0254J204j2150n624Q855J1772p554j1267O52J3382L525j1587p131O718
3069b160J1320m731j0329N18R868J824q837l408O157N447n666n306L916O818l762
3084A669o887J978Q578L34r272l132P174Q065o330j0375K801J0721M060j1930
3098b546o605P413J1684l693j2050k086J0749N865q940q861O000J0473k140j0313
3112e050j756Q836M327p388n198O325N022l976n216M04P230K46p077j605O968
3127B092M080p757n553N805R665k685j2323K73J0568M292q894q326O849J1286
3141I372m374j2553l54J2112L811r871o496O698Q389l454r159o30J1055J533q850
$$ plain form
3041 -4686 2680 5336 -2064 -8105 -2683 7375 3589 -6270 -7673 2523 8342 968 -7915 -3209
3055 -3209 7045 8249 -3901 -9525 -670 11102 3548 -7719 -7067 6315 9840 -1747 -8878 -2160
3069 -2160 9160 4429 -5900 -5382 4486 6310 -2527 -5935 222 5669 3 -5303 -1387 5431 1669
3084 1669 -5218 -3240 5338 5672 -3600 -6732 442 8507 2177 -8198 -5397 5324 9384 -2546
3098 -2546 -9151 -1738 9946 6253 -5797 -7883 2866 8731 -209 -9070 -3070 7403 5263 -5050
3112 -5050 -6806 2030 6357 -1031 -6229 96 5118 1142 -4074 -3670 3560 3806 -3271 -4876 2092
3127 2092 6172 -1585 -7138 -1333 8332 5647 -6676 -6403 4165 8457 -437 -8763 -1914 9372
3141 9372 4998 -7555 -7909 4203 8014 -1857 -8353 -1655 6734 3280 -5879 -6509 4546 6079 -2771
3156b771l802P554N723o040p400K879R408l93r818j710J0012M632q397r220O657
3171b686R552j100j1767l519J1891P488r120j1325M906J3246K97j2786n016J1711
3185A772Q343p717j1201L581J2377j989j0002k625R159M218o673n087M063O977
3199E196j977q262O77Q831k5p293j918N383M163l580p797L601Q565j015p997l316
3215f764Q268N466n705p692K431R472q0r186m018P811P107m806r468L215Q161
3230D212O42q547k296P869L398m610n056L890N584k713n419R68N370J227o500
3245a981k626N944M497n344p065L627P834L56r732l561Q924O484o652q079K022
3260e352J0574R02j0381l412Q591P243n545j0098K846Q936K873r546m946P539
$$ plain form
3156 -2771 -6573 981 6704 664 -6736 -3857 5551 5158 -4660 -6370 3642 8274 -123 -9343 -2686
3171 -2686 6866 5766 -6001 -9520 2371 9859 739 -10586 -5680 7566 7863 -4923 -9939 1772
3185 1772 10115 2398 -8803 -5222 7155 5166 -4836 -7461 1698 5916 -757 -5844 -1781 5196
3199 5196 3219 -5043 -4366 4465 4440 -2853 -4771 612 4775 1195 -6602 -3001 5564 4549 -3448 -6764
3215 -6764 1504 6970 1265 -6427 -3996 5476 5396 -3790 -7808 3 7110 2304 -7164 -3949 4212
3230 4212 4854 -3693 -5989 1880 5278 668 -4388 -498 5086 2373 -3046 -2078 3292 4519 -1981
3245 -1981 -4607 1337 5834 490 -6575 -2948 4886 5242 -4490 -8051 873 7357 705 -7374 -5352
3260 -5352 5222 6124 -4257 -7669 922 8165 2620 -7478 -4632 4304 7177 -2369 -7315 224
3274B24P307m700r170L284P385M19p048l185N397N162m364n919L226P706j713
3289D011p992j788P008O558p956n965L180R671j339r755r08Q650M579p438p782
3304g266O260P764k002r445j601R209L839p646o678O832O093l172o600J17O106
3319A810M129o776m644L166O407q57p519O50O814J061n277l442M429M064j456
3334B559p295J229Q103q08p205k005O161N017o143l734K539P235j904q677O77
3349d251O693L095o822n353N041O757l036q252J301Q717R00p640l858P015O251
3364F558n402p524L247R810J98j1416k410Q594N550n244q517K590R487l02q692
3379c473l284P453O015m905q298L126P823j10o452m603Q414N644n443j0147M577
$$ plain form
3274 224 7531 2831 -6339 -3055 4330 4749 -2299 -5484 -87 5075 711 -5208 -1982 5724 4011
3289 4011 -3981 -5769 1239 7797 -159 -6124 -2944 6727 5388 -4367 -5275 3375 7954 516 -7266
3304 -7266 -1006 6758 4756 -4689 -6290 2919 6758 -888 -7566 -734 5359 2187 -4413 -4296 1810
3319 1810 5939 -837 -5481 -2315 4092 3235 -4284 -3634 3180 4241 -1036 -4478 -49 4015 2559
3334 2559 -4736 -3507 4596 3788 -3417 -5422 739 5756 -387 -4121 -1582 5653 3749 -4928 -4251
3349 -4251 2442 5537 -1285 -6638 -1597 5160 2124 -6128 -4827 3890 4790 -2850 -6708 307 6558
3364 6558 1156 -6368 -3121 6689 6887 -4529 -6939 1655 7205 1961 -6556 -3966 5521 5219 -3473
3379 -3473 -6757 696 6711 1806 -6492 -3366 4457 4347 -2105 -6708 1706 7350 1907 -8240 -3663
3394c663R007q24p987k713P988N851p414p620M239R696j035r635j980P935N043
3409F888o570p146M233R318k515q829j108Q521K170o449n234P386M039k591n995
3424c882R8P092P05o633k214N201L637l792l926J051N900M55n829k639O250K453
3440C927k904m674J619O952j819n293o57N617J478m886m918M409N613j760p378
3455d674K806M483J773n818l135M182M840j601o642M37P516N27n807m585O230
3470E32N379l828o978K283P775o15p236k901P925L278n876n978N002N897m70p040
3486b851k567O884M837n033o414K607P851o00q470k596P705M486o057n393K327
3501c284P191n3o887k412O347M123l806o754L203N974P85p938j643O879M723o260
$$ plain form
3394 -3663 5344 4520 -3467 -6180 1808 7659 245 -7375 -3136 6560 5525 -4110 -6090 1845 6888
3409 6888 318 -6828 -2595 6723 4208 -4621 -5729 2792 4962 -1487 -6721 665 4704 2113 -3882
3424 -3882 -3784 3308 4013 -2620 -4834 367 4004 212 -3714 -2663 3237 3692 -2137 -4776 1474 3927
3440 3927 1023 -3651 -2032 4920 3101 -2192 -2849 2768 4246 -640 -5558 -1149 4464 2704 -4674
3455 -4674 -1868 2615 4388 -1430 -4565 -383 4457 2856 -3786 -3349 4167 4694 -1113 -5698 532
3470 532 5911 2083 -4895 -2612 5163 4548 -2688 -5589 2336 5614 -262 -6240 -1238 4659 4189 -2851
3486 -2851 -5418 1466 6303 1270 -5144 -2537 5314 4714 -3756 -6352 1353 5839 -218 -5611 -3284
3501 -3284 3907 3854 -3033 -5445 902 5025 1219 -5535 -2332 3642 4427 -3511 -5154 1725 6448 188
3517A88n532L303P728q66q700r56O713M763p317m953M084N486j022o574o19N255
3533I81M723p406l316M333M587j886n369R30M161K156m785k861K859N238k222
3548B123m006o71N525n15m232r12L570K891l235m199K649M592p82n205q34N547
3564B306K267n976m467N614O006m016o759K346O033J124n561m043N048M983j921
3579B984o982J01O400J881o619k813O708L658k968q034K534P949j28p842k738
3594e909P566M520n649o370K793Q218j969o571k415P096N761o610n326K249P936
3609E320j815p184j830O984N158n481p545L859P137m47o019l884O902M008k927
3624B236q256L575O731q65p033p01M943M480m106n066J742O037k029m905J86N655
$$ plain form
3517 188 -5344 -2041 5687 4821 -3879 -4835 1878 6641 -676 -5629 -1545 3941 2919 -3655 -4274 981
3533 981 5704 -1702 -5018 -685 3902 2016 -3353 -2423 1738 3894 -891 -3752 -893 4345 2123
3548 2123 -1883 -2554 2971 2456 -1776 -2688 882 3773 538 -3661 -1012 3580 2798 -2407 -3241 2306
3564 2306 4573 -1403 -5870 -256 5750 1734 -5025 -2679 3354 4478 -1083 -5126 -78 4905 2984
3579 2984 -3998 -3897 2503 4384 -2235 -5048 1660 5318 2350 -5684 -3150 4799 4671 -3171 -5909
3594 -5909 1657 6177 528 -5842 -3049 5169 3200 -3371 -5786 1310 7071 461 -4865 -2616 5320
3609 5320 3505 -3679 -5509 1475 6633 1152 -6393 -2534 4603 4156 -1863 -5747 1155 5163 2236
3624 2236 -6020 -2445 4286 3421 -3612 -4313 630 5110 1004 -4062 -2320 3717 1688 -3217 -3031 2624
3640B624J039m824j501K744K726k693l577K193O098k281m932j049N391J740l555
3655A43l499K232N240j621m105q97M377J918n052l528L648N264k353m925J76N371
3671B389N66l949l431L721M280l236l757N47N051Q95m521k891N039L422l040m760
3687c675M75O441K47n672j497M525L809m155o013K334P878j571o138k329N959
3702F18N122o529k741J236O617l61o522k446N221N198m075o341L600M771M17n690
3718a905k429N063L610l336m003J673M002M42n716k43L972K907m892l468M325
3733BL459m64n391q58M587K838n422k058K044M682j185n800p1N852K056m910k882
3750c521K973M378j446n448o39N495P42k852l316M159L482k361n301K421K500
$$ plain form
3640 2624 3663 -1161 -2662 82 2808 115 -3462 -1269 4829 2548 -2384 -3433 1958 3698 143
3655 143 -3356 -1124 4116 2495 -1610 -2507 1870 3788 -1264 -4792 -1144 4120 1767 -3158 -2982 2389
3671 2389 2955 -994 -4425 -704 3576 340 -3417 -2870 2181 3076 -1445 -4336 703 4125 1085 -3675
3687 -3675 -3200 3241 3488 -2184 -3681 844 4653 498 -5515 -3181 4697 3126 -3012 -5341 618
3702 618 5740 -789 -3530 -2294 4323 3962 -2560 -5006 215 5413 1338 -5003 -1403 3368 3785 -1905
3718 -1905 -4334 729 4339 1003 -3000 -1327 2675 3117 -2599 -2842 1130 4037 -855 -4323 2
3733 2 3461 2997 -2394 -3252 1335 4173 -1249 -3307 -1263 3419 2234 -3566 -3637 2215 4271 -639 -3521
3750 -3521 -548 3830 2384 -3064 -3703 1792 2534 -318 -3634 525 4007 1646 -3655 -1234 1266
3765A266J053l779j848L616L512l466m844L631L190K49n345N71L041K368m166
3780i51l562M074M622l006l898l06M874P68m190k937M494N574l842m624K84O650
3796D024j70n469l294N263L871k034o683K013O624j011n904k141M881N026n242
3811b46l516J385O362j055n200j642M699L663l781m995L324M880p29o472p37M814
3827G54L823m644m831L271M932r01o018r38N489L118m289l413J549O573j874m817
3843b216j063M665K437m127k532K450L341j915k841j916N925J064m832k584L978
3858a66L409j920m334K082L634R33o281O2L618K126k916l191J552M040K86o460
3874c526L20M926J492k720k526Q06L471p13l928j00L647K181m017j710K021L244
$$ plain form
3765 1266 2319 -1460 -3308 308 3820 354 -4490 -859 2331 2580 -2765 -2194 847 3215 -951
3780 -951 -4513 -439 4183 1177 -2721 -3027 1847 2615 -1575 -4512 -18 5556 1714 -2910 -2626 4024
3796 4024 3854 -1615 -4909 354 4225 2191 -4492 -2479 4145 3134 -2770 -4911 -30 4996 -246
3811 -246 -3762 -2377 3985 2930 -2270 -3912 787 4450 669 -4326 -1002 3878 3149 -3323 -4060 754
3827 754 4577 -67 -4898 -1627 3305 2404 -3614 -4552 937 4055 -234 -3647 -2098 4475 2601 -2216
3843 -2216 -3279 1386 3823 -304 -2836 -386 2955 1040 -1801 -3717 2208 3272 -1560 -4144 -166
3858 -166 3243 1323 -3011 -929 2705 3638 -2643 -2581 1037 3163 247 -2944 -1392 2648 2934 -3526
3874 -3526 -3206 1720 3212 492 -2034 -1228 2243 1530 -2398 -2498 1149 3330 -687 -2397 -376 2868
3890B868o98o093J392M681O60l536l963M062L919k115k914j212N844J44n454q51
3906c266L452M822l051m344J490M341m16m827k903M922L241k877l528K065M164
3921C285n7o261j862O527J157k136m451J186N312n38m438K63L367K687l487m622
3937d068L106L706j60n261J13L637K164l441k767K566L046j000l987p92L707K555
3953C124l962j756K912L908l580l994Q48N291N26m601j806L148L482k944k903
3968b307J080L210J489o286J250J335L852m268j965J059M315l21m199n66K103
3983b19K693j847l302P73L112M02k869q05L198J128k854j640J584K652O81o237
3999c550J023M449M43l484l175M043K963j727l648J091K979J589m266j952K430
$$ plain form
3890 2868 2170 -3923 -2531 2150 2810 -726 -4689 -627 3292 1177 -1737 -2949 2895 3039 -2415 -3266
3906 -3266 186 5008 1957 -2387 -897 3444 3028 -1799 -4702 220 3461 584 -2944 -879 3285
3921 3285 3228 -3033 -4895 1632 2789 653 -3798 -2612 2700 2162 -2276 -2013 1354 4041 554 -4068
3937 -4068 -962 2744 2584 -2677 -2564 1073 3237 -204 -2971 -405 2641 1641 -2346 -3138 569 3124
3953 3124 -838 -2594 318 4226 646 -3348 -2500 2791 3317 -1284 -3090 58 3540 596 -2307
3968 -2307 -1227 1983 3472 -2814 -1564 -229 3623 -645 -2610 -1551 2764 2443 -1756 -2322 -219
3983 -219 2474 627 -2675 -1902 1210 1612 -1257 -2062 1136 2264 -590 -2230 -646 2006 2687 -3550
3999 -3550 -2527 1922 2365 -1119 -4294 -251 2712 985 -2663 -1572 1407 2996 -1270 -3222 -792
4014g92L337j048m309J96M655J330m393l629M729L777l346l168J0N428j236l899
4030b358k165M675L419l091l156J466M431j431l817o87K709K073k116l260K724
4045e84K995r55m350R78L767J006m315j736L033L250k471k686k93K621L035l017
4061B78l381J751L817p02l962j41M191J281l319k515K641K497j047l563O3M337
4077B226m1l191r23L505J919l480l301K197L337k30l670n72L864J169l578j227
4093a996P78L876j034l778q41L116K688l288k177K253M181k182l807J041L489
4108B319J006m061k029K189L453j204l710o58M610r5j654k525K376L386l208k013
4124a818J74L688r4j954k414L507J081p65l248R45K711R29m162p63K962K356k794
$$ plain form
4014 -792 2545 1497 -2812 -2616 2039 3369 -1024 -4653 76 3853 507 -2661 -2651 2777 1541 -2358
4030 -2358 -4523 152 3571 480 -2676 -1210 3221 1790 -2027 -2714 -5 2068 -48 -3308 -584
4045 -584 2411 1456 -2894 -1916 1851 2857 -1458 -3194 -161 3089 618 -2068 -2361 260 3295 278
4061 278 -3103 -1352 2465 1763 -2199 -2340 1851 3132 -187 -2702 -61 2436 1389 -2174 -2111 2226
4077 2226 2185 -1006 -1929 1576 3495 15 -3286 -1089 2248 2018 -1652 -2224 1640 2809 -769 -1996
4093 -1996 -1218 2658 1624 -2154 -2995 121 2809 -479 -2656 -403 3778 1596 -2211 -1170 2319
4108 2319 3325 -736 -2765 -576 2877 1673 -2037 -2695 1915 1820 166 -2359 17 3403 195 -1818
4124 -1818 -1644 2044 1950 -4 -2418 1089 2170 1405 -1843 -898 1813 2742 -1420 -2183 779 3135 341
4141C41l532J580M913j742k678j989M276J769l545k119L080J163O08k837r09K566
4157I45K072k922k951K108L040J13k659j515K349J035j459k727J539L057j337
4172F88l759o5N950o78l070k179L615K064k122l424J899L261J22l248j508L021
4188E67K750l312k079N16K914N8l314o6K685K597l071j897R58K795j081k395m23
4205a798L543J421m181j579K216L011j925l075L05K748J087k134k006K073L147
4220B853j756l917l0M044J330k718j505N52L958k073k687p3L837Q47l633p88O78
4237a081L669q39m455J58L769J072k853q99K458R51j550k609M53L454j569j448
4253a319p99L222J713j643k545m91L870p00k525k525M578J550j533j989J625K336
$$ plain form
4141 341 -3191 -1611 3302 1560 -1118 -3107 1169 2938 -607 -2726 354 1517 2125 -712 -1621 945
4157 945 3017 95 -2856 -748 2292 2405 -254 -1769 580 1615 156 -2571 -1032 2025 688
4172 688 -3071 -3136 2814 2136 -934 -3113 502 2566 444 -2980 -1081 2180 2302 -946 -2454 567
4188 567 3317 5 -2074 -1558 1356 1414 -1900 -1966 719 3316 245 -1652 -694 2101 1020 -1375 -1798
4205 -1798 1745 3166 -1015 -2594 -378 2633 708 -2367 -2062 686 1773 -361 -2367 -294 2853
4220 2853 1097 -2820 -2850 1194 2524 -194 -1699 -1147 2811 738 -1949 -2022 1815 2662 -971 -1759 -1081
4237 -1081 2588 1749 -2706 -2548 1221 2293 -560 -1459 999 1950 400 -2209 -1756 1698 129 -1319
4253 -1319 -2118 1104 2817 1174 -1371 -1862 2008 1308 -1217 -3742 836 2386 853 -1136 489 2825
4269B825j866k726n67K636J712k717j759K163K186j558j901N48K055J200k802
4284e71j276J946J654r99k379J223K574j365k283l40K192J221k662j524K457J472
4300A340M54l598j136L371L463k451n421L445L626k190k835j89L626Q14k414k820
4316b915J192L962o54m166J341J963J347j573l334K618K535j291k545j264L996
4331A212L77k742n88P86L473j839k738P10K478J278k029k528K721J821j427l270
4347b305J460K665N03k670k169K677J658m72k426O69L728j201l422p85L953R10
4363B773k255l087K376J650k35j478k906L995J178k998r40J302K911j091k816
4378a621L89K277N18j914q81R86J550M55k867R05J594L62k839l93K322R79p93
$$ plain form
4269 2825 959 -1767 -2334 302 2014 -703 -2462 -299 1887 329 -1572 -1024 1031 2231 -571
4284 -571 -1847 99 1753 754 -1625 -402 2172 807 -1476 -1816 376 1597 -1065 -2589 -132 1340
4300 1340 1794 -1804 -2940 431 3894 1443 -3978 -533 3093 903 -1932 -2121 1505 2319 -95 -2915
4316 -2915 -1723 2239 1585 -2581 -1240 723 2070 497 -2837 -219 2316 1025 -1520 -2784 1212
4331 1212 1589 -1153 -1741 -955 2518 679 -2059 -1349 1129 2407 378 -2150 571 2392 965 -2305
4347 -2305 -845 1820 2323 -347 -2516 161 1819 1347 -1079 -410 3318 2117 -1305 -2090 1863 2773
4363 2773 518 -2569 -193 1457 1222 -256 -3162 833 2011 -987 -1927 -625 2286 1195 -1621
4378 -1621 -1232 1045 1563 -351 -1232 -246 1304 1759 -1108 -203 1391 1753 -1086 -1479 843 1822 1029
4395A029l721J617K889n64l475k35K726K083j664k917J581K083J92l275j473M221
4411A097J189k831j246J957O50Q83k375j231L035J573k891j129N87K358r02k896
4427b172J121L134J087m347p73J546K230p15l524M95K844J603l030k263K174L271
4443B681j606l227J158K628J76j998j864J928J553n23l284R67J932J417k925M6
4459i41J117K213p67l977J737J367Q84l153n42K855L50n50k563P78K409K08k114
4476f89q46J421J821j656j533R24K157j431j535J75K851j28j520n97O39J609M7
4493A709k192q52L151q01j999n41K532J361k272k699K172J431L58k716j363K972
4509B51K117k790j793R20L932j197k668m37K766O61k536n01J92J990O94k935j502
$$ plain form
4395 1029 -2692 -1075 1814 1250 -2225 -2460 266 2349 685 -2232 -651 1432 1624 -1651 -3124 1097
4411 1097 2286 -545 -1791 166 816 1699 -676 -1907 1128 2701 -190 -1319 -732 1626 724 -2172
4427 -2172 -1051 2083 3170 -1177 -1950 -404 1826 1111 -2413 -1918 926 2529 -501 -2764 -590 2681
4443 2681 1075 -2152 -994 1634 1810 -188 -2052 -124 1429 906 -2378 -1411 521 1938 -987 -941
4459 -941 176 2389 1622 -2355 -618 749 1633 -1520 -2062 793 1143 593 -1970 -1192 1217 1425 -689
4476 -689 -1535 -114 1707 51 -1482 -558 1599 168 -1367 -1192 1659 1531 11 -586 53 1662 1709
4493 1709 -483 -1335 1816 1015 -984 -1525 1007 2368 96 -2603 -431 1000 1358 -1358 -2721 251
4509 251 2368 -422 -2215 -1295 2637 1440 -1228 -1665 1101 1762 -774 -1275 -1083 907 1601 -1334 -2836
4526b836L281K032k772k293K518J577J27l768R5L461M70k191k511K397K374j07
4542A854k807m97K759K89k846j077K040K722k959o63l26J988K167l648n61J483
4558h2J956n68k508J380J592K96l250r06J762J137l46k138l13L157j65k151k096
4575c243L501J021o24j289j35K276P71k287j444K241J271k769j546K150R58l30
4591E22j266m38K639l32j619j737J746K190j813j524M23K274k71r05j259J896
4607E26P88j015j861P27J508j041k39p53K150Q64j747k753K701J138l01r67j221
4624a496J273K421o72l512Q32K205N76k522j233K911K309l370r83J453J754q45
4640A101j265j545K841J036k455k202K589Q74M48l063M4K621Q11j839j605Q40
$$ plain form
4526 -2836 445 2477 -295 -2588 -70 1507 1634 -2134 -2039 1422 1892 -299 -2810 -413 1961 1854
4542 1854 -953 -1450 1309 1598 -1248 -2325 -285 2437 -522 -1185 -1511 477 2644 -1004 -1565 -82
4558 -82 1874 1306 -1202 178 1770 2066 -1184 -2090 -328 809 463 -1675 -1988 1169 1004 -1147 -3243
4575 -3243 258 1279 655 -634 -769 1507 2278 -9 -1453 788 2059 -710 -2256 -106 852 522
4591 522 -744 -1182 1457 1125 -494 -2231 -485 1705 -108 -1632 -1209 1065 794 -111 -1370 526
4607 526 1314 299 -1562 -835 673 -368 -607 -1360 790 1654 -93 -2846 -145 993 692 -275 -1496
4624 -1496 -223 2198 1526 -1986 -1154 1051 1627 -895 -2128 783 3092 -278 -1261 192 1946 1101
4640 1101 -164 -1709 1132 2168 -287 -2489 100 974 1422 -1641 -1597 1024 1835 -4 -1609 -769
4656g69J797L94l284R8J659K117j994l89k57J468M33j639j295L214K68k579j201
4673a959K202J612j253k181J502J436P1l005l28J838J471j226j140J63J039j60
4689H2q96j43J034J610j052j923R16P29N53j937o90J457R77j037j279J434J024
4706H59L29k364k66L325j300q80p43J513J676j865j353P40J857n3j508o72J754
4723A049o21K89j601N47M35Q08j301j616L516j157n66j943J570J575k94k861N40
4740a631K309J080j094k552J219K035m56k367o83K272K311j708k134M33K105K60
4756A399l328P42K771j867R40k176J608J048p68q73l89J958J144k891o74J316
4772d0J022j163K12j241K467J035j959j208O41K051j623l06r25J659l00k33j406
$$ plain form
4656 -769 1028 1422 -1862 -1764 -105 2012 18 -371 -628 840 1273 -366 -1661 1553 1821 -758 -1959
4673 -1959 243 1855 602 -1579 -77 1359 1430 -1575 -1903 -65 1406 180 -960 -797 242 82
4689 82 -814 -957 77 1687 635 -1288 -372 357 910 -1027 -1717 -260 717 -320 -1599 -165 859
4706 859 1188 -1176 -1442 1883 583 -297 -1040 473 2149 284 -1069 -329 1528 1475 -33 -705 1049
4723 1049 428 717 -884 -337 98 906 -395 -2011 1505 348 -218 -2161 -591 984 690 -2171 -1631
4740 -1631 678 1758 664 -1888 -669 1366 910 -1457 -2140 132 2443 735 -1399 -966 1139 1399
4756 1399 -1929 -1187 1584 -283 657 -1519 89 1137 369 -504 -893 1065 2209 -682 -1356 -40
4772 -40 982 -181 31 -1210 1257 2292 333 -875 -234 1817 194 -112 -1037 622 322 89 -1317
4789a317J805Q1n16nj413L052j30k008r74J245Q54p31j649R85K240j37k517L59
4807g76J140j36m98j926J086J895m3k104N51J300q06l99q68J738J869k327r14
4824a218Q77J174n42j014j024K244R78k187j210L05L134K56k920r7J672J881k084
4841B25j534Q95J790O64l356j40J376J597j569j614J743J848j713j093q32K071
4857C58J819k646j262J308J889l63j944j162K378J925k182j117L72O92J151k389
4873a173L50K157j339K02j815R86m40K172k282n89K189L38j616L49J616R56n89
4890A472l072J359J925j68j799q02J815P21j887j365L03Q07J944j747p46K779
4906A539m40r29j598L52J975l18j971R69P65R34j599r36K038M48k11k513P44J301
$$ plain form
4789 -1317 488 569 53 48 -1365 1687 1557 -451 -1425 -180 674 -57 -1706 -721 1519 1382 -1135 -776
4807 -776 364 228 -270 -2196 -1110 785 742 -1362 -811 489 -317 -716 -1584 154 2023 -304 -1218
4824 -1218 -341 833 291 -723 -1747 497 1475 -712 -1922 -1617 1517 1773 -1147 -1244 428 2309 225
4841 225 -1309 -414 1376 2040 -1316 -1456 -80 1517 -52 -1666 77 1925 212 -881 -1713 358
4857 358 2177 -469 -1731 -423 1466 1103 -841 -2003 375 2300 118 -999 -627 65 1216 -1173
4873 -1173 -823 1334 -5 197 -1618 -632 -1072 1100 -1182 -1771 418 756 -860 -511 1105 2061 1472
4890 1472 -1600 -241 1684 1516 -283 -1085 730 1451 -436 -1801 -1498 -691 1253 -494 -1240 1539
4906 1539 1099 170 -1428 -1076 899 581 -1390 -421 344 1278 -321 -1257 781 1229 1018 -1495 -751 550
4924E50N5j101j010J417K205j404j306J052O44P63j079k408J898J373j032j200
4940e83N2J585Q4j386n80J391J902j604k163J455P34J108l587J429O95N95l79
4957G48k453Q48J339Q43k531m83J831J136j901K07o22K227l41j540r91J714P61
4974G92p84p94R96P32j03j193j269K570k88j387k003J870J879o70j001m77P18
4991d12J412j85j862r9J493M40j303m1N96M35j271j2J303R02j061j052o38L088
5009A733n84j783o86J345J50j70j287Q56O22J260n28k181K051k87q23p72K41J586
5027G43N28r65o68J294q88N40j853J104jp94R63j250J893o39n51NJ353j71j599
5046i56k58k39J917L60k027M58K225P70j856j443Q84J279q5j799n16Q99J255M5
$$ plain form
4924 550 605 -496 -1506 -89 2116 712 -594 458 1102 1865 786 -1622 276 1649 617 -583
4940 -583 -531 1054 1138 -248 -828 563 2465 861 -1302 153 887 1995 -1592 -163 532 1127 748
4957 748 -1705 -857 482 1325 -1206 -1689 142 1278 -623 -416 -1038 1189 848 -692 -1683 31 792
4974 792 8 -786 210 942 839 -354 -1623 947 659 -728 -2731 -861 1018 348 -653 -1130 -412
4991 -412 1000 815 -1047 -1146 347 787 -516 -557 39 474 -797 -809 494 1396 335 -717 -1355 1733
5009 1733 1149 -634 -1320 25 175 5 -1282 -426 196 1456 928 -1253 798 511 -312 -1084 -843 743
5027 743 1271 306 -362 932 44 584 -1269 -165 -166 -960 3 -1247 646 7 -544 -539 814 643 -956
5046 -956 -1214 -1453 464 824 -1203 -745 1480 2250 394 -1049 -165 1114 1029 -770 -1286 -387 868 913
5064I13j310m88J518j8j058n23J611O13p38j539J050Q49k44j094r32J370K694
5081B674k307j397N09J013j434m14J022J524q93j281l79J587J124j787r72J107
5097c04J112j91k048O5J139J803j113k361J108J654L68q13j622J597j98j214M66
5114e52l38K052l20n85o93R84J022k017n5O15J612j046j598R87n28K338k584K54
5132d52N21J517j51l455J513P73J193q33k436K136O97j416k15M67R56J232k130
5149h3o07J400J8Q18k247M17J249j409N93o74N88M98m58j135P40k57J727k346
5167a168j1J056J578j651j418J374N54J29j632k22J562J676k105r61J079O31o04
5184a33q13p0L74N30J165k128Q29j97J328j316j91R98M66k39r85O32R59j200j299
$$ plain form
5064 913 -397 -885 633 615 -443 -966 645 1258 520 -1019 31 880 636 -458 -1390 -20 2674
5081 2674 367 -1030 -521 492 -942 -1356 -334 1190 297 -984 -1363 224 1348 -439 -1411 -304
5097 -304 808 617 -1431 -1366 -227 1576 463 -1898 -790 864 1232 419 -1203 394 196 -1018 -552
5114 -552 -890 1162 842 257 -436 548 1570 -447 -502 113 1725 679 -919 68 -460 1878 -706 -452
5132 -452 69 1586 1435 -2020 -507 266 1459 626 -1810 326 1023 -393 -608 -141 815 2047 -83
5149 -83 -690 710 728 1546 -701 -284 965 -444 149 -525 63 561 103 -1032 -292 -549 1178 -1168
5167 -1168 -1179 -123 1455 -196 -1614 -240 314 443 -1189 -1411 151 1827 -278 -1239 -160 471 -133
5184 -133 -946 -1016 -642 -112 1053 -1075 -246 -443 885 -431 -622 376 842 603 -382 250 1209 9 -1290
5203a290L93R87N74k35k018K432j36j368l42K85K216j144n12j500K252R86m78
5220A102j514o03J883l9n53o87J259N88j137m46j031J459Jj6j008J038Q75j153
5238A8j036L98Q37L86j169K50P45r05J121k077J318J155K30k932Q93R48R08j147
5256e9j056J043m04J338k022k50K391j67j515L53O86J314q97j406N3J303m72n40
5274c07n97R65M06k64o87k43K219q78p76q90J282K97j85j466M57K339o60k673
5292a661J904O43L75j532j084J036K95M46mj447J052N20l09j796O29J939j17k394
5310a505N50J240K53j36o34K46K82p9k051J893N2J059j555n52K232l20j183j649
5328a857J591J428j025l74O66O36k80n0j494M07J035j258L34n43J233L35j1k161
$$ plain form
5203 -1290 -897 90 664 429 -1589 843 707 -661 -1003 -718 1498 354 -158 -1658 594 1580 1102
5220 1102 -412 -1015 868 829 276 -411 848 1436 299 -147 -1178 281 282 266 -742 296 1171 18
5238 18 -1018 -620 217 603 -566 -316 429 -476 645 -1432 -114 1041 1271 -1661 -768 180 1088 -59
5256 -59 -1115 -72 -476 862 -1160 -1410 981 814 -701 -348 338 1652 755 -651 -598 705 233 -307
5274 -307 -904 61 467 203 -484 -727 1492 614 -162 -1052 230 527 342 -1124 -667 1672 1012 -1661
5292 -1661 243 886 1261 -271 -1355 -319 -24 422 418 -1029 23 543 234 -1562 -933 1006 889 -1505
5310 -1505 -955 285 538 402 -232 14 296 217 -1834 59 111 1170 -385 -937 1295 975 -208 -1857
5328 -1857 -266 1162 137 -237 429 1065 785 735 -759 -352 683 -575 -241 -784 449 784 773 -1388
5346a388Q82K124j060j071k13J1J495J01j492J266M92j217M07j131J627r27M82
5363C88j406P75J407k398N92J56R65j18q83m63L42J750o0k251O96M44L31J60j168
5382g41N4J406k35j397Q75j206J707Q43j349p74J304O34j225o6M38P2N51j318
5400d27J43R07o60L36J8J11M12j129l24M86J84l97m20R24Q26j796L7J360P98o55
5420G34j131j055M04J478n43j130j70J315J054q73K75o19j67J074j637J543l88
5437A64P08j713m19J145L82o23r38J513l52M27p34l37J944p17j849O38k73J862
5455H28j31j090m6J548J62j758j97K22J485j27j583Q8P80P69r12j451J419j238
5473a232J797L38j864J075J366r60j626M86Q64l22j063Q64O99J50r05N20l19N78
$$ plain form
5346 -1388 -506 1618 558 -513 -726 -715 780 881 -611 655 1147 -70 337 -794 833 -94 388
5363 388 -1018 -243 1164 -1234 -642 -486 479 361 -522 -985 -643 1107 1047 -1204 -508 -64 267 427 -741
5382 -741 -687 719 484 -913 -38 -1244 463 1306 -43 -817 487 1121 -104 -170 268 340 891 -427
5400 -427 -284 623 -37 299 317 428 840 -289 -613 -127 57 -340 -760 164 990 -806 -769 591 1389 734
5420 734 -397 -1452 -1048 430 -113 -1243 -1413 -98 956 83 358 -261 -428 646 -991 552 164
5437 164 872 -841 -1260 -115 267 -356 -1294 219 -133 294 -440 -777 1167 450 -1399 -761 -1034 828
5455 828 697 -393 -439 1109 1271 -487 -684 -462 1023 896 -687 -599 181 950 38 -1413 6 -1232
5473 -1232 565 903 -961 114 1480 520 -1106 -620 244 -78 -1141 -277 422 572 -333 187 -132 446
5491D46j147n28l14K168J035j468p60O06K64R83j036o96K458k009l79m96J640
5508G67r6j213l07J190j98L14m74n20M05N13q2o31O28J495j349j103k77K196j119
5527A39j88M6K14J037o74j777J903J059j327n1n05j56J339j39j577j215J372J928
5545A428j461j157J756N40n40j37j403M48R22n74o02P8M81K48K39j272Q73K84
5563A51R8o48N63p36J092j633L79J765j523j108J606J571j758O70k31l86J666
5580A538l5j768Q96J33p58J49N03j215J360r98L51o31M66O24j075p20Q33O94K27
5599E74r40R45M97q05j033J162k04M47j139J404n91k60R29l357J886N28O93q22
5617h6j099Q54Q94n06J1m6N23q55Q1o59J027l94N57j231m11M29O95n59p83J641
$$ plain form
5491 446 -701 -1229 -1543 625 1660 192 -568 38 302 1285 249 -447 2011 2 -377 -873 767
5508 767 671 -542 -849 341 143 457 -17 -537 -132 381 299 -332 296 1791 442 -661 -938 1258 139
5527 139 -49 -3 211 1248 574 -1203 700 1759 432 381 -124 -280 1059 920 -657 -1872 -500 1428
5545 1428 -33 -1190 566 1106 566 429 -974 -526 396 -178 -780 -702 -221 27 266 -1006 -133 151
5563 151 249 -399 164 -572 520 -1113 -734 1031 -492 -1600 6 1577 -181 489 258 -128 1538
5580 1538 1503 -265 631 764 6 155 658 -557 803 -195 156 -475 -9 615 -460 -1180 -347 347 574
5599 574 -366 579 1076 271 -762 400 196 643 -496 908 317 57 986 -2371 -485 43 736 -86
5617 -86 -1185 -331 563 57 68 22 545 -310 -229 -888 139 -255 302 -929 -1340 -911 -216 -775 -1558 83
5637H3q8P18j858O38J635p04o84j28N89J220q82m18n62J236l32j255R5J516J339
5656B158k187m88Q53M71J0p00o52q66J562p06J067j364J424p2l75r30m06K948
5674A747j804n15o58J360J298k569m51J267M92K6K47o54J214j630j48J313M52
5691I87p16m48o31l91K145n6q66n90K076j142j008m85J527K70j200L67M27m62
5709a96q45j47J141L18Q93p95j314O80L18m93Q35k65m10K7k45N87N68j404P74
5728B7j89j58Q88q42J439k729J555J21N52j508N53p18J153M49n34J94M72j148
5746d23M37o22Q85N34o79q52J236j33k6p2q23N60m4o02J62P43l69P23r64O37M53
5767G61j188k1j60J111q92Q45j322J640p10K74j043q36R38N50R41j531l5J099
$$ plain form
5637 83 -5 713 -1145 -507 1128 424 -260 -388 201 1421 539 121 -441 795 463 -792 -697 819 2158
5656 2158 -29 -517 336 807 817 117 -535 -1401 161 -545 522 -842 582 510 135 -795 -1201 1747
5674 1747 -57 -572 -1230 130 1428 -1141 -1592 -325 167 193 440 -214 1000 -630 -778 535 987
5691 987 271 -177 -808 -1199 946 890 24 -566 1510 368 -640 -1125 402 672 -528 -161 266 -196
5709 -196 -1041 -1188 -47 271 1164 369 -945 -265 53 -440 395 130 -280 -253 -498 89 657 -747 27
5728 27 -162 -320 568 -274 1165 -1564 -9 112 664 -844 -291 -1009 144 593 59 253 725 -423
5746 -423 14 -608 277 811 132 -720 516 383 357 285 -538 22 -22 -624 -462 281 -88 635 -329 308 761
5767 761 -427 -448 -608 503 -389 456 -866 774 64 338 -705 -1541 -603 -53 888 -643 -678 421
5785D21Q86k406J328R34m76o30n74r1R09M14o31j476K162n46L06m74j29J281n22
5804F86j299J36J441m40q47O4l80O68J88l18N76Q53m96m34p48j23M72J0r41M87
5824d45P80O00j343P16r19J936j101n01n16l06K564k759K5J31K129j227j18R82
5842F28O66j81j488M3P26n31K13R20n17j23J83o58L37J153n25j886k2J241K82
5861D61L94l88q13J352j05q02k49k56K022j129m60j205K229l59L40p75j1pj58
5880H1j140O66J654j127L52M7r13J287l85K0m33q4N18o67l27N6O98o16j34M19
5900b8R33n61q84J54L0N25o9j087q0K233k98r75Q4J4P74j15r36o69K089r33N85
5921G86j444k72K158j450K02j584J929p77k31J479j116Q75j844R64L01L38Q2j294
$$ plain form
5785 421 1307 -1099 229 1163 687 57 -517 -608 301 715 84 -1392 770 224 530 56 -73 1208 686
5804 686 -613 -477 964 524 -323 -259 -639 29 217 -101 475 1328 832 398 -350 -473 -1 9 -932 -445
5824 -445 335 935 -408 308 -611 1325 224 -277 -793 -1099 1465 -1294 -1269 -1138 991 -236 -354 628
5842 628 1294 1113 -375 -332 394 -137 76 996 479 356 539 -119 218 1371 846 -1040 -1062 179 461
5861 461 855 467 -346 1006 901 99 -150 -406 1616 487 27 -1178 1051 692 1032 257 246 239 81
5880 81 -1059 -393 1261 134 486 533 -380 907 522 542 109 25 543 -124 -451 -395 303 -313 -447 -28
5900 -28 905 344 -540 -386 -356 169 100 -987 -1067 1166 868 -107 -23 -9 765 650 -286 -955 1134 201 786
5921 786 -658 -930 1228 -222 -20 -1604 325 -452 -683 796 -320 555 -1289 -325 -24 314 396 -898
5939h98R68O60p55R0q46Q12p80J351j398j30J021N3P78k059J596K50o19j392J67
5958a131J574L74k74j20J21m6j036j007J899R31r92j583R85J236m79j845k42J835
5976B00J94j082R77L05l29k74N67j238J013p21O99r23Q08O76M4r48M2P98k15r62
5996c69o42k73Q15p94j77J265J008p8r33L79j269J432J074j185o87m65J477q80
6014c02O55p12R86K36j141m90O55N88r81O93J21m5l30K7j501J963l34q36P05J25
6034H2J23p06J301n28Mk00R68j494J19R29o39j042M18P91O8q01o27J036L11N47
6054F60j48M61J2m40k034L71J175r23J933N59k124J740j033m99k71J024K43j215
6072e09o37O68P90K71j122r3m27P95K51l5N0J137M76k552M87J406n02q97j40p2
$$ plain form
5939 -898 70 730 -25 65 -781 31 -749 602 -796 -926 95 148 926 -1133 463 713 94 -1298 -1131
5958 -1131 443 817 543 423 544 498 -538 -1545 354 1285 293 -1290 -305 931 452 -1393 -1635 200
5976 200 394 -688 289 594 265 -9 558 -680 333 -388 311 -612 196 872 916 -32 10 808 593 -369
5996 -369 -1011 -1284 -469 -1263 -1440 -175 833 755 -178 201 -1068 364 1438 253 -434 -899 578 -302
6014 -302 353 -359 627 863 -278 -768 -113 475 -506 187 308 263 -67 -40 -1541 422 88 -748 -43 82
6034 82 205 -501 800 272 276 76 1044 -450 -331 598 -41 -1083 -665 126 194 -607 -1234 -198 113 660
6054 660 512 973 985 545 -1489 -1118 57 -866 1067 1626 -498 1242 209 -290 -561 463 706 -509
6072 -509 -1146 -478 312 583 -539 -632 -1059 -264 -13 -48 2 1139 1615 -937 -450 956 454 -443 -583 -655
6092f55P21M74j379k44J653j40p57J161j144K20m75m55K086l98j05j803J029J085
6110H74n92Q90j712l46l77K177k460m2J208Q24L50j423K11k57J676l48o6m19l63
6129a95M64n78N86J48K14r61p36K86J217k6j147P0J814o2j506J085J3m55m40K3
6149a86J22j23J478k290l60J611O69o36k05N37K45n21l70m9J82J192j288J134
6167A142o77L88p89m71m7Q65j037N46j71O5j93J16P48k34k9K05p78q80K148N64
6187A481j302n19P03K24m69j347Q90rP78m18L35q93R95L11j076o79J107N28o52
6206a2R63j429o6l60k16J915J11j038k90J594j269Q36r20k36L18J013m66o80M87
6225B55l31O44m97p77O97n08P41j486J112J137R4p40k64m81K069n69q89q11M97
$$ plain form
6092 -655 66 540 -839 -1083 570 430 -327 834 -310 -90 -565 -1020 1066 668 563 -1240 -211 874
6110 874 282 1172 -540 -886 -1263 914 -1546 -1588 -380 444 794 -629 -418 -675 1001 653 587 168 -195
6129 -195 269 -309 277 425 639 -322 -1058 -772 445 419 -728 -658 1156 1094 -412 673 686 231 -209 -186
6149 -186 -64 -187 1291 -999 -1359 252 921 285 80 617 862 341 -29 -78 104 1296 8 1142
6167 1142 465 853 64 -407 -454 411 -626 -80 -251 -186 -379 -263 485 251 222 427 -351 -1231 917 1481
6187 1481 179 -340 363 587 118 -1229 -339 -348 430 12 347 -546 449 760 -316 -995 112 640 -12
6206 -12 951 -478 -544 -904 -1120 795 906 -132 -422 1172 -97 739 -181 -417 -99 914 448 -232 255
6225 255 -76 568 71 -706 -9 -517 224 -1262 -150 987 1081 341 77 -404 1665 1096 207 -604 -107
6244a07L59j440J121K02R57o23q82j07m0P76M04O32j167J299l68j695O68K94K07
6263D90j007r2k10O58N20j038M72q56P32P04j595J610M3p70N87p25M39p60J384
6282E86k70l02O5m6o23J496K9K53o76k277J437j97R99o74o95N13P93j392K92J84
6302e05L52O3J01QJ025o68K51j139J008k17O19j590J393k02o19M18m84L64p62
6321e84K006j803j51r83K572j250K09l06J101j056o74P34K55m51K25K00m0P91
6339G95j655J386n99p6L51k158J665K00J274n60o38k8K90N33q76L83p7J049p07
6358E52r65L99L67j220l4J276k46l04m3k9N38l90N19p0o57K75P24r54O96K88J22
6379H44p10K80k139J368J397j680K89M03K90p1n80P00k68Q9q22J198k2K12j185
$$ plain form
6244 -107 252 -1188 -67 135 1092 469 -413 -520 -560 216 620 1252 85 1384 1016 -679 -11 283 490
6263 490 -517 -609 -819 -161 359 -679 -207 -1063 -331 373 -1222 388 431 -339 248 -477 -38 -798 586
6282 586 316 14 79 33 -590 906 935 1188 512 -1765 -328 -525 474 -200 -895 -382 411 -981 -689 -505
6302 -505 -153 -90 11 19 1044 376 627 -512 496 279 898 -692 701 499 -120 298 -186 178 -584
6321 -584 1422 -381 -532 -1515 1057 -193 16 -290 811 -245 -919 -185 70 -381 -156 44 4 795
6339 795 -860 526 -73 -149 202 -1956 -291 -91 1183 623 -15 -43 247 780 -96 287 210 1259 552
6358 552 -413 -14 353 -867 -901 375 129 -175 -218 -247 291 -99 420 350 -307 -32 692 -262 434 722 844
6379 844 134 414 -1725 -357 1040 -640 -351 52 342 271 -309 391 123 212 -610 588 566 778 -407
6398d07N6K41q97O02k55J82J420J4j539R46j178J109J88q32k15J060l1j954J343
6417a47J411j217j22m93J79P95p9K32j227J288M8j138j183J943J53Q0Q5j526J302
6436C84M04j089p25J726j118J79o15J113j94n85M83n5N95n62mj79m54J251k61
6455B94l76m12m15K295j146k49j179J941j26j024p3K99NM54j308L77K82L61m28
6474d28K29l85J7Q1m14Q31k06K4j75J237p28q6J36P7q42J305p83j191J590j724
6494a435K829k185N72l41N77M94j644J150l71J435j020j073O99M3R36j488O50
6511a72J78j196J834p29q97N82O34r3k33J040j771k7Q11J049q30j156J699q60
6529a37Q55l95k29J55r84J482l43j676P37N92J270j612j41J39J700j092n79O42
$$ plain form
6398 -407 -351 -110 -1007 -405 -660 -478 942 956 -583 363 -815 294 482 -350 -565 495 464 -1490 -147
6417 -147 1264 47 -75 -568 -389 406 327 559 -668 620 668 -470 -1653 290 443 523 608 -918 384
6436 384 788 -301 -1026 700 -418 -239 -854 259 65 -520 -37 -92 503 -59 -63 -242 -696 555 294
6455 294 -82 -494 -909 1386 240 -9 -1188 753 627 -397 -470 -171 -166 288 -1020 -643 -361 0 -428
6474 -428 -199 -584 -567 -486 -900 -69 -275 -251 -426 811 83 -3 133 210 -632 673 -110 -1301 289 -1435
6494 -1435 1394 -791 -219 -560 17 511 -1133 17 -354 1081 61 -1012 -313 -270 666 -822 -172
6511 -172 6 -1190 644 -85 -982 -400 234 141 -92 948 -823 -850 -39 1010 180 -976 723 -137
6529 -137 718 323 94 249 -735 747 404 -1272 -535 57 1327 -285 -426 -287 1413 321 -258 384
6547C84N66j233M98p15R25L90m22r75K3J302j608Q54m08M83J47l06P9R6L14k64
6567A30q01K47L51J94l92j32j59J424q27j41k03Q07o14O23o26J24P61r9l90j066
6587g89K10J266N2j622J000j48J19q95J063N19n08J8L5k77R8j073P75n46J284
6606E81q92k46n6Q53O00l50j85k19M68n18P08j519P38O82j005K37P02j104K85
6625b40O76K67q64J189J54j660R71j62L61j976J777Ko29J48l2O95r01P89j379
6644h14O38L79R56j284N32m49N62j498M75R34n27O9L2j91K28L50r8j43k75N78
6664D54n57K3n01l96J067l61l78J532q96O63q48m46O2o8M84m14P70L7j077J118
6684B68K00k64K16l52K37q3m25o04M01O24J71j16o30p8J670p85n44Q20j305R97
$$ plain form
6547 384 950 -283 215 -500 425 815 393 -582 -559 743 -865 -11 -419 64 211 -95 -16 80 394 130
6567 130 -671 -424 -73 121 -271 -403 -562 862 35 -106 -309 498 -116 507 -119 5 766 667 277 -789
6587 -789 -579 687 739 -883 117 -31 88 -807 256 775 267 285 320 43 141 -932 -157 -703 581
6606 581 -311 -557 -613 240 840 490 305 86 554 36 744 -775 -37 645 -360 -123 579 -525 -240
6625 -240 436 703 -161 1028 1182 -478 493 331 692 -1284 493 495 -134 14 -18 677 -224 565 -814
6644 -814 -176 203 1159 -125 407 -42 520 -978 -503 431 -96 -27 5 -186 42 392 294 151 -124 454
6664 454 -103 -80 -581 -977 90 -271 -649 883 -13 650 -198 -644 -582 -650 -166 -580 190 227 -850 268
6684 268 468 204 420 68 305 222 -203 -807 -406 218 389 273 -357 -435 1235 450 -94 726 -579 418
6704D18n17k1j06O69K40j114O74k20p27K486k677J440o84O79K72r38J20r64J085
6723A15q61O7J830m95o01j115R54N18o55l06J09Q98O9l46J50P92k381J281K55
6742B78j236J101j13p8k79k7K75k20o08N63J068m77p49M22N47j061J686P4o2o68
6762D36p2j12n27O38M49n05J90n25J371r37jj168J346j19k49K54j228J146o77
6781b90N23p12Q32P21j658J116J26o10m65J80l46K58L33J34o73J298R46j669n71
6800e27N31K25k9K63j400O98J028q88q31J210m65K88L49r13k94Q69M16o79L06
6819A57l90R69j728J436J24k46o03m74J073O4q06Q33m33n43J281j212l1O47l00
6838a82O87j005j702K022J050m34J44r55J333q08n21m90M05J118q57K01L72j03
$$ plain form
6704 418 -99 -120 -226 443 683 -431 243 23 -704 1782 -895 545 -139 540 812 -126 -6 -970 115
6723 115 -746 -679 1151 656 55 -1060 -106 412 -243 -549 -440 458 527 181 331 1123 -1258 23 278
6742 278 -958 143 30 -48 -327 -354 -79 -299 -907 -344 724 247 -502 -80 467 -594 1092 1166 1104 436
6762 436 364 252 -275 363 812 307 497 -28 1343 406 405 -763 583 464 215 469 -759 387 -290
6781 -290 233 -479 353 1074 -584 532 658 48 -417 -237 -583 -325 8 142 -531 767 1713 44 -527
6800 -527 4 229 200 463 -937 -239 789 -99 -930 280 -185 103 452 -461 -755 114 530 -149 157
6819 157 -233 736 -992 444 568 322 -281 -755 318 382 -424 409 -24 -567 714 -498 -529 118 -182
6838 -182 505 -500 -2202 -180 870 436 580 -375 958 150 -371 -861 -456 662 -195 6 378 275
6856B75j441O2J305K80J382l037L48J210l67p69J052p29L70j29j93J403k91j185
6874d54k6N05L71Q87j408M53j088o4J101N9j96k80K61l85K85L00R42j392N02j259
6894h86M66R39m86p23Q51J96R6l05M61j30n80o27R34o84J116O72k320J034J045
6913A069j322J039p7J19j400LO93j938J096L57M20O70j784J504o37j217J546q30
6931f89R26l78M30m38N05N91j434p88J273PM24K02M7j031L05l61P2P20l61N70
6951E92M46j388P21p4j39P20j550J746r92m30M21n65M36m54J658r56J17k26p41
6970f58J51R79l37R38m60n14K2M43r18J85L54J436j423q14K49P59r62Q13k3j462
6990a242K185j461K52M01k71k16l87R04N59J25k192K61J543l51M37m84m79J027
$$ plain form
6856 275 -1166 -1104 201 481 1863 -1174 -826 384 17 -752 300 -429 -59 -188 -381 1022 731 -454
6874 -454 -480 25 396 1283 -125 328 -760 -824 277 336 140 -140 121 -264 21 321 1263 -129 373 -886
6894 -886 -420 519 33 -690 161 357 453 148 609 479 -101 -728 206 -478 638 1310 -1010 24 1069
6913 1069 -253 786 709 828 -572 -569 124 -1814 -718 -361 59 729 -1055 449 -188 -1405 141 -689
6931 -689 237 -141 289 -149 356 947 -487 -1275 -2 5 429 631 678 -353 -48 -409 -337 383 22 592
6951 592 1038 -350 371 297 158 878 -672 1074 82 -348 73 -492 -56 -510 1148 192 309 83 -658
6970 -658 -507 472 135 1073 613 99 121 564 -354 -169 185 1621 198 -616 -367 392 -570 243 220 -1242
6990 -1242 943 -518 -266 135 -136 -352 -739 165 724 849 -1343 -1082 461 110 547 63 -416 611
7008F11p77j98%N34L90j135K60J231q03Q77j857J9J355P27j490o11P00R04o57
7027H0o80P55r01J882j203K8m9R44j921P75M74L89K16k188J629m50j18L66Q6m13
7047b99M53k05j301M91L44Q40L54q76K56j43K93j025K29P44n71R87r50n94K474
7066A501j573J69Q76o16J62j013k45R38K45K9R2o73L8m10J64J027j611J609k248
7085a539J436J071j102n66M99M04q99J146Q03j826R10Q8K3O4n20r11O01K01Ll8
7105a52P41q12o49R12l35Q37j023O12M26m90o42N09M91o43P32l44o5Q1M02L46
7125I34n03l53N48j189J137k61p78J08k71K41P62m14k89J16L31%Q13j816L24M75
7145h5M09l44j088M69J629q04j141J166p27L70J97j73o79J210q79J25J90n35J11
$$ plain form
7008 611 -166 -364 -364 170 560 -575 -315 916 113 990 -867 -848 507 1234 -256 -867 -167 737 80
7027 80 -600 155 -746 1136 -67 -39 -88 856 -1065 -290 184 573 789 -1399 230 -220 -338 28 114 -299
7047 -299 154 -51 -1352 -861 -517 323 677 -199 57 -86 207 -818 -589 155 -416 571 -379 -973 1501
7066 1501 -72 97 973 357 519 -494 -739 199 444 473 565 -108 -70 -480 -316 711 -900 709 -1539
7085 -1539 -103 968 -134 -700 -201 203 -696 450 1253 -573 337 425 448 512 -8 -919 -318 -117 -114 -152
7105 -152 589 -223 -872 40 -295 542 -481 131 557 67 -575 -66 425 -218 514 170 105 186 588 934
7125 934 431 78 626 -563 574 313 -465 -357 -628 -387 375 -39 -328 -212 119 119 932 -884 -560 -85
7145 -85 324 -20 -1108 -639 990 186 -955 211 -516 -146 51 -122 -801 409 -470 -345 -155 -690 -579
7164e79K81J61q59J968k53j678J48O49k05j35J065j371J699n37j897J106p6jJ664
7183A150j208k08J23M5J14j008M72N33j51J206o60j32O19o15r73k94J166Lo09
7202d27M73K25n04N86o71O53O01n64N15j327R7m33J855r26n92R21n95L97L86j691
7222a021J135r19J407l05n75k19J567q20j03P8m36l74J088p8j183Q37m14j09l9
7241d83Q61R47j63j122J81K4j33k91J110j042J52l54p84R90n39J219j21j083q34
7260a465K680o08q66j31N95L51l17n20P87j979K704n94j228q4J096l22l03j612
7278a816J189q3J06J454r51k45J119j878M50P7M52m95M58L26L42l13n55P11J61
7297E09q88M43m53n9M13k30N87j584J479P32l92K15J63j113R82j220j28L91k97
$$ plain form
7164 -579 -298 -137 -996 972 719 -959 -811 -162 -367 -502 563 -808 891 354 -1543 -437 -513 -514 1150
7183 1150 -58 -266 -143 -98 16 -992 -520 13 -138 1068 408 276 895 280 -693 -987 179 182 -427
7202 -427 46 271 -233 353 -318 335 936 372 887 -440 -343 -776 1079 153 -439 482 -113 284 670 -1021
7222 -1021 114 -805 602 297 -278 -497 1070 250 147 225 -211 -585 503 425 -758 79 -335 -444 -483
7241 -483 378 1325 1162 40 221 245 112 -179 931 -111 41 -313 -1097 -107 -646 573 452 -631 -1465
7260 -1465 1215 607 -259 -390 205 556 239 -281 506 -1473 1231 637 -591 -675 421 99 -204 -1816
7278 -1816 -627 -710 -604 850 -101 -346 773 -1105 -655 -578 -126 -621 -163 163 505 192 -363 348 509
7297 509 -379 64 -389 -448 -35 -265 322 -1262 217 949 557 772 935 -178 804 -416 -544 -153 -450
7316d50K27m83J574j94p07o41Q22j80l3l83M33J33L3n60l03N32q71L66O0k9M61
7337a93J9K6k67P03N19m38m60j13K75J185j413q19N18K24o6K52O15j29l11j76
7357d9l64J070n5l12J88L69j66r22j050O67J881j183J06k83r33J102J24j972J324
7376d58R23k42k55L42j112J623q84p14J052k65k90Q90j100L16k74R87q16o3r9
7395d39M52J94o58P03L95j484L07L21p67J125O13l123K782j40l02l16Q27m62j16
7414h8L38m12Q75n36J614j450j192J961j098j451J484n27L85j304J574m36J096
7431H33j138l72M56o27J140J366p60n96j804J163J17J24n68J286N08q22q44K54
7449b84P83Q28j641J49k16Q40r40Q22N93j470K97r09J046l93M96n41J077Q09j325
$$ plain form
7316 -450 -223 -706 868 674 -33 -674 148 -32 -65 -448 -15 118 151 -409 -712 -180 -1051 -685 -625 -654 -193
7337 -193 -174 -148 -415 288 807 369 -91 -204 71 1256 -157 -976 -458 -234 -300 -48 567 438 127 -49
7357 -49 -413 657 602 290 478 847 681 -241 -1291 -624 1257 74 180 -103 -1036 66 190 -1782 -458
7376 -458 465 223 -32 310 -802 821 -63 -777 275 10 -280 610 -490 -174 -448 539 -277 -340 -439
7395 -439 13 207 -451 252 647 -837 -530 -209 -976 149 762 -2361 421 281 -21 -337 490 28 -88
7414 -88 250 -162 713 177 1791 341 -851 1110 12 -1439 45 -482 -97 -1401 173 -263 833
7431 833 -305 -677 -221 -848 292 1658 898 302 -1502 -339 -222 -98 -666 620 1128 306 -538 -284
7449 -284 499 1327 -314 -165 -381 459 -481 341 934 -536 -239 -1148 -102 -495 1 -540 537 1346 21
7468B1Q1J42K11p53r20J904N38J50j399R96m79j141J148K28m89n24J183q93J253
7487A257k103O00R50l03q94j13J443l56L08l79j85N31m61r61J191P10p66j145
7505f76q17K634n82j176l1Q95r36M87K16N62o61p70M00j15J3M34l68O33Rj57o50
7526f56O77k95R75o12k31l02l38R70n88M81l33K20L31o18K52k13N65q3k38N11
7546D75n03R40j870J810r14NJ272j178O91N32j379m2j56J998q31r39j58p8p64
7565a089J397K33n69K49l69m11J219l49R6m77N74M88j319k68P12j118K22J178
7583C99qQ1q68J316l49l43q48j02J447P5r82K72N01Q6q7j55L42L34m18k12q45
7604c64J19K71p02l06O69n47J416P2j049J710k262J020P89j038j00N38R68m60
$$ plain form
7468 21 102 244 455 -298 -1218 686 1224 1374 -25 971 492 -649 499 727 238 -286 897 4 1257
7487 1257 -846 -246 704 401 -493 -606 837 481 789 410 225 756 295 -666 525 1235 469 -676
7505 -676 -1493 1141 559 -617 -648 247 -689 -202 14 576 -85 -855 -455 -570 -557 -123 -491 142 151 -6 -656
7526 -656 21 -274 701 89 -142 -444 -782 188 -400 81 -252 -32 299 -319 -67 -280 285 202 -36 475
7546 475 -28 912 -958 852 -62 -57 1215 37 728 1260 -119 -161 -317 1681 850 -89 -247 -325 -1089
7565 -1089 308 541 -28 221 -148 -559 660 311 407 -70 504 992 -327 -595 117 -1001 -779 399
7583 399 391 472 -396 920 571 228 -620 -722 725 800 -182 90 591 677 590 435 777 1111 693 481 -364
7604 -364 -245 26 -676 -982 -313 -860 556 628 -421 1289 -973 47 836 -202 -302 236 1204 744
7622G44M67j083l65n84J276R2L06p20Q65m63q5j281J545j982K260k31n13j006
7640g58J75K348q23p22m4p25J131n69P06j027O77o52O83J088j915L83l47P53l48
7659A4M64M83j541R76M64q60O98k40j41j262M51J185o59m95Q3R8J065j099L30
7678A4L67o21J136p88q66J132j41P67o20j164K17K206m35j563m47J266k14j128
7696h82O22k12K01n24O31k10M95O4K53q01O98j96q06M08r4N37k68P91k99L64n62
7717B10k64m19n17Q73L07j012J907j013L53j337J157p58l70J679j583J04J563
7734H80q01k06n39M5Q48J4o25J51N9K5q84N13k37J273k01p98K63M23k54l40j047
7755a438J718K50j085O27J94nR63q57j21l46Q10R2p24j82N59K64r63R53j774J631
$$ plain form
7622 744 1211 128 -237 -821 455 547 853 133 998 535 450 -831 714 -1268 992 761 248 -758
7640 -758 -583 1765 942 220 176 -549 582 13 719 -308 369 -283 400 1488 -427 -44 -391 362 14
7659 14 478 961 -580 396 860 0 698 458 317 -945 -494 691 32 -463 -380 -282 783 -316 14
7678 14 381 -240 896 108 -758 374 233 1000 380 -784 -567 1639 1204 -359 -806 460 246 -882
7696 -882 -260 -472 -271 -795 -164 -374 121 185 438 -363 335 139 -667 -259 -353 184 -84 707 408 772 210
7717 210 -54 -473 -990 -117 190 -822 1085 72 425 -912 245 -513 -883 796 -787 -683 880
7734 880 79 -127 -666 -621 227 241 -384 -233 -174 -149 -1033 -520 -757 516 315 -483 -220 203 -51 -391 -1438
7755 -1438 280 530 -555 72 266 261 1224 367 246 -100 710 802 78 -104 455 719 -244 709 -1065 566
7775E66j395J47P69L41l29l77n38K156n57j866P83N95q10K91l55J49L84K52m49
7794b43Q33j33j735J048L2N76r3o22L79J2j058M18j080P63n58J877l24N72n68
7813I6l61J147o52p91M86j38L75K64j37k59O82j030K63m46N11n38P06p78jJ254
7833F53K97j254M25Q76j472P57k49R59j173j57J96P87l71l24M00m26O32o08K76
7852B24j58k98k42J883k033o38J467j112K90P87k89j76R19q68L26L08L08O35j761
7871d28J8R21n90k98O73J90K55p94n46oR72m48k84J183j635J060j46q7L57k68
7891I9m83n16N31J442j186m71j56M44O72k46j435K065m87J85j97j160J973j636
7909e62R39K65m18o19Pj87RJ099R0j384O95p72J291j079Q24m05Q44n63r58J777
$$ plain form
7775 566 -829 -682 87 428 99 -278 -816 1340 783 -1083 -300 295 -515 -224 -579 -430 -46 206 -243
7794 -243 590 457 -1278 -230 -198 378 285 -337 42 54 -1004 -586 -1666 -903 -1461 416 92 664 96
7813 96 -265 882 230 -561 -75 -213 162 426 289 30 712 -318 -55 -501 10 -528 178 -600 -601 653
7833 653 950 -304 121 997 -475 282 33 992 -181 -338 -142 645 274 -50 350 -76 556 -52 224
7852 224 66 -232 -474 1409 -624 -1262 205 -907 -617 170 -119 -295 624 -244 82 390 698 1333 -428
7871 -428 -410 511 -79 -377 296 486 741 -53 -599 -605 367 -81 -365 818 -817 243 97 10 367 99
7891 99 -384 -900 -369 1073 -113 -584 -740 -296 376 130 -1305 760 273 458 261 -899 1074 -562
7909 -562 377 642 224 -395 -388 -575 -566 533 623 -761 -66 -838 453 -626 198 -207 637 74 -884 893
7929H93j162J405j367L84R8Q82k27p78r26K93J289j344J10J069j030R45n39J51
7947A46l61M69j339qJ085J48Q4l75o18J367P39j727j41M40l09k13Q7Q01O75l37
7967F13n55r33J304R70k128m23K60J024Q55j433Q24q7O49j537N52l28R87N2j510
7986h44J496k84K69k54o63N63N02j189k12R81n93M38J7r9j473J546j66o4L17j52
8006A36p42O73J028j890J064k85r73J430p96J456m59q55J73L01p59R55k92q40
8024f75M63J16n6R34N45n45P98j971n31M68J571j390Q41L3J06p78O1J87o34l02
8044g59K34J92P69o85o95N97l92J743j225p52R81o35P92m22L53L71m89j190J600
8063C88j032M68o43J150k10l25N0k17o40K111j505N63m14J1O62o15M35M9l08q07
$$ plain form
7929 893 -269 1136 -231 153 251 1133 906 128 -798 -505 784 -560 -450 619 -411 534 -5 146
7947 146 -215 254 -1085 -1093 -8 140 224 -151 -769 598 1337 -390 -531 -91 -400 -613 -526 275 950 613
7967 613 58 -875 429 1399 -729 -1152 -892 132 987 -446 378 291 940 -597 -45 -373 614 666 -844
7986 -844 652 368 637 383 -280 283 785 -404 -616 365 -228 210 227 128 -1345 201 35 -29 288 136
8006 136 -606 67 1095 -795 269 -16 -989 441 -355 1101 642 -213 -40 261 -498 457 165 -675
8024 -675 -212 -96 -152 782 1327 782 1580 -391 -922 -454 1117 -273 568 601 707 -71 -10 177 -457 -759
8044 -759 -525 -333 436 -249 -944 -347 -739 1004 -221 -973 8 -627 165 -257 96 467 -22 -1212 388
8063 388 -644 -176 -819 331 121 -204 -154 -371 -1011 1100 -405 158 -256 -245 417 -198 237 286 -22 -829
8083h29J67P9L72j58J238l39j139J014j54L24q05Q61m46Q1j094L19M18k59J06
8102b44J357m02j108R70j540k95J268N19j375P71j30J124p07J74k66Q75k28n41
8120B22n1J30J10o99Q22M84j718J091k83k62j086J788k46r95Q10Q94p56j259J222
8139B18m21r7M14K49j49k89j63J39Q55l06o93O51l46J01p89J025q47M29Q48j031
8159b02P76k66l77J71k92L38m82J329j213r83R46M40j81L25q68L84OO68lj234
8179g18M13L75k23m19k48J492j44j639K164k51r5n88
$$ plain form
8083 -829 -662 -583 -211 -369 869 530 -609 405 251 575 -230 631 185 266 -828 -509 -91 -350 -244
8102 -244 1113 711 -397 573 -967 -1262 6 525 -850 -79 -209 915 208 382 116 991 763 222
8120 222 171 301 411 -288 534 1018 -700 391 108 -154 -1240 548 302 -693 117 1011 255 -1004 218
8139 218 -203 -300 114 363 214 -75 -238 -99 756 450 -243 408 62 163 -626 399 -448 -19 829 -202
8159 -202 574 308 -69 102 -190 148 -334 995 -218 -1201 -255 185 4 329 -539 -155 -149 519 516 -718
8179 -718 -305 70 -153 -572 -820 672 528 -1111 1053 802 707 119
8191A19
$$ Imaginary data points
##PAGE= N=2
##DATA TABLE= (X++(I..I)), XYDATA
0@%%%%%%%%%%j08K16k16K16k17L25m32M37n45O51p57Q84r96J186j375J553j757
27i35K001k269K558k877L228l622M053m516N030n596O213o896P649q473R375j0374
43e451J1487j2731J4128j5701J7498j9564K1962k4803K8224l2428L7748m4727
55b4358N4326o8415R1153j33859K40946r67464k045404K024145K147890m06838
65I12122j583551K2652P60651n7097n17716K51737M98954M3041k31540r6760j87485
76a84992m2477M19311L93214m01887o09538J50288N86640l5197m68871k2430L43637
87A27698n0802l07798R2354L20292j15780l36845J14993L87132p6639l96452M2935
98a98912M40303K0547m74734j42161M59380K92940l47488l94107J63507L86791
$$ plain form
0 0 0 0 0 0 0 0 0 0 0 0 -108 108 -108 108 -109 216 -216 221 -324 327 -430 454 -542 644 -731 822 -935
27 -935 1066 -1203 1355 -1522 1706 -1916 2137 -2379 2651 -2945 3268 -3628 4021 -4452 4923 -5451
43 -5451 6036 -6695 7433 -8268 9230 -10334 11628 -13175 15049 -17379 20369 -24358
55 -24358 29968 -38447 52706 -81153 159793 -807671 -2853075 -828930 1318960 912122
65 912122 -671429 -648777 111874 54777 -462939 -211202 287752 330793 99253 2493 -184992
76 -184992 -227469 191842 585056 183169 -426369 -276081 310559 275362 -193509 -215939 127698
87 127698 76896 -230902 -138548 181744 65964 -270881 -155888 231244 154605 -241847 -198912
98 -198912 241391 261938 -212796 -354957 104423 397363 49875 -344232 -180725 206066
108B06066j778l03967r2670K03112J31950j06791j34377L4107J32478N4998p0921
119E2207r6197O819R2366L0931p6669k5827R2101J8359j56217p8524J77753J39025
131A76127j92330k24217J57266K83200j07107l42413K5998L70569R2784l22913
141h3036j69037K54585K23693j51802k13460R2045K17591r770j84585o2417J18817
152C2624R4506n9378j09934j1872P9891L2501p5993p3926N2784R6441l3953j21665
164i7974R461J56146M1131j71308q9259J93370J76948j78557k83634J05059L63799
175B25182J4573l99964j57458L60299K87074k66992l68094J29015L89975K7468
185B41078l27963j40915K12650K02085o6807j81218m6534J11292J04983l8073
$$ plain form
108 206066 204288 -99679 -192349 10763 142713 35922 -98455 -64348 68130 123128 52207
119 52207 -43990 -37171 55195 86126 9457 -16370 75731 94090 -62127 -140651 37102 176127
131 176127 -16203 -240420 -83154 200046 92939 -249474 -223476 147093 239877 -83036
141 -83036 -252073 2512 226205 74403 -139057 -47012 170579 160809 -23776 -86193 32624
152 32624 127130 67752 -42182 -54054 25837 58338 -17655 -91581 -38797 57644 23691 -97974
164 -97974 -88513 67633 108764 -62544 -151803 41567 218515 39958 -243676 -138617 225182
175 225182 239755 -160209 -317667 42632 329706 62714 -305380 -176365 213610 241078
185 241078 -86885 -227800 -15150 186935 120128 -61090 -107624 3668 108651 70578
195G0578j31794l9105J15389R4259p9044j21738L2022R8641j7715q2224K4484
206c6247P7352l8722q8102M4886J16370l5554j36084K5028J80193K3248k04754
217g2386r2034J99243J77632j39138k29018O2680K43167J3555k39334r8633J90483
228A6217J58003j15973j80636L7582J57857Q592j32288l5422R8415M4778q2515
239b5390n7422P1358P6706n2282r2742L6557J29133J3505j52910p8706J59532
250B7339J73996j10420k52222K2635K91078P3500k99128j89134K45637K78539
260B61820j58024l26964M6291L28817O8929k78670j59437J94481K09275r9856
270H6662k25148K965K12136Q7766j71307j65657R9639K04609k2212k14718m9439
$$ plain form
195 70578 -61216 -100321 15068 109327 30283 -91455 -59433 39208 21493 -60731 -36247
206 -36247 41105 2383 -85719 -40833 75537 39983 -96101 -71073 109120 132368 -72386
217 -72386 -164420 34823 212455 73317 -155701 -93021 150146 163701 -75633 -174266 16217
228 16217 174220 58247 -122389 -84807 73050 81642 -50646 -86068 12347 57125 -25390
239 -25390 -82812 -11454 65252 12970 -79772 -43215 85918 99423 -53487 -132193 27339
250 27339 201335 90915 -161307 -138672 152406 225906 -73222 -262356 -16719 261820
260 261820 103796 -223168 -176877 151940 220869 -57801 -217238 -22757 186518 86662
270 86662 -138486 -135521 76615 164381 -6926 -172583 -72944 131665 109453 -105265 -154704
281a54704K04997J13854j73388j55362J30938J91863p7288j96507L4980J95161
291A14544j101j95994l3710J98084Q0665j86454j45758J41161J81170r5467k14895
302a57755K6639K22697M6057k03951j18994J52434J67829p6246j75719J5315J66370
313F4676M1652j35960p7475J02708J09690n6926j29139L662J26066M4512j11821
324a8355q4958R3012J31998n4006j68931J786J82917N7916j81419j15873J49246
335f667J52888j19059j86837P3080J96952k6562j97464j9049J78414O5308j39405
346b8401q0713J08925J02799o9539j09638K8226J07659J8129q5161m8358O0381
357D309O6354l8610q8749J2865J05918K1885j16574p1905J03615J12269p4922
$$ plain form
281 -154704 50293 164147 -9241 -164603 -33665 158198 80910 -115597 -80617 114544
291 114544 113443 -82551 -116261 81823 162488 -23966 -169724 -28563 152607 57140 -157755
302 -157755 -131116 91581 137638 -66313 -185307 -32873 134956 58710 -117009 -101694 64676
313 64676 106328 -29632 -107107 -4399 105291 48365 -80774 -77112 48954 93466 -18355
324 -18355 -103313 -10301 121697 67691 -101240 -99454 83463 141379 -40040 -155913 -6667
335 -6667 146221 27162 -159675 -86595 110357 83795 -113669 -132718 45696 111004 -28401
346 -28401 -109114 -189 102610 33071 -76567 -48341 59318 77447 -7714 -56072 4309
357 4309 70663 32053 -56696 -43831 62087 83972 -32602 -104507 -892 111377 36455
368C6455j47935L3216J67953K0093j77255r0477J50263J51514q6198j78539J2254
379a08656J75582N3038j43722r6504R8642J27367l7867j27133j0608J07098M7385
390H4622p4495o1319M7194O2849l1751o9387J5376P4831K653p9815k8347P5615
402A8026M2280p4813p1206O3240J00363l9716j23253J963J33184L9629j23378
413c3681p7519J00898J11181o5384j31133K1013J39816L8588j12626p9700O9134
424a9413J00027j6971r8707k3058Q2543N5340n8956p9580K3735Q0687m05p8243
436c3001j7373P0567K1685p4129l5324Q0011O3539p7202r5275N9944J20954l0264
448E4132j45119r772J61540P3391j47782j31628J08274J77136m1456j91167j9596
$$ plain form
368 36455 -111480 -78264 89689 109782 -67473 -157950 -7687 143827 57629 -120910 -108656
379 -108656 66926 119964 -23758 -120262 -21620 105747 67880 -59253 -69861 37237 84622
390 84622 10127 -51192 -3998 58851 27100 -42287 -26911 47920 50573 -29242 -57589 18026
402 18026 60306 -14507 -85713 -22473 77890 38174 -85079 -83116 50068 89697 -33681
413 -33681 -111200 -10302 100879 35495 -95638 -74625 65191 103779 -8847 -88547 -19413
424 -19413 80614 63643 -35064 -58122 24421 79761 20805 -58775 -35040 45647 45242 -33001
436 -33001 -50374 20193 41878 -32251 -67575 12436 75975 -1227 -96502 -36558 84396 54132
448 54132 -90987 -100759 60781 134172 -13610 -145238 -36964 140172 98716 -92451 -112047
459a12047J81999Q3979j53649j34128R9754J61248m0901j65636k7618J35588O7310
470I5899j00559r0769N9022J04689k0902j04600j7050R2205M6657p4863o2187
481g2458O5872Q3586n2854j07308L3497J35077L497j50380n4587J48705J11724
492A44371j21241j61110P3134J96932m014k05720q0859J74633J48263j07991j84545
503a28147L1660J85192L6836j62609r1246J17508J20482o8405j31700K2188J18687
514E0446P168j01762k4275R2617L8061q2889n3473P8001P7967n9317q9195M3158
526b3493J06817j3242j24574l0189J21462P4307j00846j13892N7576J36256j0933
537G9249j45741m3754J31059R7793r4568j38888L8378J49607K3773j34961p2973
$$ plain form
459 -112047 69952 153931 282 -133846 -34092 127156 86255 -79381 -106999 28589 95899
470 95899 -4660 -95429 -36407 68282 47380 -57220 -74270 17935 64592 -10271 -72458
481 -72458 -6586 77000 24146 -83162 -49665 85412 88909 -61471 -116058 32647 144371
492 144371 23130 -137980 -64846 132086 128072 -77648 -158507 16126 164389 56398 -128147
503 -128147 -96487 88705 125541 -37068 -128314 -10806 109676 41271 -90429 -68241 50446
514 50446 57614 -44148 -68423 24194 62255 -20634 -74107 3894 81861 22544 -66651 -23493
526 -23493 83324 70082 -54492 -84681 36781 111088 10242 -103650 -46074 90182 79249
537 79249 -66492 -110246 20813 118606 24038 -114850 -76472 73135 96908 -38053 -111026
548a11026J02552R8689o3469j15677K5352J17947J3740j05020l8241R1422N8911
559G5180p5426p0769O9273R2612n3774j14575K9269J31812J0898j38274n7689
570a01463J19214R2979r5115j30863M7668J48524Q342j42668o7053J12542J08103
$$ plain form
548 -111026 -8474 90215 26746 -88931 -63579 54368 68108 -36912 -75153 16269 75180
559 75180 -246 -71015 -1742 90870 37096 -77479 -48210 83602 94500 -43774 -101463
570 -101463 17751 110730 15615 -115248 -67580 80944 89286 -53382 -120435 -7893 100210
$$ [...]
8191a25
##END NTUPLES=NMR FID
##END=
