##TITLE=1H_SA_pyrether CNHEP
 DMSO-d6, 8 sc, 
 4.6.2019
##JCAMPDX= 6.0         $$ Bruker NMR JCAMP-DX V2.0
##DATA TYPE= NMR FID
##DATA CLASS= NTUPLES
##ORIGIN= UXNMR, Bruker Analytische Messtechnik GmbH
##OWNER= root
$$ XWIN-NMR		Version 3.5
$$ Tue Jun  4 14:24:58 2019 Russian Standard Time (UT+4h)  she@DPX200
##.OBSERVE FREQUENCY= 200.13155
##.OBSERVE NUCLEUS= ^1H
##.DELAY= (6, 6)
##.ACQUISITION MODE= SIMULTANEOUS
##.ACQUISITION SCHEME= undefined
##.AVERAGES= 8
##.DIGITISER RES= 18
##SPECTROMETER/DATA SYSTEM= spect
##.PULSE SEQUENCE= zg30
##.SOLVENT NAME= CDCl3
##.SHIFT REFERENCE= (INTERNAL, CDCl3, 0, 15.7039)
##AUDIT TRAIL= $$ (NUMBER, WHEN, WHO, WHERE, WHAT)
$$ ##TITLE= Audit trail, XWIN-NMR		Version 3.5
$$ ##JCAMPDX= 5.01
$$ ##ORIGIN= Bruker BioSpin GmbH
$$ ##OWNER= she
$$ F:/spectra/data/she/nmr/H-F/1/audita.txt
$$ ##AUDIT TRAIL=  $$ (NUMBER, WHEN, WHO, WHERE, WHAT)
(   1,<2019-06-04 14:23:21.03 +0400>,<she>,<DPX200>,
      <created by zg, POWCHK disabled, PULCHK disabled
       configuration hash MD5:
       00 E9 B6 7A A2 85 ED C7 34 08 36 98 17 FE 4E 26
       data hash MD5: 16K
       2F 47 F4 C6 57 D5 F7 C1 3D 1F AF AA 70 7B C7 CE>)
$$ ##END=
$$ 
$$ hash MD5
$$ 8F 0C 0B 25 C5 27 C1 FB C4 B8 88 C6 2D 80 B3 24
##$RELAX= 
##$RELAX= 
##$RELAX= 
##$RELAX= 
##$RELAX= 
##$RELAX= 
$$ Bruker specific parameters
$$ --------------------------
##$DU= <F:/spectra>
##$EXPNO= 1
##$NAME= <H-F>
##$PROCNO= 1
##$TYPE= <nmr>
##$USER= <she>
##$AMP= (0..31)
100 100 100 100 100 100 100 100 100 100 100 100 100 100 100 100 100 100 
100 100 100 100 100 100 100 100 100 100 100 100 100 100 
##$AQSEQ= 0
##$AQ_mod= 1
##$AUNM= <au_zg>
##$AUTOPOS= <>
##$BF1= 200.13
##$BF2= 200.13
##$BF3= 200.13
##$BF4= 200.13
##$BF5= 200.13
##$BF6= 200.13
##$BF7= 200.13
##$BF8= 200.13
##$BYTORDA= 1
##$CFDGTYP= 0
##$CFRGTYP= 5
##$CHEMSTR= <none>
##$CNST= (0..31)
1 1 145 1 1 1 1 1 1 1 1 1 1 1 1 1 1 1 1 1 1 1 1 1 1 1 1 1 1 1 1 1 
##$CPDPRG= <>
##$CPDPRG1= <>
##$CPDPRG2= <>
##$CPDPRG3= <>
##$CPDPRG4= <mlev>
##$CPDPRG5= <mlev>
##$CPDPRG6= <mlev>
##$CPDPRG7= <mlev>
##$CPDPRG8= <mlev>
##$CPDPRGB= <>
##$CPDPRGT= <>
##$D= (0..31)
0 1.2 0 0 0 0 0 0 0 0 0 0.03 0 0 0 0 0 0 0 0 0 0 0 0 0 0 0 0 0 0 0 0 
##$DATE= 1559643800
##$DBL= (0..7)
120 120 120 120 120 120 120 120 
##$DBP= (0..7)
150 150 150 150 150 150 150 150 
##$DBP07= 0
##$DBPNAM0= <>
##$DBPNAM1= <>
##$DBPNAM2= <>
##$DBPNAM3= <>
##$DBPNAM4= <>
##$DBPNAM5= <>
##$DBPNAM6= <>
##$DBPNAM7= <>
##$DBPOAL= (0..7)
0.5 0.5 0.5 0.5 0.5 0.5 0.5 0.5 
##$DBPOFFS= (0..7)
0 0 0 0 0 0 0 0 
##$DE= 6
##$DECBNUC= <off>
##$DECIM= 24
##$DECNUC= <off>
##$DECSTAT= 4
##$DIGMOD= 1
##$DIGTYP= 9
##$DL= (0..7)
0 120 120 120 120 120 120 120 
##$DP= (0..7)
150 150 150 150 150 150 150 150 
##$DP07= 0
##$DPNAME0= <>
##$DPNAME1= <>
##$DPNAME2= <>
##$DPNAME3= <>
##$DPNAME4= <>
##$DPNAME5= <>
##$DPNAME6= <>
##$DPNAME7= <>
##$DPOAL= (0..7)
0.5 0.5 0.5 0.5 0.5 0.5 0.5 0.5 
##$DPOFFS= (0..7)
0 0 0 0 0 0 0 0 
##$DQDMODE= 0
##$DR= 18
##$DS= 0
##$DSLIST= <SSSSSSSSSSSSSSS>
$$ [...]
##$SUBNAM2= <"">
##$SUBNAM3= <"">
##$SUBNAM4= <"">
##$SUBNAM5= <"">
##$SUBNAM6= <"">
##$SUBNAM7= <"">
##$SUBNAM8= <"">
##$SUBNAM9= <"">
##$SW= 24.9336996594482
##$SWIBOX= (0..15)
0 0 2 0 0 0 0 0 0 0 0 0 0 0 0 0 
##$SW_h= 4990.01996007984
##$TD= 16384
##$TD0= 1
##$TE= 0
##$TE2= 300
##$TE3= 300
##$TEG= 300
##$TL= (0..7)
0 120 120 120 120 120 120 120 
##$TP= (0..7)
150 150 150 150 150 150 150 150 
##$TP07= 0
##$TPNAME0= <>
##$TPNAME1= <>
##$TPNAME2= <>
##$TPNAME3= <>
##$TPNAME4= <>
##$TPNAME5= <>
##$TPNAME6= <>
##$TPNAME7= <>
##$TPOAL= (0..7)
0.5 0.5 0.5 0.5 0.5 0.5 0.5 0.5 
##$TPOFFS= (0..7)
0 0 0 0 0 0 0 0 
##$TUNHIN= 0
##$TUNHOUT= 0
##$TUNXOUT= 0
##$USERA1= <user>
##$USERA2= <user>
##$USERA3= <user>
##$USERA4= <user>
##$USERA5= <user>
##$V9= 5
##$VALIST= <valist>
##$VCLIST= <CCCCCCCCCCCCCCC>
##$VD= 0
##$VDLIST= <DDDDDDDDDDDDDDD>
##$VPLIST= <PPPPPPPPPPPPPPP>
##$VTLIST= <TTTTTTTTTTTTTTT>
##$WBST= 1024
##$WBSW= 4
##$XGAIN= (0..3)
0 0 0 0 
##$XL= 0
##$YL= 0
##$YMAX_a= 227773
##$YMIN_a= -260439
##$ZGOPTNS= <>
##$ZL1= 120
##$ZL2= 120
##$ZL3= 120
##$ZL4= 120
##$ABSF1= 10
##$ABSF2= 0
##$ABSG= 5
##$ABSL= 3
##$ALPHA= 0
##$AQORDER= 0
##$ASSFAC= 0
##$ASSFACI= 0
##$ASSFACX= 0
##$ASSWID= 0
##$AUNMP= <proc_1d>
##$AZFE= 0.1
##$AZFW= 0.1
##$BCFW= 1
##$BC_mod= 2
##$BYTORDP= 1
##$COROFFS= 0
##$CY= 11.3945322036743
##$DATMOD= 1
##$DC= 2
##$DFILT= <>
##$DTYPP= 0
##$F1P= 18.9103706918063
##$F2P= -1.10871071338519
##$FCOR= 0.5
##$FTSIZE= 0
##$FT_mod= 4
##$GAMMA= 1
##$GB= 0.15
##$INTBC= 1
##$INTSCL= 1
##$ISEN= 128
##$LB= 0.24
##$LEV0= 0
##$LPBIN= 0
##$MAXI= 10000
##$MC2= 0
##$MEAN= 0
##$ME_mod= 0
##$MI= 1.114404
##$NCOEF= 0
##$NC_proc= 0
##$NLEV= 6
##$NOISF1= 3.799351
##$NOISF2= 2.8
##$NSP= 1
##$NTH_PI= 0
##$NZP= 0
##$OFFSET= 15.70392
##$PC= 1
##$PHC0= -8502.706
##$PHC1= 17.20018
##$PH_mod= 1
##$PKNL= yes
##$PPARMOD= 0
##$PSCAL= 0
##$PSIGN= 0
##$REVERSE= no
##$SF= 200.130013532006
##$SI= 16384
##$SIGF1= 3
##$SIGF2= 2
##$SINO= 400
##$SIOLD= 16384
##$SREGLST= <1H.CDCl3>
##$SSB= 0
##$STSI= 0
##$STSR= 0
##$SW_p= 3612.71676300578
##$SYMM= 0
##$S_DEV= 0
##$TDeff= 0
##$TDoff= 0
##$TI= <>
##$TILT= no
##$TM1= 0
##$TM2= 0
##$TOPLEV= 0
##$USERP1= <user>
##$USERP2= <user>
##$USERP3= <user>
##$USERP4= <user>
##$USERP5= <user>
##$WDW= 1
##$XDIM= 8192
##$YMAX_p= 0
##$YMIN_p= 0
$$ End of Bruker specific parameters
$$ ---------------------------------
##NTUPLES= NMR FID
##VAR_NAME=  TIME,          FID/REAL,        FID/IMAG
##SYMBOL=    X,             R,               I
##VAR_TYPE=  INDEPENDENT,   DEPENDENT,       DEPENDENT
##VAR_FORM=  AFFN,          ASDF,            ASDF
##VAR_DIM=   8192,          8192,            8192
##UNITS=     SECONDS,       ARBITRARY UNITS, ARBITRARY UNITS
##FACTOR=    0.0002004,     1,               1
##FIRST=     0,             0,               0
##LAST=      1.6414764,     0,               0
##MIN=       0,             -260439,         0
##MAX=       1.6414764,     227773,          0
$$ Real data points
##PAGE= N=1
##DATA TABLE= (X++(R..R)), XYDATA
0@%%%%%%%qJ6j6J9k7L2m0M8n6P2q8J00j16J37j57J83k14K46k81L22l67M15m71
$$ 0 0 0 0 0 0 0 0 -8 8 -8 11 -16 16 -24 24 -32 40 -48 52 -64 73 -84 99 -115 131 -150 172 -195 220 -251
30b51N34o00O74p55Q41r39J046j163J292j431J584j756J946k153K384k642K933
$$ -251 283 -317 357 -398 443 -496 550 -613 679 -752 832 -924 1022 -1131 1253 -1389 1544
47A544l263L641m077M585n190N923o834Q002r560J1761j5136K1012l4136J16110
$$ 1544 -1719 1922 -2155 2430 -2760 3163 -3671 4331 -5229 6532 -8604 12408 -21728 94382
61I4382o0898k60500O5469K23509J65811j08621k14417j03124J30126J86353M9865
$$ 94382 33484 -227016 -161547 61962 227773 119152 -95265 -198389 -68263 118090 167955
72A67955j45471j59368j0663J50113J36726j2139j52824j25272L4475J71281J20745
$$ 167955 22484 -136884 -147547 2566 139292 127153 -25671 -150943 -116468 54813 175558
83A75558o8921j95509r6450J18297K03210M8092j65675j89545Q294J95267J54594
$$ 175558 106637 -88872 -185322 -67025 136185 184277 18602 -170943 -162649 32618 187212
94A87212o7405k09167j07170J16949K01160N5348j46365j75227j1891J55196J46926
$$ 187212 119807 -89360 -196530 -79581 121579 176927 30562 -144665 -156556 -1360 145566
105A45566j5692j53577j23785L6297J53570J01593n9311j53065p5410Q5813J50465
$$ 145566 129874 -23703 -147488 -111191 42379 143972 84661 -68404 -143814 -58001 92464
116I2464M4542j12750j42969r247J39850J29984l2535j61507j05685P2841J68865
$$ 92464 137006 24256 -118713 -127960 11890 141874 109339 -52168 -157853 -85012 83853
127H3853P0942j06418j62109l4100J29923J45105k406j42186j17784L8994J46002
$$ 83853 154795 48377 -113732 -147832 -17909 127196 124790 -17396 -135180 -96186 49816
138D9816Q7280o4746j38972n8215Q3450J29135L3501r6993j20994j4261J06464
$$ 49816 137096 72350 -66622 -124837 -41387 87748 121249 24256 -96738 -110999 -4535
149d535J10031p489j16956r6752L2281J25512P6420n9924j26693m5099R0296J20209
$$ -4535 105496 98007 -18949 -115701 -83420 42092 118512 58588 -68105 -113204 -22908 97301
161I7301R114j12963j01657K8393J23777P4964n9490j23423m7843P5714J10648
$$ 97301 106415 -6548 -108205 -79812 43965 118929 59439 -63984 -111827 -36113 74535
172G4535K5044q2380r7608j0315Q4325Q8266j546q7926q0009J6896R7793O9433
$$ 74535 99579 17199 -80409 -90724 -6399 81867 80321 -7605 -87614 -70718 27075 96508
184I6508l9651j06856n1082O5417J08539K3529r0657r8114R184J02894P4329l6981
$$ 96508 56857 -49999 -101081 -35664 72875 96404 5747 -92367 -83183 19711 94040 57059
196E7059r9143m4929N3333Q4843K1924n8461p1049o940O0305O1537l003o4984
$$ 57059 -42084 -87013 -33680 51163 73087 14626 -56423 -63363 -3058 58479 55476 -9508
208i508n9210J0974P4369N8839k4695q6951n2376M6090R6681L5744o7081r1031
$$ -9508 -68718 -57744 16625 75464 50769 -36182 -88558 -42468 54213 89957 22876 -68155
220f8155q021Q1625P2339j8687q1970m7691L6116P1814K4191m6001o0519j0072
$$ -68155 -76176 5449 77788 59101 -22869 -70560 -34444 37370 61561 15560 -44959 -55031
232e5031M6265N1845L976m5529m8348r69N2380N1706o144o0758m7769K2904O9388
$$ -55031 -8766 43079 47055 1526 -46822 -47791 4589 56295 50151 -10607 -58376 -35472 33916
245C3916L5026m3167p0288j4769N7669O0950q922o8092m7440K6923O7434L0858
$$ 33916 68942 25775 -44513 -59282 -1613 59337 50415 -17677 -65117 -38194 29240 60098
257F0098l7676n9631j6989L9990N1876J1424l7486m5097o567L8072M2085J441
$$ 60098 22422 -37209 -54198 -14208 37668 49092 11606 -33491 -40058 -1986 40099 41540
269D1540m2828m0019Q337M7820L2210k2832n3960k2685L6485N4485P699m8192
$$ 41540 -1288 -41307 -32970 14850 47060 24228 -29732 -52417 -15932 38553 46252 -1940
281a940m8691P843N4554L7525k0479n2086k3757K9716M6949J0689l4455l9326
$$ -1940 -50631 -42788 11766 49291 28812 -23274 -47031 -17315 29634 40323 5868 -33458
293c3458m25L6075L1803p093l7598k6802J0492L7339K4932j3177l9195k4953J6960
$$ -33458 -33883 2192 33995 26902 -10696 -37498 -27006 10333 35265 22088 -17107 -42060 -25100
306b5100M3230K2849k3656m5867j5300L4015M4278K141m2675l5876J5306M7571
$$ -25100 18130 40979 17323 -28544 -43844 -9829 34449 36590 -6085 -41961 -26655 20916
318B0916K1318l0676m4199l598L8736L3980r541l8249k1239J5247L0206J2912
$$ 20916 42234 11558 -32641 -36239 2497 36477 26936 -11313 -32552 -17305 12901 25813
330B5813j3317k2450j1041P633K1047J4726o620k6367j8068J4215L6354J5948
$$ 25813 12496 -9954 -20995 -13362 7685 22411 15791 -10576 -28644 -14429 21925 37873
342C7873k8715m2425l098M5267L8888j5396n1915k5011L1118M6366M938l7356
$$ 37873 9158 -33267 -36365 8902 47790 32394 -19521 -44532 -13414 32952 37890 534
354E34l0684R583L1800J2483j6381j9560j513J2125J1079J016n900r016p803M486
$$ 534 -30150 -20567 11233 23716 7335 -12225 -13738 -1613 9466 10482 4582 -4434 -12237 -7751
368g751J8272J3606j0838k9056j2612K3587L3909J936l5960l0629J2233L9670
$$ -7751 10521 24127 13289 -15767 -28379 -4792 29117 31053 -4907 -35536 -23303 16367
380A6367J7822k5600l5994k517L0890K5875q349k8498j4855J2671K2314Q567r611
$$ 16367 34189 8589 -27405 -29922 968 26843 18494 -10004 -24859 -12188 10126 18693 9082
393I082j5965q147N266J3564J0013m093j5185j1087O384J7376O801j2702j7249
$$ 9082 -6883 -15030 -9764 3800 13813 9720 -5465 -16552 -10168 7208 14009 1307 -15942
406a5942k53J9001J4848q636k2590r650J6182K3953M879k0573k2601k40K2654
$$ -15942 -16195 2806 17654 9018 -13572 -23222 -7040 16913 21792 1219 -21382 -21622 1032
419A032J9678l715k1722j5451O311K0084J1325q624j7057o434R064J3910M620
$$ 1032 20710 16995 -4727 -20178 -13867 6217 17542 8918 -8139 -14573 -5509 8401 13021
432A3021r312j2918l817R751J2929K819j0454j3489j826J2802J3243j143j4966
$$ 13021 3709 -9209 -13026 -3275 9654 12473 2019 -11470 -13296 -494 12749 11606 -3360
445c360j0063P197J6060N387j2210j4651J804J7142J1039q651j8833p189J0884
$$ -3360 -13423 -6226 9834 15221 3011 -11640 -9836 7306 18345 9694 -9139 -16328 -5444
458e444J6960M706j1616j5927m664Q995J5161P381p918j5160p932R327J7716O372
$$ -5444 11516 16222 4606 -11321 -15985 -6990 8171 15552 7634 -7526 -15458 -6131 11585 17957
472A7957j2358j6560n53J5282J1893o645j6174n957J0179J2302L80j1552r565
$$ 17957 5599 -10961 -11514 3768 15661 9016 -7158 -13115 -2936 9366 9746 -1806 -11371
485a1371J883R341P296j174p629o830J179R429R283k744j3371r018Q295J8081
$$ -11371 -9488 -147 7149 5975 -1654 -8484 -7305 2124 11407 8663 -4708 -13726 -5431 12650
499A2650N207j6157k0042K04K0877J6852o628k1910j1934R524J8308P116p807
$$ 12650 17857 1700 -18342 -18138 2739 19591 12963 -8947 -20881 -11357 6951 14067 6260
512F260j2601n138N025R303O385k576r717o653M032J2582N073j0733j4327J322
$$ 6260 -6341 -11479 -6454 2849 9234 6658 -3059 -9712 -5680 6902 11975 1242 -13085 -11763
526a1763J7717J1110r984k0121m922J7053J8446k874j9201j2751Q246J7314O794
$$ -11763 5954 17064 7080 -13041 -17963 -910 17536 14662 -4539 -17290 -9044 8270 15064
539A5064r457j3978m229Q359J1942M944p322j3371o757R243J7621O739j2804j9800
$$ 15064 5607 -8371 -12600 -4241 7701 12645 5323 -8048 -14805 -5562 12059 18798 5994 -13806
553a3806l608J7426J8811k093k0116j3869P733J8486N891j2608j4284Q41J4169
$$ -13806 -17414 12 18823 16730 -3386 -17255 -9522 8964 14855 2247 -12037 -11196 2973
566B973R342o270j3630n377Q682J3346M844q859j4286m799J0498J6186M110j3257
$$ 2973 12315 6045 -7585 -12962 -4280 9066 13910 5051 -9235 -14034 -3536 12650 16760 3503
580C503j7554j875J5453J5911k285j8053j3660O287J8680J0180j0198j8602n791
$$ 3503 -14051 -15926 -473 15438 13153 -4900 -18560 -12273 6407 16587 6389 -12213 -18004
593a8004J3653J7919K067j5363j5114J937J5942J2279n721j6134p400R258J3621
$$ -18004 -4351 13568 15635 272 -14842 -12905 3037 15316 9595 -6539 -13939 -4681 8940
606H940J356j1603j0651K426J1859Q564m519j2615p635O172J3947Q647p096j6133
$$ 8940 10296 -1307 -11958 -9532 2327 10891 6372 -6243 -13878 -7706 6241 14888 7792 -8341
620h341r127R723J8927Q192j2916k0841m029J8353J8823l537k1343j2703J1160
$$ -8341 -17468 -7745 11182 19374 6458 -14383 -18412 -59 18764 15227 -6116 -18819 -7659
633g659K0077M441j5615j5283K547J5224R098n448j1634n179N035Q361M211k269
$$ -7659 12418 16859 1244 -14039 -11492 3732 12830 7382 -4252 -9431 -4396 3965 8176 5907
647E907o930o167J291R917Q403m847j5127o689J2789J7814k6k0452j5640Q527
$$ 5907 -1023 -7190 -5899 4018 12421 7574 -7553 -14242 -1453 16361 16335 -4117 -19757 -11230
661a1230K2864R864j4893k1515k907J6845J5983k701j5846r036N342J1891M635
$$ -11230 11634 21498 6605 -14910 -17817 -972 15011 12310 -3536 -12572 -7230 4661 9296
674I296n009p281l707L301P351M663m284j0041m538P169J2149K266j1548j2572
$$ 9296 4287 -2994 -6701 -3400 3951 8614 4330 -5711 -10249 -3080 9069 11335 -213 -12785
688a2785J308J4102J0196o172j4817o420J0262J3730J497j2057j1032K369J3126
$$ -12785 -11477 2625 12821 6649 -8168 -14588 -4326 9404 10901 -1156 -12188 -9819 3307
701C307R161m670j3300q324O949J4456N901r185j4144l158J0230J0672L61r777
$$ 3307 12468 7798 -5502 -13826 -6877 7579 13480 4295 -9849 -13007 -2777 7895 8256 -1521
715a521q047J619Q733O207l257p488l591M130P354L187m171q172l011O142J0430
$$ -1521 -9568 -7949 784 6991 3734 -3754 -7345 -3215 4139 7326 3155 -5017 -8028 -1886 8544
730H544J912r769j1417R45J3302Q959n926j4557m450J0592J2169l55j1980r068
$$ 8544 10456 687 -10730 -9785 3517 12476 6550 -8007 -12457 -1865 10304 9949 -2031 -11099
744a1099N273J1806N023o758r327k542N602P263K630l233o939m652K497Q486N276
$$ -11099 -5826 5980 11003 4245 -5082 -7624 -2022 5241 7871 4638 -2301 -6953 -4456 4030 9306
759I306m936r339l188P844Q571r95r621o197N322R829K428q488q828J329R243
$$ 9306 4370 -4969 -8157 -313 8258 7263 -2358 -8555 -3233 6596 9024 536 -8292 -6963 2280
774B280O665l318q485m534L437P532M201l501p893l596N188Q295J477p079q468
$$ 2280 8945 5627 -2858 -7392 -3955 3577 7778 4277 -3616 -7212 -2024 6271 7748 669 -7799
789g799N41Q633O702k930q724n490L318Q388M318l827p062k588L422N075L035
$$ -7799 -7258 1375 8077 5147 -3577 -9067 -5749 2639 6957 3130 -3932 -6520 -3098 1977 5012
804E012k308n165k502L715N860M9o466n366L794Q078K466p732q707J228R804O478
$$ 5012 2704 -2461 -4963 -1248 4612 4661 -1805 -7171 -3377 4701 7167 -565 -9272 -8044 1760 8238
820H238m201r058l559N626P249J384m430m445p80K508L921K195j441n890l528
$$ 8238 4037 -5021 -8580 -2954 4295 5679 1249 -3196 -3976 -1468 2453 4648 3207 -2683 -6211
835f211L048Q020K496o848p907l18Q734O781k993q335l430N299O509m27n695k727
$$ -6211 -3163 4857 7353 505 -7402 -7720 1014 7795 4802 -3533 -6963 -1664 4845 4418 -1277 -4004
851d004L676M143j78m608k319J084L419K394J14k739m415j780L782O997J783o009
$$ -4004 -328 3815 3637 -971 -3290 -2206 1213 3607 3721 982 -3433 -5213 -1431 5566 7349 1340
867A340p883m25P571P272k006q267m167L728O595J587m451m451K10L552K851m23
$$ 1340 -6543 -6968 603 7875 5869 -2398 -6565 -2837 3758 5345 894 -3557 -3347 205 3056 2633
883B633k506k435j08K971K636q47l297j990J521L415K23k991k992J272M515J740
$$ 2633 127 -2308 -2416 555 3191 2344 -953 -2943 -1422 1993 2216 -775 -3767 -2495 2020 3760
899C760l390m668o03M152N047P00m344n013j147M378N221J933l922o323k073M806
$$ 3760 370 -4298 -4901 -749 4298 4998 654 -4359 -5506 -1128 4093 6026 2104 -4219 -6292 -1486
915a486N919M19n433m223J676M330J351k946k441J238L253M17k597j730J525K497
$$ -1486 4433 4852 -581 -4804 -3128 1202 2553 -393 -2834 -1596 1657 2074 -523 -2253 -728 1769
931A769l01q53m14J28q79m03J681K395j140m123k459M182N659o76o963m794L751
$$ 1769 1468 615 201 329 -550 -953 728 3123 1983 -2140 -4599 -417 5242 4566 -2397 -7191 -3440
948c440P693K766n512o456J58N294L934j226l297j010Q69L77o66R42J798k96k639
$$ -3440 4253 7019 1507 -4949 -4791 503 4437 3211 -86 -1096 -227 150 -516 426 2224 1928 -711
965g11j609J320K123j28j778j60K109P64k524k847J214M354K455l186m582j345
$$ -711 -2320 -1000 1123 995 -783 -943 1166 1930 -594 -3441 -2227 2127 4582 1396 -3186 -4531
981d531M406L746l29l637l066Q68K857K180n23k305k177j3K616K479q56k385j816
$$ -4531 -125 3621 3292 -345 -3411 -2543 314 2494 1971 -334 -2511 -2524 92 2571 1715 -670 -2486
998b486M34J850J081j46o58p46q44Q5P85J654N02j296j705O60J219R0j545L8K545
$$ -2486 -2052 -202 879 733 75 -671 -1515 -1430 -645 1009 1511 215 -1490 -830 389 479 -1066 -1028 1517
1017A517J215k758l758pM728L674j775n654k052L479M453j26l417j659J688J582
$$ 1517 2732 -26 -3784 -3791 937 4611 2836 -2818 -4870 -1391 3062 2936 -481 -2140 -452 1130
1033A130n53j286J175J657j157k617r1L223K262k745m073L3M135K659k706l796
$$ 1130 577 -709 466 2123 966 -1651 -1742 1481 3743 998 -3075 -3042 1093 3752 1046 -2750
1049b750M24L428J467k879k115K342L026j32l196k390K045L191Q55k237j915k74
$$ -2750 -2326 1102 2569 -310 -2425 -83 2943 2811 -385 -2775 -730 2461 3316 1079 -836 -1110
1065a110K13Q53R15Q31k82k238j691M12K682K400j197k889j273J692K057M13j477
$$ -1110 -897 -44 871 1702 1420 -818 -2509 -2097 585 2985 1788 -1101 -2374 -682 1375 1788 311
1082C11j462K98R60J063k20j382j154N66J564P43r85j679k17J659J482j122k131
$$ 311 -1151 -853 107 1170 950 -432 -1586 -1020 544 1287 302 -1377 -1594 65 1547 425 -1706
1099a706j90K647J295j688k354j55K245J545n43j723k34j88P0O5J675J422j346
$$ -1706 -1896 751 2046 358 -1996 -2151 94 1639 1096 -627 -861 -1049 -979 -914 761 2183 837
1116H37l269j260L479L614m12m306k094J643L757L23l392j998K155K929n78k840
$$ 837 -2432 -3692 -213 3401 2989 -1317 -3411 -1768 1989 2312 -1080 -3078 -923 2006 1428 -1412
1132a412q70J619K077j28j657l79J070M69r43l8J115L42j509j500J574K134Kl405
$$ -1412 -2282 -663 1414 1286 -371 -750 320 789 -154 -192 923 1265 -244 -1744 -170 1964 1966 -1439
1150a439k014K302L597L04l263k846J543L406J767j826k261o85J150J220J94k77
$$ -1439 -3453 -1151 2446 2750 -513 -3359 -1816 1590 3357 1531 -730 -1415 -265 955 1149 872
1166H72k98j066r49J320J290j13j373r85R41J427J75k320n16R83K080L93j980
$$ 872 574 -492 -1441 -121 1169 1056 -317 -1302 -361 1066 1241 -1079 -1595 -612 1468 1861 -119
1183a19j182L45J779P17r24j452mL23J375J22m10j492r35Q71K643O58k118k749
$$ -119 -1301 -956 823 1540 616 -836 -840 -517 858 980 570 -922 -1857 -986 1657 2315 197 -2552
1201b552j1K713K369p91k493j346J068J466O90o76n74j55k93j00Q34R62p52j406
$$ -2552 -2563 150 2519 1728 -765 -2111 -1043 423 1113 437 -137 -292 -585 -685 149 1111 359 -1047
1219a047J17J510J117j681k657Q50L291J061k419l114N05L643J459k210k956K59
$$ -1047 -930 580 1697 16 -2641 -1791 1500 2561 142 -2972 -2467 1176 2635 425 -2531 -2272
1235b272K940J233q40j859j41Q34M99n25N51J135j289k303o19L308K656j121l496
$$ -2272 668 1901 1061 -798 -939 -105 394 -131 420 1555 266 -2037 -2656 652 3308 2187 -1309
1252a309k104K229L582k00k944j624J668K552o16k670j97K459J653r43k721o06
$$ -1309 -3413 -1184 2398 2198 -746 -2370 -702 1850 1234 -1436 -1633 826 2479 1536 -1185 -1791
1268a791J659J045K18q15n21r5p16J78J467O72o10k256p99J931K581m5k598j690
$$ -1791 -132 913 1131 316 -205 -300 -1016 -838 629 1301 691 -1565 -2364 -433 2148 2103 -495 -2185
1286b185O13K434J262q76j590j353O09J701J147o81j714j102O59J717J37j030
$$ -2185 -1572 862 2124 1248 -342 -1695 -1086 615 1762 1081 -633 -1735 -1076 641 778 -252
1302b52m96P12J028p15j528j24J398K011n77k025j470R54J670O70l06m33n87j116
$$ -252 -748 -36 992 277 -1251 -1375 23 2034 1457 -568 -2038 -1084 586 1256 950 517 -70 -1186
1320a186n74J191K605Q3k543k811J072M070J682k707l400j18L462K048j811k615
$$ -1186 -1760 -569 2036 2119 -424 -3235 -2163 1907 3589 882 -2518 -2636 826 2874 1063 -1552
1336a552j03K274J143j683j277R26J684l71j891m10R90J414n24o30K54L97q45
$$ -1552 -1655 619 1762 79 -1198 -272 1412 1041 -850 -1260 -270 1144 620 -10 244 641 -204
1353b04j008N00K211N85j867k935j47L139K923p29l540j989J306L122J000j277
$$ -204 -1212 -712 1499 2084 217 -2718 -2865 274 3197 2468 -1072 -3061 -1755 1367 2367 1090
1369A090j504q12Q67O92Q53k58j160m22O14K54J57j283J21N81O05j02j131m00
$$ 1090 -414 -1226 -359 333 1186 928 -232 -654 -40 214 371 -912 -791 -210 395 293 -838 -1238
1387a238P87J628J60j564j126P66J086O08l11l38r51j180L26K360J456j201l445
$$ -1238 -451 1177 1337 -227 -1353 -587 499 1107 796 458 -493 -1673 -1347 1013 2469 1268 -2177
1404b177j523K860L371N33l384k731J175L094P39j617j370M14J350l32j684K1
$$ -2177 -3700 -840 2531 3064 -320 -3051 -1876 1218 1957 340 -1030 -616 734 402 -1282 -1261
1420a261J567J121j105j470k4J138Q8m27n5J102J00j722p37J154K739L37l180
$$ -1261 306 1427 322 -1148 -1172 -34 54 -373 -428 674 774 -948 -1685 -531 2208 2545 -635
1437f35k328J121L305J813k357l019m31K795J591q97j321j03K40O8O57N5J64n26
$$ -635 -2963 -1842 1463 3276 919 -2100 -2531 264 1855 958 -363 -466 -226 -158 499 554 718 192
1455A92r47L24O93O79q51k70j01P38K15j393n30J395J579o67j605p83L90J916
$$ 192 -755 -431 262 941 90 -180 -281 457 672 -721 -1251 144 1723 1056 -549 -1332 -942 974
1473I74J129r45j212j215K07J477J277M0j855j293n00K078J445n30j704j036Q39
$$ 974 2103 1158 -54 -1269 -1062 415 1692 1732 -123 -1416 -1916 162 1607 1077 -627 -1663 -824
1490h24J583K44q94q94O52N39No42m2P25o46j17J27K65l94k47k50J482J89j315
$$ -824 759 1003 109 -785 -133 406 411 -231 -273 452 -194 -311 -184 81 -313 -560 -810 672 861 -454
1510d54j767J049K214J216j633k578k18K418J807p96j813o77M86J211j50m41P0
$$ -454 -2221 -1172 1042 2258 625 -1953 -2171 247 2054 1258 -555 -1232 -746 465 315 -126 -56
1527e6R6q14k99P18J511j99j936p84J622J548m65j693m16J491J044o68k007m43
$$ -56 40 -774 -1073 -355 1156 957 -979 -1763 -141 1407 942 -751 -1167 324 1368 700 -1307 -1750
1545a750K151J641j321k302J53J550J100n93j202j41M65K05j2J86M63q8j389n82
$$ -1750 401 2042 721 -1581 -1428 122 1222 629 -573 -714 -249 -44 -56 130 593 505 -884 -1466
1563a466J425J546j90k049r77J012K107j3j411j353J145J026k07o71l71M43K97
$$ -1466 -41 1505 1315 -734 -1711 -699 1408 1395 -16 -1369 -224 802 595 -76 -447 -4 293
1580B93Q7k06m61R6K11K34J51k4q42k62N28Q57M6p22o76l1J121K96l23p77o1M41
$$ 293 380 174 -287 -191 20 254 405 381 -461 -723 -195 662 708 -14 -690 -721 400 696 373 -404 -465 -24
1602b4K7K72J05q2p73n72P52J275K3q30j570K75J747N44r98j465N07J491L27j136
$$ -24 3 275 380 298 -475 -1047 -295 980 1003 173 -1397 -1122 625 1169 171 -1294 -787 704 1031 -105
1622a05j212R23J368M35j850p58J068J220j69j870J76Q17M0n65M6P91Q03j112
$$ -105 -1317 -394 974 1409 -441 -1199 -131 1089 920 -950 -774 43 83 -482 -436 355 1158 46
1640D6j447M69J766R74j174j728l48J758J539j039j576n30O86J572m52q92n2K35
$$ 46 -1401 -932 834 1808 634 -1094 -1442 316 1855 816 -760 -1290 -604 968 516 -376 -428 -193
1658a93J17J73l06M36R9J16o74m25O78K12k28oJ21P4o77j57L33R13J03n99n71
$$ -193 -76 97 -209 227 326 442 -232 -657 21 233 5 -1 120 194 -483 -640 -307 606 709 110 -461
1679d61l45O17N55Q3j56l21n59Q7J158P63r45j357o07J127J671l05j457o01P77
$$ -461 -806 -189 366 449 293 -28 -587 -500 658 1421 476 -881 -1488 -361 1310 1005 -452 -1053 -276
1698b76J005k29j172K9J440o1r12m70J41J339M34j567l62N98N58J07j050N87M39
$$ -276 729 500 -672 -643 797 736 -176 -646 -505 834 1268 -299 -661 -63 495 602 -448 139 578
1717E78k99q69p89J324J381K37j940j462J113K110J84j110j914N00J252M45o74
$$ 578 279 -590 -1379 -55 1326 1563 -377 -1839 -726 1384 1568 458 -1456 -956 296 741 67
1734F7m58R2N94m12p09O60R92l9q67n70N36Q30k41l01l38J30jj19m20O26O41J8
$$ 67 -391 -299 295 -117 -826 -166 826 787 -80 -650 -114 716 475 174 -164 -34 -35 -154 -574 52 693 711
1756G11j097q20Q10O38N58l88n93j64P4PJ138K63r51n82o01R64R92j22r62m97
$$ 711 -386 -1206 -396 242 800 412 -181 -345 -271 -264 874 1137 186 -396 -997 -33 959 837 -125 -622
1776f22K70K47K16k61K13K31j48p08k34Q78P32l41o88p41N41N30J89o78L83L47
$$ -622 -352 -105 111 -150 63 294 146 -562 -796 82 814 473 -215 -956 -415 115 304 -374 9 356
1796C56o52p06L64J085R54o85j602m35J172J447l52j159m58L00O52k5k37J74Q
$$ 356 -296 -1002 -638 447 1401 716 -886 -1321 -149 1298 946 -213 -671 -371 281 256 19 193 201
1815B01n47p58L17J277M26p55p91N7L07O59k0m21J75M02o18q54L52J264M20j084
$$ 201 -346 -1104 -787 490 916 161 -630 -573 -266 393 373 -48 127 529 -89 -943 -591 673 1093 9
1835Iq32l44J140O48l65l39L5J06l81l6K35J210m42q09r02N76J514rj145j009
$$ 9 -823 -1167 -27 621 256 -83 -48 58 -323 -359 -124 1086 644 -165 -1067 -491 1023 1014 -131 -1140
1855a140N53Q70J18k90q3O8l0n83l84J113N32m37m72l24K53M22J01m3n6K9j94
$$ -1140 -587 283 401 111 28 96 66 -517 -901 212 744 307 -165 -489 -236 186 287 244 188 217 23
1876B3n66M95L43M44m71o48j78O66M89k38j42m18j57L96J16J02L43m87n69k23
$$ 23 -543 -48 295 739 268 -380 -558 108 597 359 217 -201 -358 38 154 256 599 112 -457 -680
1896f80O45P14O8p24o65J77Q25q5l53l1M23j58n33l32Q09R91o02r71j52L67P52
$$ -680 -35 679 747 23 -642 -465 360 275 -78 -109 314 156 -377 -709 100 1091 489 -482 -634 -267 485
1917D85k52o70J97O99n75o46K9J067Q32r27j162j84J278Q57k10j155n29O15P07
$$ 485 233 -437 -240 459 -116 -762 -733 334 1166 239 -923 -1107 171 1028 818 -337 -866 -251 456
1936D56k1p88M34M15l23o32j44P23Q14m27r82k33P44N61l61o81J4N34K05n98J62
$$ 456 435 -353 81 496 173 -459 -603 120 934 507 -475 -708 36 597 236 -445 -431 103 308 -290 -128
1957a28L33J95J41j057l07M96P29K17m88n21n8L30M06l0m3j38p94N3Q29K29j30
$$ -128 205 400 541 -516 -823 -327 402 619 131 -390 -448 -118 288 258 215 77 -717 -664 165 394 264
1978B64m56k75N12K19J39p19M37J38k71k71k1O15K99m47o33K25O43j91k70l10
$$ 264 -192 -467 45 264 403 -316 121 259 -12 -283 -304 311 610 163 -470 -245 398 207 -63 -373
1998c73P49K64o53n74N7R37N29r14r48K82R52N89n97j158L18J044m2m89n10O06
$$ -373 376 640 -13 -587 -530 407 936 22 -926 -644 308 897 300 -858 -540 504 462 -27 -537 69
2018F9O19n14p15O1Q18O59j027r93N65J113J10q49o62N08R83m41o00m5L65N41
$$ 69 688 174 -541 -480 338 997 -30 -1023 -458 655 765 -84 -746 -238 745 304 -296 -341 24 565
2038E65n32n26L76K15M79l84n72p6L47M79o6j1l67k51R7J07P2L56k70n14K74l1
$$ 565 33 -493 -117 98 577 193 -379 -455 -108 371 305 294 -73 -324 -227 -120 -48 308 38 -476 -202 -233
2060b33L48R9m6k47m0p3K24j33J34k80j12K79J73N6k82Q3n8P04k71j30n07L53
$$ -233 115 214 168 -79 -119 -192 32 -101 33 -247 -359 -80 93 149 -133 -50 -108 596 325 195 -312 41
2082D1O10l95n18m12P81M93m97m09J18J13K42j38m5O2Q5j2m17k34J084L04o29
$$ 41 651 256 -262 -674 107 600 103 -306 -188 -75 167 29 -16 46 131 119 -298 -532 552 856 227
2103B27r56K83Q43K23l25p61k8L70J80j38RM53j44j50k10j75N63Q1R3p84J46N04
$$ 227 -729 -446 397 620 295 -466 -494 -124 56 -82 -73 380 236 86 -124 -299 264 345 438 -346 -200 304
2125C04k22k24k00N64K08p61j80M74P15K99j252m34M55O21L36l24p74K37O27n6
$$ 304 82 -142 -342 222 430 -331 -511 -37 678 977 -275 -709 -254 367 703 379 -395 -158 469 413
2145D13p96N45j78L53q02j99P57R43n15r32l59J004M61o78n01L46L86K76n22o44
$$ 413 -383 162 -16 337 -465 -664 93 1036 521 -411 -770 234 695 17 -484 -138 248 524 2 -642
2165f42M73J116o01p05l10J06Q78K85o77l59L50p4K50p1K51J52m13n45L0O78M04
$$ -642 -169 947 346 -359 -669 -563 315 600 -77 -436 -86 -160 90 19 270 422 9 -536 -506 172 576
2186E76k97n42l65L09Q08j95n56J7K50r7L7N4M7L13l74K15l21J31R2j74M23m30
$$ 576 279 -263 -628 -319 489 294 -262 -245 5 -92 -55 -1 46 359 -15 200 -121 10 102 -72 351 -79
2208g9j06k80N25K08K88m73n85L2L46N85k2k15m71k78K46K30L43k06J73m28l06
$$ -79 -185 -465 60 268 556 83 -502 -470 -124 461 439 224 -247 -525 -279 -49 294 88 261 -167 -473
2229d73N38J85J2m74j66L41Q7K83m22j33N21m09j27j18L89L95J2j59m40k45K63
$$ -473 65 250 262 -212 -378 -37 50 333 -89 -222 299 -110 -237 -355 34 429 441 282 -158 -403 -140
2250a40L07Q8j35q5L3m95J52O72K21p04l26j91O27M28N6o86j87N40pj26m27L52
$$ -140 167 255 120 35 68 -427 -275 397 618 -86 -412 -603 24 452 508 -178 -365 175 168 42 -385 -33
2272c3M89m04n57k0P52N68o58k66l3L68n2j91k28M26M39m86j049M63J128N28r10
$$ -33 456 52 -505 -525 227 795 137 -129 -162 206 154 -37 -265 161 600 114 -935 -472 656 1184 274
2293B74j184J19J052N36m31r95p2R86K64o90l05L69J189r49j198K62J273L82p51
$$ 274 -910 -791 261 797 366 -629 -701 285 549 -141 -446 -77 1112 163 -1035 -773 500 882 131
2312A31j021J97J109K96r85n75M03J101j83q36l04R90P40n60j040n8O24R68q22
$$ 131 -890 -693 416 712 -273 -848 -445 656 473 -363 -667 323 1063 503 -537 -595 29 997 175
2331A75o68j30M21P98m85n76P58o8j30m48l23Q68M36j24q89j68N24O28l81n43
$$ 175 -493 -623 -202 596 111 -465 293 225 95 -353 -676 192 628 504 -385 -553 -29 599 218 -325
2351c25l33Q75L88m10l86K6K13L60n38l89M07L55J95k11n17j62N19L80j91l74
$$ -325 -658 217 605 195 -191 -165 48 408 -130 -519 -112 243 438 227 -290 -452 67 447 256 -118
2371a18j57L02J23n68L87L34k00j06m96K4O47L42k96n75l8L14O75K8p41k39L00
$$ -118 -275 27 150 -418 -31 303 103 -3 -499 -475 172 514 218 -357 -395 -81 594 622 -119 -358 -58
2392e8M63k25n38R6O00No54m1M33N05k88n18j35J91N88k25m37m3O10rn88l06Q11
$$ -58 405 180 -358 -262 338 343 -311 -352 81 586 298 -220 -355 -164 424 199 -238 -281 329 320 -268 -574 237
2415B37M16j76p25o04O85J031j30j183l36R19J88L41r48n0O95K06q00n55O90P61
$$ 237 653 477 -248 -852 -167 864 734 -449 -785 134 322 663 -285 -335 360 566 -234 -789 -99 662
2435F62m2j017m77Q02P87o91m85l5R12K16p97n02J61J260J61j069r21P07J050
$$ 662 620 -397 -874 -72 715 24 -461 -496 416 632 -165 -667 -506 754 915 -154 -1075 -368 682
2454F82M2j039k93Q53K82j88q39l01R44O31o16n85K30Q47J97j325k21N33Q34L2
$$ 682 724 -315 -608 245 527 339 -500 -801 143 774 158 -427 -197 650 847 -478 -699 -166 668 700
2474G00r48m40Q04R05p17n91m06O18P67q69m80R6N41P18r45k15L71M26%l13k42
$$ 700 -248 -688 116 1021 304 -287 -693 -75 692 -177 -657 -561 -20 698 -247 -462 -91 335 335 22 -220
2495b20j82P06j27m19J07M20K39n21n30K24L89L18k61n30j47M67N21l40k33m56
$$ -220 -402 304 177 -242 -135 285 524 3 -527 -303 86 404 143 -387 -534 -67 454 114 -119 -575
2515e75R77o4j45l69j20N92Jn55k47L40M15k69j88j65K41M72k09m41P1M56J54
$$ -575 402 338 193 -176 -296 296 297 -258 -505 -165 250 -19 -207 -372 -131 341 132 -309 -238 218 372
2536C72r42L91j00P20k05m92m34J02R43J15m98m51K62N16O3k46n44N50J14j52
$$ 372 -570 -179 -279 441 236 -256 -690 -588 355 470 -28 -479 -217 299 362 116 -428 122 236 84
2556H4m65l6R43M4m89n37J35J025j69q79l54N71Q01m31q98Q1J000J63l21j129
$$ 84 -381 -417 526 570 81 -456 -321 704 535 -344 -698 -127 674 243 -655 -574 426 589 268 -861
2576h61M63R10L20j001n26L88N79N02o38o20J74Q87j61q29j32Q17M30o40j220
$$ -861 -398 512 832 -169 -695 -307 272 774 136 -484 -310 577 416 -413 -545 272 702 62 -1158
2595a158P25J080L48j080o66M11P90N16j169p75Q76Q25j15j159l64J099R41q86
$$ -1158 -433 647 995 -85 -751 -340 450 966 -203 -978 -102 723 608 -551 -915 184 1125 239
2613B39j041L10Q93N56p94p27L72O83K1r78l29R01M34k3j248J17O76Q75m84j131
$$ 239 -802 -492 401 957 163 -564 -192 491 512 -466 -795 106 540 517 -731 -614 62 937 453 -678
2633f78j3Q72J013m53j469K94O18M76m26q52M71Q83j07n85o28L29J133p04m35
$$ -678 -691 181 1194 741 -728 -434 184 660 234 -618 -147 736 629 44 -584 -255 878 174 -261
2652b61l52L70O25j0p98J56P40O9q36k76K94J160k50m18j219O50M85L35m89p58
$$ -261 -613 -243 382 372 -426 -270 470 539 -297 -573 -279 881 631 213 -1006 -356 129 464 -25 -783
2672g83N88M78qn62j24K68N34k27k69m45O70M51n54m90l57R65K16j15q70M13P29
$$ -783 -195 283 275 -287 -411 -143 391 164 -105 -550 120 571 17 -473 -830 135 351 236 -634 -221 508
2693E08l13p14O5O07N69l4j069j84P01O04n15o90J93M83L43j64p05j45K90Q62
$$ 508 195 -519 -454 153 722 688 -381 -565 136 740 225 -465 -272 211 554 390 -315 -460 -170 692
2713F92o19l97L20O87l11p44k01O74P92o54q52j35Q57M86m52r02M62R96p8n54
$$ 692 73 -324 -4 683 372 -372 -573 101 893 239 -613 -748 109 595 143 -759 -297 699 621 67
2733F7r07N98J017q6p28p43P98O67k14r93k03R95L62n84n57J04R20M4o30n54M95
$$ 67 -840 -242 775 689 -39 -782 16 683 469 -524 -727 268 630 46 -511 -407 513 557 -73 -627 -132
2754a32J064l96j223k05P46Q01j79p08m01R65N79m60j024M4J027J53p08q25M82
$$ -132 932 536 -687 -892 -146 655 476 -232 -633 332 911 451 -573 -529 498 651 -57 -882 -400
2773d00Q05pp95j41L61N47l32o39K17P65n2M6r55L23N77M66n99q85L70O02K56
$$ -400 405 398 -397 -538 -177 370 38 -601 -384 381 329 375 -580 -257 320 786 187 -698 -328 274 530
2794E30o33k75j2Q60k43m11l46K41M39j4q51M4J011J75j04j027L17M69K48j57
$$ 530 -103 -378 -390 470 227 -184 -530 -289 150 136 -715 -671 340 515 411 -616 -299 170 418 261
2814B61n15j34L42K62k21l93M96M97l64m53k54O15K91J23r31j16N14M36j03l49
$$ 261 -254 -388 -46 216 -5 -398 98 595 231 -222 -476 139 430 553 -378 -494 20 456 353 4
2834Dn16P47K64m00m99K69L48L98o43k36J22O94l40l91n32L39R37o46k53J9N63
$$ 4 -512 235 499 99 -400 -131 217 615 -28 -264 -142 552 212 -179 -711 -372 565 -81 -334 -315 248
2855B48K05l09p85Q5J006R9k70q56L86M95K2o04J37JM78r5l54j99L49R7k20k38
$$ 248 453 144 -641 -556 450 549 279 -577 -191 304 326 -278 -141 -140 338 243 -111 -310 39 136 -84 -322
2877c22L20M65N6n85n76L71P35N6p88m19N83Q20n64l52l39P63Q62j053o56j15
$$ -322 -2 463 519 -66 -642 -271 464 520 -268 -687 -104 716 152 -200 -539 224 1086 33 -623 -738
2897g38R01N07o47p50L34P47j11m60l55P92K95l04o14J6N30M92l63o25k22R15
$$ -738 163 670 23 -727 -393 354 243 -217 -572 220 515 211 -403 -387 143 635 272 -353 -575 340
2917C40K10n74n04L89N42j01m22l87M35O13L6p77l36L08M55j14l79k7K47L61j98
$$ 340 550 -24 -528 -139 403 302 -120 -507 -72 541 577 -200 -536 -228 227 113 -266 -293 -46 315 117
2938A17m53k76O79K45m00m85M98M94l18m41m23P98L59K43o42k66L37M63j74n20
$$ 117 -336 -612 67 312 -88 -573 -75 419 101 -340 -763 35 394 637 -5 -271 66 529 355 -165
2958a65j51N79J14k01l78J5K61K92m07m00K82K90o4n5l39L48L20r1m00k30O17
$$ -165 -316 263 377 176 -202 -187 74 366 -41 -441 -159 131 67 12 -327 21 341 250 -150 -380 237
2979B37J63j87l94m22P32K76l18o17M55P12K0n28k33j78L90L13n88o9p7O34r3
$$ 237 400 213 -181 -603 129 405 87 -530 -75 637 657 129 -104 -282 108 421 -167 -236 -313 321 228
3000B28k60PK22M08k19n21k56N31J89l4j59n19N74L35m91k62J0L52L53l81n65
$$ 228 -32 -25 197 605 386 -135 -391 140 329 295 136 -383 191 526 35 -227 -217 135 488 107 -458
3021d58L64P10l78l85k19N47L34o67m37K77M21K22l09l62L88J85J05o33J0K43
$$ -458 -94 616 238 -147 -366 181 515 -152 -589 -312 109 331 22 -340 48 233 338 -295 -285 -42
3041d2M82l79l90O8K51L98l76n64M24M68J49p82J00p1J84M54p60J83J57L49m01
$$ -42 440 61 -329 -261 -10 388 12 -552 -128 340 489 -293 -193 -264 -80 374 -386 -203 -46 303 -98
3062i8l58M01K27J70k09m97K56J63K89j48n55L44L95n4m41j37j31P50j73p06N7
$$ -98 -456 -55 172 342 133 -364 -108 55 344 196 -359 -15 380 326 -115 -252 -383 367 194 -512 -455
3083d55M76m4p0J9l3K89J12k22k59l04N32L13k19n17L54q0K2k15j08N97k34Q6
$$ -455 21 -23 -93 -74 -107 182 294 72 -187 -491 41 354 135 -382 -28 -108 -86 -301 -409 188 -46 40
3105D0j24j70L46J99m88o0L4J52L21k05o9j66O90j54l42K4j04J42M1k57r8J39
$$ 40 -84 -254 92 291 -197 -257 -223 -71 250 45 -24 -190 500 346 4 28 -76 66 107 -150 -248 -109
3127a09J75K90m39R2N2O3J80k76j84k2N79k81l11J12L00M7k68p9J21J14n37K03
$$ -109 66 356 -83 9 61 124 304 28 -156 -178 401 120 -191 -79 221 268 0 -79 42 156 -381 -178
3149a78J29k33M14J34k36k71P7L78J82l98j2rM6j00j93J5L83M0O3l86P4J00K4
$$ -178 -49 -282 132 266 30 -241 -164 214 396 -2 -14 -23 23 -77 -270 -255 128 168 231 -155 -81 19 43
3172D3l19L08J76J96l75k66L17J66m1j20m90K04N10r1l30j61N68j93K83o59LJ55
$$ 43 -276 32 208 404 29 -237 80 246 205 85 -405 -201 309 218 -112 -273 295 102 385 -274 -271 -116
3194a16M03k11m79L46J57QJ02m03K73K76l04O4m28K04O1K46l61j39K18mk01K45
$$ -116 287 76 -403 -57 100 108 210 -193 80 356 52 116 -312 -108 -47 199 -162 -301 -83 -87 -288 -43
3216d3R7L1M7o4l39O8K71J43k41k79K11L35m7n37J30K45Q6O7n67Q6L04K50l24
$$ -43 54 85 132 68 -271 -203 68 211 -30 -309 -98 237 190 -347 -217 28 114 181 -386 -300 4 254 -70
3239g0l45K07M50J3l18M7K39l1kl06J20J84o7K03j08k16q9J55J24l23L17Jj5m1
$$ -70 -415 -208 242 255 -63 -16 223 192 190 -116 4 188 121 324 216 0 -89 66 190 -133 184 185 170 129
3263A29m00n0K15K16J07k78Q1m3r5%M1J2J89k25J45k98K32Q0J13k11R4L12j57
$$ 129 -271 -321 -106 110 217 -61 20 -23 -118 -118 -77 -65 124 -101 44 -254 -22 58 171 -40 54 366 209
3286B09j38k50P8j17K51n8j7L5Ln1m5P8m1J48R5j35k0m00M36j92J08l44N31N16
$$ 209 71 -179 -101 -218 33 -25 -42 -7 -4 -55 -100 -22 -63 85 180 45 25 -375 61 -131 -23 -367 164 680
3310F80o54m02L54K06l49J74j2l59M27J85l19R2K84j99k58m2K77p0j56K83k07
$$ 680 26 -376 -22 184 -165 9 -3 -362 65 250 -69 23 307 108 -150 -192 85 15 -141 142 -65
3331f5m3L2J1k45J64J22J62j25k4J6L0N0n4q6j9J01M4k20K52l51M11P3j46m42
$$ -65 -108 -76 -65 -310 -146 -24 138 13 -11 5 35 85 31 -55 -74 27 71 -149 103 -248 163 236 90 -352
3355c52N62K07m1l57l46K84J48j6l96K75K03mJ03k55O5O4p2k23J63l04J87J14
$$ -352 210 417 376 19 -327 -43 105 89 -307 -32 171 167 270 15 80 144 72 -151 12 -292 -105 9
3377Ij73j6M31l84K14L06j01j65J0k13j75M33j20L44l42n3k71O5O61m69j90J39
$$ 9 -164 -180 251 -133 81 387 286 121 131 -82 -257 176 56 400 58 5 -266 -201 460 -9 -199 -60
3399f0K07l09K80j13l2j1P0Pl19M81l07L0L71k39l08L39m7m8K64j21k72L85o6
$$ -60 147 -162 118 5 -27 -38 32 39 -280 201 -106 -76 295 56 -252 87 40 -8 256 135 -137 248 182
3422A82l86M8J77k8K04l51k7J4l1K30J14k33N7J56o1j77M17m05M6M9m7j99K22
$$ 182 -204 -156 21 -7 197 -154 -181 -167 -198 32 146 -87 -30 126 65 -112 305 -100 -54 -5 -52 -251 -29
3445b9J98n4Qn7RJ23k19K9q3j21J69r3L13k91j85M1O4L50j57j90j62K92J67l59
$$ -29 169 115 123 66 75 198 -21 8 -75 -196 -27 -120 193 -98 -283 -242 -178 172 15 -175 -337 -45 122 -237
3469b37Q7N0J55k04K0J15N0n2N1n11j17O43K39o18L06o5K2J43k18o6M65k79R4
$$ -237 -150 -100 55 -149 -129 -14 36 -16 35 -476 -593 50 289 -329 -23 -88 -66 77 -141 -207 258 -21 73
3492G3J66j67j30R2K66l24q7L85m43J70j57J20L58l98p3K72J48q0m51K58J10K29
$$ 73 239 72 -58 34 300 -24 -111 274 -169 1 -156 -36 322 -76 -149 123 271 191 -260 -2 108 337
3514C37l19J36j74j5L96m62Q7KQ8k8L65m53j46K31j49J30J45L9k53j06K22l6j59
$$ 337 18 154 -20 -35 361 -101 -14 -12 76 48 413 -40 -186 45 -104 26 171 210 -43 -149 73 37 -122
3537a22mN1J51j07oJ78M6l6j67J34o0k54K0j35L97pl24R8j12J52K34k34j02R6
$$ -122 -126 -75 76 -31 -37 141 187 151 -16 118 58 -196 -176 -311 86 79 -245 -147 -259 -107 127 -107 -209 -113
3561a13K51n8J34j84q8J4oN6J62L4k13q3N7N2j18K10n9jm26M86k38J33K0k62M38
$$ -113 138 80 214 30 -58 -44 -50 6 168 202 -11 -94 -37 15 -103 107 48 47 -379 107 -131 2 22 -240 198
3586A98l56J98n1J96l74K21n7N1j16K54l20K3K46j34k01J13K87k71J17j60K74
$$ 198 -158 40 -11 185 -189 32 -25 26 -90 164 -156 -133 113 -21 -222 -109 178 -93 24 -136 138
3607A38k5Qp1K26k13j30k0N7Q2Q8j04O4k53K25nM61l45k00M3J2j14J61J25l20
$$ 138 113 121 50 276 63 -67 -87 -30 52 140 36 100 -153 72 67 528 183 -17 26 38 -76 85 210 -110
3631a10N5N1j04J13J51K46n02j38K87j10N1p8J12J53j69q0q1K98k91K66k3M5j56
$$ -110 -55 -4 -108 5 156 402 -100 -238 49 -61 -10 -88 24 177 8 -72 -153 145 -146 120 97 142 -14
3654a4l4k43M71l46o0k9J69K02N7l36N8L77k37j02j47L52k6k63RK05m4J25j51
$$ -14 -48 -291 180 -166 -226 -255 -86 116 173 -163 -105 272 35 -67 -214 138 112 -151 -142 63 19 144 -7
3677gm0J0l8PJ14NK43Qn60N59l06O3J12J24l19m3q1L61l2k32J42l17R3K78j46
$$ -7 -47 -37 -75 -68 46 51 294 302 -258 301 -5 58 170 294 -25 -68 -149 212 180 -52 90 -227 -134 144 -2
3702bj1M4r1m8J74J67j97n6j46o1M47n30J3K65J42J56k87l8Q9m6k22J9L65l87
$$ -2 -13 31 -60 -108 66 233 36 -20 -166 -227 220 -310 -297 -32 110 266 -21 -59 30 -16 -238 -219 146 -241
3726b41L12oK8J5k74J12J1K7M37l38oj42l1K36J4l00M8K20L55l59O0j78k25K29
$$ -241 71 65 93 108 -166 -54 -43 -16 421 83 77 -65 -96 140 154 -146 -98 122 477 118 178 0 -225 4
3750DL22j53q2J45k11p9Nj2j17K59k84N69l27J04l40J55j64K14j25N21m35K27
$$ 4 326 173 91 236 25 -54 -49 -61 -178 81 -203 366 39 143 -197 -42 -206 8 -117 404 -31 196
3772A96m50K94j16k52K99L0O8J08k49PK93l53j7J01K39l32J92k07J32J6r8J54
$$ 196 -254 40 -76 -328 -29 1 69 177 -72 -65 228 -125 -142 -41 198 -134 58 -149 -17 -1 -99 55
3794E5l29P1L59l66P7N4J9K6J22l06J37k10M13l20K00k78m2L09o3J60k05J54k4
$$ 55 -274 -203 156 -210 -133 -79 -60 -34 88 -218 -81 -291 122 -198 2 -276 -318 -9 -72 88 -117 37 13
3817A3j70J66N3k19J91k38J93M5q9L32j60l26J15L01k18k5j7j15K61j09n4k3J50
$$ 13 -157 9 62 -157 34 -204 -11 34 -55 277 117 -209 -94 207 -11 -36 -53 -168 93 -16 -70 -93 57
3840E7J03r0q7P6j85L21k38P0j58L0K21l50M20m79L69l8K5n2Q4j07k83N11n3j03
$$ 57 160 70 -17 59 -126 195 -43 27 -131 -101 120 -230 190 -289 80 42 67 15 99 -8 -291 220 167 64
3864F4j0j23k0J7J69r8k29N05k54p3L92k85q4l06M10j7j43J73J06k41J79l15M7
$$ 64 54 -69 -89 -72 97 -1 -230 275 21 -52 340 55 -29 -335 75 58 -85 88 194 -47 132 -183 -136
3887a36K51k21K93m03L39k17J83m6k92K74J20Mn03O5K49j29p8J59L17K81p38K54
$$ -136 115 -106 187 -216 123 -94 89 43 -249 25 145 149 -354 -289 -40 -169 -247 -88 229 510 -228 26
3909B6K20j12l38L6L0Q3J84j67r7l5lj08K13K71l23J30J58k77j2J50l34M73j17
$$ 26 246 134 -204 -168 -138 -55 129 -38 -135 -170 -173 -281 -68 203 -120 10 168 -109 -121 29 -305 168 51
3932E1R2J90n85L42q4q1j7L22j12J02j60k48R9N5n1K09k12J29jk23L67m2j14j33
$$ 51 143 333 -252 90 6 -75 -92 230 118 220 60 -188 -89 -34 -85 124 -88 41 40 -183 184 142 28 -105
3956a05J92k51P5k36L35P0l24M5J5L75j5m7J59k1k99j62P4J5K2Q6m4J43m7K5j2
$$ -105 87 -164 -89 -325 10 80 -244 -199 -184 191 176 129 288 267 -32 -194 -120 -105 -83 3 -41 102 55 80 68
3981F8k80K65J80l31l2K62l8O6n1j62J26l73K67K36k53J57o1l96L93k9J25km91
$$ 68 -212 53 233 -98 -130 132 94 160 109 -53 73 -300 -33 203 -50 107 46 -350 43 14 139 137 -354
4004c54L73N2J15k16j73J51K4q8J10Q2j29L43l66j34N4O4R1K67l37J83j72L9n7
$$ -354 19 71 186 -30 -203 -52 -28 -116 -6 76 -53 290 -76 -210 -156 -92 -1 266 -71 112 -60 -21 -78
4027g8N9K73n24K93j88L93k68q0M1n4k97N46k30K4k85O65j29j53p4j81L80l5k0
$$ -78 -19 254 -270 23 -165 228 -40 -120 -79 -133 -430 116 -114 -90 -375 290 161 8 -66 -247 133 98 78
4050G8J35l09K31m5P6p3n5K01m39M40k20J98k63j02M25k07j03K99m29J47K26j07
$$ 78 213 -96 135 90 166 93 38 239 -200 240 20 218 -45 -147 278 71 -32 267 -162 -15 211 104
4072A04q3K59j94p5J39k01j14J82l8N3l44O31o93K22K55k16K02k74K51k09K29
$$ 104 21 280 86 11 150 -51 -165 17 -21 32 -312 319 -374 -152 103 -113 89 -185 66 -143 86
4093H6k5L4j00j02L3K81l00r0j88J66J44k71M28J24q2L2j99J36j59J90J53q3l05
$$ 86 61 95 -5 -107 -74 207 -93 -183 -371 -205 -61 -332 96 220 138 170 -29 107 -52 138 291 208 -97
4116i7j08K74k8j2M84n02OK4j38M31k74m8j38J72QnQ4O2k16K45k77k62J71M27
$$ -97 -205 69 41 29 513 11 17 41 -97 334 60 12 -126 46 54 49 133 195 -21 224 -53 -315 -144 283
4140B83l5l09j58NM56l02m3M8k8j54L19J1R5j81j15K9j11J99l2N0l28L57O0j17
$$ 283 248 -61 -219 -214 242 -60 -103 -55 -83 -237 82 93 188 7 -108 -79 -190 9 -23 27 -301 56 116 -1
4164aN0M1R2l67K46n14L82k77M33Rl42L31K0p9J03k6O5l36L41j86J53l33L01j05
$$ -1 49 90 182 -185 61 -453 -71 -348 85 94 -248 83 103 24 127 101 166 -170 171 -15 138 -195 106 1
4188Am2K51j92J04j40Q4J7N2P8k43kO6J43k96K47l9k07K48k00J59J50l54j07L53
$$ 1 -41 210 18 122 -18 66 83 135 213 -30 -32 34 177 -119 128 89 -118 130 -70 89 239 -115 -222 131
4212A31K92n21l2R6M7J81l6j96J17k10j24J79j0K50j52o4J48j78K3J63j47Mj25
$$ 131 423 -98 -130 -34 13 194 158 -38 79 -131 -255 -76 -86 164 12 -52 96 -82 -59 104 -43 -39 -164
4235a64L17l20K87j06P6k03p1p5M18N8m75K45K37k31LL31l19k70O64n32j26L21
$$ -164 153 -167 120 14 90 -113 -184 -259 159 217 -258 -13 224 -7 -4 327 8 -262 402 -130 -256 65
4257F5O1m23K36j34K24l6o4J32j57J51j03k63N95k33j05q7J33j27J60%j28j13
$$ 65 126 -297 -61 -195 29 -7 -71 61 -96 55 -48 -311 284 51 -54 -141 -8 -135 25 25 -103 -216
4279b16K15o9J38j65q1J64n6l31N40k73j21K85j9L7J24k81J89k19K77j36J85J33
$$ -216 -1 -70 68 -97 -178 -14 -70 -401 139 -134 -255 30 11 48 172 -109 80 -139 138 2 187 320
4301C20n37M13k53k8O9j21K27j30L27n7k97J23O6O8j80p9k2l19J06M29n1R0m07
$$ 320 -217 196 -57 -85 -16 -137 90 -40 287 230 -67 56 122 190 10 -69 -91 -410 -304 125 74 164 -243
4324b43J20k24K71K6J35r4q3K36l16J16K26o2j65J70k97K37M26n36j46O85m83
$$ -243 -123 -347 -76 -50 85 -9 -92 144 -172 -56 170 108 -57 113 -184 53 479 -57 -203 482 -1
4345ak9j47K65J8j43l0P7p0J29j28r3K54l94M08MP0J12l22M3L54l63k51K83J08
$$ -1 -30 -177 88 106 -37 -67 10 -60 69 -59 -152 102 -292 116 120 190 302 -20 23 377 14 -237 46 154
4369A54N8k00J12j04M3o2m5m9J22r2N3K01r0R0m56K40j46R0J28o4N5k9j73L80
$$ 154 212 12 124 20 63 1 -44 -93 29 -63 -10 191 101 191 -265 -25 -171 -81 47 -17 38 9 -164 216
4393B16l10k56K69J29j86P2j41L46j61j89J39m0N7N3k3j79O3L49o2l35L77j89
$$ 216 -94 -350 -81 48 -138 -66 -207 139 -22 -211 -72 -112 -55 -2 -25 -204 -141 208 146 -189 188 -1
4415aK68l93n4L07n0k88K28P3n9j45M66k54Ol34J11M85j59n8j99p6J20M7L25j67
$$ -1 267 -126 -180 127 77 -211 17 90 31 -114 352 98 104 -230 -119 366 207 149 -50 -126 -6 41 366 199
4439A99m03K19j17%NK3J67K26j79j50%K4P5KK64j78o4j06p8Q9M40o02J49j00k40
$$ 199 -204 15 -102 -102 -97 -74 93 319 140 -10 -10 14 89 91 355 177 113 7 -71 18 458 -144 5 -95 -335
4464c35N98k26L6J8p7J64k16R2o1k07R5l22K36J58L75j46k62R7J09o3k24L27K7
$$ -335 263 37 73 91 14 178 -38 54 -7 -214 -119 -441 -205 -47 328 182 -80 17 126 63 -161 166 193
4487A93l64J43j72J35R5J0M1p7k02L50j35K19k99J07l15L6M04q2M28m73n3N3J71
$$ 193 -171 -28 -200 -65 30 40 81 4 -198 152 17 236 -63 44 -271 -235 169 87 515 42 -11 42 213
4510B13l16K94K6k50j42K47O2q3mJ6M1m5m5l7pK39k64j9p6M23n5K3l86l7K19l49
$$ 213 -103 191 217 -33 -175 72 134 51 47 63 104 59 14 -23 -30 209 -55 -74 -150 273 218 241 -145 -182 37 -312
4536c12K91M3J28M7k51k48L89m5j46Q3j44j36J82J10J34r5m9Rj5k21K75J28j42
$$ -312 -21 22 150 197 -54 -302 87 42 -104 -21 -165 -301 -119 -9 125 30 -19 -10 -25 -246 29 157 15
4559A5j49j44K77j92M39k46k8q8Q4L6J41Jk33K10j33j11r9K73R0k31o7K05k26
$$ 15 -134 -278 -1 -193 246 0 -28 -116 -32 4 145 146 -87 123 -10 -121 -220 53 143 -88 -155 50 -176
4582a76J10R0k70L97j39N4l47M95j71p7J32q1o6J45J18l71J60J18j45J84o7r9
$$ -176 -66 24 -246 151 12 66 -281 214 43 -34 98 17 -49 96 214 -157 3 121 -24 160 93 -6
4604fqk30L04k31J59O9q9j20N93m98J9j22j50K01N13n94j19L74m3J52l1j28K41
$$ -6 -14 -244 60 -171 -12 57 -32 -152 441 -57 -38 -160 -310 -109 404 -190 -309 65 22 174 143 15 256
4627B56K07k67Q9m73J55R3p0J4Q9K08l29J54n5l97K25O9o0L26l51L48q6j24J88
$$ 256 463 196 285 -188 -33 60 -10 4 93 301 -28 126 71 -326 -101 -32 -92 234 -117 231 145 21 209
4650B09J27m16n5k38K61K48j36J51q2m55M72L9j66j68L56o8k1J6j69jK82l59j89
$$ 209 336 -80 -135 -373 -112 136 0 151 69 -386 86 125 -41 -209 147 79 58 74 -95 -96 186 -173 -362
4673c62N62k55J36M4J5l37K14n7J03k3o4l07K57K36J24J03m11J22k53K70J18k98
$$ -362 200 -55 81 125 140 -197 17 -40 63 40 -24 -331 -74 162 286 389 -22 100 -153 117 235 -63
4695f3J21l0L06n31L66k87Q7L4j50j41K10J95R9L0n58L14J03k51oL07k27Q5k16
$$ -63 58 28 334 -197 169 -118 -31 3 -147 -288 -78 117 216 246 -312 2 105 -146 -152 155 -72 13 -203
4718b03J86q0J09n1K24L1m34J66j6M3K6O1Kp7M19n28J77J13j75r8L18j75n7j71
$$ -203 -17 -97 12 -39 185 216 -218 -52 -68 -25 1 62 64 -13 406 -122 55 168 -7 -105 213 38 -19 -190
4742a90J80J40k9l10J61L87K8l40J56R9m11j05J55M6M64o30J52J33q3j24J60k17
$$ -190 -10 130 101 -209 -48 339 367 27 183 282 -129 -234 -79 -33 431 -199 -47 86 3 -121 39 -178
4764a78K85M4j67J05k32q1J91J73k53l0j16J29K43k12mL73l33K02j23o5q0K07
$$ -178 107 151 -16 89 -143 -224 -33 140 -113 -143 -259 -130 113 -99 -103 270 -63 139 16 -49 -129 78
4786G8L00m50N0j11K83k8j13R7p6J77nk46j62L10O1Rl61L92j59M05l26Qj59J1
$$ 78 378 -72 -22 -133 150 122 9 106 30 207 202 -44 -206 104 165 174 -187 205 46 451 125 133 -26 -15
4810a5J55n7J12m16o5L08Q9k72J07J32N7m88N29n6Jk80k37K10N38l49K0J3P2k04
$$ -15 140 83 195 -221 -286 22 111 -161 -54 78 135 -353 176 120 121 -159 -396 -186 352 3 23 36 108 -96
4834i6k0J35J00j6k41K10k43J13j07K4K4J78j23j39N1J7N7M78m54J24j56j45J84
$$ -96 -116 19 119 103 -138 72 -171 -58 -165 -141 -117 61 -62 -201 -150 -133 -76 402 -52 72 -84 -229 -45
4857d5K34k26k30M84m93J86LJ83l50L00N6k72M20j52M3l58L59k67o6M3K53k09
$$ -45 189 -37 -267 217 -276 -90 -87 96 -254 46 102 -170 250 98 141 -217 142 -125 -191 -148 105 -104
4879a04N18m87K82K8j77l4J43j11k05j9J62n4J89r4k32J14M40m58J67J14k80K41
$$ -104 414 -73 209 237 60 26 169 58 -147 -166 -4 -58 131 37 -195 -81 359 -99 68 182 -98 143
4901A43k21J34k50L12j18J53k08qL53k72K57k46j36J07k8l8J51P9m00k1J71M79
$$ 143 -78 56 -194 118 0 153 -55 -63 290 18 275 29 -107 0 -28 -66 85 164 -236 -257 -86 393
4923C93n36K44j1k60J28k3L83j63r8p7j31k20N79K3k90j17L77l15J58J63j74k90
$$ 393 -143 101 90 -170 -42 -65 318 155 57 -20 -151 -371 208 231 -59 -176 201 -114 44 207 33 -257
4945b57j57L49J29K42l13J99m40K39J56l41J41J11j88J19k8k18Q5M05j03j61o7
$$ -257 -414 -65 64 306 -7 192 -248 -9 147 -194 -53 58 -130 -11 -39 -257 -172 233 130 -31 -98
4966i8J11j9J59j14j76p7K18j49L55k36r7J30O2j47L83l06P1j6K49m12J61k53
$$ -98 13 -6 153 39 -137 -214 4 -145 210 -26 -123 7 69 -78 305 -1 70 54 303 -109 52 -201
4988b01K14m4j27Q8j63L32l2j2L8Oj90r9L17pk85J54M18n70L09j95M8J35j42j0
$$ -201 13 -31 -158 -70 -233 99 67 55 93 99 -91 -190 127 120 -165 -11 407 -163 146 -49 -1 134 -8 -18
5012a8j25K54Lo0j7j32q5M0J66j42J76j35j9K12k78K83n7j88K66m93j56N80J31
$$ -18 -143 111 114 54 37 -95 -180 -140 26 -116 60 -75 -94 118 -160 123 66 -122 144 -349 -505 75 206
5035B06k71J12k54J90M4O5j88J75j38N1J66l28L77o0q2j22J6O6L0j29L84k88K43
$$ 206 -65 47 -207 -17 27 92 -96 79 -59 -8 158 -170 207 147 65 -57 -41 25 55 -74 310 22 265
5058B65k91J3j75L26j48M09k07J14m79J63P7j54pP5K43k06r1J17q7M9j36%M7J29
$$ 265 -26 -13 -188 138 -10 399 192 306 -173 -10 67 -87 -94 -19 224 18 -73 44 -43 6 -130 -130 -83 46
5082D6k7j05M97n29j20K64L57p32J06M58n58L24K39j43k22L24l40K23j41K85r6
$$ 46 19 -86 411 -118 -238 26 383 -349 -243 215 -343 -19 220 77 -145 179 -161 62 -79 206 110
5103A10l5K1l05M62j19p0k58M50o14L06J55N8J5j06k03J36J42k1K0k86J62l6K90
$$ 110 75 96 -209 253 134 64 -194 256 -358 -52 103 161 176 70 -133 3 145 124 144 -142 20 -16 274
5126B74m05O5L55j81J3k61n2J10J76l37j35K41l6K29k39J8M1J36n5rK28k24J04
$$ 274 -131 -66 289 108 121 -140 -192 -82 94 -243 -378 -137 -173 56 -183 -165 -124 12 -43 -52 176 -48 56
5149E6J79l00O5k10l1J2K20m45K89N3J17j44J32J27k58J54p2J72J12j00q2j33
$$ 56 235 -65 0 -210 -241 -229 -9 -454 -165 -112 5 -139 -7 120 -138 16 -56 116 228 128 46 -87
5171h7kK01j02R0l73K84K6j99M9j61QK71N3k30Q2J91qj30J72K00m67J9J16j96
$$ -87 -89 112 10 100 -273 11 37 -162 -113 -274 -266 5 58 -172 -90 101 93 -37 135 335 -132 -113 3 -193
5195a93J07J96j53p5K57k15j84Q7NJ95N8j45j11M47k87K43ll62K04j37K05k12
$$ -193 -86 110 -43 -118 139 -76 -260 -173 -168 27 85 -60 -171 276 -11 232 229 -133 71 -66 139 -73
5217g3lr1J32K8N8l81K50L40l82J39j9Q1k40K18J28j53l02M35k64J80m22M03j51
$$ -73 -76 -167 -35 -7 51 -330 -80 260 -122 17 -2 79 -161 57 185 32 -270 165 -99 81 -341 62 -89
5240h9K94m74NM30j76K12l35J47j62J83L98l52K20k70J1j92L00l05q1J9K98j37
$$ -89 205 -269 -264 166 -10 202 -133 14 -148 35 433 81 301 31 42 -150 150 -155 -236 -217 81 -56
5262e6n4R3K30r3j45j67K45P7k20J18j63L78o92L29K27j12j87J0P9J6J19L14m65
$$ -56 -110 -17 213 120 -25 -192 53 130 -90 28 -135 243 -449 -120 107 -5 -192 -182 -103 -87 32 346 -119
5285a19J25N3k35L70k49J73j46j41l6J0K41j62M1K6j44K38J5J45pr5JO0k5m86
$$ -119 6 59 -176 194 -55 118 -28 -169 -205 -195 46 -116 -75 -49 -193 45 60 205 198 103 104 164 139 -347
5309c47N45j83L0P4K8l95L91n9j20l28L62K47j27k26K62m9m53L54l2P6J08M7n34
$$ -347 198 15 45 119 147 -248 143 84 -36 -364 -2 245 118 -108 154 105 -348 6 -26 50 158 205 -329
5332c29J90p7K67M0M75p60n9K70j86J57J72k89k67J06J51lN79n09n5k83J45J66
$$ -329 -139 -216 51 91 566 -194 -253 17 -169 -12 160 -129 -396 -290 -139 -142 437 -72 -127 -410 -265 -99
5354i9L1K61j76j58K71j68L14l60PM09k73m07J06N83k98m5J99J3l46K45J78l40
$$ -99 -68 193 17 -141 130 -38 276 -84 -77 332 59 -348 -242 341 43 -2 197 210 -136 109 287 -53
5376e3J10J4k04M09j82l8j98K08j28l27M62J53p7k52J75j04J03l61N17j17p6k71
$$ -53 57 71 -133 276 94 56 -142 66 -62 -389 73 226 149 -103 72 -32 71 -290 227 110 34 -237
5398b37K76R0j17K31m55K06p9J76k55L69p7k35K9O9k88L10K05n1J8k94pK09p9
$$ -237 39 129 12 243 -212 -6 -85 91 -164 205 128 -107 -78 -9 -297 13 218 167 185 -109 -116 93 14
5421A4j62J47Oj62L46j98K56j92P2k32J69j61O1Q7J29o07M16l7J58K78m03k77
$$ 14 -148 -1 5 -157 189 -9 247 55 127 -105 64 -97 -36 51 180 -427 -11 -48 110 388 -15 -292
5443b92M02q4l2J38l51J27Q9J56m89M16J08m17K87J33j58M6j54J61J32k92LL24
$$ -292 110 26 -6 132 -219 -92 -3 153 -336 80 188 -229 58 191 33 79 -75 86 218 -74 -71 253
5465B53l82J76J1J53k13P2m58M21k59P3J8J04n9M81l66J26P7j64Q2l67L49j30
$$ 253 -129 47 58 211 -2 70 -388 33 -226 -153 -135 -31 -90 391 25 151 228 64 146 -221 128 -2
5487bN2j66K59k09K62j74N5J66l04j10L85n32K73R9R2m1l12O5L87n4J74l90j98
$$ -2 50 -116 143 -66 196 22 77 243 -61 -171 214 -318 -45 54 146 105 -207 -142 245 191 365 -25 -223
5510b23L55J37k25k67L54L6J6j00N1j39m3L0K27l46r1L94l70j07N24n05K73K3
$$ -223 132 269 44 -223 131 167 183 83 134 -5 -48 -18 209 -137 -228 166 -204 -311 213 -292 -19 4
5532Dq3K01k38J33O7r7k33J96n4K69j75n1K43j17j91o1L56J58k82O5O6n9K31m90
$$ 4 -79 122 -116 17 84 -13 -246 -50 -104 165 -10 -61 182 65 -126 -187 169 327 45 110 176 117 348 -142
5556a42J40q6K41P3m1j36k17L12j04L17j57l11J85Lk62J71K61m10K01j7j25K04
$$ -142 -2 -88 153 226 185 49 -168 144 40 357 200 -111 74 77 -185 -14 247 -163 38 21 -104 100
5578A00P3k41o7J09m0K0L6K56l46j51N38n55L13J03p0j57J43j73J77J12k69J83
$$ 100 173 -68 -135 -26 -66 -46 -10 246 -100 -251 287 -268 45 148 78 -79 64 -109 68 180 -89 94
5600I4J84j4j87j36p1J83r0j88R1J05j4M2K35k36k20K09l6J59r2J61k62K59m1
$$ 94 278 264 77 -59 -130 53 -37 -225 -134 -29 -43 -1 234 -2 -222 -13 -49 110 18 179 -83 176 135
5623A35N1j78j82J20k5M1K06O9j41J18l05J32P3q5n2k4qK57l83L02J31n38P6K53
$$ 135 186 8 -174 -54 -79 -38 168 237 96 214 -91 41 114 29 -23 -47 -55 202 -181 121 252 -286 -210 43
5647D3m5J0J0l01K36l6L1o8Q0r2J25K44Nm23J88J94k63K19p6p8R5J9J99j49j51
$$ 43 -2 8 18 -283 -47 -83 -52 -120 -40 -132 -7 237 242 -181 7 201 -62 157 81 3 98 117 316 167 16
5672A6O0j50j10J76o7J80M7l46K33J22k05o1J07K24j69L8K2j27o2qK77j55m27
$$ 16 76 -74 -184 -8 -75 105 152 -194 39 161 -44 -105 2 226 57 95 117 -10 -72 -80 197 42 -385
5695c85j68N20j80L37r9m5K7J22J9j10m65M52pl10L05L5K35l89j69M02j19j43
$$ -385 -553 -33 -213 124 25 -20 7 129 148 38 -427 25 18 -292 13 48 283 -106 -275 127 8 -135
5717a35k3L63m07J27R6k0j89J57Q5kK45n12K61k31L81k10k08M35k7j14j20K5%
$$ -135 -158 205 -202 -75 21 1 -188 -31 54 52 297 -215 46 -185 196 -14 -222 213 186 72 -48 -23 -23
5740b3K03k11J78l4l03J80R0L60m48J52l68K32m3J55j09j92L94m61l6P34o58j7
$$ -23 180 -31 147 113 -190 -10 80 440 -8 144 -224 8 -35 120 11 -181 213 -248 -284 450 -208 -225
5762b25N34n75K33Q7N8k7j18J37j93M0Q3J23j29j63k32L83j19L16o2j19k98K53
$$ -225 309 -266 -33 54 112 85 -33 104 -89 -49 34 157 28 -135 -367 16 -103 213 151 32 -266 -13
5784a3j31J8Q0L14m7m86J12J67m8k27K12J65M6l51L11l3J30J01k48j33J27l14
$$ -13 -144 -126 -46 268 221 -265 -153 14 -34 -261 -49 116 162 -189 122 89 219 320 72 -61 66 -248
5806b48M20k44j10j99L48O5Q6R5J6k71M8l31J12M75m12O6j65M6N32m88j21M31
$$ -248 172 -72 -182 -381 -33 32 118 213 229 -42 6 -325 -213 262 -150 -84 -249 -203 329 -159 -280 151
5828A51k41L58l37K10J10l39J29k4M2P1k74j13J61k87L68m6r9L91q5j84N5k12
$$ 151 -90 268 -69 141 251 -88 41 17 59 130 -144 -257 -96 -383 -15 -61 -160 231 146 -38 17 -195
5850a95R2J94k00L25p2l56K39n0M05j76m26K99J29j55j78J80j11k1n2k45O29l94
$$ -195 -103 91 -109 216 144 -212 27 -23 382 206 -220 79 208 53 -125 55 -56 -77 -129 -374 255 -139
5872a39K62k26M8j21K51J28j4k56l09N86m39K62o9L33k65k7k5j18K24J49j59J
$$ -139 123 -103 -55 -176 75 203 189 -67 -376 210 -229 33 -36 297 32 5 -20 -138 86 235 76 77
5894G7J65k36Nj1j78R7K7K84k96J52K03j19j98N9k46J79j89ML29j63K04k53J22
$$ 77 242 6 11 0 -178 -81 -54 230 -66 86 289 170 -28 31 -215 -36 -225 -221 108 -55 149 -104 18
5917A8J27Q9m76M31r6m13M47J25j98L0q0M9N5j14R8K3M4L20o61J45l1O7m10L53
$$ 18 145 234 -242 189 93 -320 127 252 54 84 4 53 108 -6 92 115 159 479 -182 -37 -68 -1 -411 -58
5941e8J93j63J5K63l40J22J8k24K65k1j17M8p4K2M39n60N2L00K49m86L1K66l44
$$ -58 135 -28 -13 250 -90 32 50 -174 91 70 -47 1 -73 -51 388 -172 -120 180 429 -57 -26 240 -104
5964a04K12nJ04l68N5J60k22J75m8N2L99l21j20J2o5k39L95j47J50j5N0k92K08
$$ -104 108 103 207 -161 -106 54 -168 7 -41 11 410 89 -31 -19 -84 -323 72 -75 75 60 110 -182 26
5987B6n9k4L44o03L05J03j90j90M53j6m6J95j16j33J47j12k27J5J82O4m15M03
$$ 26 -33 -57 287 -316 -11 92 -98 -288 165 149 103 298 182 49 196 84 -143 -128 54 118 -297 106
6009A06K10m61K61j95K37k96j94L03J68k11J4J48l2k4N7k69J34j84K41N65p65
$$ 106 316 -145 116 -79 158 -138 -332 -29 139 -72 -58 90 58 34 91 -178 -44 -228 13 578 -187
6030a87J57lk82N59o1j99K84k42Lj74K58m2k17M11k07k68j73K82J11P9K69l83
$$ -187 -30 -33 -315 244 183 -16 268 26 29 -145 113 71 -146 265 58 -210 -383 -101 10 89 358 -25
6052b5k17L09k35P1K98j8m74L94l04L02l4Rj12M5j77R5o0K31j73K43j89Nl4n2
$$ -25 -242 67 -168 -97 201 183 -291 103 -201 101 67 76 -36 9 -168 -73 -133 98 -75 168 -21 -16 -50 -102
6076a02o7J99K9K80k19k52P1J38R6k18R3k29P6K05o7J72k06j6Q8Q3k58j7J51J48
$$ -102 -169 30 59 339 120 -132 -61 77 173 -45 48 -181 -105 100 33 205 -1 -17 71 154 -104 -121 30 178
6100A78j35j29J98l95J46M94o8k80n9k21P2J36K06jJ8o6j04J19n7j01J44l13N41
$$ 178 43 -86 112 -283 -137 357 289 9 -50 -271 -199 -63 143 142 160 94 -10 109 52 -49 95 -218 323
6123C23k83J85j75J34k50K06M0k18N8R6r6J30j77J5j3k17M74l17J61J51m35J2
$$ 323 40 225 50 184 -66 140 180 -38 20 116 20 150 -27 -12 -25 -242 232 -85 76 227 -208 -196
6145a96J69K4j06R8P4l08M38j28j14j6j49K6N14l4l62K1M8J24k24j48K49J51m9
$$ -196 -27 -3 -109 -11 63 -245 193 65 -49 -65 -214 -188 326 292 -70 -49 -1 123 -101 -249 0 151 102
6168A02Q0K3l81L15J21k64k30K22l02L07j20q8K92j22p6l4K62j28pn0l19N33j23
$$ 102 182 205 -176 139 260 -4 -234 -12 -314 -7 -127 -215 77 -45 -121 -155 107 -21 -28 -78 -397 136 13
6191A3KR1k30J4M9J75r9j07K79j94M2L3l21L81k15K58j12n2n5J64j63O5k8J46
$$ 13 15 106 -124 -110 -61 114 15 -92 187 -7 35 68 -253 128 -87 171 59 7 -48 116 -47 18 -10 136
6215A36o4J32k65K92j91j77L71k04M5p0J8l8Jk09K25P6O4j79J80P4j54q8J49N2
$$ 136 72 204 -61 231 40 -137 234 30 75 5 23 -15 -14 -223 2 78 142 -37 143 217 63 -25 124 176
6239A76n22N40j57m9J30j29j0k3l3lK2l5J50J30m72M06N9j93N4R0K3m76J46J67
$$ 176 -346 194 37 -12 118 -11 -21 -44 -77 -80 -58 -93 57 187 -285 121 180 -13 41 131 154 -322 -176 -9
6263ik9P9J8K29l19J19M22k48j71o6J04j42j82J92L7K40k21m4qJ47R5m64J69o4
$$ -9 -38 41 59 288 -31 88 510 262 91 25 129 -13 -195 -3 34 274 53 9 1 148 243 -221 -52 -116
6287a16L73l00K2j1M7J17l16PK39J23Q7m33L1J53o2L83j77l57K59k56jJ04K7O9
$$ -116 257 -43 -21 -32 15 132 -184 -177 62 185 272 -161 -130 23 -39 344 167 -190 69 -187 -188 -84 -57 12
6311A2L9j72j2L38qJ95m00K68l61J9K35m74L06j6k17K62j33K13j99J41J57k7j78
$$ 12 51 -121 -133 205 197 392 -8 260 -101 -82 153 -321 -15 -31 -248 14 -119 94 -105 36 193 166 -12
6334a2k60L75K0J39m54L13m6j83j3K42j0l39J66M6N0P0Nk82K43O2l05M10m88J61
$$ -12 -272 103 123 262 -192 121 75 -108 -121 121 111 -228 -62 -16 34 104 109 -173 70 132 -173 237 -251 -90
6358i0oJ82k7K4K55k91J88k93m4j7K04K22j29k30k78n3L80N0L17l26l78M32J13
$$ -90 -96 86 59 83 338 47 235 -58 -102 -119 85 307 178 -52 -330 -383 -3 47 364 38 -340 92 205
6381B05l86K66j76K96k11O6l18N15m69M83j56k31n9L38nk57J1l3j2J79r3Kj02
$$ 205 -181 85 -91 205 -6 60 -258 257 -212 271 115 -116 -175 163 158 -99 -88 -121 -133 46 -47 -45 -147
6404a47L9K41j52j29J45K75j26k65O4L99m35J83k6j13J11M6L5j65J74j43j35p6
$$ -147 -108 133 -19 -148 -3 272 146 -119 -55 344 -91 92 66 -47 64 110 145 -20 154 11 -124 -200
6426b00K18r4J29J46j49J7o5J75n29N56l8j36J08M3J23m25J37j57j5K38j22m05
$$ -200 18 -76 53 199 50 67 2 177 -352 204 166 30 138 181 304 -121 16 -141 -156 82 -40 -445
6448d45O62l01L1Jl9P7JK03j67k7J79j86K18l30K25k59K70m90K48R0N6n4J4j1
$$ -445 217 -84 -53 -52 -91 -14 -13 190 23 -4 175 -11 207 -123 102 -157 113 -377 -129 -39 17 -37 -23 -34
6472c4n3M31k89L06n69o3R4L91k81J48J8k36m8J92r0P3k06L80k7k13J72R9m77
$$ -34 -87 344 55 361 -208 -271 -177 214 -67 81 99 -137 -185 7 -83 -10 -216 164 137 -76 96 195 -282
6495b82J81j63L43J47r2j30mL8p7J4K04k45K1m2q1J16L47o39J93k80M87N3J04
$$ -282 -101 -264 79 226 134 4 0 38 -39 -25 179 -66 -45 -87 -168 -52 295 -344 -151 -431 56 109 213
6518B13r3k33K66O8m67K00l0j65O62k07k53QJ13M0M5k32J10R5l76K88l2j05n7
$$ 213 120 -113 153 221 -246 -46 -76 -241 421 214 -39 -31 82 122 167 -65 45 140 -236 52 20 -85 -142
6541a42J17k94L38r5r7L94k88p4o2K87k66J88j58O3m21N79q4J53j30L54l54J9
$$ -142 -25 -319 19 -76 -173 221 -67 -141 -203 84 -182 6 -152 -89 -510 69 -15 138 8 362 8 27
6563B7KR4j35j27J17p6K85j96j9k5R6R1j97L2K20k35j09J57L60l25j37L31j89
$$ 27 29 123 -12 -139 -22 -98 187 -9 -28 -53 43 134 -63 -31 189 -46 -155 2 362 37 -100 231 42
6586D2l32mK00L95n61L42K44n63K64J96m7k01K49k04J36l69J8J66L0J72k7o0k0
$$ 42 -290 -294 -94 301 -260 82 326 -237 27 223 176 -25 224 20 156 -213 -195 -29 1 173 146 86 66
6609F6J05j69o8P9J25j06k13L93j77J06r1p2J94m13L87Ok38J08l0K12o35N38j20
$$ 66 171 2 -66 13 138 32 -181 212 35 141 50 -22 172 -241 146 152 -86 22 -8 204 -431 107 -13
6632a3K75m39n3K81J32K05l84J1K32o16M68p3j79J89m30M82l04M80L5j50r1j47
$$ -13 262 -177 -230 51 183 388 4 15 247 -369 99 26 -153 36 -394 88 -216 264 299 149 58 -89
6654h9P9O5K3R8j56N8k30M7J07J28Q5M8k86J81j80Jr4K22m7K5J67K6l95K03q8
$$ -89 -10 55 78 176 20 78 -152 -105 2 130 215 263 -23 158 -22 -21 -115 107 60 85 252 278 -117 86 -2
6679bK11k5k34q1J06K14j5j31j52K56J78l75R3R1j08J2K54j99n6P4j92P3k37L4
$$ -2 209 184 -50 -131 -25 189 174 43 -109 147 325 -50 43 134 26 38 292 93 37 111 -81 -8 -245 -211
6703b11P0Q7J1k04J16j21K53j78K52k51K54k54L35j16j00Lqk3O0J63l3O8o0j64
$$ -211 -141 -54 -43 -247 -131 -252 1 -177 75 -176 78 -176 159 43 -57 -54 -62 -85 -25 138 105 173 113 -51
6727e1p3J29o8M4J55k63R8J96n9j08J7o4J93j06J15k49n2L13N8k15l01M28lk7
$$ -51 -124 5 -63 -19 136 -127 -29 167 108 0 17 -47 146 40 155 -94 -146 167 225 10 -291 137 134 107
6751A07k31Q0j73K82l21M13l25K87j4k29J98k0j30j12Q5J64J79j86J8r5J16j88
$$ 107 -124 -44 -217 65 -256 157 -168 119 105 -124 74 54 -76 -188 -103 61 240 54 72 -23 93 -95
6773i5j9K32o9J08l4k14L40j63j22q0oJ48R4k32J91k28K72k76L22l96L97k93M44
$$ -95 -114 118 49 157 123 -91 249 86 -36 -116 -122 26 120 -112 79 -149 123 -153 169 -227 170 -123 321
6796C21k55J3K62n45J83j42J45m2P0J51j43L4n26M21J48q3O5K4r0k28oJ11J63
$$ 321 66 79 341 -204 -21 -163 -18 -60 10 161 18 52 -474 -53 95 12 77 101 11 -217 -223 -112 51
6819E1j54L74m34K64R2k01J69j48j42J43k6K22k3n7qn09K81L98l3k51j44M6K1
$$ 51 -103 271 -163 101 193 -8 161 13 -129 14 -12 210 187 130 122 -387 -106 292 259 8 -136 -90 -69
6842f9M1J31OM8m10Q5J37k02l6K72j15J31J31k46k40K09K55KJ4j82J55k16P5M8
$$ -69 -28 103 109 157 -253 -168 -31 -233 -269 3 -112 19 150 -96 -336 -127 128 130 144 -38 117 -99 -24 24
6866B4M62k88q4O6l56JL32L7j57J63l15J51J34l73K35k28Q5j5K1K29m09K70Q9
$$ 24 486 198 114 180 -176 -175 157 194 37 200 -115 36 170 -203 32 -196 -111 -126 -105 124 -285 -15 74
6889G4k19J12k4qM8K5j34M3Q7K57m15K06J18j14k12K72k11J64K05k22j70K20o1
$$ 74 -145 -33 -57 -65 -17 8 -126 -83 4 261 -154 52 170 56 -156 116 -95 69 274 52 -118 102 41
6912D1NJ2j12j01j7J68K41m44N7K01pJ09%j90J14j82J28Lp8j4J57j60K26j59j32
$$ 41 46 58 -54 -155 -172 -4 237 -207 -150 51 44 153 153 -37 77 -105 23 26 -52 -66 91 -69 157 -2 -134
6937a34L04j27QN9m37K29J83R5l39k73K32OR1Q6KK93j81k43R2L38n71K80K85j36
$$ -134 170 43 51 110 -327 -98 85 180 -159 -432 -200 -194 -103 -17 -15 278 97 -146 -54 284 -287 -7 278 142
6961A42j07M8K2j46k1J37j21K91m69K70j91p1L50k98M15m8l11m5J42l7O9j01L07
$$ 142 35 83 105 -41 -62 75 -46 245 -224 46 -145 -216 134 -164 251 203 -108 -153 -11 -48 21 -80 227
6984B27r3k20r4L79J76n66K19p0J12j6j85K61j25N3J73l23K74m46K00K54l32K21
$$ 227 134 -86 -180 199 375 -191 28 -42 70 54 -131 130 5 58 231 -92 182 -264 -64 190 -142 79
7006G9k16K58l8r8p5Q2N0N5j29Q7K41n71K09J70k60K08j49R3k62J32Jl5J34m6
$$ 79 -137 121 83 -15 -90 -8 42 97 -32 55 296 -275 -66 104 -156 52 -97 -4 -266 -134 -133 -168 -34 -80
7030h0K22k55L20m42L24j56J43K91m67L61r6l8k14K85K8k00l0j37j48O18j83l69
$$ -80 142 -113 207 -235 89 -67 76 367 -100 261 165 127 -87 198 226 26 -4 -141 -289 329 146 -223
7052b23J96J25l69MN99k45m5q6Op0O5r0J83J97k33q9L59j86l08J94L4Jj17L52
$$ -223 -27 98 -271 -267 332 87 42 -44 -38 -108 -43 -133 50 247 14 -75 284 98 -210 -16 18 19 -98 254
7076B54n40K08j60M43o22M50o6n3L57l61J22J32k96J04J18o8K60j83k19J30P6
$$ 254 -286 -78 -238 205 -417 33 -33 -86 271 -90 32 164 -132 -28 90 22 282 99 -120 10 86
7097H6m08K32Lk02K28RQ0j97J9L39m77O28l89J98l64M10l54j29J80K7k19J56J51
$$ 86 -322 -90 -87 -289 -61 -52 28 -169 -150 189 -288 340 -49 149 -215 195 -159 -288 -108 -81 -300 -144 7
7120Gm7L01l69J38j48M7p0R9J29k02o1n2J92P8k22K46k40J49J9J81J2m3p3o8k4
$$ 7 -40 261 -108 30 -118 -71 -141 -42 87 -115 -176 -228 -36 42 -180 66 -174 -25 -6 175 187 144 71 3 -21
7145b1J43j78J5J80o4o3k45J42L54k75l15K11K04j84k42L31j19N3l1j7n1J60J21
$$ -21 122 -56 -41 139 75 12 -233 -91 263 -12 -327 -116 88 -96 -338 -7 -126 -73 -104 -121 -172 -12 109
7168A09r8j06n9M57q4r7j39j57m0K76J24l3j34j09K21q2j36Q1l62K93K09l37K16
$$ 109 11 -95 -154 303 219 122 -17 -174 -214 62 186 153 19 -90 131 49 -87 -6 -368 -75 134 -203 13
7191A3O7j68M25m12Q5j73J55l38J60K80j95k57L61l03J91j52M13k65O7R2j01L33
$$ 13 80 -88 337 -75 10 -163 -8 -346 -186 94 -101 -358 3 -300 -109 -261 152 -113 -46 46 -55 278
7213B78N2l38j61K92j71R5N0j00j5K18Ll85J44L27k91r2Qn6M30l45J63m6j24n9
$$ 278 330 -8 -169 123 -48 47 97 -3 -18 200 203 -182 -38 289 -2 -94 -86 -142 288 -57 106 60 -64 -123
7237a23R3j05KK35r3n9Q4J4j34j23K93l83L35p3j21J0J87M6m22M07k27K98k63
$$ -123 -30 -135 -133 102 9 -50 34 48 -86 -209 84 -299 36 -37 -158 -148 39 85 -337 70 -157 141 -122
7260a22J42K87m66K43O7k12k09K94j04K51j58P3o8OJ85k40L63k25j73J57L77m01
$$ -122 20 307 -159 84 151 -61 -270 24 -80 171 13 86 18 24 209 -31 332 107 -66 91 468 67
7282F7l4J83j01r9r0Q4l9qL51j98j70o8J25P0j48M8J87k34n9J16j92J12J77k83
$$ 67 33 216 115 16 -74 10 -29 -37 314 116 -54 -122 3 73 -75 -27 160 -74 -133 -17 -209 -97 80 -203
7306b03L85j99K41l1n69L45j8K9L12m69K25J10r2k52L13L6l63M29n18K95J86j6
$$ -203 182 -17 224 193 -376 -31 -49 -20 292 -177 48 158 66 -186 127 163 -200 229 -289 6 192 176
7328A76k5K2j10L46n18MJ6M1Q6J52L4l92J83j2R1K4j21j83J2J00j5K77l66J7J19
$$ 176 151 173 63 409 -109 -105 -89 -48 38 190 224 -168 15 3 94 118 -3 -186 -174 -74 -89 188 -178 -161 -42
7353d2J09q3R2r1J3Q9n4k9l5k29L06j15j4K53Q2n36K74J39j36j62K86j59R5j87
$$ -42 67 -16 76 -15 -2 87 33 4 -31 -260 46 -69 -83 170 252 -284 -10 129 -7 -169 117 -42 53 -134
7377a34L32k46Mn2J26O8k25p9M01j83J09k59r5J74J12k27J56k44l5J83M4j38M17
$$ -134 198 -48 -44 -96 30 98 -127 -206 195 12 121 -138 -233 -59 53 -174 -18 -262 -297 -114 -70 -208 209
7400B09r7l2j92N4p4K53j15j34J82J08k87R6K47p3Q4j97J54n22L80O0j48J49j01
$$ 209 112 80 -112 -58 -132 121 6 -128 54 162 -125 -29 218 145 229 32 186 -336 44 104 -44 105 4
7423Dj00K61n40O13k08j91L48j67J71j55K23l21O4j41P2j3M0P5L5O3k46j28N21
$$ 4 -96 165 -375 238 30 -161 187 20 191 36 259 -62 2 -139 -67 -80 -40 35 70 133 -113 -241 280
7446B80k04o5l44L33J53n7Q9j80l8J99pk43rk38M49k61N82l54k76O8J42r4M40
$$ 280 76 11 -333 0 153 96 185 5 -33 166 159 -84 -93 -331 118 -143 439 85 -191 -123 19 -75 365
7469C65m49j10K43N9q4O8n13L42K17r4m1j35K62m09K83n4r8L00j85K48o8k19J65
$$ 365 -84 -194 49 108 24 92 -421 -79 138 44 3 -132 130 -279 4 -50 -148 152 -33 215 147 -72 93
7492I3r9J19L7j54j2L42l53J43k84K66Q0n27L19l36M88o6k96M97l26n0K98k8l36
$$ 93 -6 113 150 -4 -16 326 -27 116 -168 98 178 -349 -30 -366 122 56 -240 257 -69 -119 179 151 -185
7515a85L59l69K97m2j62j68N09k70j74N5L66n3j74J47j94rn9P9j67L48n0J0l9
$$ -185 174 -195 102 60 -102 -270 239 -31 -205 -150 216 163 -11 136 -58 -67 -126 -47 -214 134 84 94 55
7538E5K18j95k76M80j13J9k06p8j53P1K57j29lj41J41j16L32n2j88j27M80m19
$$ 55 273 78 -198 282 169 188 -18 -96 -249 -178 79 -50 -53 -194 -53 -169 163 111 -77 -204 276 -143
7560a43M45m60J82M6k9n2k01N6K13n2J19oq6k26L72k76J93r9l00M96Q4k14m1j29
$$ -143 302 -158 24 70 41 -11 -212 -156 57 5 124 118 32 -194 178 -98 95 -4 -304 192 276 62 21 -108
7584a08j6l8K53O2j98K66m2j69J54l30K80P5j52Pm6L31l72o8K34r2n2oL58l62
$$ -108 -124 -162 91 153 -45 221 179 10 164 -166 114 189 37 44 -2 329 -43 -111 123 31 -21 -27 331 -31
7608c1K25l7l26K41J12n6q3r5q8Q2j2L43k50j46L32j72j18K11n7j01o7J7K57k15
$$ -31 194 157 -169 72 184 128 45 -50 -138 -56 -68 275 25 -121 211 39 -79 132 75 -26 -93 -76 181 -34
7632c4q0K89m39L18Oj87J56L10n23j96L29j16j4K9K72l47J86Q0j85J32l1K9K34
$$ -34 -114 175 -264 54 60 -127 29 339 -184 -380 -51 -167 -181 -152 120 -227 -41 39 -146 -14 -45 -16 218
7655B18k52P8j0N89r34M05P5m29J73K37j26j04R9J48r9j29L3l01K85q8P2J19m7
$$ 218 -34 44 34 623 -311 94 169 -260 -87 150 24 -80 19 167 68 -61 -28 -329 -44 -132 -60 59 12
7678A2j37J3j09K03J54p4q9Q4j56k04J87J12j69J98j61J02N4j84L91l3K2j42o2
$$ 12 -125 -112 -221 -18 136 62 -27 57 -99 -303 -116 -4 -173 25 -136 -34 20 -164 227 194 216 74 12
7701A2J38R8o1j13j91K18o4N5J82l30k37L34N2N6J17m18L10r5l4M5L3k59r5L36
$$ 12 150 248 187 74 -117 101 37 92 274 -56 -293 41 93 149 266 -152 158 63 29 74 107 -152 -247 89
7725H9K7j13j05K01k08k44L87j09RK93k73K20k8k18K17l45L08p7J39q4k5k51J91
$$ 89 116 3 -102 99 -109 -353 34 -75 -66 227 -46 174 146 -72 145 -200 108 31 170 86 61 -190 1
7748Aj85J59J38j85l6k3O62n70M4J71O0j06J4J60k26oj45k62L96q9J10k43L35
$$ 1 -184 -25 113 -72 -108 -131 531 -39 5 176 236 130 144 304 78 72 -73 -335 61 -28 82 -161 174
7771A74j71M4K14k14L97n39QJ30o2J02J75k84J53k99K43O6k4j96oJ29%J42k71
$$ 174 3 47 261 47 444 -95 -87 43 -19 83 258 -26 127 -172 71 137 113 -83 -89 40 40 182 -89
7794h9K56r0k12j30Q5L69k07K92n30M78k02r1L71k13M5J13m36J0qK92m45K40L08
$$ -89 167 77 -135 -265 -180 189 -18 274 -256 222 20 -71 300 87 132 245 -191 -181 -189 103 -342 -102 206
7817B06m34K87J7N9J78k65j11J90j16M3k02K67Rp6J7L4o6RJ76m60M03k34k02K95
$$ 206 -228 59 76 135 313 48 -63 127 11 54 -148 119 128 52 69 103 37 46 222 -238 165 -69 -271 24
7841B4j42m3J01k70K45j21R8L2j35J87%P0l5Q5N5j98K3J00k70J01K0k40J84J41
$$ 24 -118 -161 -60 -330 -85 -206 -108 -76 -211 -24 -24 46 11 96 151 -47 -24 76 -194 -93 -73 -313 -129 12
7865A2j10L95k79L44j06l83o4K03k3L43j48m38J70J56j12q6L11n4j35J1K31l38
$$ 12 -98 297 18 362 256 -127 -191 12 -11 332 184 -254 -84 72 -40 -126 185 131 -4 7 238 -100
7887a00r9K45k38K32L2j8j8j36N60m55m1k00K02n1j58M51j66j59N6k2K69k84J87
$$ -100 -199 46 -192 40 72 54 36 -100 460 5 -36 -236 -34 -85 -243 208 42 -117 -61 -83 186 -98 89
7910H9l0j2k56K22J8k7J57o5l73J69K53j58M2L56m52L3J44j8J42k82o9J46J2P1
$$ 89 59 47 -209 13 31 4 161 96 -277 -108 145 -13 29 385 -67 -34 110 92 234 -48 -117 29 41 112
7934A12m08J95K5K64R0m61J80l27J21K01l5j25m9N57m29J53j50J33j9J57J1l96
$$ 112 -296 -101 -76 188 278 -183 -3 -330 -209 -8 -43 -168 -217 340 -89 64 -86 47 28 185 196 -200
7956b00P5N4j8j06J51J90k35P1N4Mk57L69N8k26l38M38j22j4K05j18j01n9M26
$$ -200 -125 -71 -89 -195 -44 146 -89 -18 36 40 -217 152 210 -16 -354 84 -38 -52 153 35 -66 -125 301
7979C01m31k3J96j47L35k72K96j99n7k15K86K81o32K12q0j47J44N69l64k6L9J34
$$ 301 -130 -153 43 -104 231 -41 255 56 -1 -216 70 351 -281 -69 -149 -296 -152 417 53 27 66 200
8001B00j68O0L01n91L09m58K19J88Q8k47J88j36J26l21J73J72K4j88O3k44K47
$$ 200 32 92 393 -198 111 -347 -128 60 148 -99 89 -47 79 -242 -69 103 127 -61 2 -242 5
8022Ej43J32m7l0J8j03K68j00k45L45m05K86o4j3j23J63j63M0K46K36l40k7L5
$$ 5 -138 -6 -53 -83 -65 -168 100 0 -245 100 -305 -19 -83 -96 -219 -56 -219 -179 67 303 -37 -64 -29
8045b9KJ81j42J60l74K99l29k1J61J60k92M14j1j32k15J53N3k15K43O4l13Q4L9
$$ -29 -27 154 12 172 -202 97 -232 -253 -92 68 -224 190 179 47 -168 -15 38 -177 66 130 -183 -99 -60
8068f0M7N3K18m80K75j22J70j06Q5r5m2K7K10p7j6Q8k33K12o0k17J67J86k03K11
$$ -60 -13 40 258 -222 53 -69 101 -5 80 -15 -57 -30 180 103 87 175 -58 154 94 -123 44 230 27 238
8092B38l12o6L72j66J90n31R2L13r4M6k28j5P7J49O7M4k20K39k11J03R0q2Kl00
$$ 238 -74 -140 232 66 256 -275 -183 130 36 82 -146 -161 -84 65 132 176 -44 195 -16 87 177 95 97 -203
8116b03K57k50L77k38q1J90l3j14O8j6K46j96J15k69J03Q8j6L21m32o4L08J45
$$ -203 54 -196 181 -57 -138 52 19 -95 -27 -43 203 7 122 -147 -44 44 28 349 -83 -147 161 306
8138C06o68L95P7p8K82m60K12P3j91j12K91l2k52J72P8J10jk72j59M97j65ql24
$$ 306 -362 33 110 32 314 -146 66 139 -52 -164 127 95 -157 15 93 203 202 -70 -229 268 103 95 -229
8161b29l8K34J24o5m7j02L99l70P0k12J72J70J33j63k65J51j39K9K56l45K07K9
$$ -229 -267 -33 91 26 -21 -123 276 -94 -24 -236 -64 106 239 76 -189 -38 -177 -148 108 -237 -30 -1
8183aJ67k82J27J82j35l76L67r9
$$ -1 166 -116 11 193 58 -318 49 -50
8191e0
$$ Imaginary data points
##PAGE= N=2
##DATA TABLE= (X++(I..I)), XYDATA
0@%%%%%%%%%Qj6J6j6K4l2L2m0M8n6O6p4Q8j04J20j36J54j76J99k26K58k90L25
$$ 0 0 0 0 0 0 0 0 0 0 8 -8 8 -8 16 -16 16 -24 24 -32 34 -40 48 -56 64 -72 82 -94 105 -121 137 -153 172
32A72l64M05m53N07n63O25o94P67q50R44j043J154j281J420j576J757j964K203
$$ 172 -192 213 -240 267 -296 329 -365 402 -448 496 -547 607 -674 746 -830 927 -1037 1166
50A166k486K825l240L766m451N388o757Q949j3026K3167r3924j81816J65616K43229
$$ 1166 -1320 1505 -1735 2031 -2420 2968 -3789 5160 -7866 15301 -78623 -260439 -94823 148406
64A48406P1056j87196k02163n388J92129J58067l7341j86007j17752O8433J73348
$$ 148406 219462 32266 -169897 -175285 16844 174911 137570 -48437 -166189 -97756 75592
75G5592Q1636q9989j65421o3303J04412J67866M5484j34666j75548j1492J75382
$$ 75592 157228 67239 -98182 -161485 -57073 110793 156277 21611 -153937 -165429 9953
86I953J66749l8711k01861j30057R7466K11928Q1082j44741j99940k3109J78529
$$ 9953 176702 137991 -63870 -193927 -96461 115467 196549 51808 -148132 -171241 7288
97G288J70056l3634j93613j30431P2289J84032R0591r4187j69003o1856J06152
$$ 7288 177344 143710 -49903 -180334 -108045 75987 166578 72391 -96612 -158468 -52316
108e2316J56878L8775j17525j41804q404J32973J26158k2498j45415j03462N7550
$$ -52316 104562 143337 25812 -115992 -124396 8577 134735 112237 -33178 -136640 -79090
119g9090J56679P5001r6234j61917m0453J29732J51228j659j52901j29667L9417
$$ -79090 77589 152590 56356 -105561 -146014 -16282 134946 133287 -19614 -149281 -109864
130a09864J62473J00351p2488j59212o4394R9810J46736K8968j16426j26239K558
$$ -109864 52609 152960 80472 -78740 -143134 -43324 103412 132380 15954 -110285 -107727
141a07727J23565J05212k7681j27104q7358M5784J27127O9655o4057j27036n0289
$$ -107727 15838 121050 93369 -33735 -121093 -75309 51818 121473 57416 -69620 -119909
152a19909Q2278J23942K4659j02300j12363Q125J19075R0512m4692j27926o0787
$$ -119909 -37631 86311 110970 8670 -103693 -95568 23507 114019 69327 -58599 -119386
163a19386P7477J24204K5906j01680j10025N962J10760Q9774k7468j08540o9929
$$ -119386 -41909 82295 108201 6521 -103504 -97542 13218 102992 75524 -33016 -102945
174a02945L9942J02690N6205m7140r9546m4223N8990R8534K8358p6892r7727o190
$$ -102945 -63003 39687 95892 48752 -50794 -95017 -36027 62507 90865 13973 -83754 -89944
186h9944R5334Q7470k3842j09250o6998N5029J11417L7203p5627r5160n806Q4093
$$ -89944 5390 92860 69018 -40232 -107230 -52201 59216 96419 20792 -74368 -80174 3919
198C919P3212j5459p9436n1825K7071P2696L8704l5831p1593l1783M3155P4380
$$ 3919 77131 61672 -17764 -69589 -42518 30178 68882 33051 -38542 -70325 -27170 47210
210D7210K5206n6533q0782j4277P5526Q2868n535q9948o9750L3198R5560M5766
$$ 47210 72416 15883 -64899 -79176 -3650 79218 73683 -16265 -86015 -52817 42743 88509
222H8509n3484q4970j7620O3368O5882n433o4737m8691J7878N9496L4781k3889
$$ 88509 35025 -49945 -67565 -4197 61685 56252 -8485 -57176 -39298 20198 54979 31090
234C1090n5495k9593K6083N7088K9384l3081o2358k2119M6894O5378O146o1518
$$ 31090 -24405 -53998 -27915 29173 58557 25476 -36882 -59001 -12107 53271 59417 -2101
246b101n7599J5384P0265M1297l7323p1014k1796N1997O3062K401n8192n1515
$$ -2101 -59700 -44316 25949 67246 29923 -41091 -62887 -10890 52172 54573 -3619 -55134
258e5134J0397N5738L9814j5820n0029l2756J6629M7131K7835k0130m7401k2415
$$ -55134 -44737 11001 50815 34995 -15034 -47790 -31161 15970 43805 23675 -23726 -46141
270d6141K8226M8491J3238l8950m6870N35N0278M1608j6441n6661l1506L1110
$$ -46141 -17915 30576 43814 4864 -42006 -41471 8807 50415 33974 -22687 -54193 -23083
282b3083N6305J6430m1260n0086l000M4718L9224r953m3866k8278J8403M2484
$$ -23083 33222 49652 8392 -41694 -44694 24 39248 29295 -14571 -42849 -24446 18038
294A8038J8616k3064l8118j0754K7259L7077P926k8547l6996o517L1756L7952
$$ 18038 36654 13590 -24528 -35282 -8023 29054 36980 8433 -28563 -35080 -3324 34628
306C4628K433l8111l8983M354M3772L2506j6969m7318k0677L1964M5665M463m2235
$$ 34628 37061 -1050 -40033 -35679 8093 40599 23630 -23688 -44365 -12401 33264 37727 -4508
319d508l4810J4844M5903K1464k5924l9918q403K8884K9446q64k4360k1937j77
$$ -4508 -39318 -24474 21429 42893 16969 -22949 -31352 -2468 26978 26114 1754 -20183 -20360
332b0360J7598J8353L729j6227k3074n400K3701K9998J70l6018l0622J5457M7629
$$ -20360 -2762 15591 19320 3093 -19981 -25381 -1680 28318 28488 -7530 -38152 -22695 24934
345B4934K2497l3559m9903n221M4958L8980j3483m6012k0389K4449L3747K941
$$ 24934 47431 13872 -36031 -41252 3706 42686 29203 -16809 -37198 -12749 20998 23939
357B3939k5162j7956O309J7762P529n472r718p166o12R210J4001M154j7501k3272
$$ 23939 -1223 -19179 -12870 4892 12421 6949 -2769 -9935 -10547 -1337 12664 16818 -683 -23955
371b3955M68K9356K5207j2336l8081j7041K6340L8237L688l5301k9366J2079L5838
$$ -23955 -23487 5869 31076 18740 -19341 -36382 -10042 28195 31883 -3418 -32784 -20705 15133
384A5133J5973k1453l0064m488K2294K0796j797j7790j4811M41J2221J3457L276
$$ 15133 31106 9653 -20411 -24899 -2605 18191 16394 -1396 -16207 -15766 -3545 9912 13188
397A3188r738j3866m060J2708J5775Q62j6137j3134O836J9707P462j6168k0419
$$ 13188 3450 -10416 -14476 -1768 14007 14869 -1268 -14402 -7566 12141 19603 3435 -16984
410a6984k73K1710J7820p056k4798j5650J1641K5624J1766j4401k2810p199J6291
$$ -16984 -17257 4453 22273 15217 -9581 -25231 -13590 12034 23800 9399 -13411 -20610 -4319
423d319K0318L130j5410j5623L36J4412J2033k581j3717j0214K777J2845Q904
$$ -4319 15999 19129 3719 -11904 -11568 2844 14877 12296 -1421 -11635 -8858 3987 12891
436A2891m200j3527r231M922J4541Q547p687j5340n211J2208J4689p29j4954j0772
$$ 12891 8691 -4836 -14067 -9145 5396 13943 6256 -9084 -14295 -2087 12602 11873 -3081 -13853
450a3853P564J7331M469j3840j6271K64J6692J3820m072j6447j2263L636J4502
$$ -13853 -6289 11042 15511 1671 -14600 -14336 2356 16176 12104 -4343 -16606 -12970 1532
463A532J1312j175j3280j3369j12J4361J4131j214j6440j2572O672J7267P135
$$ 1532 12844 11669 -1611 -14980 -15092 -731 13400 12186 -4254 -16826 -10154 7113 14248
476A4248j1716j4967J53J4017J0582n185j3402n505O957J0216L224n744q962l427
$$ 14248 2532 -12435 -12282 1735 12317 7132 -6270 -11775 -4818 5398 8622 2878 -6084 -9511
490i511N084R238M063p040j2024k462J2189J4598k176j8255j3147R719K2530Q740
$$ -9511 -4427 4811 8874 1834 -10190 -12652 -463 14135 11959 -6296 -19443 -9724 12806 21546
504B1546j4998k1681k969J7109J7417l10j4900j2033L66R660R335Q49o885r163
$$ 21546 6548 -15133 -18102 -993 16424 16114 1214 -10819 -10453 -793 8542 9391 2506 -6657
518f657k164P357J0800Jj2117r692P448J6591N106j4842j6834L130K0328J2784
$$ -6657 -8821 -1464 9336 9337 -2780 -12472 -5024 11567 16673 1831 -15003 -11873 8455 21239
532B1239j0524k0798o268J4605J6214m8j5011j2404K962J1761R654k365j1198
$$ 21239 10715 -10083 -16351 -1746 14468 14420 -591 -12995 -10033 1728 11382 9017 -2181
545b181j0272J192J3446J3061j463j6997j4505N634K0930J2273j0706k1654o653
$$ -2181 -12453 -11261 2185 15246 13783 -3214 -17719 -12085 8845 21118 10412 -11242 -17895
558a7895J4524J7613r00j6784j1519O659J5345M457j1210j2264m6J2686J0769
$$ -17895 -3371 14242 13342 -3442 -14961 -8302 7043 11500 290 -11974 -12020 666 11435
571A1435k212j2885j0360K598J4494J2006m016j6570j1937N965J8521J0027r829
$$ 11435 9223 -3662 -14022 -11424 3070 15076 11060 -5510 -17447 -11482 7039 17066 7237
584G237j9055o918J3934J7658K175j6193j5884K881J7622J3003o280j8487r767
$$ 7237 -11818 -18736 -4802 12856 15031 -1162 -17046 -14165 3457 16460 10180 -8307 -18074
597a8074R672J7673N962j2013j5297j194J3776J1598l824j3384o856P756J2965
$$ -18074 -8402 9271 15233 3220 -12077 -13271 505 12103 8279 -5105 -11961 -4205 8760
610H760K913r517j1596j111J0461J2069J271j2621j4027r58J4836J5448n48j8671
$$ 8760 11673 2156 -9440 -10551 -90 11979 13250 629 -13398 -14356 480 15928 15380 -3291
624c291j5601N194K1642J2978j1304k2223n169J7782J8086l502j8977j0882R577
$$ -3291 -18892 -13698 7944 20922 9618 -12605 -17774 8 18094 14592 -4385 -15267 -5690
637e690J6390L657j1407j2271oQ908P325K52o477o375k302N271R268L452q085
$$ -5690 10700 14357 2950 -9321 -9327 -419 6906 7158 681 -5694 -7996 -2725 6543 9995 1910
652A910j2710m8J5397J3048p571k0336q181J5833K0874K86k1371j7235N991K1172
$$ 1910 -10800 -10848 4549 17597 10026 -10310 -18491 -2658 18216 18502 -2869 -20104 -14113 7059
666G059J0671j0864j7414m384J1596J1688L97q866p296O60O577O270O24o728p944
$$ 7059 17730 6866 -10548 -14932 -3336 8352 8749 -117 -7413 -6753 -176 6094 6718 -10 -7954
681g954J28R899Q652l467j2601q068P022J4799M510j1462j3626K19J3641J0738
$$ -7954 -7826 2073 10725 7258 -5343 -13411 -6389 8410 12920 1458 -12168 -11949 1692 12430
695A2430m612j4149o895Q437J3196L507r824j2472j979J1492J2647k20j3432j0925
$$ 12430 7818 -6331 -13226 -4789 8407 11914 2090 -10382 -12361 -869 11778 11558 -1874 -12799
709a2799L385J3529Q290n384j1711m848N953R473K345n990p905o46O276O175l00
$$ -12799 -9414 4115 12405 7021 -4690 -9538 -3585 5888 8233 2243 -5662 -6308 -32 6143 5843
724E843p217o078Q92Q690P352k389j0935p311O061J3750M289j0515j2432M37J3383
$$ 5843 -1374 -7452 -6560 2130 9482 7093 -3842 -11153 -5092 8658 12947 2432 -10000 -9563 3820
739C820R420o263j3565m796R194J1263J43j0672q305K167Q850N646j150o158n858
$$ 3820 13240 6977 -6588 -11384 -2190 9073 9216 -1456 -9761 -7594 1256 6902 5752 -406 -6264
754f264m07N707P961J147p348q352R27R499O109m933r843k520P790Q451k071r987
$$ -6264 -6671 -964 6997 8144 796 -7556 -6629 2870 8979 4046 -5797 -8317 -527 7924 5853 -4134
770d134n972M604J0310L155o658q565r97P041P325N3o134o498L36P113O605j969
$$ -4134 -10106 -5502 4808 7963 1305 -7260 -8257 -1216 6109 6162 28 -6470 -6134 979 7584 5615
786E615q943n358M617R137L185o335r024j401O832Q032M81o969o312N25N445N145
$$ 5615 -3328 -8686 -4069 5068 8253 1918 -7106 -8507 -1675 6357 6838 -131 -6443 -5918 -473 4672
802D672J67m722m273M38M407M395j532o467k806N498P214q07q964n865N157J0136
$$ 4672 4839 117 -4156 -3718 689 5084 3552 -2915 -5721 -223 6991 6184 -2780 -8645 -3488 6648
818F648K575p286q884J7P908O326k200o398l596J950M105K852o07k983l941j180
$$ 6648 9223 1937 -6947 -6930 978 7304 5104 -1294 -4890 -2940 1165 4017 3410 427 -3514 -4694
834d694N189O380o40q099n903L300R989L509o381q528k90O899N735k832o630j600
$$ -4694 495 6875 6235 -1864 -7767 -4467 5522 9031 2650 -5878 -6168 731 6466 3634 -2996 -4596
850d596M389L801j779m548j515L114L442J061j989l305k357J036N060M464j493
$$ -4596 -207 3594 1815 -2733 -4248 -1134 2308 3369 1380 -1925 -4282 -3246 1814 6278 4785
865D785p225n414L293Q565L978n531q379j922O602O125r64o267l294K599M324
$$ 4785 -2440 -7854 -4561 4004 7982 2451 -5928 -7850 -1248 4877 3913 -2354 -5648 -3049 1275
880A275J699k172k945q75J597K966J409j917l121n66K319K848m55l698k082K273
$$ 1275 2974 802 -2143 -3018 -1421 1545 2954 1037 -2084 -2650 -331 2517 2062 -1636 -3718 -1445
896a445M037M01m244l756J162N515L408k278m992l370K101N770L727j247n922
$$ -1445 2592 2993 -1251 -5007 -3845 1670 5078 2800 -2192 -5562 -3461 2309 6036 4789 -1133
911a133m844J429O475M416k110o653k467L196M909K05l960k038K126L270o97l218
$$ -1133 -5977 -4548 1927 6343 4233 -2420 -4887 -1691 3218 3423 -537 -2575 -449 2821 2124 -1094
927a094j031K126K100n76j520m01N15n59L72J302J597j844l852j52M926M016k338
$$ -1094 -2125 1 2101 1525 5 -396 119 -440 -68 1234 2831 987 -2865 -3017 1909 5925 3587
944C587p290k174N967O734n73p764n275K917O591K533l372m438j7J897J180n75
$$ 3587 -3703 -5877 90 6824 6251 -1513 -6788 -3871 2720 5253 1881 -2557 -2574 -677 503 -72
960g2R02R73q10k453o56K261J862p16j487m90J592K50k394k202K222M011O16m777
$$ -72 830 1803 993 -1460 -2116 145 2007 1291 -196 -686 906 1156 -1238 -3440 -1218 2793 3409 -1368
978a368l637J194M913K791k428m114j166K506L224O11j458k903r82J640L034J003
$$ -1368 -5005 -3811 1102 3893 1465 -2649 -3815 -1309 1915 2526 1068 -1835 -2817 -1177 1857 2860
994B860k123k795q75J876K082J31p40j378k80k86K98J201J516m54j814p93R89
$$ 2860 737 -2058 -2933 -1057 1025 1156 416 -962 -1242 -1528 -1230 -29 1487 1033 -781 -1574 -585
1011e85J262q2j026M93J504K32k864k620K060M555J912m338m736k77N110L895
$$ -585 677 595 -431 62 1566 1798 -1066 -3686 -1626 2929 4841 503 -4233 -4510 600 4495
1027D495j933m030j348K471K047q24j740J154J181j172k070K97L459J246l347
$$ 4495 2562 -1468 -2816 -345 1702 878 -862 292 1473 301 -1769 -1472 1987 3233 -114
1042a14l101J549M267J258l819l252J796L604O17l433j668K230K564p18l837j000
$$ -114 -3215 -1666 2601 3859 40 -3212 -1416 2188 2805 -628 -2296 -66 2498 1780 -2057 -3057
1058c057K629L099l46k868j745R71J403R12J37J03q56j830p99J708K419J229k459
$$ -3057 -428 2671 2325 -543 -2288 -1317 86 998 1135 1238 382 -1448 -2247 -539 1880 3109 650
1075F50l020k85K302K130l80k601m15N65J423N68o02j143m49O97J445M33j223
$$ 650 -2370 -2655 -353 1777 1397 -1204 -1619 -1054 369 937 335 -808 -1257 -560 885 1318 95
1092I5j380M55J711O91j415j896N32K359O07k070j978P13K654P59j207j959QQ55
$$ 95 -1285 -830 881 1572 157 -1739 -1207 1152 1759 -311 -2289 -1576 1078 1837 630 -1329 -1321 -466
1110d66N65J84Q00O70j647k325k78L863K774j902m273j545L557L169r41l845j187
$$ -466 99 283 1083 1753 106 -2219 -2497 1366 4140 2238 -2035 -3580 -23 3146 2205 -1640 -2827
1127b827K744K279q03k793n28K034J682p83k040K65J035O05o32l17Q53L56j579
$$ -2827 -83 2196 1393 -1400 -1928 106 1788 1005 -1035 -770 265 870 238 -79 774 1130 -449
1144d49q69J613J874j348k344j044K484L012r34l756j485K028M063q8l156j797
$$ -449 -1318 295 2169 821 -1523 -2567 -83 2929 1995 -1761 -3246 -1218 2845 2757 -399 -2196
1160b196L75J951J215o95l14n30p04k49J351Q90p66j321k92J431J313r16j946
$$ -2196 -1821 130 1345 650 336 -194 -898 -1147 204 1094 328 -993 -1285 146 1459 543 -1403
1177a403l58J833J743r17j976p17Q21J765K35j260j119R3J264P72R4r14j358m1
$$ -1403 -1761 72 1815 898 -1078 -1795 -974 791 1026 -234 -1353 -1260 4 776 870 -44 -1402 -1443
1195a443J497K377j217j929j819J096K924J568k100k969l34J993J439K49j354
$$ -1443 54 2431 1214 -715 -2534 -1438 1486 3054 954 -2015 -2349 -356 1083 1332 -22
1210b2m36k5M0L64P40P72j028j243M68J468Q00j780j677J279K339O83l304k445
$$ -22 -458 -483 -443 -79 661 1433 405 -838 -370 1098 1898 118 -1559 -280 2059 2742 -562 -3007
1228c007J709L409M76k851k247Q17L071Q50j836j834L94J688l7J00J35J45j030
$$ -3007 -1298 2111 2587 -264 -2511 -1694 1377 2227 391 -1443 -1049 639 602 702 837 982 -48
1245d8j593M60K854J506k237l607n56L639K295l54m230r64K714K315j085k564
$$ -48 -1641 -1181 1673 3179 942 -2665 -3221 418 2713 2359 -1871 -2835 -121 2194 1109 -1455
1261a455j1K655R43j897k228N50J909P92k74j353o10K72J47M17J267n8j335j933
$$ -1455 -1466 1189 2132 235 -1993 -1443 466 1258 984 -369 -979 -707 -560 -143 1124 1066 -269 -2202
1279b202K42K426J907j202k825j066J892K122L56j800j746k02J459J232J054j104
$$ -2202 -1960 466 2373 1171 -1654 -2720 -828 1294 1650 -150 -1896 -2098 -639 593 1647 543
1295E43j837m07J297J536m14j018p04J102O59p08j539L62J744J342j292k276n03
$$ 543 -1294 -1701 -404 1132 718 -300 -1004 98 757 49 -1490 -1128 616 1958 666 -1610 -2113
1312b113J412J720L41j177p72j92m1J63J827J165r08k656j489J869L593K66l373
$$ -2113 -701 1019 1360 183 -589 -781 -822 -659 1168 2333 1425 -1231 -2720 -851 2742 3008 -365
1329c65k842J069L941R42k552k765J203K360P10k037q41J105J291n19j610N9J431
$$ -365 -3207 -2138 1803 2745 193 -2572 -1369 991 1701 -336 -1177 -72 1219 700 -910 -851 580
1346E80Q84q20j247M07L78l40n27J050J012K40k774j758J507L250J438k390l181
$$ 580 1464 644 -603 -196 182 -158 -685 365 1377 1617 -1157 -2915 -1408 1842 3280 890 -2291
1363b291q27K728L017k65k104j881O26J288M94K68q17o96l21L84J156m17o94k64
$$ -2291 -3118 -390 2627 2362 258 -1623 -997 291 785 1053 236 -460 -781 -397 759 342 -352 -616
1381f16P74N92p20q80j48J063J331n68j674n12O29J404K04p22o73n07k36P97K009
$$ -616 158 750 30 -850 -998 65 1396 828 -846 -1358 -729 675 879 157 -516 -1023 -1259 -462 1547
1400A547N07k171k610p2L483K721j392l678j603K250L124l21k081j314J144J355
$$ 1547 2054 -117 -2727 -2799 684 3405 2013 -1665 -3268 -1018 2106 1785 -296 -1610 -466 889
1416H89n97j436K60J651N76j379j053J42J457Ln52L3K98j29j204j12J322K161
$$ 889 292 -1144 -884 767 1343 -36 -1089 -947 510 513 -39 -6 292 163 -1041 -1153 169 2330
1434B330p57l166j457K363L482R4l368k466J222K812J370j686j936p3J181M56
$$ 2330 1573 -1593 -3050 -687 2795 2889 -479 -2945 -1723 1089 2459 773 -1163 -1236 -55 401
1450D01K72L3l29q12l93L74P87N72q41j162R02N16j02r25M7Q16J139n75j697o20
$$ 401 673 706 377 -435 -828 -454 333 905 64 -1098 -196 320 218 -707 -660 156 1295 720 -977 -1597
1470a597J102J892L54q90j927q23J251J599J184j648j210j344R70K173N39j464
$$ -1597 -495 1397 1751 861 -1066 -1889 -638 961 2145 497 -713 -2057 -1087 1086 1625 161
1486A61j634k59J571J554q18p90o38O78Q22n1r72J4Q68l69n18j97K95R1j89K88
$$ 161 -1473 -1732 -161 1393 575 -215 -853 -175 647 596 -376 -362 506 137 -381 -578 -283 -192 -381 -93
1506i3Q34l85j364k45O68J896M70j936k091P29K708J282j728k135k00J777O89
$$ -93 741 356 -1008 -1253 -585 1311 1781 -155 -2246 -1517 1191 2473 745 -1390 -1590 187 876
1523H76k21q83K25L5m88j35J136J022j243j324j02J778J088j433j420k52J901
$$ 876 655 -228 -3 32 -456 -591 545 1567 324 -1000 -1102 676 1764 331 -1089 -1341 560
1540E60Q61j571j531N12J869J215k073j710Q39J860J011j548j172j2J257J79n98
$$ 560 1421 -150 -1681 -1169 700 1915 -158 -1868 -1029 831 1842 294 -878 -890 367 546 -52
1557e2N10r9k92r18j70J299J346r60j968n33J670J312k02j588n83J156J245k71
$$ -52 458 359 67 -851 -1021 278 1624 664 -1304 -1837 -167 1145 943 -645 -1228 -72 1173 902
1575I02j027m57P51L07l56m51r9K1K48N19n54j64m88K07P58P07m53r85n33P83
$$ 902 -125 -582 169 476 120 -331 -430 -409 -161 358 -196 -360 -848 -641 117 824 371 -614 -1147 -364
1595c64J247J17j009q66N60N48K96m8k15m57o28J09P90J040n74j166r05R20J796
$$ -364 883 1000 -9 -875 -315 233 529 481 266 -191 -819 -710 80 1120 546 -620 -1525 -605 1191
1614A191J76j668j249J268J396o1j450j137J166J630n70j720n53J539J035n37
$$ 1191 1367 -301 -1550 -282 1114 1053 -397 -1534 -368 1262 692 -1028 -1581 -42 993 456
1630D56j064O6Q79K95n92n02P42M16m83j243P07J533K28j668j433N73K217R64
$$ 456 -608 -542 337 632 40 -462 280 696 213 -1030 -323 1210 1438 -230 -1663 -1090 1127 2091
1648B091j499j973j17J878J073o52j490Q8P40K61j44l60J37q2Q9l15M3M29j16
$$ 2091 592 -1381 -1498 380 1453 801 -689 -601 139 400 256 -104 33 -49 40 -275 -232 197 81
1667H1j61l42O45K8o20j77M79N38K16q65o47O88O05M3j94k51o40m16O36J152M2
$$ 81 -80 -422 223 251 -369 -546 -67 471 687 -178 -825 -137 468 511 317 66 -574 -990 -354 798 840
1688H40r27j383J81J779P46q02j279k18J067P76k57j371K57R45K97j077o44J022
$$ 840 -87 -1470 -1289 490 1236 434 -845 -1063 4 780 523 -848 -591 354 651 -426 -1070 -48
1706d8Q89j23j057n74M29J105j5q46K13J23L04j153o6J125J250o49j957p29J526
$$ -48 841 718 -339 -913 -484 621 606 -240 -27 96 400 -753 -819 306 1556 907 -1050 -1779 -253
1725b53J779J10k402o70P97J683j03r78o34M15P16p38l70Q84O26n46j027j74J125
$$ -253 1526 1636 -766 -1436 -639 1044 941 -37 -671 -256 460 -278 -648 236 862 316 -711 -885 240
1744B40O92q39j39r9L0L40m11o26J027M06k13j023j86O99Q01J78j093q09M00K36
$$ 240 932 93 -46 -145 -115 225 -186 -812 215 621 408 -615 -801 -102 699 877 -216 -1025 -625 -389
1764c89J016J69l10o96r61P54M11Q18l02j176j16M69M38J78m58J91O8j58k87J34
$$ -389 627 796 486 -210 -1171 -417 -6 812 510 -666 -782 -313 125 303 -155 36 104 -54 -341 -207
1784b07M64O44n19q23j50N09O46m31l10k05M76n84m03P20P09K90p71j049J42J169
$$ -207 257 901 382 -441 -591 -82 564 133 -177 -382 94 -490 -893 -173 536 826 55 -994 -852 317
1804C17J120q02j112k73O27N30k28K03J28l55l78m82M63Q77J90q61j120M59R98
$$ 317 1437 635 -477 -750 -123 407 179 382 510 155 -223 -705 -242 635 825 -36 -1156 -697 301
1823C01K16n85R1J77j21l39k14M86O71n7p54q21N84J022J60l71r87K0Q90n07J22
$$ 301 517 -68 23 200 79 -260 -474 12 683 626 -128 -949 -365 657 817 446 -541 -521 369 -138 -16
1844a6L00K24k04j195k70J129J171k41j420p16P97J110k21l63n60L99j69r0J89
$$ -16 284 508 304 -891 -1161 -32 1139 898 -522 -1238 -441 669 448 85 -475 -76 -245 -335 -146
1863a46N05O51n46j196J8O51N87r0p17J88J30n0l88L33M97O3m09p54R4R50M08
$$ -146 359 1010 464 -732 -714 -63 524 434 -283 -95 35 -15 -403 -70 427 490 81 -673 -579 371 779
1884G79m27l26n71K90M12L07J94l71m40p13M03N86O26l67r05l9M62M17l99J11
$$ 779 352 26 -545 -255 157 464 658 287 -153 -866 -463 123 749 382 -523 -562 -100 317 -82 29
1904B9J7O6Q9n86j25J187J58k23j269o8P63N33l69o76J96L83o6m10L5Q28N11r22
$$ 29 46 112 201 -385 -510 677 835 612 -657 -725 38 571 202 -474 -278 105 39 -371 -336 492 1003 81
1926H1j227K57J536O31r94j114j07R78O26m63m33q2N95k51o42L63M79R11r25j195
$$ 81 -1146 -889 647 1278 284 -830 -937 41 667 204 -229 -311 284 33 -609 -246 233 1144 219 -976
1946i76M59O55M21l57n90j02R33k09m25M5M99p8j54m61m38Q30L34J66n49o13J38
$$ -976 -517 138 559 202 -388 -490 443 234 -191 -146 353 275 121 -340 -778 52 386 552 3 -610 -472
1967d72L65J79K86L5n88j41P6P61J79o99o05Q3P22j31j54J05K19j85q0k56J20
$$ -472 -107 72 358 393 -195 -336 -260 501 680 -19 -624 -541 181 50 -104 1 220 35 -45 -301 -181
1988a81P95R8r36m88O33M85lm84m07O51L06m98l91K21R02l9q56r92Q49J254K0
$$ -181 614 712 -224 -712 -79 406 403 -81 -488 163 469 -29 -420 -199 703 664 -192 -1184 -335 919 939
2009I39j081p40L98R00L0m94l65L19O57o69n25J69J152J08j050o26N40J181k58
$$ 939 -142 -882 -484 416 446 -48 -413 -94 563 -106 -631 -462 690 798 -252 -878 -338 843 585
2028E85j152m0O73M13N6j033o8O64N65o43m03L91L25L41o31n48K35K71J29J3M1
$$ 585 -567 -607 66 479 535 -498 -566 98 663 20 -383 8 333 674 43 -505 -270 1 130 143 184
2049A84Pl14r3K80J36r3J62r52M01K31L11n4j94m17M4N01K4p2O0r5j06j92O09
$$ 184 191 -123 -216 64 200 107 269 -683 -282 -51 260 206 12 -405 -361 140 164 92 152 57 -49 -241 368
2072C68j34l67l1J6M52j10l66n9M15r1J17q60J64Q02K01k52o59J68K05Q00o24
$$ 368 234 -133 -164 -148 304 194 -172 -231 184 93 210 -650 -486 316 517 265 -394 -226 -21 779 155
2093A55l49j03M01m12n8M92M2L82j048k81N32R92j56p09p22O27O09R0q11l21P64
$$ 155 -194 -297 104 -308 -366 126 168 550 -498 -779 -247 745 589 -120 -842 -215 394 484 -327 -648 116
2114A16L93p45j05J34P95l32m22k55K22L73O3l90P4K29j00l58j51M78N72m5j058
$$ 116 509 -236 -341 -207 588 256 -166 -421 -199 174 237 -153 -79 150 50 -308 -459 19 591 546 -512
2135e12J4K8J351k01j489J35M67M18j77J59l96L78L5o07k93J076N70q72p89K27
$$ -512 -498 -470 881 680 -809 -674 -207 211 34 193 -203 175 210 -397 -690 386 956 84 -705 -478
2155d78O73N19m56o73J76N96k90l70k18K71R28l71p66k87N83R13j75o90l74L30
$$ -478 195 714 258 -415 -239 357 67 -303 -521 -250 678 307 -459 -746 -163 750 575 -115 -489 -159
2175a59K83N5k76M08j7m50n06K79P68L68p19o85N2P06P32o72m56k27K34O50j45
$$ -159 124 179 -97 311 294 -156 -662 -383 385 753 34 -651 -599 107 839 167 -289 -516 -282 368 223
2196B23k08qK62n3n91lM01K02R2k41k62r8pM80J19j60k74m16j57Q91J21k94j54
$$ 223 15 7 269 216 -375 -378 23 225 317 76 -186 -284 -291 189 308 148 -126 -542 -699 192 313 19 -135
2219a35k75qL78L49K14m19k21m33K77J60N24j86k29j78j29L41p2q2J74J02j23
$$ -135 -410 -418 -40 309 523 104 -117 -550 -273 -113 411 225 -4 -182 -311 30 -42 -124 50 152 29
2240B9k8k59M26J77k06l72O9m8M04L78n5n89J52m52J31K52M57K56q53n30K01R19
$$ 29 1 -258 168 345 139 -233 -164 -212 192 570 515 -74 78 -374 -243 9 466 722 -131 -661 -460 459
2262D59L08n60q66L29O60l63o6K1K46K42o06m21O08K70L1n20l40K88O51l64l13
$$ 459 767 207 -659 -330 330 -33 -99 -78 168 410 -196 -617 -9 261 292 -228 -568 -280 371 7 -306
2283c06L2N29K89q14o30L79J121K17j161o36N67J191P8r83p76L77R00O1n67l67
$$ -306 -274 255 544 -270 -900 -521 600 817 -344 -980 -413 778 856 -127 -903 -526 374 435 -132 -499
2303d99R11J18n54q84O81J066L5j186q10O06J252j32p15o78Q62N88m18p37k01
$$ -499 412 530 -24 -908 -227 839 874 -312 -1122 -516 736 604 -111 -789 73 661 243 -494 -695
2322f95J069P33q60j239L99J014O22p96r72j68J263j5m38l97R3Q68m53k32k14
$$ -695 374 1107 247 -992 -593 421 1043 247 -725 -893 370 355 -83 -480 -387 481 28 -204 -418
2341d18O81N76n07p16k90J040M56m12r81m5Q79J69m25l57j03P23J85k38n06j56
$$ -418 263 839 332 -384 -674 366 822 410 -571 -616 263 432 7 -350 -453 270 455 217 -289 -445
2361d45P31r6k99n31N41M23J77n01l93K90K44k21L22k09j75R6nl76p7O44L43m36
$$ -445 286 190 -109 -640 -99 324 501 0 -393 -103 141 -80 242 33 -142 -46 -51 -427 -504 140 483 47
2383D7n73L77O20J83j54q42k2M09K37m77j49J97O12N0q09k08M49O19j74n06n21
$$ 47 -526 -149 471 654 500 -342 -364 45 282 -195 -344 -147 465 515 -294 -502 -53 566 392 -114 -635
2404f35P22P15n80o60L00O02Kr02j04M92O47j06j125m36J007Q65o8j298j58J018
$$ -635 87 802 222 -438 -138 464 466 -436 -540 -48 599 493 -632 -1068 -61 804 736 -562 -720 298
2424B98M33n66n20K13N13J90p93m60P30P26m76r56L3J159M95r80p70K15P77P34
$$ 298 731 165 -355 -142 371 561 -232 -692 38 764 288 -668 -635 524 1019 39 -731 -516 261 995
2444I95j187n01M06J234l32j210l21O75J195l48j288J23P17N42k94r72K24O21
$$ 995 -192 -693 -287 947 615 -595 -916 -241 954 606 -682 -559 158 700 406 -566 -342 279
2462B79K63q21l93Q10Q48m00r43l52O38P57l88j020k8Q82P72p53r11K9J304L11
$$ 279 542 -279 -672 138 986 586 -357 -709 -71 686 298 -722 -750 132 904 151 -760 -731 573 884
2482H84j001p07N68Q20J72q55q66O27R45l56l91k71K55O22j38p09J40P67nm66
$$ 884 -117 -824 -256 564 736 -119 -985 -358 587 231 -160 -431 -176 446 308 -401 -261 506 501 35
2502C5m44J74N06J74o50j74Q4N69J33l29l80J25M48m6q8o56J97N57J7n91k43N85
$$ 35 -409 -235 271 445 -205 -379 -295 274 407 78 -302 -177 271 225 137 -519 -322 235 252 -339 -582 3
2524CL41m21k75n2L51M08m92k60J73N25l14l02j85M73L74K01n69m71M33O13k48
$$ 3 344 -77 -352 -404 -53 355 -137 -397 -224 301 -13 -315 -500 -27 347 548 -21 -492 -59 554 306
2545C06p11O6j0R13m20p30M7N26N44m14m00k2O81n4n77l66M96M73qq04O2R38k22
$$ 306 -405 -339 -349 564 144 -586 -539 -13 531 117 -283 -305 376 322 -255 -621 -125 348 340 -464 -402 536 314
2568C14n92r4j81R58O48r90q98Q17N31J91p90r48N91R79k1q49j23M64O12p27m96
$$ 314 -278 -372 -553 405 1053 63 -835 -18 513 704 -86 -1034 -443 536 515 -334 -457 7 619 -108 -604
2589f04M49J078l1j200m82P8J420K08j106r52Q53J158p74p44j5J172K07l77j103
$$ -604 -155 923 892 -308 -790 -712 708 916 -190 -1142 -289 869 95 -649 -664 508 715 338 -765
2608g65K59R27O15j088r48M33J164L59j055n11O10O45m09o00q2O49P49q61q88
$$ -765 -506 421 1036 -52 -1000 -567 597 956 -99 -610 0 645 236 -364 -446 203 952 91 -797
2627g97J94J201L42j215o54K7J352O04j256p83O34J048k23q20j47K69R99k11o49
$$ -797 -603 598 940 -275 -929 -902 450 1054 -202 -985 -351 697 474 -346 -493 -224 775 564 -85
2646h5o63O76R52o86l00m52N59P41n25o47K13L54J14m66l13K73Q66k30p46m37
$$ -85 -748 -72 880 194 -106 -558 1 742 217 -430 -217 137 251 -215 -528 -255 611 381 -365 -802
2666h02N35Q08J53q28o83O52M82K00o57m16O30L45l57o11J9R52rl59k58M6K50
$$ -802 -267 541 694 -134 -817 -165 317 517 -140 -556 74 419 62 -549 -530 422 413 54 -204 -158 92
2687I2M02m09k07j39O98P2n30o20Q37N61n83m89k77P06N61n86m79j1M95M14m22
$$ 92 494 85 -122 -261 437 509 -21 -641 196 757 174 -315 -592 114 675 89 -390 -401 94 508 86
2708H6o43K02P12L2n60k65J13Q46j90r58J06Q90K62m99p14l1J144J46p35n53K88
$$ 86 -557 -355 357 389 -171 -436 -323 523 333 -625 -519 371 633 134 -580 -611 533 679 -56 -609 -321
2729c21J110j10j064k25L84J395o38j054j51P08R30o48r06K05Q12J43n55m74L53
$$ -321 789 679 -385 -610 -226 1169 531 -523 -674 34 964 316 -590 -385 427 570 15 -459 -106
2748a06N02j1j064K75M61O41k83j123P1Q48N06m61j013NJ259k8n64o58L26R31
$$ -106 396 385 -679 -404 57 698 415 -708 -637 211 717 256 -757 -752 507 479 -85 -743 -417 514
2768E14J80j054l90L97J115k35r37k90Q11K95l41n73J24P07k1l57p60M85R60p3
$$ 514 694 -360 -750 -353 762 527 -410 -700 111 406 65 -508 -384 323 302 -55 -815 -330 630 557
$$ [...]
8191F3
##END NTUPLES=NMR FID
##END=
