##TITLE=1H_SA_pyrether CNClEP
 DMSO-d6, 8 sc, 
 4.6.2019
##JCAMPDX= 6.0         $$ Bruker NMR JCAMP-DX V2.0
##DATA TYPE= NMR FID
##DATA CLASS= NTUPLES
##ORIGIN= UXNMR, Bruker Analytische Messtechnik GmbH
##OWNER= root
$$ XWIN-NMR		Version 3.5
$$ Tue Jun  4 14:31:06 2019 Russian Standard Time (UT+4h)  she@DPX200
##.OBSERVE FREQUENCY= 200.13155
##.OBSERVE NUCLEUS= ^1H
##.DELAY= (6, 6)
##.ACQUISITION MODE= SIMULTANEOUS
##.ACQUISITION SCHEME= undefined
##.AVERAGES= 8
##.DIGITISER RES= 18
##SPECTROMETER/DATA SYSTEM= spect
##.PULSE SEQUENCE= zg30
##.SOLVENT NAME= CDCl3
##.SHIFT REFERENCE= (INTERNAL, CDCl3, 0, 15.7039)
##AUDIT TRAIL= $$ (NUMBER, WHEN, WHO, WHERE, WHAT)
$$ ##TITLE= Audit trail, XWIN-NMR		Version 3.5
$$ ##JCAMPDX= 5.01
$$ ##ORIGIN= Bruker BioSpin GmbH
$$ ##OWNER= she
$$ F:/spectra/data/she/nmr/H-F/1/audita.txt
$$ ##AUDIT TRAIL=  $$ (NUMBER, WHEN, WHO, WHERE, WHAT)
(   1,<2019-06-04 14:29:44.17 +0400>,<she>,<DPX200>,
      <created by zg, POWCHK disabled, PULCHK disabled
       configuration hash MD5:
       00 E9 B6 7A A2 85 ED C7 34 08 36 98 17 FE 4E 26
       data hash MD5: 16K
       07 34 7D C5 E3 8B 12 33 02 90 CC 14 4E EB 88 A4>)
$$ ##END=
$$ 
$$ hash MD5
$$ 9A E3 1C 14 65 AC 8D E0 E5 8E 29 CA 5E BB CD 97
##$RELAX= 
##$RELAX= 
##$RELAX= 
##$RELAX= 
##$RELAX= 
##$RELAX= 
$$ Bruker specific parameters
$$ --------------------------
##$DU= <F:/spectra>
##$EXPNO= 1
##$NAME= <H-F>
##$PROCNO= 1
##$TYPE= <nmr>
##$USER= <she>
##$AMP= (0..31)
100 100 100 100 100 100 100 100 100 100 100 100 100 100 100 100 100 100 
100 100 100 100 100 100 100 100 100 100 100 100 100 100 
##$AQSEQ= 0
##$AQ_mod= 1
##$AUNM= <au_zg>
##$AUTOPOS= <>
##$BF1= 200.13
##$BF2= 200.13
##$BF3= 200.13
##$BF4= 200.13
##$BF5= 200.13
##$BF6= 200.13
##$BF7= 200.13
##$BF8= 200.13
##$BYTORDA= 1
##$CFDGTYP= 0
##$CFRGTYP= 5
##$CHEMSTR= <none>
##$CNST= (0..31)
1 1 145 1 1 1 1 1 1 1 1 1 1 1 1 1 1 1 1 1 1 1 1 1 1 1 1 1 1 1 1 1 
##$CPDPRG= <>
##$CPDPRG1= <>
##$CPDPRG2= <>
##$CPDPRG3= <>
##$CPDPRG4= <mlev>
##$CPDPRG5= <mlev>
##$CPDPRG6= <mlev>
##$CPDPRG7= <mlev>
##$CPDPRG8= <mlev>
##$CPDPRGB= <>
##$CPDPRGT= <>
##$D= (0..31)
0 1.2 0 0 0 0 0 0 0 0 0 0.03 0 0 0 0 0 0 0 0 0 0 0 0 0 0 0 0 0 0 0 0 
##$DATE= 1559644183
##$DBL= (0..7)
120 120 120 120 120 120 120 120 
##$DBP= (0..7)
150 150 150 150 150 150 150 150 
##$DBP07= 0
##$DBPNAM0= <>
##$DBPNAM1= <>
##$DBPNAM2= <>
##$DBPNAM3= <>
##$DBPNAM4= <>
##$DBPNAM5= <>
##$DBPNAM6= <>
##$DBPNAM7= <>
##$DBPOAL= (0..7)
0.5 0.5 0.5 0.5 0.5 0.5 0.5 0.5 
##$DBPOFFS= (0..7)
0 0 0 0 0 0 0 0 
##$DE= 6
##$DECBNUC= <off>
##$DECIM= 24
##$DECNUC= <off>
##$DECSTAT= 4
##$DIGMOD= 1
##$DIGTYP= 9
##$DL= (0..7)
0 120 120 120 120 120 120 120 
##$DP= (0..7)
150 150 150 150 150 150 150 150 
##$DP07= 0
##$DPNAME0= <>
##$DPNAME1= <>
##$DPNAME2= <>
##$DPNAME3= <>
##$DPNAME4= <>
##$DPNAME5= <>
##$DPNAME6= <>
##$DPNAME7= <>
##$DPOAL= (0..7)
0.5 0.5 0.5 0.5 0.5 0.5 0.5 0.5 
##$DPOFFS= (0..7)
0 0 0 0 0 0 0 0 
##$DQDMODE= 0
##$DR= 18
##$DS= 0
##$DSLIST= <SSSSSSSSSSSSSSS>
$$ [...]
##$SUBNAM2= <"">
##$SUBNAM3= <"">
##$SUBNAM4= <"">
##$SUBNAM5= <"">
##$SUBNAM6= <"">
##$SUBNAM7= <"">
##$SUBNAM8= <"">
##$SUBNAM9= <"">
##$SW= 24.9336996594482
##$SWIBOX= (0..15)
0 0 2 0 0 0 0 0 0 0 0 0 0 0 0 0 
##$SW_h= 4990.01996007984
##$TD= 16384
##$TD0= 1
##$TE= 0
##$TE2= 300
##$TE3= 300
##$TEG= 300
##$TL= (0..7)
0 120 120 120 120 120 120 120 
##$TP= (0..7)
150 150 150 150 150 150 150 150 
##$TP07= 0
##$TPNAME0= <>
##$TPNAME1= <>
##$TPNAME2= <>
##$TPNAME3= <>
##$TPNAME4= <>
##$TPNAME5= <>
##$TPNAME6= <>
##$TPNAME7= <>
##$TPOAL= (0..7)
0.5 0.5 0.5 0.5 0.5 0.5 0.5 0.5 
##$TPOFFS= (0..7)
0 0 0 0 0 0 0 0 
##$TUNHIN= 0
##$TUNHOUT= 0
##$TUNXOUT= 0
##$USERA1= <user>
##$USERA2= <user>
##$USERA3= <user>
##$USERA4= <user>
##$USERA5= <user>
##$V9= 5
##$VALIST= <valist>
##$VCLIST= <CCCCCCCCCCCCCCC>
##$VD= 0
##$VDLIST= <DDDDDDDDDDDDDDD>
##$VPLIST= <PPPPPPPPPPPPPPP>
##$VTLIST= <TTTTTTTTTTTTTTT>
##$WBST= 1024
##$WBSW= 4
##$XGAIN= (0..3)
0 0 0 0 
##$XL= 0
##$YL= 0
##$YMAX_a= 282986
##$YMIN_a= -382148
##$ZGOPTNS= <>
##$ZL1= 120
##$ZL2= 120
##$ZL3= 120
##$ZL4= 120
##$ABSF1= 10
##$ABSF2= 0
##$ABSG= 5
##$ABSL= 3
##$ALPHA= 0
##$AQORDER= 0
##$ASSFAC= 0
##$ASSFACI= 0
##$ASSFACX= 0
##$ASSWID= 0
##$AUNMP= <proc_1d>
##$AZFE= 0.1
##$AZFW= 0.1
##$BCFW= 1
##$BC_mod= 2
##$BYTORDP= 1
##$COROFFS= 0
##$CY= 11.3945322036743
##$DATMOD= 1
##$DC= 2
##$DFILT= <>
##$DTYPP= 0
##$F1P= 18.9103706918063
##$F2P= -1.10871071338519
##$FCOR= 0.5
##$FTSIZE= 0
##$FT_mod= 4
##$GAMMA= 1
##$GB= 0.15
##$INTBC= 1
##$INTSCL= 1
##$ISEN= 128
##$LB= 0.24
##$LEV0= 0
##$LPBIN= 0
##$MAXI= 10000
##$MC2= 0
##$MEAN= 0
##$ME_mod= 0
##$MI= 1.114404
##$NCOEF= 0
##$NC_proc= 0
##$NLEV= 6
##$NOISF1= 3.799351
##$NOISF2= 2.8
##$NSP= 1
##$NTH_PI= 0
##$NZP= 0
##$OFFSET= 15.70392
##$PC= 1
##$PHC0= -8496.604
##$PHC1= 9.60018
##$PH_mod= 1
##$PKNL= yes
##$PPARMOD= 0
##$PSCAL= 0
##$PSIGN= 0
##$REVERSE= no
##$SF= 200.130013532006
##$SI= 16384
##$SIGF1= 3
##$SIGF2= 2
##$SINO= 400
##$SIOLD= 16384
##$SREGLST= <1H.CDCl3>
##$SSB= 0
##$STSI= 0
##$STSR= 0
##$SW_p= 3612.71676300578
##$SYMM= 0
##$S_DEV= 0
##$TDeff= 0
##$TDoff= 0
##$TI= <>
##$TILT= no
##$TM1= 0
##$TM2= 0
##$TOPLEV= 0
##$USERP1= <user>
##$USERP2= <user>
##$USERP3= <user>
##$USERP4= <user>
##$USERP5= <user>
##$WDW= 1
##$XDIM= 8192
##$YMAX_p= 0
##$YMIN_p= 0
$$ End of Bruker specific parameters
$$ ---------------------------------
##NTUPLES= NMR FID
##VAR_NAME=  TIME,          FID/REAL,        FID/IMAG
##SYMBOL=    X,             R,               I
##VAR_TYPE=  INDEPENDENT,   DEPENDENT,       DEPENDENT
##VAR_FORM=  AFFN,          ASDF,            ASDF
##VAR_DIM=   8192,          8192,            8192
##UNITS=     SECONDS,       ARBITRARY UNITS, ARBITRARY UNITS
##FACTOR=    0.0002004,     1,               1
##FIRST=     0,             0,               0
##LAST=      1.6414764,     0,               0
##MIN=       0,             -382148,         0
##MAX=       1.6414764,     282986,          0
$$ Real data points
##PAGE= N=1
##DATA TABLE= (X++(R..R)), XYDATA
$$ [...]
2411a43K507r12l029j114K529K536j660l517l30L963K368l384k770M11L578Q01
2427A834k136k283Q54K377M87j017k828K46L352J332k347k852O85L492L61k587
2443a030j913J745K334J5k384j313J557J990K65j928k312J659K241K92k476j494
2459b752J916K510m14l050o70J755K423l41k838p52J946J750l44k295j452K088
2475e20K334m28l070o74K351K237j144k670k72K441J524j234k377l2K058J957
2491B481j529k378L1K399J770j939k888L82L489J272k420k655R18K787J161k418
2507D63k436P75L398M32k036k442J045L044O72k736k458J288L684K73l260j892
2523b186K000K672q0l080j373K195K691n02l268j296K371K520n69l427p00K569
$$ plain form
2411 -143 2364 1452 -1577 -2691 -162 2374 714 -2803 -3133 830 3198 -186 -2956 -2545 1033 1834
2427 1834 -302 -2585 -1731 646 1133 116 -2712 -2466 886 2218 -129 -2981 -2296 1196 1557 -1030
2443 -1030 -2943 -1198 1136 1151 -1233 -2546 -989 1001 1266 -662 -2974 -1315 926 1218 -1258 -2752
2459 -2752 -836 1674 1260 -1790 -2460 -705 1718 1377 -1461 -2213 -267 1483 1139 -1156 -2608 -520
2475 -520 1814 1386 -1684 -2358 -7 2230 1086 -1584 -1856 585 2109 875 -1502 -1534 524 2481
2491 2481 952 -1426 -1395 1004 2774 835 -2053 -1671 1818 3090 670 -1985 -1067 1720 2881 463
2507 463 -1973 -1198 2200 2632 596 -1846 -801 2243 2915 179 -2279 -991 2693 2966 -294 -2186
2523 -2186 -186 2486 2406 -674 -2047 148 2839 2337 -931 -2227 144 2664 2095 -1332 -2032 537
2539E37K448j655l500j05L186K159j926k851k20K812K173k249l150L36L019J646
2555B660k036l227P41L389R63k545k843J552K973L40k770j539J573K580j21k445
2571g55j883J145L008J57k835j937K178K967n56l501r16K485K517r17l037r04
2587b784K356J946j101k062o15K149J694p80k769n41K397K035j139l162Q1K794
2603D99J112k241j302P18K038N19j796j636K42K338J224j342k520L57K144J212
2619A566j935k112J703K004K42k387j214J365J784L51j449j277L47J849N18j505
2635a50j524O97K792R8k687j752K037K410m67k287j50J024J263m17j274r76Q07
2652e56K641J83k585j858J375L064q7k974p83K252J426j448k043o1K901J088j252
$$ plain form
2539 537 2985 1330 -2170 -2275 911 3070 1144 -1707 -1927 885 3058 809 -2341 -2005 1014 2660
2555 2660 624 -2603 -1862 1527 2490 -55 -2898 -1346 1627 1967 -803 -2342 -769 1811 1690 -755
2571 -755 -2638 -1493 1515 1672 -1163 -3100 -922 2045 1489 -2012 -2928 -443 2074 1157 -1880 -2784
2587 -2784 -428 1518 417 -1645 -2260 -111 1583 803 -1966 -2507 -110 1925 786 -2376 -2295 499
2603 499 1611 -630 -1932 -1214 824 1343 -453 -2089 -1847 491 1715 373 -2147 -1790 354 1566
2619 1566 -369 -2481 -778 1226 1468 -919 -2133 -768 1016 1367 -82 -1359 -1012 837 1355 -150
2635 -150 -1674 -977 1815 1913 -774 -2526 -489 1921 1454 -833 -983 41 1304 887 -387 -1363 -556
2652 -556 2085 2268 -317 -2175 -800 2264 2177 -797 -1580 672 2098 650 -1393 -1454 1447 2535 1283
2669A283j642r64O24K599K09k586p04J995K142k088l221N38M075J199k795k651
2685a987J203J854K94r17j189K96K098P36k248k812N90M410J365l568k840J946
2701g69K718n81k871j17K697J278j611k158j314J929K572P01k394k543J443K674
2717A654n34l340N6L497J969l086l540N81L188J277r33j328o46R25P27q57j559
2734a949J3L439J970k827m433O22L947J427k684j208J785J234j774j950K83J824
2750b81J671L76j488l361J58L067J947k281j426J905J816k213l129N11L818J369
2766B459j875j498n57o2R49R33j82o82P50J323j054l287n36M023K782k067k928
2783a509j68J717j52o14J06J433N19n29n62k099q04K491L260n44l373j184K406
$$ plain form
2669 1283 -359 -1323 -699 1900 2109 -477 -1181 814 2956 868 -2353 -1815 2260 3459 664 -1987
2685 -1987 -784 1070 1364 447 -742 -446 1652 2388 140 -2672 -2082 2328 3693 125 -2715 -769
2701 -769 1949 1368 -1503 -1620 1077 2355 744 -1414 -2728 -799 1773 2474 80 -2463 -1020 1654
2717 1654 1120 -2220 -2164 1333 3302 216 -3324 -2743 445 1722 789 -539 -1185 -260 467 -390 -1949
2734 -1949 -1936 1503 3473 646 -3787 -3165 782 2209 -475 -1683 102 1336 -438 -2388 -2105 -281
2750 -281 1390 1766 278 -3083 -2925 142 2089 -192 -1618 287 2103 -110 -3239 -2728 1090 2459
2766 2459 584 -914 -1471 -1533 -584 349 167 -515 235 1558 504 -2783 -3319 704 3486 1419 -1509
2783 -1509 -1677 40 -112 -726 -620 813 1332 803 241 -1858 -2662 -171 3089 2545 -828 -2012 394
2800C94O59j777o70K481J466r93k498j010Q77J044K364K57k110j776J138J153
2816I99j352j684K287L104n54m354j394K168K227J58m54k69j015M0K16l38j152
2833a367J536L270l26l908l010K211L912l8k590K31J673o05j939o57Q04K132J328
2850B657m78k611k472J071L464N70k746p45K729O24l506j904K163L713L65k148
2866G46j865n94Q40J002N56r41r4J594N94k993k974K493M447M5l156k126J448
2883i78J333n77j324R64J667K92j219k129j304J924K887J200k717k386J263J819
2899G15j039j956J517L095L81l386k185N75J689J581K61q64j283J24R57o84j496
2916a998O70L186J035l460l002J218L022N15j310l44P84K27j076p24l6J087J874
$$ plain form
2800 394 1053 -724 -1394 1087 2553 1560 -938 -1948 -1071 -27 2337 2594 484 -1292 -154 999
2816 999 -353 -2037 250 3354 2800 -1554 -2948 -780 1447 1605 1151 882 -133 -93 123 -215 -1367
2833 -1367 169 3439 3113 -795 -3805 -1594 2318 2280 -310 -79 1594 989 -950 -1607 -803 1329 2657
2850 2657 2179 -432 -2904 -1833 1631 2201 -545 -1290 1439 2063 -1443 -3347 -1184 2529 2894 746
2866 746 -1119 -1713 -873 129 685 -256 -350 1244 1838 -1155 -4129 -1636 2811 2856 -300 -2426 -978
2883 -978 355 -222 -1546 -582 1085 1377 158 -1971 -3275 -1351 1536 2736 19 -2367 -1104 715
2899 715 -324 -2280 -763 2332 2713 -673 -2858 -2283 -594 987 1248 384 -899 -775 182 -502 -1998
2916 -1998 -1328 1858 2893 -567 -3569 -2351 671 1186 -124 -468 316 543 -533 -1257 -1293 -206 1668
2933A668R03k024k817k4K729J038j546o78J529M29j369k114Q35K003J289l17j179
2950C55j265o07J622J383q26j341J468J160j520k432J66K845J341j215j351m58
2966f75J17M88P08j24o32O07J208r52k516l50K780K291j583k233j34J148O31j131
2984c52k93J290R09m73j130j087n17K082K077r41k622l20J911P38j730q88J696
3001C50J628k32k471r69R12J457Q66q57j171l88J328J79j230j182J649K386p16
3018A539k445j318J673K270j079j313%R49P1l83j068m13J793J522p41k496r52
3035b391J968J826q91j947N19J610P21k321j116J188J993M4j303j103m69J771
3051I9P80r05j184K71J824N05k555j071J525K247j21k280p41P49J297P8j349l14
$$ plain form
2933 1668 2571 547 -2270 -2294 435 1473 -73 -751 778 1207 -162 -2276 -1441 562 1851 1534 355
2950 355 -910 -1517 105 1488 662 -679 789 1949 429 -2003 -1837 1008 2349 1134 -217 -675
2966 -675 -558 -70 638 514 -118 489 1697 745 -1771 -2121 659 2950 1367 -866 -1000 148 779 -352
2984 -352 -645 645 1554 1081 -49 -1136 -1653 429 2506 1565 -1057 -1377 534 1272 -458 -1346 350
3001 350 1978 1746 -725 -1694 -782 675 1541 684 -487 -875 453 632 -598 -1780 -131 2255 1539
3018 1539 -906 -2224 -551 1719 640 -673 -673 276 347 -36 -1104 -1517 276 1798 1057 -1439 -2391
3035 -2391 -423 1403 512 -1435 -916 694 1415 -906 -2022 -834 1159 1203 -100 -1203 -1672 99
3051 99 879 -26 -1210 -939 885 1390 -1165 -2236 -711 1536 1415 -865 -1606 -857 440 518 -831 -1145
3069a145R41J284l45j787r32J505J801n69j635m02J312J019p80j308N4J706L17
3086A036q34j089l61J256J251o41j405k67J423R35j203j268M05J822M11j470j189
3103a188P21J075O63j178o78J46Q90O50j061p87k0J921K97j254j117N09J491K25
3121A305j377q04P47R53J05j077l07M03J387l8j354o95L95J588J31j631n18N89
3139a98J303l96j256k12J117R00n37j252k23Q32J049n74j307L24O49P65m02j532
3157i50J03J465N88q90j356rJ531M58o16r63j12J284P13j299q25J07J363O45j164
3176G3j064M29J158K47q23j437Q22J137O15j302j225P49J357j97j247n25P47J291
3194H05k96q73j192J204J233j97j509n29R83J181J22j858o24J566R81n75j034
$$ plain form
3069 -1145 -204 1080 735 -1052 -1984 -479 1322 753 -882 -1284 28 1047 267 -1041 -987 719 1036
3086 1036 202 -887 -1248 8 1259 618 -787 -1054 369 1304 101 -1167 -762 1060 1471 1 -1188
3103 -1188 -467 608 1271 93 -585 -439 451 1101 40 -747 -767 1154 1451 197 -920 -411 1080 1305
3121 1305 -72 -876 -129 824 929 -148 -455 -52 1335 1297 -57 -752 -357 1231 1362 -269 -787 -198
3139 -198 1105 709 -547 -759 358 1258 721 -531 -754 78 1127 553 -754 -430 219 984 582 -950
3157 -950 -847 618 1206 316 -1040 -1049 482 940 324 -639 -751 533 1246 -53 -878 -771 592 1237 73
3176 73 -991 -562 596 843 20 -1417 -595 542 1157 -145 -1370 -621 736 539 -708 -1233 -486 805
3194 805 509 -364 -1556 -352 881 684 -825 -1354 -371 810 932 -926 -1550 16 997 422 -612
3211f12p20J511R81p30j289l20J269J019j058j313Q8J731M20o74j477O1J583M29
3229H99q99r39q8J281Q17j056j648Q34J603K41j217j021P26R40L47p70j047L37
3247f60J585p4j260o35Q87R90K55j501o17Q38J253j87j590k03Q02J169l59r63
3265b70m01Q78P17j4j354j84Q29R88n07j277j03J308N26o56j112J21Q24P43p09
3284C47r80L81Q18M39m93j212K20J019N65n35j164K99J059J35p61o61M20P27J78
3303H01o98q21N34J022L64r48p28j51J294K31j059o68P66J022k54j117j23N45
3321A2R31k59r75m62P20O74J3j166o51P73J536o73j312m03J009J327p17j326L62
3340e87J072q9n27l30j81Q47P12m39j250j45N20J128l10j385J4J267M10j282r77
$$ plain form
3211 -612 -1332 179 1160 430 -859 -1179 90 1109 51 -1262 -1174 557 977 303 -1174 -1113 470 899
3229 899 0 -939 -1027 254 1071 15 -1633 -799 804 1045 -172 -1193 -467 473 820 50 -997 -660
3247 -660 925 851 -409 -1044 -157 833 1088 -413 -1030 -192 1061 874 -716 -919 -117 1052 693 -270
3265 -270 -671 207 924 910 -444 -628 201 1189 682 -595 -698 610 1136 480 -632 -511 313 1056 347
3284 347 -633 -252 566 1005 512 -700 -480 539 1104 569 -595 -296 763 898 137 -524 -104 623 801
3303 801 103 -718 -184 838 1202 254 -474 -625 669 900 -159 -827 -61 961 707 -410 -533 12
3321 12 943 684 -291 -753 -33 641 654 -512 -1163 -390 1146 473 -839 -1242 -233 1094 377 -949 -587
3340 -587 485 396 -131 -461 -642 205 917 478 -772 -917 -397 731 421 -964 -950 317 727 -555 -1532
3359a532J058J353K2r94p84K86O16K24q0p23J04J000J59j234j219J269J700l03
3377I22j409l44Q86N28p17l90L90K52K66l25n98o73O53J533J23j324q13J056O26
3396F42p27p16M85J076p4r38n67M52L57N87K62q00n83K83J132m56j264M43J458
3415A052M17j515j262P07J266J81p13j60L08j48J16n1n86J09R85Q58j362k008
3433a806J122J807j44j150k63J283m8j063m98K93J033L32k02o68q55m0J269Q00
3451A202r22q93Q23R15j029j486M13K133J64j330l17qk65L15N02L87m70l24J134
3470I44p24j462j75K150J213j629j462N55R29n87m67Q28J122p27n77j63l82l62
3488i76Q54J878p89j970R5R69L99j448K73J431Q31j485j533N25P87K49O52K59
$$ plain form
3359 -1532 -474 879 901 -93 -877 -591 25 249 169 -554 -450 550 709 -525 -1744 -475 1225 922
3377 922 -487 -831 55 583 -134 -524 -134 118 384 59 -539 -1212 -559 974 1097 -227 -1040 16 642
3396 642 -85 -801 -316 760 686 -252 -819 -367 -10 577 839 39 -544 -261 871 415 -849 -406 1052
3415 1052 1469 -46 -1308 -601 665 846 133 -27 281 133 249 198 -388 -279 706 1564 202 -1806
3433 -1806 -684 1123 979 -171 -434 849 801 -262 -760 -467 566 898 696 28 -827 -867 402 1202
3451 1202 280 -613 210 1125 96 -1390 -977 1156 1320 -10 -327 -335 -600 -285 217 604 134 -190 944
3470 944 220 -1242 -1417 733 1946 317 -1145 -590 339 -248 -715 113 1235 508 -69 -232 -614 -976
3488 -976 -122 1756 967 -1003 -908 61 460 -988 -715 716 1547 62 -1471 -946 -159 90 742 1001
3506A001j110q40O49M66o77m12J126J428j072k262J60J627P25q07j12M58n9j186
3524h97Q9N88J4K12O11M24j772j105J280J547p45q69L19J197j020j149K91J375
3542C90O77m93l65n33q00J97J670L49j318l53J356N2j743q78K359Q67k15k024
3560h05M13L14m57J62R49L31q64j48M94n81j352J106K093J13k350k86J226J22
3578D80j070R4J307O74j220n93q6k9j51J304R95j411j472P06J372r07r62Q40K129
3597B000q58j943k22O83J093n92L31J79p11n06L02O01n99l93K059L67j763j924
3615a896J139J914o11j034N54O40n40r78k9J119J7L63J24m53j672o7K130L89j022
3634H7p69R43P24j641r75J713Q21k97q35L57o42l02M21J161k21q79j8J352q27
$$ plain form
3506 1001 -109 -949 -300 166 -511 -923 203 1631 559 -1703 -1543 84 809 2 -110 348 289 -897
3524 -897 -808 -220 -206 6 617 1041 -731 -1836 -556 991 246 -623 -304 893 -127 -1276 -985 390
3542 390 1067 574 209 -324 -1124 -927 743 1092 -226 -579 777 829 -914 -1792 567 1434 1219 -805
3560 -805 -392 -78 -535 -373 576 907 43 -105 389 -192 -1544 -438 1655 1768 -582 -868 358 480
3578 480 -590 -496 811 1485 265 -328 -414 -443 -594 710 1705 294 -1178 -472 900 -7 -969 -129 2000
3597 2000 1142 -801 -1023 -340 753 161 492 671 -40 -546 -244 357 -242 -635 1424 1791 28 -1896
3615 -1896 -757 1157 546 -488 66 706 166 -812 -841 278 295 658 782 329 -1343 -1410 720 1109 87
3634 87 -682 261 985 -656 -1631 82 903 606 -229 128 -514 -816 -395 766 545 -334 -352 1000 173
3653A73j820Q86J896M64k120m90R75J2j39q2R74l05l80K8k08p35n4J022J211q44
3673D64j683O15J131m65j121N97J307k29j054M9J98l68L01P60jr57l21R73M44
3692F40j312k06J186R80j387p78K36J254j08m25q2J9m36j14P22k42m99M19J076
3711I43k41j711J60J210N17o45q67N99N54p24m50Q45o1j1K88J74o81q67P04J330
3731A066n28j031K38J230j46j399J72Q35O17q65m37K17j1l23N83M54p65LP10p0
3751E50p86r05J357R78m28j425M43Q22j79l10k45J94L84o27J85J38p34K68J181
3770H61k33q49m72Q45O67p29m55J00Q03n02p14M16K05K10K65n69Q8O9j71O64m94
3791El93p4R42M6q15l10N88M16m31k31K65P3Jk14r1k08L87L21p1n13n67P53K34
$$ plain form
3653 173 -1647 -761 1135 1599 -521 -1011 -36 -24 -163 -245 729 424 44 72 -136 -871 -925 97 1308 464
3673 464 -1219 -604 527 62 -1059 -462 845 616 -438 -389 -191 -559 -258 502 501 -456 -777 196 640
3692 640 -672 -878 308 1288 -99 -877 -641 613 505 80 -2 17 -419 -533 189 -53 -552 -133 943
3711 943 702 -1009 -849 361 878 233 -634 -35 519 -205 -655 190 129 118 406 580 -101 -968 -264 1066
3731 1066 538 -493 -255 975 829 -570 -398 437 1054 189 -248 -31 -42 -365 218 672 -93 -90 620 550
3751 550 -236 -1141 216 1194 766 -659 -216 606 427 117 -128 66 450 -177 8 146 -588 -320 861
3770 861 628 -221 -693 152 819 90 -365 -265 538 36 -678 -262 -57 153 418 -151 -63 6 -165 499 5
3791 5 -388 -462 480 526 -289 -599 -11 405 -26 -257 8 81 82 -132 -223 -431 -44 277 206 -307 -874 -121 113
3814A13M44j022k78R75K9m77L5k9L81j26J66k13o94Q00K87j07o43k84N20M86m36
3835g3k09k69Q19N5m31m82N35L08K07n00Jj06l7N72k82o41q5Q15K07m29p63Q97
3857A09K21k9o88J81Q1R8k4lr2J23j2L64k55o29L97N32l16k78j36N51K22l15n37
3880d35K74K51M2N9l21l8k01Q16l26j56k67O02J05n8n64l63O04M11k73l50K93
3901A05R0j70J67l47J42K84P9j12m99M1L79K86l96l86K66P24m84p65J16N19L48
3922C87m90j05J42K6K25Q4m72p6J56L84K3o16J49Q1J83r7o2k64M26K68p2o45J94
3945a71P0N84k71l33l66M50M93q0o21k39Q03l6n39R9L28j54J42l26j3J5J12O8
3967A5J1j69K5J63M47p23j29L4K56L63o45K03M62j49j56k05l57N45O5M3p6n97
$$ plain form
3814 113 557 -465 -743 232 261 -216 -181 -210 171 45 211 -2 -696 104 391 284 -359 -643 -123 363 -73
3835 -73 -282 -551 268 323 -108 -590 -55 253 460 -40 -39 -145 -182 390 108 -533 -618 197 404 -25 -788 109
3857 109 330 301 -387 -206 -125 -27 -51 -54 -146 -23 -35 329 74 -555 -158 374 58 -220 -356 195 417 102 -435
3880 -435 -161 90 132 191 -130 -168 -369 447 121 -35 -302 300 405 347 -217 -580 24 435 162 -188 105
3901 105 195 25 192 -155 -13 271 350 238 -261 -220 159 445 49 -337 -71 653 169 -596 -480 39 387
3922 387 -103 -208 -66 -40 185 269 -203 -279 -123 261 284 -332 -183 -102 81 -16 -78 -342 84 352 280 -365 -171
3945 -171 -101 483 212 -121 -487 -37 456 376 -245 -484 319 283 -256 -157 171 17 159 -167 -180 -165 -53 15
3967 15 26 -143 -118 45 492 -231 -360 -326 -70 293 -352 -149 313 164 8 -197 -554 -9 56 99 23 -574
3989e74N90M91ro40n93M73O28p2r62O6N83M05l30j76m6J81r5J69k15k02J33N84
4011C89m60k79L5M95O44o87o25M09L57o4o87O07J01l2j20J85l24p36R16J82l9
4032B67p45L7P73J8p59j43Q88K31p58k4O14j89l80K2P07o75j18L54L84o25p48
4053h69J014O42n38n69k82J086j69o46M41r3J45q1l57M90k09LQ29m56q62k36M87
4074b30Q00o52p84P86O28m27l67j7N77k50k63N95k20l77J04N30l78m56J13P96
4094E08R4j174L8L56P68o93j61M85q7l46j84P49J59o19K07M94p84q89O71Q28J40
4115E60j014P0R43l11j013L86P12J76q68K91K11m22n5K25J014r19o90M51R24o25
4135D6r81P31J069m69j034L27O74m09l27O73L03p33m60M80M89p03j46J081L00
$$ plain form
3989 -574 16 507 498 -142 -735 -262 366 294 -668 -602 -19 386 56 -120 -166 15 -80 89 -126 -328 -195 389
4011 389 -71 -350 -315 180 824 137 -488 -79 278 214 -473 134 235 203 83 268 -56 -792 124 306 267
4032 267 -478 -441 332 350 -409 -552 336 567 -191 -215 399 210 -170 -148 559 -116 -234 120 504 -121 -869
4053 -869 145 787 249 -320 -602 484 315 -331 110 17 162 81 -276 214 5 8 837 381 -481 -717 -230
4074 -230 570 -82 -866 -80 548 121 -246 -263 314 64 -199 396 176 -201 -97 433 55 -401 -288 508
4094 508 602 -572 -534 -178 590 -103 -264 221 134 -212 -396 353 512 -107 100 594 -190 -1079 -408 420 560
4115 560 -454 -384 559 248 -765 -379 333 509 -359 -68 143 -279 -334 -109 905 -14 -704 -253 671 46
4135 46 -935 -204 865 396 -638 -311 363 -46 -373 300 603 -130 -590 -110 379 -324 -470 611 911
4154I11j190p70J040M00o32k60P93N06r61p31N69Q59r36L10P58q8j256j76J172
4173C18L77j088l64J396j41j308j03R70N57p48K38L28k17r30M65Q70k12j015N64
4192d3R21m12j553O79J270J17j346lQ97k13j043M78J078n73o26L30M78j121m96
4211a181J329P68q28q71P37Q95q01j124J137Q64n99j064N05P10r39j14J181M73
4229A078j338n20J020K68j237Q5J184N08j117r20J006N06o56m77J324J77j239
4246c48m17J181j78q80L50J268j45j725K30R44M56j166m9J037M26k102K67J121
4264B70q7m70L5J093q81j106N48J494n15j161O98Q22k80j620O21J040k8r69P07
4283B11M57q97q15Q64P77o00p46O04Q55j445r0Q06J187p21j331P85N83r49k33
$$ plain form
4154 911 -279 -1049 -9 391 -241 -501 292 798 -163 -894 -325 534 -402 -92 666 578 -678 -854 318
4173 318 695 -393 -757 639 498 -810 -913 57 614 -134 104 432 215 -715 -250 620 408 -607 -43
4192 -43 878 466 -1087 -408 862 979 -367 -370 527 314 -729 -251 827 254 -372 -42 436 -685 -1181
4211 -1181 148 916 88 -783 -46 849 48 -1076 61 925 326 -738 -233 477 -462 -576 605 1078
4229 1078 -260 -780 240 508 -729 -644 540 1048 -69 -989 17 523 -133 -610 714 891 -348
4246 -348 -765 416 238 -642 -292 976 831 -894 -664 280 736 -430 -479 558 984 -1118 -851 270
4264 270 183 -287 -252 841 -40 -1146 -598 896 381 -780 -82 740 460 -1160 -539 501 473 -496 211
4283 211 668 -229 -1044 -180 597 -3 -749 -145 710 -735 -825 -19 1168 447 -884 -99 484 -465 -698
4302f98Q75Q00o23q11O91J69j087j98J519K99j134o37J015L07j265j79J402O73
4320A118j425l81Q25J35k35l26J007l4j548L13O47L15j073J61J208j9j357m40
4338a109J372%o97K72J233m97j306L5J285l82o20L65R58p54j072M18J049J54j299
4357e95O19O28l92j125O73P45p19K6K71N53r03n75P54J122j239o20R48L11j000
4376e18l12O84Q38l25j099O09L68m46n24R77L40q00j43P99l8r23l09J402J1q78
4396b87k45Q14N2r35j99R96K81o49k94N27J61o21M86O68k16j130P3Q91j53o66
4416d46J29J037j40r12k57Q31j76k58J99K25j00l67J07N36j64q29M25P46n02m13
4436c29j38Q75k41m37K19L75l92j05m6K30J05l68M85J71m66l22L29K87m13m76
$$ plain form
4302 -698 177 977 354 -457 234 403 -684 -882 637 936 -198 -835 180 487 -778 -957 445 1118
4320 1118 -307 -688 137 272 37 -289 718 684 -864 -551 96 411 -662 -501 707 688 -669 -1109
4338 -1109 263 263 -434 -162 1071 574 -732 -697 588 206 -414 -49 909 155 -917 -499 550 704 -595
4357 -595 24 652 260 -865 -192 553 -166 -140 131 684 -219 -794 -40 1082 -157 -777 171 482 -518
4376 -518 -830 -146 692 367 -732 -123 245 -201 -725 252 592 -208 -351 448 410 -513 -822 580 591 -287
4396 -287 -532 282 334 -601 -800 196 477 -172 -466 61 222 -399 87 755 539 -591 -518 373 220 -446
4416 -446 -317 720 580 -332 -589 242 66 -192 7 232 132 -235 -128 408 244 -585 -160 586 84 -329
4436 -329 -467 408 167 -270 -51 324 -68 -173 -219 11 116 -252 233 404 -62 -384 -55 232 -181 -657
4456f57Q30L28o09o72P18O83n55q1O6O4j01j45K07J17l56J98K77J17m24m36N42
4477A11K30n77q7K41L80o60J17N16Q0o61M49J5j64m24O34Q1k11m01J49M76r8l60
4499a64M7L59L10p13J21K86k00R6m6J28l36j05p7J66P1l38L78N42n40j96L16J79
4521B84k9m14J73L62l23k85M85K09n64K2J28K42m24k18L11M18j57l88Q9J06K64
4542B91o36M87q9K4l22M21J36n7m06M2N08o00k7M16J3j76j33J03K94m43j44N51
4564B53j74k1j42K38j8l93J75K83j61R8m64K02Q6k17N18LJ70m80K54l06J02J43
4586A49j59K9J09q9K87j87k19j03L04K39j70m27J39K29J74j86l66L78l25%L68
4607A74m6l60O27m57R5O1l19N15J6q8k71kJ52j1j85j5J82j25j94K85J03k1j66
$$ plain form
4456 -657 173 501 -108 -780 -62 621 66 -15 51 115 14 -131 76 193 -163 35 312 429 5 -431 111
4477 111 341 -236 -323 -82 298 -362 -245 271 351 -310 139 154 -10 -434 200 281 70 -331 -182 294 196 -164
4499 -164 -117 242 552 -161 -40 246 46 142 96 224 -112 -217 -294 -128 -57 -395 -17 525 -15 -211 105 284
4521 284 255 -159 14 376 53 -232 253 462 -102 -80 48 290 -134 -352 -41 377 220 -168 -79 27 291
4542 291 -345 142 53 77 -245 176 312 255 -151 -109 399 -201 -228 188 201 25 -108 -5 289 -154 -298 253
4564 253 79 58 -84 154 136 -257 -82 201 40 138 -326 -124 -38 -255 263 266 436 -44 210 -96 6 149
4586 149 -10 19 128 39 326 139 -80 -183 121 360 190 -237 -98 131 305 119 -247 131 -194 -194 174
4607 174 128 -232 395 -62 33 94 -225 290 306 218 -53 -55 97 86 -99 -114 68 -57 -251 34 137 116 -50
4630e0J99J5l30K59N6o0p1k81M30j63l3j41O9R9J32j17K60n24K41k19N75m62j82
4653b98K10L82n8l35P4L93l24L3r6M3n7p8J24j74M04l89L20K3k88j4L37m0l06
4676a14J4K12K04l88m9J93k3n4k55L91J3K88m68M42l45k69k4K51J19p5lj43l9
4699a22K5j08J32K49q4l13L65K43o00L60M2m9l83J71L02p8l55j74N83j08l69J03
4721a68M94m08P9j00L34j4l69J18O3M00o93j50N61J88p69K28N34k90m10L71K14
4742B13k82k2L03j23P9m49j0O95m56j52J71O06n89o2L7K22r8n92N90L01n23j86
4764c27L57K50l25l06Q28k08m89M3J20K08k46o8N13N0o17k75M79K61m34K36L28
4785C78j76l65r7K38K68p21K03P59k42o56J23M79k52m23N11N44l93n16J47M84
$$ plain form
4630 -50 149 164 -166 93 149 89 18 -263 167 4 -29 -170 -101 -2 130 13 273 -251 -10 -229 346 -116 -298
4653 -298 -88 294 236 -99 -25 368 44 77 -19 24 -33 -111 13 -161 243 -146 174 197 -91 -105 232 192 -114
4676 -114 -100 112 316 -72 -121 72 49 -5 -260 131 144 432 -36 406 61 -208 -232 19 138 63 60 -83 -122
4699 -122 -97 -205 -73 176 92 -221 144 387 -213 147 189 140 -243 -72 230 152 -203 -377 206 98 -271 -168
4721 -168 326 -82 -3 -103 231 217 -152 -34 29 429 -264 -414 147 335 -434 -206 328 38 -372 -1 213
4742 213 -69 -91 212 89 168 -281 -291 404 -52 -204 -33 573 -16 -78 -41 181 83 -509 81 382 -141 -327
4764 -327 30 280 -45 -351 477 269 -220 -177 -57 151 -95 -163 350 400 -217 -492 -13 248 -186 50 378
4785 378 202 -163 -260 -22 246 -475 -272 487 245 -411 -288 191 -61 -484 27 571 178 -338 -191 293
4805B93j34m36K60N56o10l84L84P81q05m69M85P26r88J62q8M56m89j78M69L96
4825C87o33k87O73L11q10J18O25J07q26m22R76K02l44k29L71K47n97q8N45P9l30
4846G5k66N27n15k02j48J367r4r03q8M19J33p11j21J190n2j049L24K86K5o15N07
4867H9L28j5p25M9M62l51k17L13M42K14j239M34N81l27o20M88N78o17l07K25N90
4888C75l70k86L84N15r35o23J026N84q30l39R25M79q54p05N38M45m24j43O81R3
4908E36p08m64O99L72m56k89O48K78j175J10O90M54r52p1O07qq06j36R46k6m12
4929a63p6O99l54q08K01P54J34o18K2N14j58o52j04J204m40n07R9M56k96m81O19
4950D5M82j61p38K47K80m13p03Q81R21o57o63N38L11m71n83N44J050r24j65N8
$$ plain form
4805 293 159 -277 -17 539 -71 -455 -71 710 -95 -564 -79 647 -341 -179 -267 189 -300 -478 -9 387
4825 387 -246 -533 140 451 -359 -241 384 491 -335 -757 219 421 77 -152 219 466 -131 -219 326 405 75
4846 75 -191 336 -179 -381 -529 838 744 -159 -247 172 305 -406 -527 663 611 -438 -114 172 197 -418 89
4867 89 417 402 -323 -274 188 -163 -380 -67 375 589 -650 -216 365 38 -582 -94 484 -133 -440 -215 375
4888 375 5 -281 103 618 -317 -940 86 670 -160 -499 426 905 51 -654 -116 329 -95 -238 443 536
4908 536 -172 -636 63 435 -21 -310 338 616 -559 -449 241 695 -257 -328 279 271 -535 -671 275 249 -163
4929 -163 -239 460 106 -702 -501 253 387 -231 -209 305 147 -505 -609 595 155 -352 -253 203 -93 -574 45
4950 45 527 366 -372 -125 155 -258 -961 -80 841 184 -479 59 370 -101 -684 -140 910 -14 -179 -121
4970a21M31m05l84N28R85j204l60L10M66n98m1M82O35o61p50Q45K89m64m31J156
4990G08m3r83l47O70L71n33l04P74M51j264k16J139N3n78J40N31m90m62l92J155
5010C80j63j16l67N88k2r19K83N63J30m12J51K23j46r25N27M29l0m85M52J47l31
5031d3p77M66J208o13r99M56Q80q34n00O55O77k42n37J77K02j14o27N82M77m92
5051Bm56J97O72o71k19M65N71j076j85M20N92k44n09N63N71p88l92P40k65k62
5071b74j0Q99pr97j69M82K81o87K82O42n6r07J70K88M40p91P53j45m5m02j35N04
5093A16J09n36P1M77j26o50J63O73p9m26L87M4k21p24L83O47j39q91Q40K06l32
5114ho80N09N85n38m0K09K90p20Q5K74L90l44K9Q9n8k05k32L16L30j22l15M01
$$ plain form
4970 -121 310 -95 -479 49 1034 -170 -530 -220 246 -352 -393 89 724 63 -687 158 447 -17 -448 708
4990 708 665 -318 -665 5 376 -157 -461 313 764 -500 -716 423 476 -102 38 569 79 -383 -775 380
5010 380 217 101 -266 322 300 -619 -336 227 357 -55 96 319 173 -752 -225 204 174 -311 141 288 -43
5031 -43 -820 -354 854 241 -758 -302 578 -256 -756 -101 576 334 -203 -26 176 62 -565 17 494 2
5051 2 -454 -257 415 -256 -475 -10 561 -515 -700 -280 312 68 -441 122 693 -95 -487 253 -12 -274
5071 -274 -284 615 608 -389 -558 -76 205 -482 -200 442 386 -521 -351 -63 377 -414 339 194 149 -253 -388 116
5093 116 225 -311 -240 237 111 -539 -376 297 218 -208 179 223 2 -722 -339 308 169 -722 118 324 -8
5114 -8 -688 -179 406 -132 -172 37 327 -393 -308 -34 356 12 41 130 72 -133 -365 -49 281 159 -156 245
5136B45k2j51m30M51K20n77J61L6o0J45k30L43J70l66k79K62j82m8q4M74qr8j43
5159a71L25N3m28q7P81k40m61L41n1J62l97n7N19K31r08M5L90L94n81p0M40j65
5181F5k99L4l5L41m71K50N08n67l97N99K63l9m74N09L0l42l4l63Q35k9k09j9N3
5204B09k88k08K11L03J33n27M90j1m96j09N61M9m47q0K52K10l23o4J02J91l05
5225a47K78K6j46j34k6M08k99o4R6O8R2q0l38N47o4k57N9K82j06l64J03K47k24
5248d3K46l05K18l05M8J07L11j67m00J19K89K3l13k22M78R9l14j06k3N09j84m
5270F1o0J54m9Q0k69O5%J13n2j12j46J32K68k11J22j49J27K6l14K22M52l30l38
5293b08M55P3l90k47K77N6j26N7J71R7m46k4j08P36l41j89N8J72j45k41K49J13
$$ plain form
5136 245 223 72 -358 93 313 -264 -103 -67 -127 18 -212 131 301 -65 -344 -82 -264 -312 -396 78 70 -28 -171
5159 -171 154 207 -221 -308 473 233 -228 113 62 224 -173 -230 289 520 -388 -343 47 441 -140 -210 230 65
5181 65 -234 -200 -235 106 -365 -115 393 -174 -571 28 291 252 -222 287 317 -25 -59 -422 413 384 175 156 209
5204 209 -79 -287 -76 227 360 -167 323 312 -184 -293 268 317 -130 -210 42 252 -71 -135 -33 158 -147
5225 -147 131 157 11 -123 -149 259 -40 -104 -8 60 152 72 -266 281 217 -40 19 301 195 -169 -66 181 -43
5248 -43 203 -102 116 -189 -141 -34 277 110 -290 -171 118 141 -172 -394 84 183 -131 -237 -260 249 65 61
5270 61 1 155 106 186 -83 -18 -18 95 43 -69 -215 -83 185 -26 96 -53 74 100 -214 8 460 130 -208
5293 -208 247 320 -70 -317 -40 16 -110 -53 118 215 -231 -255 -363 373 32 -157 -99 73 -72 -313 -64 49
5315D9n8M2R1Q9k19k46M66Q5k70oN4k20o5L97K2l12L2J5q0J04p8K4J59O4l11K49
5341G7K5K98m74JL73n72J57K50j63J66j40o2N99n22n7L0O5N8k92l2L29m2k07J39
5365DQ6k03j57M46r1l47O57l94j30j09j7M78j12j16l8O2j38j83J49L34j81p8N0
5388b8j31L00k86q2L61j97J73j02J08j94k07K50K20L39n26l20K57J62k11n0R2
5409g2l9J16p0J74j96k99J77N54m22j20K70M4j73K19j60K15l49j94m5L92J2j10
5431g6Q5K74m45q4L29q8O8l16M48J91n48k3L72n4j21o1L17K8l61J20j31J20j89
5454a45J39L0M0j0k76M17p2l55K65L24j65n26M5L33K44l75l19N74k37l50L43J7
5476e9no5K32K49m08k06J73K38j32Mj07M74l33l84K99K18j84N0j91M87j75n72
$$ plain form
5315 49 -9 33 124 213 -6 -252 214 299 29 23 77 -143 -208 189 211 -101 -69 -54 -134 -30 -108 -84 75 139 -172 77
5341 77 102 400 -74 -73 300 -272 -115 135 -28 138 -2 -64 535 13 -44 -14 51 109 -183 -215 114 72 -135 4
5365 4 90 -113 -270 176 85 -262 395 1 -129 -238 -255 223 111 -5 -43 19 -119 -302 -153 181 0 -78 -28
5388 -28 -159 141 -145 -227 134 -63 110 8 116 -78 -285 -35 185 524 -2 -322 -65 97 -114 -164 -72
5409 -72 -111 5 -65 109 -87 -386 -209 345 -77 -197 73 117 -56 163 3 218 -131 -325 -370 22 34 -76
5431 -76 9 283 -162 -246 83 -5 63 -253 195 386 -162 -185 187 133 12 -49 268 296 -65 55 -76 44 -145
5454 -145 -6 24 64 54 -222 195 123 -232 33 357 192 -334 -289 44 288 -87 -406 168 -69 -419 -76 -59
5476 -59 -64 -129 103 352 -56 -262 -89 149 17 21 -86 388 55 -329 -30 188 4 54 -137 350 175 -397
5498c97M64L19o46L12J67M0m63k12O05J53j79m02K71K30l63k39N50K28l47m11
5518c20M21J15l52qO33j44k82l1l75N27k89J81M34k76k9m89M28K30p70J11O66
5539C81l46l76J58O18m05l63L88L12J11j071M62J87R0n08K53O98n36n12M67K48
5559B56k07l65K92N62o27k19J39M15m3n04M16K28n21l01J63O91q5n93N27J49o72
5580b99r3L38P13l90n01M56j21l48m96Q04J06k45k06N19J36o99k08P71M6n84M0
5601b61O30k63q03K63P23O1m69j61L32Q0o24M83M10j44m30j21N63l00m06M09M30
5622D02k11n72J40Q84n90k41P8M86K83j041J26J86K78m55L13M05m36m57L64K82
5642B24j75l42J90Q78p61l94N50O4l63k71M87K89m56n56O45L20k60n85P79J85
$$ plain form
5498 -397 67 386 -260 52 219 259 -204 -416 189 342 163 -239 32 262 -101 -340 210 438 91 -320
5518 -320 101 216 -136 -144 489 345 63 32 -343 184 -105 76 510 234 205 -284 144 374 -396 -285 381
5539 381 35 -341 -183 435 30 -333 55 367 478 -593 -131 56 146 -362 -109 589 53 -459 8 256
5559 256 49 -316 -24 538 -89 -308 -169 246 203 -301 115 343 -178 -479 -316 375 290 -303 224 373 -299
5580 -299 -392 -54 659 269 -232 224 103 -245 -741 63 169 -76 -282 237 373 -326 -534 237 283 -301 -261
5601 -261 369 106 -697 -434 289 350 -119 -280 52 132 -492 -9 401 257 -173 -294 269 -31 -437 -28 402
5622 402 191 -381 -241 643 53 -188 -110 376 659 -382 -256 -70 208 -247 66 471 35 -422 -58 224
5642 224 49 -293 -103 775 14 -380 170 234 -129 -400 87 376 -80 -636 9 329 69 -516 263 448
5662D48m16p56N56N59n49NM21J10n66k63M92L60n61J17P51l15q05j59N73K48l67
5683a17m8K33l85k35L99Q70rq18j72O85o7q08k0P83Q4p71M55K25n12n82N95Q29
5705F14n43l90K97K52k80k88J72N46j04p54K79J76o9m79Q16K44l10k54L6K10m33
5726b62P3M60J46o35k59M04J55k38l11J067j19n77k06M42l00k33M17L46M59j195
5746c66L0K89L91n03K18K45m40k21rM66k59j25J06N39k44k24j23O33q1o45M55
5767A32L25m27l27J00K87M5j21K0L05n24k95N06L58k23j23j94N71o70l81N49M47
5788C60J8o14K89J85q4m42J31K62m03j55K76M99o19J31L01L35n99k09M70K19o87
5809c36K04M99j72k1l87L34R9m96m7L88P7k78k90N58O4n28q9R24k43n30L3L67
$$ plain form
5662 448 32 -724 -168 391 -158 -153 268 378 -188 -451 41 401 -160 -43 708 393 -412 -571 2 250 -117
5683 -117 -165 68 -317 -552 -153 717 708 -110 -282 403 336 -472 -492 291 375 -396 59 284 -228 -810 -215 614
5705 614 71 -319 -22 230 -50 -338 -166 380 276 -478 -199 -23 -92 -571 245 489 179 -75 -39 171 -262
5726 -262 -189 271 417 -218 -477 -73 82 -156 -467 600 481 -96 -302 140 -160 -393 24 370 829 -366
5746 -366 -336 -47 344 -159 59 304 -136 -357 -366 100 -159 -284 -178 361 117 -107 -230 403 322 -323 132
5767 132 457 30 -297 -197 90 135 14 34 339 -185 -480 26 384 161 38 -156 415 -255 -636 -87 360
5788 360 378 -236 53 238 154 -288 -157 105 -298 -453 -177 322 -297 -166 135 470 -129 -338 132 351 -336
5809 -336 -132 367 195 174 -213 121 220 -276 -323 65 142 -136 -426 132 196 -332 -421 503 260 -270 -237 130
5831A30J7N0m92M77n4k40m1L70J3k29k84P74j41m62J01K4K9p6j48J49Q3l43J91
5854a02J85L3l19L58J3J22p67M95J45l8j44k64K91j5m64L60L22L7j47oRK5m45
5877c16J38M43J2l85j48L64l77J28L00J46n72L9K90P5r0l30M81p4k92J01J13O5
5899A11k81J70L03k13p6K7L2k9P9l26J07L90l07j0n9K46k31K38j64j36L0lL33
5922B31k86j86R1J91K15o92K81M49l37J73k02J73J5J31l20Q7j2l36K73N3o8o0
5944a36K35n4j69J2K29J89k26j33J48P4j29N6j53K73j53N0Q8L7l06p2R5q3o0m6
5968b34J73R6r9j63L47q1k40J00P8J85j39M4j97M6K13k0L11m72K44k58J46k24
5990a44j9Q3j05L31j01J06m25K03L47M4m27p0l00N89O2r7O2n43O17l44j46J30
$$ plain form
5831 130 147 197 -295 182 128 -112 -153 217 230 1 -283 491 350 -112 -11 13 42 -34 -182 -33 50 -293 -102
5854 -102 83 116 -203 155 168 290 -477 18 163 125 -19 -283 8 -7 -471 -111 211 248 101 95 104 129 -316
5877 -316 -178 265 277 -108 -256 108 -269 -141 159 305 -267 -228 62 137 47 -283 198 124 -168 -67 46 111
5899 111 -170 0 303 90 14 41 73 44 123 -203 -96 294 -13 -23 -82 164 -67 171 7 -129 -99 -102 231
5922 231 -55 -241 -150 41 256 -436 -155 294 -43 130 -72 101 116 247 -73 14 2 -334 -61 -8 -76 -136
5944 -136 99 45 -124 -112 117 306 80 -53 95 169 40 96 -57 216 63 113 201 238 -68 -140 -45 -128 -188 -234
5968 -234 -61 35 -64 -227 120 39 -201 -101 -23 162 23 67 -130 -84 129 109 420 -52 192 -66 80 -144
5990 -144 -163 -80 -185 146 45 151 -274 -71 276 320 -107 -177 -477 112 174 77 139 -404 213 -131 -277 -147
6012a47R6K09k24j18J64N3n4K0j34J44J80k28P5j95l12M50R4o7j21K70j61J00
6034I4n1k08R6Q6l7j73J52P4J66ok77L1m1Q2L7j60OM81q5l51m7K33j78L09j59
6059G4K01n3l80J38j66K49l3l94L96j07J01r1J72j07m2j60L37j91j0J13nk8j64
6082a50m5K43j87j72L16K2p8m3n0K65Nk84J37l11M79j56Q9j03q9j92N34k75J88
6105A43N7j66L3R0k21j76M93k76M1j78M84n78K49K74j60k07k72J44K60j26p0J12
6127e0L43n75J50N7J24N7l71K45J05j62J44J70j25l23M24j61m6K1p2L65j30j72
6149A8k48K72K08m78L51l38M7L88K87k99K6j82K5N83l96k52k0LN3l31K66J19q7
6172A5r4j22J37J58l04K36J77l15J4p0K52n64L83L00J79m14j48J9M78k01o7m1
$$ plain form
6012 -147 -51 158 -66 -184 -20 33 -21 -1 -135 9 189 -39 36 -159 -471 -21 73 6 -115 155 -6 94
6034 94 43 -165 -69 17 -20 -193 -41 33 199 193 -84 -53 -94 -12 25 -135 -129 352 267 -84 -131 102 -76 233 74
6059 74 275 222 -158 -20 -186 63 30 -364 32 -75 26 -65 107 0 -42 -202 135 -56 -66 47 42 14 -150
6082 -150 -195 48 -139 -311 5 27 -51 -94 -144 121 126 -158 -21 -332 147 -9 80 -23 -112 -304 230 -45 143
6105 143 200 34 67 157 -64 -240 253 -23 18 -160 324 -254 -5 269 109 -98 -370 -226 34 -92 -162 -50
6127 -50 293 -282 -132 -75 49 106 -265 -20 85 -77 67 237 112 -211 213 52 6 27 -45 320 190 18
6149 18 -230 42 250 -228 123 -215 -168 220 507 208 234 52 77 660 264 12 -8 -5 48 -283 -17 102 15
6172 15 -79 -201 -64 94 -210 26 203 -112 -98 -168 84 -480 -97 203 382 -32 -180 -161 317 116 49 8
6194HJ62l59M1M39l30K41l10P22k64n42k13O48r6l74j27N15K87n62j69K98m1j55
6216a81O4O05p83O9L35J36k72oo4L63j07l39k15Q22k86m85J67K13P6j58j04J78
6238B8K7j36L27j40P9r13N55L75j99l64L7M83l0o33M49L27k50j83K99K0o74M9
6260d67P46J04m50j95L27pl32R7j20N55l03r8Q0K84m08J24J35J14M3m51J20P2
6282c0l02P2L85k59j94J14L05L1l65qN45J4n47K21l1K28l36N21k13L13j021M52
6304a05L35j49n17L27P88n34l62n38P34M08k80N6L0n21J48mL66j2o87M91M49l79
6326D4o91P35L19k56l96K77Q0j12n41O15J99m66Q0J62J25n92K47J34L46l59j63
6347b13N72K01p02m90P10M34p86j25L03Q5P7K7K56k64m25K13L06j78l91J09M79
$$ plain form
6194 8 170 -189 -148 291 -39 202 -108 614 350 -192 -405 243 147 -227 -354 161 448 -114 -283 15 -26 -181
6216 -181 -117 488 -295 -226 109 245 -27 -33 -97 266 159 -180 -395 427 141 -344 -177 36 112 -46 -150 28
6238 28 55 -81 246 106 185 -728 -173 202 3 -361 -324 159 129 -504 -55 272 22 -161 138 158 -516 -467
6260 -467 279 383 -67 -262 65 58 -274 -177 -297 258 -45 -143 -63 221 -187 -63 72 186 229 -222 -102 -30
6282 -30 -332 -260 125 -134 -328 -214 91 122 -243 -251 294 308 -239 -18 -49 179 -157 364 151 464 -557 -105
6304 -105 230 81 -436 -109 679 145 -217 -755 -21 387 107 163 193 -328 -180 -184 182 170 -517 -26 423 44
6326 44 -647 88 407 151 -245 32 112 0 -541 74 273 -193 -113 49 174 -418 -171 -37 309 -50 -213
6347 -213 359 560 -142 -632 78 512 -274 -399 -96 -11 66 93 349 85 -340 -127 179 1 -390 -281 198
6368A98K52n21k34K27j03JL4M69l09j49q0K97k8o04N26L39Pp80K00L21j6k39K09
6391A7L42l07m36J36L59O3n57P37p8k27o56O01J80l76Q7L59J27m47m00N26J28
6412A78Q6l45J96K54p39j26M28k0j19K57N04k77o99r2N22L73n75o8L29J35l27
6433a25m59O67R5Nl42J98J11l04j70P04q2o46J10M80l74j54K26L09K3j89m15K76
6455e6p6J44N6M5mj61p6L84m50l40L84M92m79j70K84L51j60n62O20L35n48k18
6477b05J93L15p86K24N19j18k20l65M57%k59k38N78J82k98l54M08j4j27M94l68
6498A8k8k22J16J17J80n44J56M73N7m66QL81j08j79LL73L9m94q4J87K66l06k14
6521b71N02ml93K13n5K62k93l4M41n48J70J62k91M88k95j73J7qK30l10N56p0l50
$$ plain form
6368 198 450 -71 -305 -78 -181 -180 -146 323 14 -135 -215 82 54 -550 -24 315 322 -458 -258 63 47 -192 17
6391 17 359 52 -384 -248 111 174 -383 354 276 49 -607 -6 174 -202 -115 244 371 -76 -476 50 178
6412 178 264 -81 115 369 -370 -496 -68 -88 -207 50 554 277 -422 -514 8 381 -194 -262 67 202 -125
6433 -125 -584 83 178 183 -159 39 150 -154 -324 380 298 -348 -238 242 -132 -286 -60 249 272 83 -332 -56
6455 -56 -132 12 68 113 109 -52 -128 256 -194 -534 -150 342 -137 -307 -23 328 168 -394 226 561 13 -205
6477 -205 -12 303 -483 -259 260 142 -78 -443 14 14 -245 -483 95 277 -21 -375 33 19 -108 386 18
6498 18 -10 -232 -116 1 181 -363 -207 266 323 -143 -135 246 138 -41 -38 335 374 -120 -204 -17 249 -57 -271
6521 -271 231 227 -166 47 -8 254 -39 -73 368 -180 -10 152 -139 349 54 -119 -102 -110 120 -190 366 296 -54
6544e4pK37k50k07L81M33j84l72j50M80j69j57K24l05K4Q6n8o9N23o23N79l02
6566F0j53m0L63kk52k73K82P0k24J07j19J30J98j40M45n4l79k11L59n4j30j64
6588a81N90m9m54p7K97L8l64L03k29K41j67J61j67K48o5j09J43O7l80P5J72L65
6610D58p64K8M14R2l41K24l03l1M62J24k68n1k30L35k1j69k7K46j96L98p19O8
6632b71L01k85L36j11K62q8m18K18J51k85J67J04J94k87J5j96L21L6k57J08J11
6653A26M8l28K36K34k78N5n2m3k45K01K44J01m03M6J74j16R7q3P5j15J28j0j25
6676c3k8Q6J12l89M8J46K05k2L11m06Q2j0J79l75PJ95N1k77k12K37O2l01N28j71
6700B5k6J26j23J16j78k66j49N88K7j66j44K86Q8k93k21K70J5k0m9p1K09J8L9
$$ plain form
6544 -54 -61 176 -74 -281 100 533 349 -23 -173 307 138 -19 205 -100 -76 10 -48 -117 406 -217 362 60
6566 60 -93 -133 230 228 -24 -297 -15 55 -169 -62 -181 -51 147 7 452 398 19 -192 167 113 -17 -181
6588 -181 409 360 -94 -171 126 164 -200 103 -126 115 -52 109 -58 190 125 16 159 226 -154 -79 93 458
6610 458 -306 -278 136 228 -113 111 -192 -223 239 363 95 44 -186 149 128 -41 -68 178 -18 380 -339 -271
6632 -271 30 -255 81 -30 232 144 -274 -56 95 -190 -23 81 275 -12 3 -193 128 164 -93 15 126
6653 126 174 -154 82 316 38 93 41 -2 -247 -46 198 299 -104 -58 116 0 97 14 89 -26 102 92 -33
6676 -33 -61 25 137 -252 -204 -58 147 125 436 30 112 102 281 -94 -87 108 159 -118 -330 -93 -31 -332 196 25
6700 25 -1 125 2 118 -60 -326 -475 113 140 -26 -170 116 204 -89 -310 -40 -25 -45 -94 -165 44 62 101
6723A01L76n83j48M65j27l11Q7K27J41k74O7J18k5l49K33P5k11J90P9j18J19o2
6745G0j31K61j71Q5lN8J3l06R4nLJ54J24j82k38R0M01M9o15N08j81j1k53L87q9
6770A12j9L58n71J84l70K96n3r3J06j00K17L8j04N1l02M53j91k12j8P2J37Q1R5
6793A67k97K52r1N5j18M5O0L6j91N2j18j86N71p4j72j46l5L15l30L57l04j53j21
6816d26J38J10R0J08o2r3L48q8r4J72k11r9m7M17m15J8j98P6M44k99N7J41k57
6839a70j26K52K33m48J73L09j93j21k48K49J2L80o04J4N58m05k28N68j27j98K11
6860I1OJ32l19P5O8M70o45J3Q3J57L7k36O65n74O2m08L24K29l26j9L48P2l49L5
6884iL3j49jj7L92j39l67K15J71N5n8k91K73n7k55L78l15L41j25j6L10m64k30
$$ plain form
6723 101 477 -106 -254 211 84 -227 -140 87 228 -46 21 139 114 -235 -2 73 -138 52 131 13 132 70
6745 70 -61 200 29 114 111 169 182 -124 -30 -35 -32 122 246 64 -174 -84 317 366 -249 259 78 67 -186 201 112
6770 112 93 451 -120 64 -306 -10 -63 -156 -50 -150 67 105 1 52 -250 203 12 -200 -218 -146 -9 72 167
6793 167 -130 122 31 86 -32 13 73 109 -82 -30 -148 -334 237 163 -9 -155 -190 125 -205 152 -152 -305 -426
6816 -426 -288 -178 -88 20 -42 -135 213 125 31 203 -8 -107 -154 263 -152 -134 -332 -256 188 -111 -54 87 -170
6839 -170 -296 -44 189 -259 -86 223 30 -91 -339 -90 -78 302 -302 -288 270 -135 -363 205 78 -120 91
6860 91 97 229 -90 -15 53 523 -122 -109 -26 131 168 -68 597 23 85 -323 1 230 -96 -115 233 305 -44 -9
6884 -9 24 -125 -126 -143 249 110 -257 -42 129 184 126 -165 108 51 -204 174 -141 200 75 59 369 -95 -325
6907c25J94L98j89j66k76N46N0l22j12L60m6k0L8L57p92L3K89K66j09o82K10K67
6929c1k30L10Qr9r4J99Pj42j36o5L50l47J66j59L07P9m11J40L02L05p40L23k92
6952b50K46l5P0j24r4J71k5K31n2j73jJ15J0k20j68N79k9o36N0O22k34l79M56
6975A30j93j81K12J73J79m84M0L48j51l6j27l3L03l12j00J08K29K63p64M68J08
6996A80m00k1J91J03j53N7K0J60k10k75L22J76j89RLJ94j21o5K24j66Q1m14L22
7019B8j8k20J60J45K28m84J04K92k93n7n36R24o1j54p6J45Pl14J87P9K80o72J95
7042a11K61k39m44J85P34j91o63N2N16l8j15K32N2j31q5p1kk77O7N61k1k04n33
7065d65M52K86l12m3r7L64o1l56J76o5J88m2R1J64n66K39K59P5k81k96N46j32
$$ plain form
6907 -325 -131 267 78 -88 -364 182 232 -90 -202 158 112 92 130 487 -305 -272 17 283 174 -508 -298 -31
6929 -31 -261 49 57 -42 -136 63 70 -72 -208 -273 77 -270 -104 -263 44 123 -288 -148 154 459 -281 42 -250
6952 -250 -4 -39 31 -93 -187 -16 -41 190 138 -35 -36 79 89 -131 -299 280 251 -385 -335 287 53 -326 130
6975 130 -63 -244 -32 141 320 -164 -124 224 73 37 -90 -123 180 -132 -232 -124 105 368 -396 72 180
6996 180 -220 -241 -50 53 -100 -43 -23 137 -73 -348 -26 150 -39 -30 -27 167 46 -19 205 39 120 -294 28
7019 28 10 -210 -50 95 323 -161 -57 235 -58 -115 -651 273 212 58 -18 127 134 -180 7 86 366 -306 -111
7042 -111 150 -89 -533 -348 386 195 -468 -416 100 62 -53 179 231 100 15 -56 -58 -335 -268 293 272 68 -465
7065 -465 -13 273 -39 -82 -179 185 124 -232 -56 -121 67 25 116 280 -286 -47 212 287 6 -290 256 124
7087A24j84k34K62L51l34l10J96L55l50j16J83K88l77J24L03l75J23j87M31j59
7107A14l78N2N12j64k65N1p1M01m59L57q2l14K42n0M94m30j78K78J73k22n25M15
7129d9L38l7j76l2R4l00K96k11N9j63M1J75M38l79n00N16qk62J19O9K08j77m99
7152d40M31K43m60J02J39K43o9l04L38j64j66m19O91M7m29P9K62k3k46j09M09
7173A55p4r8p8K53j28j61J50k7J5j46n7K15R1l76J5M79k38j38J93j15J45q9j64
7196a78K04l0k30L36R0m53K18J26K33l16j70j56N81k73j86J37J26j01lL65m03
7217h3n0O9P0K89m43K89m30K58K07l21L9O33n0q43J00M21m9j9k6K87j99l23J95
7240B1J9j46O9Jm9m16M24J31J72j30m38J67J20r9J99j59P8J71k48J51p3J8j54
$$ plain form
7087 124 -60 -294 -32 319 -15 -325 -129 226 -124 -240 -57 231 -146 -22 281 -94 29 -158 273 114
7107 114 -264 -212 300 136 -129 -78 -149 252 -207 150 68 -246 -4 -54 440 10 -168 110 283 61 -464 -49
7129 -49 289 252 76 44 138 -162 134 -77 -18 -181 -140 35 473 94 -406 110 102 -160 -41 28 236 59 -440
7152 -440 -9 234 -226 -124 15 258 189 -115 223 59 -107 -526 165 212 -217 -138 124 101 -145 -254 155
7173 155 81 -17 -95 158 30 -131 19 -8 7 -139 -196 19 110 -266 -251 228 -10 -148 45 -70 75 -14 -178
7196 -178 26 -4 -234 102 192 -261 -43 83 316 0 -170 -326 255 -18 -204 -67 59 -42 -45 320 -83
7217 -83 -133 -64 6 295 -148 141 -289 -31 176 -145 -106 527 477 -366 -266 155 106 87 61 348 149 -174 21
7240 21 40 -106 -37 -36 -85 -501 -77 54 226 96 -342 -175 -55 -154 45 -114 -36 135 -113 38 -35 -17 -171
7263a71K53j5j26j35M01j81l22j28N64R0m23L3M7J77n03N83m4k52ML60m5k04j03
7286a40R2J82p4l40J15L10k53l1l2K69l62L64j5n9p9J04l3M6P9j98j48L13j60
7309e0l9k13M15j55r1J95o7K55r3J58o34J59J17K22J8m74K3M59K01l01o07M68
7331c4K33p4k19J21o5L2l5P7rJ8j74L40q3l85J38J45k08P5J81J20l14J92k37j1
7355a76J46J09J0k57J15J85J63k72K9K81l64m5J41j25k2O9J87j37j36J63j48J72
7377H8l5j56j39K34M14k88k9j73m3J50R8j47L0j37M63k52l25QK66K48j77k29K71
7400A40j14M5o0k30N22k71j00j78j31L85J73j89K2K94k90p7J20m04N58o8L7j62
7422B2j22P5j21P1n2L50n08L23L2J2l0M9k44R6P8J57l52N9N1K16q1k2jm0N5o20
$$ plain form
7263 -171 82 67 -59 -194 207 26 -296 -424 140 230 -193 -160 -113 64 -439 144 100 -152 -148 212 167 -37 -140
7286 -140 -48 134 60 -280 -165 145 -108 -139 -171 98 -264 100 85 26 -53 51 18 64 143 -55 -203 110 -50
7309 -50 -89 -302 113 -42 -133 62 -5 250 157 315 -319 -160 -43 179 197 -277 -254 205 406 105 -502 -34
7331 -34 199 125 -94 27 -38 -6 -41 36 27 45 -129 211 128 -257 -119 26 -182 -107 74 194 -120 72 -165 -176
7355 -176 -30 79 89 -168 -53 132 295 23 52 333 -31 -76 65 -60 -82 -13 174 37 -99 64 -84 88
7377 88 53 -103 -242 -8 406 118 89 -84 -127 23 121 -26 4 -133 330 78 -247 -239 27 275 98 -131 140
7400 140 26 71 11 -219 303 32 -68 -246 -377 8 181 -8 14 308 18 -59 61 -343 215 147 184 22
7422 22 -100 -25 -146 -75 -127 223 -285 38 70 82 52 101 -143 -47 31 188 -164 -105 -54 162 81 59 58 18 73 -547
7448e47O89k2j70j17n1K31J0J75m20L00P8k89J60l52L84J74j99Q1j98q7J31K62
7470B23l98J10J0K45k46Q7R8j63Q1J79%j40M6l88L12k46l3K87K76l12k7j05K61
7493A57j12l26N07j32k31M17l85K37j70l09L90J07k27J52l76J27J20o5J87L1R5
7514A94m96J74M8J04k0L14j88q2Kk55K35m5J14J98k93L50n70J08L34m11K95j70
7536f0J21J67k12J62n3k77O4K03r7j24o5KJ68K8N7j41o5J29k7j62K05j75r6L67
7560A19k44q6K82L40l50k66Q4K87j86j40j61K17K21o5l7K05l56j7K21J51M5k48
7582A6J26k6k27m5K05j34M67n09L19k82m8k3K79J41k87k49M86j81K81m05K86K28
7604D18n06l55O48o4m56J78K83J09o61L32J35l04K03n0L19qp66O12K03k43n4k02
$$ plain form
7448 -547 142 120 -50 -167 -218 13 23 198 -222 78 156 -133 27 -325 59 233 34 115 -83 -170 -39 223
7470 223 -175 -65 -55 190 -56 31 129 -34 47 226 226 86 132 -256 56 -190 -223 64 340 28 1 -104 157
7493 157 45 -281 226 94 -137 280 -105 132 -38 -347 43 150 -77 75 -301 -174 -54 -119 68 99 194
7514 194 -302 -128 -80 24 4 318 130 48 50 -205 30 -15 99 297 4 354 -216 -108 226 -185 110 -60
7536 -60 61 228 16 178 125 -152 -88 115 18 -106 -171 -169 -1 27 84 -57 -122 7 -20 -182 23 -152 -248 119
7560 119 -125 -211 71 411 61 -205 -121 166 -20 -160 -321 -104 117 52 15 220 -136 -153 68 219 264 16
7582 16 142 116 -111 -156 49 -85 382 -127 192 -90 -138 -161 118 259 -28 -277 209 28 309 -96 190 418
7604 418 -88 -443 205 141 -315 -137 146 255 -406 -74 61 -243 -40 -90 229 221 -545 67 270 27 -27 -229
7626b29J97J90j81j08k2k4J3M6M83l36K5k84L28K0j69j04M07j45n3l72O17j57
7648A42m16J00N25k19j00R5k67L20j30n0K4k28J23L19l0r2k87J56J37l42j07L99
7670G2j61K96m98K81K56j55k94K98O5k93%M22q4q11K79L77L28n37j42J12J15K6
7692d8j02L51l00K10j61M1j98K02j08L94j61l91K21J20j90o2Q7J84L35m46j86
7713b08J70m9q9K48KL40o32J04J56qk7j60L29k76l70L71P7K7j49pM20l36J05K35
7737B73l33j18K49j52K32k60O8o8J25n0J93k33R9k42OJ28K76R4k68L50k57k72
7759a60M2N3K52k25k94N28m09M1R5M28k94R1j67n4O0J8k29K87R1m77J81J56p5
7782f1n8n2O90m77m9k26L97o9l9j94L01n68J55J55Q9J22l50L80O0k34l06L70K13
$$ plain form
7626 -229 -32 158 -23 -131 -153 -177 -164 -118 365 29 54 -230 98 118 -51 -155 252 107 54 -318 299 142
7648 142 -274 -174 351 132 32 127 -140 180 50 0 24 -204 -81 238 208 116 -171 -15 122 -220 -327 72
7670 72 -89 207 -291 -10 246 91 -203 95 160 -133 -133 289 205 -606 -327 50 378 -159 -301 -189 -74 -48
7692 -48 -150 201 -99 111 -50 -9 -207 -5 -113 281 120 -271 -50 70 -120 -182 -95 89 424 -22 -208
7713 -208 -38 -87 -176 72 74 414 -218 -114 42 34 7 -153 176 -100 -470 -99 -22 5 -144 -151 269 -67 38 273
7737 273 -60 -178 71 -81 151 -109 -41 -109 16 -34 159 -74 25 -217 -211 -83 193 287 19 369 112 -160
7759 -160 -118 -65 187 -38 -332 196 -213 -172 -77 351 57 148 -19 -73 -13 5 -224 63 154 -323 -142 14 -61
7782 -61 -119 -171 519 42 -7 -233 164 95 56 -138 163 -405 -250 -95 -6 116 -234 146 206 -28 -334 36 249
7805B49l55L43l20N32l58k85j68L11J79j45J2L48l32l97M43j05j15j16M79j9k02
7826b1n12L72L29k85j52J50J61j48L31m36K67n7j17K91r8j34P6o7K92n7l05L21
7848B01j03j91j02M26J49n92J28K58k96n6L28J33k59l00J95N48M1n69l35M70j76
7869a02k5j5J32L47l41J68o6j89O5q5K82l66n8J32L33j61l51K38J52m8k05J83
7891B0J61j83k23N27l87R4j54K69O6k06ol51K56p6k68O62j13k00j00L72K6l3k96
7914a43P6r1M94m07K1O4q2L89k58K45m99O7p3M25m29M4K03j33p3j32N69k21J22
7937A78j04mj44o5K28j43J03k06J47K27q2m48J67L92l50K43j86j61L95l20J27
7958fJ00j45J90j19M6J77m08L48J22J92n36l36N53n9k37J57k10K21p0j07J12l17
$$ plain form
7805 249 -106 237 -83 449 91 -194 -362 -51 128 -17 -5 343 11 -386 57 -48 -163 -279 200 181 -21
7826 -21 -533 -161 168 -117 -269 -119 42 -106 225 -211 56 -1 -118 173 75 -59 17 -50 242 185 -120 201
7848 201 98 -93 -195 231 380 -212 -84 174 -122 -178 150 283 24 -276 -81 467 508 -61 -396 74 -102
7869 -102 -127 -142 -10 337 -4 164 98 -91 -26 -111 171 -195 -253 -121 212 51 -300 -62 90 42 -163 20
7891 20 181 -2 -225 302 -85 9 -145 124 190 -16 -22 -373 -117 -193 -461 201 88 -112 -212 160 186 153 -143
7914 -143 -67 -158 336 -71 -50 14 -68 321 63 308 -191 -124 -197 228 -201 -157 46 -87 -160 -292 277 56 178
7937 178 74 70 -74 -139 89 -54 49 -157 -10 217 135 -313 -146 246 -104 139 -47 -208 187 -133 -6
7958 -6 94 -51 139 20 66 243 -165 183 305 497 -39 -375 178 119 -118 39 -171 50 -20 -127 -15 -332
7980c32K91r3J27r3n9J74K89m15j73N73o4j53j71J14m8O9k10O37n86o3K15r3K87
8003B23n32M42k71K82k80%J32Q7K0k28R1J1k3R5k7n7j1J4Km0K5PM01k86j99J4
8029a08J79Ml4j54J43J50j83J07j35j55R0J48J33l57R2J01J86m57o0J02K56J47
8051A95l37J73J73l56jJ80O6k67K5J73k6K4j65J79J2l49L33k7M81n72l01L02L68
8074B83j93j55p4Q3P5K04Q9l30N6j22K65l85L70l29J13J62j96j7k13N93j08l61
8096a90P3N7K43j96k81J72J20j51L96r7l56J15K06k72J71qj25J83j72N8o5J65
8118D6O5k55L23k11L6O6J69j20l38M37j81Ol82K54j16J00L8j99M88p0k68L09m06
8141b09N9l3J48M56p16L97ORj50k45M42j10j63K57j22k5j01K36N8k74K08k0j36
$$ plain form
7980 -332 -41 -134 -7 -100 -159 15 304 -111 -284 289 225 72 -99 15 -33 36 -174 463 -123 -186 29 -64 223
8003 223 -309 133 -138 144 -136 -136 -4 83 103 -125 -34 -23 -46 49 22 -35 -46 -32 -30 -70 -45 -38 363 77 -122 -108
8029 -108 71 75 41 -113 30 180 -3 104 -31 -186 -96 52 185 -172 -80 21 207 -250 -310 -208 48 195
8051 195 -142 31 204 -152 -153 27 93 -174 -149 24 -2 22 -143 36 48 -301 32 5 486 -86 -387 -85 283
8074 283 90 -65 -139 -56 19 223 312 -18 38 -84 181 -204 166 -163 -50 112 -84 -101 -314 279 171 -190
8096 -190 -117 -60 183 -13 -294 -122 -2 -153 243 146 -210 -95 111 -161 10 2 -123 60 -112 -54 -119 46
8118 46 111 -144 179 -32 4 70 239 119 -219 218 37 43 -339 -85 -201 -101 -63 -262 226 156 -112 197 -209
8141 -209 -150 -183 -35 421 -295 102 108 117 -33 -278 164 54 -109 148 26 1 -100 136 194 -80 128 108 -28
8164b8j65N0K72j75J48P0o40N78J1q4j16j71J44L17j61j23k0Lk2M78j82k66k88
8187c70L40k10J7j1
$$ plain form
8164 -28 -193 -143 129 -46 102 172 -468 110 121 37 -79 -250 -106 211 50 -73 -93 -90 -112 366 184 -82 -370
8187 -370 -30 -240 -223 -234
8191b34
$$ Imaginary data points
##PAGE= N=2
##DATA TABLE= (X++(I..I)), XYDATA
0@%%%%%%qJ6j6J6j6J6k4L2m0M8n6P0q0R5j14J30j49J73k01K32k63K96l37L80m26
31b26M80n38O01o71P48q32R26j027J136j257J392j540J705j892K097k329K598
48A371k905L259l677M182m802N584o606Q006j0058J3352j9491L4772j40792k64343
62c82148K83110L13381k784k35649j16583L6550J04162Q7973P332j39700j09466
73a53822J10611K06892j6988k10080r5946J09460R7643J2416L0264J1412j43368
84d1506j55960R6317K60466N9863k02335j61563N9080J37862O0679l3710j06157
95b6964r8743P2345K26000O4757k58997k48029J28990L29705Q2534k15367j87477
106a31246J3984J07838R4270M6993o0115j37801k7145J43868R4553j08266j31243
$$ plain form
0 0 0 0 0 0 0 0 -8 8 -8 8 -8 8 -16 16 -24 24 -32 38 -42 53 -61 69 -80 93 -108 124 -139 157 -180 200 -226
31 -226 254 -284 317 -354 394 -438 488 -539 597 -660 732 -808 897 -995 1102 -1227 1371
48 1371 -1534 1725 -1952 2230 -2572 3012 -3594 4412 -5646 7706 -11785 22987 -117805 -382148
62 -382148 -99038 214343 211559 -24090 -140673 -104123 39 88012 95344 -44356 -153822
73 -153822 -43211 163681 146693 -63387 -159333 -49873 47770 60186 90450 101862 -41506
84 -41506 -197466 -101149 159317 219180 16845 -144718 -85638 52224 112903 79193 -26964
95 -26964 -125707 -53362 172638 237395 -21602 -269631 -140641 189064 271598 56231 -131246
106 -131246 -117262 -9424 84846 131839 71724 -66077 -93222 50646 145199 36933 -94310
117i4310M5133J17519J6877l7393n386m6398j02853K0767J92686J09415j49208
128F6849k02213L201J51296R3774j5394p1523r2412k6756J20015J32944q1970
139G7811k20183k3405K33250J54974j33466k12993l0401J21251J11650L9028m7613
150F9903j27060q1501R0553J49030j0665j39832m0993R5635N1558n1253l3092
161b7717J5348k1956l0302O9829J00758m5717j56397n2427J10059J14900R247
172H5625o5072q7773n8131N7109J47260L9575j56690j35140J00937J90463o664
183A11499j83050r4024R3973J32671L4530o2881j04119o2027O1489J35211L4763
194I8035j13598q8280N4487P8528k1394m6301K3489K7282m0666k2851O3844M4712
$$ plain form
117 -94310 -49177 68342 85219 47826 42440 -3958 -106811 -86044 106642 216057 66849
128 66849 -135364 -132163 19133 112907 97513 25990 -66422 -93178 26837 159781 77811
139 77811 -142372 -165777 67473 222447 88981 -124012 -154413 -33162 78488 117516 69903
150 69903 -57157 -138658 -48105 100925 90260 -49572 -90565 5070 56628 5375 -27717
161 -27717 -12369 -34325 -64627 5202 105960 60243 -96154 -148581 -38522 76378 85625
172 85625 20553 -67220 -125351 -68242 79018 118593 -38097 -173237 -72300 118163 111499
183 111499 -71551 -165575 -71602 61069 95599 32718 -71401 -133428 -71939 63272 98035
194 98035 -15563 -103843 -49356 29172 7778 -38523 -15034 12248 -28418 -51269 12575 57287
206E7287p0146q6910L0212J05627M8154m7410q8516n9034L7093J29386P7415j02256
218C0902j64108J0399J77210Q4402j21810j35455L6033J29803M9159o1985q3420
229d8870k9946M5707Q6711L4805o7646q2193J3536P0505J6293l3738Q98K3835
241B9897k6378m4285L0416P4540n768q6303l5324O9564P5611j3114p8671n8414
253f8229K2638R3872O9662n2040j31143l9336J16630J15622m3409j30683l4619
264h1035Q9173P6335k2684o9109l4642K3616N3358L2408k7959o0414j6863M4252
276F436L7431j1870k0817J806o290k5279O071N2257K2732n3421n9612K0987P1809
289D2240K6433m8888o3132p372N8476O5552r115q8440o3560N1989J06460J8699
$$ plain form
206 57287 -12859 -99769 -69557 36070 84224 36814 -51702 -110736 -73643 55743 133158 30902
218 30902 -133206 -122807 54403 138805 16995 -118460 -82427 47376 96535 34550 -48870
229 -48870 -78816 -33109 53602 88407 20761 -61432 -47896 22609 38902 5164 6062 29897
241 29897 3519 -40766 -10350 64190 58422 -27881 -63205 6359 81970 68856 -9815 -68229
253 -68229 -45591 48281 117943 65903 -65240 -104576 12054 127676 84267 -46416 -81035
264 -81035 8138 84473 61789 -7320 -41962 -18346 35012 67420 39461 -20953 -37816 6436
276 6436 43867 31997 11180 12986 6696 -18583 -12512 39745 62477 9056 -50556 -29569 42240
289 42240 68673 19785 -43347 -50719 7757 73309 64194 -24246 -87806 -35817 70643 89342
301H9342r4070p8166L4282Q7147K6777n1860n7461l417M5216M1422q346m7871
313a7005k9305K4155M0268L296k6013j3293N406k946m511J8676K4497j3996m5870
326c6641j6307M0609M7355n812n5209m0081K4770O6809K8118n3302p5301J944
338g3048Q4442N7911m6712r0842j5191P4843O4142k3363p2821l0088M2600N6534
350B8407K408m7259l3370J9246L8822O238k5177j2538J2272P023j2538l183K2788
363C139J6487k4177l8076N565N1058L2306l4792o2631p408O4811N7219k7289q1243
376d5031k8747O4547P5706j2695q2674m3844N1289P5431L094o5996m5657K9898
388b4679N8471J1913m0863l3111J4240L3172N140k0103q737J3247P275j5055j0589
$$ plain form
301 89342 -4728 -82894 -48612 38535 65312 13452 -44009 -47426 -2210 39212 30866 -17005
313 -17005 -46310 -22155 18113 21409 -4604 -17897 -12491 -15437 -19948 -1272 23225 9229 -36641
326 -36641 -52948 -12339 35016 29204 -26005 -66086 -41316 25493 53611 309 -74992 -73048
338 -73048 11394 69305 22593 -68249 -83440 -8597 55545 32182 -40639 -70727 -28127 28407
350 28407 30815 -16444 -49814 -30568 8254 14492 -10685 -23223 -10951 -3928 -16466 -19649 3139
363 3139 19626 -4551 -42627 -37062 13996 46302 11510 -51121 -58529 6282 63501 36212 -45031
376 -45031 -73778 -9231 66475 53780 -28894 -72738 -21449 53982 57076 -8920 -54577 -24679
388 -24679 33792 45705 4842 -28269 -14029 19143 24283 4180 -4557 8690 15965 910 -9679
401i679J9062K5357r833l9815j4507L8938M5316j2425n9362k9141M4423O3084
413F1418k247o6959m5116L6927P1080J2099o0321n3686K1142O4778K3110m3996
425A8229m9151P462M6041K2971k5366l2816J229K5128J0963j3645j1993O982J0205
438A6239r036j4761O878K4498M050l0279k5700J8404M2538Q257m2002l8889J5902
451b3901N2430K1172l9906n1367K469N5598L5591l1623n7653q373M9015L9462
463D2914k0645m7784j3153L1603L0573p304k9219j3463J5345J9540j961j7680
475a1234n770J2710P188j2651j0892J4769J8298j1400l0192l712L2789K4514j8957
488E460l8478q851L2817L3956o885m2911k5463K8177M9288K839n1656l5548L0743
$$ plain form
401 -9679 9383 34740 24907 -14908 -29415 9523 54839 42414 -16948 -46089 -1666 61418
413 61418 59171 -7788 -52904 -15977 55103 67202 6881 -46805 -25663 39115 62225 18229
425 18229 -30922 -23460 22581 45552 20186 -12630 -11401 13727 24690 11045 -948 6034 16239
438 16239 7203 -7558 -680 23818 27868 -2411 -28111 -9707 32831 41088 -914 -39803 -23901
451 -23901 28529 49701 9795 -41572 -39103 16495 52086 20463 -37190 -45563 3452 42914
463 42914 22269 -25515 -38668 -7065 23508 16204 -13015 -26478 -11133 8407 6446 -11234
475 -11234 -17004 -4294 2894 -9757 -20649 -5880 12418 1018 -29174 -32886 -97 24417 5460
488 5460 -33018 -41869 -9052 24904 18019 -24892 -50355 -22178 27110 29949 -21707 -57255 -26512
501b6512N3244K437m6144k9078K1880L5181N109k3495j9075O352K2121P846j7401
514g535j7098J2064K4203l748k8444m142L0761J5256k9075k7088K1035L9317l90
527B5116l8615k4271J9785L8605J3251k7974l8355O23M5111L0588l1680n0582
539c8398P497N7330K0769m3887l9931J7950M1225Q028k3236j7715L295J3799R754
552A6480o770j5525K518K4153P483l0405k3143K7099L7855j4186m3056o41M2610
565B4472J5055l3989k9683J4273L3921J4373j6114l2120j6486K4264M2417K44
577D0627m7753k3964L9027L7936k5854m6235P589M4929J1089k8762j9887N871
589e387J0385N739L342o114j0564P439J5643j3693l1837Q129M8780J1115m9218
$$ plain form
501 -26512 26732 29169 -16975 -46053 -24173 11008 16117 -7378 -26453 -20101 2020 9866 -7535
514 -7535 -24633 -12569 11634 7886 -20558 -24700 6061 21317 -7758 -34846 -13811 25506 25116
527 25116 -13499 -37770 -17985 20620 33871 5897 -32458 -31835 13276 43864 12184 -38398
539 -38398 -30901 26429 47198 3311 -36620 -18670 22555 30583 7347 -10368 -7073 6726 16480
552 16480 9710 -5815 -3297 20856 28339 -2066 -25209 1890 39745 25559 -17497 -18138 24472
565 24472 39527 5538 -24145 -9872 24049 38422 22308 -9812 -26298 -2034 40383 40627
577 40627 -7126 -31090 7937 45873 20019 -26216 -18627 26302 37391 8629 -11258 -5387
589 -5387 4998 10737 14079 7965 -2599 4840 20483 6790 -25047 -16918 31862 42977 -6241
602f241l2977L2598L8590j5742l5651K955K7896R716j2752j8308j5500M984L5186
615A4754K5999l1022m9466P526M9772Q597m2330j4048L7285J9676l0308k7572
627c1137J2464J9955K374n33k58j3941j0808J5461J2940j9828j5104L2137L1394
640C5116l3680n4343J1171N7707J4192l7875k0576J7730J2092q228n165j305m476
653a7640J2286K8161o011n0762k1319M8348M4685k5805m2762J2029L2369j3293
665B86l1193R277L2387N351j6059p041o558j0631J2428K9575l196l3316J013L8819
679B1142j040n3860j4589N9187M3477l4714n0722K722K8613P882k616K518o265
692A735r476J3826J5050k6565l2826K8146N8005m775o0580j8282M0865J8900k6797
$$ plain form
602 -6241 -39218 -6620 31970 16228 -19423 -16468 11428 21144 8392 -9916 -25416 -20432 14754
615 14754 40753 9731 -39735 -32209 17563 26160 -16170 -30218 7067 26743 -3565 -31137
627 -31137 -18673 1282 3656 3123 2865 -11076 -21884 -6423 6517 -13311 -28415 3722 35116
640 35116 1436 -52907 -41736 15971 30163 -7712 -28288 -10558 1534 -6694 -11859 -13164 -17640
653 -17640 -5354 22807 16796 -33966 -55285 -6937 37748 11943 -30819 -18790 13579 286
665 286 -30907 -21630 10757 16108 49 -6992 -13550 -24181 -11753 17822 14626 -18690 -17677 21142
679 21142 20102 -33758 -48347 10840 54317 19603 -31119 -28397 216 8098 5482 8000 1735
692 1735 -7741 6085 21135 -5430 -38256 -10110 47895 43120 -17460 -35742 5123 24023 -2774
705b774q158L0388J2175k7139j9603O682P312P336K0765N275l4319k5874K9698
718A764L2969k6431l7187K9301N2660j4997o2560j5333M1550K9465o087r776q721
731F617j6828j203K5440Q015k7739o393M0114J6188m8942l9245L3558M7445j1274
744B5753l2460P527J9241j6140k4552J0013K3492L871q59J618k1575l0649J6673
757a8047N0006L139m8708j4265M3966J7050m6056l1462L4883M2634o006k7656
769e22j3462p087K00K4005K4501j7778l2329R750L0413j5322l9828J1576N2033
782B6150O638m4315k0196K3544J1750j6570j074K0878N034j5019o219l378j4263
795b7040L667L9946K0859m1072m3773K2186M4771q605l9200N108L8424N726l0540
$$ plain form
705 -2774 -10932 19456 31631 4492 -15111 -8429 -1117 6219 26984 32259 -2060 -27934 1764
718 1764 34733 8302 -28885 416 53076 38079 -24481 -39814 1736 31201 25114 15338 6617
731 6617 -10211 -11414 14026 22041 -5698 -12091 28023 44211 -4731 -43976 -10418 37027 25753
744 25753 -6707 820 20061 3921 -20631 -10618 12874 16745 15886 17504 -4071 -34720 -18047
757 -18047 31959 35098 -13610 -27875 16091 33141 -12915 -44377 -9494 33140 27134 -522
769 -522 -13984 -21071 -20871 3134 27635 9857 -22472 -12722 17691 2369 -37459 -25883 26150
782 26150 32788 -11527 -31723 -8179 3571 -12999 -14073 6805 11839 -3180 -9399 -12777 -27040
795 -27040 -23373 16573 37432 -3640 -47413 -25227 19544 10939 -28261 -23153 15271 20997 -9543
808i543j8298N506J0204J4704J9434q589l7775j1560L3325J9770k5938j6150L1121
821F211K2262l2489l4260J6891L4451r61j7712J927P289q464o631O708j13m506
835i397J7458K2354k1654m7100K458N3389K1731l6977k7952K1708K3196j3865
847E349k0382N046J4749P625N728n050k5601j5744K6647L3560j1288l3059L970
860h450K7382n368l1089J896L5137J1805k3968j7347O968Q057k38L299K128p721
874B491k50J5791j208l0447j1870L7289L3687k2572m3504o7L2889J0735j8041
887D923q837Q282O311M81k495j1031j1855J2842K7679L94l2792j4914K4302J7531
901B0821j7976j6245J7831J9295j3900k3924L06J7730Q470k689n673r583l599
$$ plain form
808 -9543 -27841 -22335 -12131 2573 22007 13418 -24357 -35917 -2592 17178 -8760 -24910 6211
821 6211 28473 -4016 -38276 -21385 13066 12105 -5607 -3680 3609 -4855 -11486 -4778 -4891 -9397
835 -9397 8061 30415 8761 -38339 -35881 17508 39239 2262 -25690 -3982 19214 5349
847 5349 -15033 -9987 4762 12387 18115 13065 -12536 -28280 -1633 31927 20639 -12420 -8450
860 -8450 18932 13564 -17525 -15629 19508 31313 7345 -10002 -3034 5023 4785 8084 10212 2491
874 2491 2241 18032 16824 -13623 -25493 11796 45483 22911 -20593 -20660 12229 22964 4923
887 4923 -3914 4368 10679 11160 8665 -2366 -14221 -1379 26300 26694 -6098 -21012 3290 20821
901 20821 2845 -13400 4431 23726 9826 -14098 -13792 3938 12408 9719 4046 -5537 -9136
914i136J2915J0594j5269k0067J4162L2378l307l8797j6441K8554K6902r222k2578
927i312m271R346O756N38n623r490K436J7685O191k1329j8804J4081K5082l945
941I341k3275j640J9201L461j7689q730J2984J3512j369j1048r850n54J2157J3025
955I526o309k1166j781K3797J2355k1845k3485J1859K8709M164k2034j5498P432
968a4276J5522N666p169j0495k216J1671J0454r728j6637L344K0754O539j9159
981e730j2594J2590J5502n973j5005O86J4178O540q363j2674j552J1852J4110
994A3567k600j8989r690J6432K0030o899k4294m294K2257J5339j2230k0789m54
1007a2614J6933J2201o258j4384m982J0427J2422k921j4826m155J4009J1043r997
$$ plain form
914 -9136 3779 14373 -896 -20963 -6801 25577 22270 -16527 -32968 -4414 22488 13266 -9312
927 -9312 -13583 -4237 2519 3057 -2566 -12056 -9620 8065 14256 -7073 -25877 -11796 13286 9341
941 9341 -13934 -15574 3627 7088 -10601 -19331 -6347 7165 5796 -5252 -15102 -15656 -3499 9526
955 9526 3217 -17949 -19730 4067 16422 -5423 -28908 -17049 11660 15824 -6210 -21708 -14276
968 -14276 1246 6912 -257 -10752 -12968 -1297 9157 -571 -17208 -13864 6890 13429 -5730
981 -5730 -18324 -5734 9768 3795 -11210 -10524 3654 10194 1831 -10843 -12395 -543 13567
994 13567 10967 -8022 -17712 -1280 18750 11851 -12443 -16737 5520 20859 8629 -12160 -12614
1007 -12614 4319 16520 10262 -4122 -9104 1323 13745 10824 -4002 -8157 5852 16895 6898
1020F898j4855L633J6047L537j3588r269Q692J2814j229j3303o795Q335J4161
1033A5078J170j5134j2413Q940J9531J868j9093j3290J2046J9380p61j8732j0233
1046a1643J1193J5913o73j4736r349P753J3638J199j3482q435Q467J2858k803
1059I900j4386l785J2040R712p917j3900O89J3598O674r947j3312K499J4519P129
1073A3513j1612j5118K140J7577Q245j3377j6743K389J9226P525j3281j5735L064
1086a2187J6494O998j1548j3957K803J4101N835j0326j1951L565J3057L238j0859
1099d737q710O314J1703k35j2243o012Q900J1054l194j3350m500J1330J1714m839
1113C195j5033m600J3048J2635n277j6704m110J4005J3161n743j7092l596J3592
$$ plain form
1020 6898 -7957 -4324 11723 15260 1672 -7597 1095 13909 12680 -623 -7418 917 15078
1033 15078 16248 1114 -11299 -2359 17172 19040 -53 -13343 -1297 18083 17322 -1410 -11643
1046 -11643 -450 15463 14790 54 -9295 -1542 12096 13295 -187 -8622 -155 12703 9900
1059 9900 -4486 -8271 3769 13481 5564 -8336 -7647 5951 12625 2678 -10634 -8135 6384 13513
1073 13513 1901 -13217 -11077 6500 14745 1368 -15375 -12986 6240 13765 484 -15251 -12187
1086 -12187 4307 11305 -243 -14200 -11397 2704 8539 -1787 -13738 -10173 2884 6122 -4737
1099 -4737 -13447 -7133 4570 4335 -7908 -13920 -5020 6034 2840 -10510 -15010 -3680 8034 3195
1113 3195 -11838 -16438 -3390 9245 3968 -12736 -16846 -2841 10320 4577 -12515 -16111 -2519
1126b519J2253n856j4708l456J2537J0064m890j3050k223J1806Q334o408j2130
1139a0246P64J2427N846r285j0117L933J2676K943j0951q775O126J2990K143j2184
1153a710j0002O839J5271K211j4467j0637Q608J6139J003j5515q978R212J4563
1166A2537J06j4237p827P929J2596J106j1780p897O922J2355p83j2259n893R866
1180B741J0948m736j2899j771J1877P107p033j0341O25J0766N438o333j1442k57
1194e310J2227Q784q139j5306J94J5343Q712j1372j3902L523J4845M045j1293
1207B351j0316L658J1564M423p133j1091k27J1506P022q709j1845L883J3601K200
1221A0887j4142p945R532J1673l107j1658l601O967P307j635q419m822O564J0413
$$ plain form
1126 -2519 9734 3878 -10830 -14286 -1749 8315 3425 -9625 -11848 -42 8292 1884 -10246
1139 -10246 -9482 2945 8791 -494 -10611 -6678 5998 8941 -2010 -10785 -4659 8331 10474 -1710
1153 -1710 -11712 -4873 10398 12609 -1858 -12495 -3887 12252 13255 -2260 -11238 -2026 12537
1166 12537 12643 -1594 -9421 -1492 11104 12210 430 -7467 -545 11810 11027 -1232 -7125 2741
1180 2741 13689 8953 -3946 -5717 6160 13267 6234 -4107 -3482 7284 12722 6389 -5053 -5310
1194 -5310 6917 15701 7562 -7744 -7550 7793 16505 5133 -8769 -5246 9599 13644 2351
1207 2351 -7965 -4307 7257 11680 4547 -6544 -6771 4735 11757 3048 -8797 -4914 8687 10887
1221 10887 -3255 -11200 -1668 10005 6898 -4760 -8361 -1394 5913 4278 -4141 -8963 -2399 8014
1235H014p74j4575q152J2119J5259m583j7820l676J4410Q648q573j1244J814R778
1249F45N531m726r916m319P851J1892j060j4393n576J2421R656r422j2651N049
1263i018J4995Q45j2387p195O161P515J472l794n285p19O711N590p868j1056M847
1278i186J7615K998j7186j2275J1231J4810k632j1993j637Q237M130k861n961
1291d710m383L826J1338N391j1830j3944N931J6962P67j4754l827J4079O600j1715
1305b69j0533N395J1163K532l626n095m397J599Q415K515r531m989J2364J0410
1319A5953j2070j8644N709K0922N006j4550q829O085N949j447k579o08p1M341
1333E167O408n263j5663j778J8787J2046j3383j5183O616J2832m449j2292K773
$$ plain form
1235 8014 7240 -7335 -15487 -3368 11891 7308 -10512 -14188 222 8870 297 -10947 -9133 645
1249 645 6176 1450 -8466 -12785 -4934 6958 5898 -8495 -14071 -1650 8006 -1416 -14067 -9018
1263 -9018 5977 6822 -5565 -12760 -6599 916 2388 -1406 -6691 -7410 -699 4891 -2977 -14033 -9186
1278 -9186 8429 11427 -5759 -18034 -6803 8007 5375 -6618 -8255 -18 4112 1251 -4710
1291 -4710 -9093 -5267 6071 11462 -368 -14312 -8381 8581 9348 -5406 -9233 4846 11446 -269
1305 -269 -10802 -5407 5756 8288 4662 -433 -4830 -3231 5184 7699 -1832 -6821 5543 15953
1319 15953 3883 -14761 -9052 11870 16876 2326 -6503 -418 5531 4084 1505 897 826 5167
1333 5167 11575 6312 -9351 -11129 7658 19704 6321 -8862 -2246 10586 6137 -6155 -3382
1346c382J2307L054p433o226k403K33P596Q814m814j3211J284J3067k00j6928
1360h242l308J9814J2020j4464j7579K791J2170L035k752j112j749k117L500K366
1374D373q699p236J2463J7229p857k3266l157J8703Q000j1488n609R051M600q529
1388a422p218K215L403M322P002j384j4820q054J2962J2380r118j2545R545J5470
1402A2738p985k0554j384J7690R299o070o192k790l023J602Q001P42r015P39J3772
1417G570J594k0375j0428J6931J8854o484j5926L90Q541k534o086L239O757J28
1431B171l99O78q201r507P358J8730Q00j7878n799J4617N012j4987p158J5138
1445E75J3520o705j2721l102J998L226P882N387q460j0140O291J0643p436j3983
$$ plain form
1346 -3382 8925 11979 4546 -1680 -4083 -3850 3746 12560 7746 -5465 -4181 8886 8686 -8242
1360 -8242 -11550 8264 20284 5820 -11759 -8968 3202 6237 3485 2373 624 -1493 2007 4373
1374 4373 -4326 -11562 901 18130 10273 -12993 -16150 2553 10553 -935 -6544 2507 7107 -1422
1388 -1422 -8640 -6425 -3022 1300 8302 6918 -7902 -15956 -2994 9386 268 -12277 -2732 12738
1402 12738 4753 -15801 -17185 505 9804 3734 -2458 -5248 -8271 -6669 1332 2074 -6941 -6202 7570
1417 7570 9164 -11211 -21639 -4708 14146 7662 -8264 -7874 667 -1867 -7953 -4714 2043 2171
1431 2171 1772 2450 -5751 -15258 -7900 10830 11630 -6248 -12047 2570 7582 -7405 -14563 575
1445 575 14095 7390 -5331 -8433 -6435 -3209 4673 10060 1600 -8540 -2249 8394 958 -13025
1459a3025P692K1012K20k0519q895J1137Q558l966r23M122j418m847J62J076m917
1474d531J251J4242O233j6651j5049R646J6770l993j3195L499J3837k105j3973
1487d019m198O890O369L785K260o834j2619N07J4699M797j2640n333J4043P338
1501A5045j4828j4615R290J5383L72q390k006L53k807K13N623j75l989M039O837
1516A0345q259j5512L547J9820N607j5605r339R386O981p557o796N230P639N57
1530F044k356m296q179j747J2940J1070r007j4708L848J2895k775j3623Q33J5005
1544E944M550j0798q092K059L675J807L318K97n988k211O203J070r885l313J4400
1559C036J0131j1544j6144L511J3918J910q313j575M925J681k416k969k840q27
$$ plain form
1459 -13025 -5333 15679 15899 -4620 -13515 -2378 6180 2214 1291 5413 3995 -852 -690 386 -4531
1474 -4531 -3280 10962 17195 544 -14505 -4859 11911 7918 -5277 -1778 12059 9954 -4019
1487 -4019 -8217 -1327 5042 8827 11087 4253 -8366 -7859 6840 11637 -1003 -6336 7707 15045
1501 15045 217 -14398 -5108 10275 10647 2257 251 604 -2203 -1990 3633 3458 -531 3508 10345
1516 10345 2086 -13426 -9879 9941 15548 -57 -9396 -10 6971 -586 -7382 -2152 5487 6044
1530 6044 3688 -608 -8787 -10534 2406 13476 4469 -10239 -6391 6504 3729 -9894 -9061 5944
1544 5944 10494 -304 -8396 -6337 -2662 -855 2463 2760 -3228 -5439 764 1834 -8051 -11364 3036
1559 3036 13167 1623 -14521 -11010 2908 4818 -3495 -5070 -145 1536 -880 -3849 -6689 -7516
1573g516P248R400m250j5030l639J3742P766r332p529P643Q356n727r916J235
1587g549P676L190o45j927m289l163M659N881l760o776N089J0424l592j4869k076
1602a1727J4067Q168o831r108J119N340J336j630k025j082K144P004J24j1061
1616d162o426R922J2061l574j2358j190R717K283p144k946N168M807j052l897
1630A209l173j120L818O313j116p868j626Q192L770q797p023P464J0797k158j1355
1645b673l442O278N919l09m136l182K82N475K680n513p572L759J1185Q53j0917
1660a313o339O707Q407k642o942J34M781J266k540l447o84L216M421k03o691l683
1676e552N350O854l267q907N80R192L198q268p032L618P875K180n072n737R3N161
$$ plain form
1573 -7516 -268 9132 4882 -10148 -13787 -45 7721 -1611 -9140 -1497 6859 1132 -8784 -7549
1587 -7549 127 3317 2672 745 -3544 -6707 -2048 3833 73 -6703 -1614 8810 5218 -9651 -11727
1602 -11727 2340 10508 3677 -5431 -4312 1028 2364 734 -1291 -2373 -229 6775 6899 -4162
1616 -4162 -10588 -666 11395 7821 -4537 -5727 3990 6273 -871 -3817 1351 6158 5106 1209
1630 1209 -1964 -3084 734 7047 5931 -1937 -3563 4629 8399 -398 -7421 43 10840 8682 -2673
1645 -2673 -6115 163 6082 5773 1637 -1545 -1263 4212 6892 1379 -6193 -2434 8751 9604 -1313
1660 -1313 -7652 -945 7462 4820 -2122 -1988 2793 4059 1519 -1928 -2612 604 5025 4822 -1869 -5552
1676 -5552 -202 6652 3385 -5522 -4942 4250 7448 -820 -7852 -4234 3641 5821 749 -4988 -4895 266
1692B66M483l208p075p17Q029M789o529q016K435Q621J779o385m827K973N175
1707A793k27m031k545K162M576O80m979m484L296P348l59p530l506N781O763k953
1723A785p865j195P133M601k957o707j886N342N705r79p292l155N511O557j910
1738B688p561k164O836N216l968o084j75N880L048l490m325N76M575K473l326
1753A99m532Q19N981K719n866m826L010P043J151o716m291L883O888J12o831l722
1769d979L306O641J088o521m908L514O780R86o475m398M147O148j56n920l154
1784c901M423M947r39n376k013M088M387j861n457q40M694M259l225n975j28O278
1800C361L541m177o350P96O394L614m705o053O92O324L472m445o263O70O333L603
$$ plain form
1692 266 4749 1541 -5534 -6251 1778 6567 38 -7978 -5543 3078 4857 -1528 -6355 -3382 1793
1707 1793 1566 -2465 -5010 -2848 1728 2408 -2571 -7055 -3759 3589 3230 -4300 -7806 -2025 4738 1785
1723 1785 -6080 -7275 -142 4459 1502 -5205 -7091 -1749 3956 2977 -4315 -7470 -1959 4598 2688
1738 2688 -4873 -7037 -201 5015 1047 -5037 -5212 668 3716 226 -4099 -3523 1052 3525 199
1753 199 -4333 -3514 2467 5186 -680 -5506 -2496 4547 5698 -1018 -5309 -1426 5462 5574 -1257 -4979
1769 -4979 -1673 4968 6056 -465 -5373 -1859 4921 5907 -568 -4966 -819 5329 5173 -747 -3901
1784 -3901 522 5469 4530 -846 -2859 1229 5616 3755 -1702 -2542 2152 6411 3186 -2789 -2917 3361
1800 3361 6902 2725 -3625 -2829 3565 7179 2474 -3579 -2887 3437 6909 2464 -3799 -3129 3204 6807
1816F807m693n644M37O356K837m702n329J555N668J300m547m050K651M540Q65
1831D051m976l286K752N101M62o380k899M211N566j249o612k503N200N147k026
1846B559o641j745N109M993j767n958k301M304N578j799o712j606N201M556k383
1861A388n804j215N844L356l455m655J35M439K990l391m384N51N148K499m552
1876a106m584J282O289K042n605m554K963N778N47n372l513L221N281P20m885
1891a496m133K062N958J495m781m965L382O103J15o443k598M321N060j367n557
1906b844j067L560K899n71l789j645L409L986j166n665j501N386N458l742o698
1921c990J85O401K471m138m577J773M825J849l414m252k11M757M048k360o250
$$ plain form
1816 6807 2114 -3530 -3093 3263 6100 1398 -3931 -2376 3292 4592 45 -4005 -1354 3186 4051
1831 4051 -925 -4211 -1459 3642 4104 -2276 -5175 -964 4602 3353 -3259 -5762 -562 4585 2559
1846 2559 -4082 -5827 -718 4275 2508 -3450 -5751 -1447 4131 2332 -4380 -5986 -785 3771 1388
1861 1388 -4416 -5631 213 3569 114 -4541 -4406 33 3023 -368 -4752 -4201 947 3446 -1106
1876 -1106 -5690 -4408 1881 3923 -1682 -6236 -3273 2505 3052 -2320 -5833 -2612 2669 3389 -1496
1891 -1496 -5629 -3567 2391 3886 -895 -5860 -2478 3625 3740 -2703 -5301 -980 4080 2713 -2844
1906 -2844 -3911 -351 2548 1977 -1812 -3457 -48 3938 2772 -2893 -4394 992 6450 2708 -3990
1921 -3990 -3805 2596 5067 929 -3648 -1875 2950 4799 1385 -2867 -3078 1679 5727 3367 -2883
1936b883q18O273L343m494n275K650O284k07n516k686K983M048L11k649k725L27
1952a034L328J631l019m361K662P021n46p697l508N933N683k496n533m08M052
1967A708J781k063l015n23K362M048M93n970m455M136P048j397o899j055O354
1982B553K004n151m224L164M898J23k674k569j244J343M158O2m320j532M876L116
1998D583n405o705L854Q575M16p296l810L854L067p71j544l70L56J705J830l046
2014g07n278Q03Q395L245p366o413M130O022k157n372J679N078O29l921k537j27
2030c897J572L441K777l485n839J891N879m94o551m70Q395L676p933o837L310
2045d565O199J022k534m34j016o23J540J089l075j727N818N141n010r150R11R090
$$ plain form
1936 -2883 -3701 2572 5915 1421 -3854 -1204 5080 4873 -643 -3329 -346 3702 4013 1364 -1361 -1034
1952 -1034 2294 3925 906 -3455 -793 6228 5682 -2015 -5523 410 6093 3597 -1936 -2344 1708
1967 1708 3489 1426 -1589 -2112 250 4298 4791 -1179 -5634 -1498 5550 4153 -2746 -3801 2553
1982 2553 4557 -594 -4818 -1654 3244 3367 693 -1876 -3120 -1777 2381 2443 -1877 -3409 1467 4583
1998 4583 -822 -7527 -3673 4902 5318 -1978 -5788 -1934 1133 362 -1182 -1552 -1196 509 2339 -707
2014 -707 -5985 -5182 3213 6458 -908 -7321 -3191 2831 674 -4698 -3019 2059 2688 -1233 -3770 -3897
2030 -3897 -2325 1116 3893 408 -5431 -3540 2339 1845 -4706 -5176 3219 6895 -1038 -7875 -4565
2045 -4565 1634 2656 122 -312 -1328 -1951 -411 678 -2397 -4124 1694 6835 1825 -7325 -6414 2676
2061B676L064o468k478M482J541l686k441J728K651J830J306j949o208j535O705
2076A218N563n209n642M071O163m046q169J526Q309L248m685l600n47K73J187
2091c40L441K45m001L75M416m85p880k379Q866P193n530p405R43M767q58k854
2107a486K018K983r07r70n84l335k279M667P828j842r300j876P267J878o115k083
2123d136O941M202m839n884K5K853J815K512J119m518m440K815M609k791n056
2138d773M710P687k758j0077k260P193M603k981j764J503r05k298L91Q50j006
2153a885P79N412J007q541o043O265Q353k283o459J524M716j670n624o58M987
2168a20K355K18k57l693m829J605P404J490o158j966N694K020p498m974O754P685
$$ plain form
2061 2676 5740 -728 -3206 1276 2817 -869 -3310 -1582 1069 2899 4205 2256 -3952 -5487 1218
2076 1218 6781 1572 -4070 1 6164 2118 -6051 -4525 3784 7032 2347 -1253 -1800 -1527 -340
2091 -340 3101 3346 -655 -280 4136 3651 -4229 -6608 2258 9451 3921 -3484 -2541 2226 1368 -1486
2107 -1486 532 3515 2608 1638 1054 -2281 -4560 107 7935 6093 -3207 -5083 2184 4062 -2053 -4136
2123 -4136 2805 7007 2168 -3716 -3691 -838 977 3489 4608 90 -4350 -1535 3074 283 -4773
2138 -4773 -63 7624 4866 -5211 -7471 -278 4325 1344 -420 1083 178 -2120 -1729 -879 -1885
2153 -1885 -1106 4306 5313 -3228 -9271 -3006 5347 3064 -3395 -1871 2845 1175 -4449 -5107 -120
2168 -120 2235 2453 2196 -1497 -6326 -4721 2683 4173 -1985 -3951 1743 3763 -3735 -8709 -1955 5730
2184E730j758n871j454J305r3P60K524o08k036J746K318l770o440L545R711J351
2200F960q798m728N120L653l141k509L866K727j230k528j348k021O41O529L079
2215F272n344o524K859O131k043n734K022P909J87p199l838L203L558J050J77
2230B686r85k655q50K771Q25m016l83O372L868p195p139L033P791M90m857o39
2246h83K935k71k412p17J132M48K394K756l022o553j1P159K530m889l425M575
2262A746K790l872m868K177N019J023k055j758j838q70K728L233j745l624J860
2277e4M176k089o632J20P132L365m720m441J830J861k09m97N78k1J65R77p21l628
2295b808j554N154M783l524n801M79N064K84m112n63L332J746j662k421r75K89
$$ plain form
2184 5730 3972 -1899 -3353 -2048 -2141 -1381 1143 535 -1501 245 2563 -1207 -7647 -4102 5609 6960
2200 6960 -1838 -6566 -1446 2207 -934 -3443 423 3150 1920 -608 -1956 -3977 -3336 3193 6272
2215 6272 928 -5596 -2737 3394 1351 -4383 -2361 5548 5735 -1464 -5302 -2099 1459 2509 2686
2230 2686 1701 -954 -1804 967 1792 -2224 -2607 3765 7633 438 -6701 -3668 4123 4613 -244 -883
2246 -883 2052 1781 -631 -1348 -216 232 2626 5382 2360 -4193 -4204 2955 5485 596 -2829 1746
2262 1746 4536 664 -4204 -2027 2992 4015 1960 202 -1636 -2506 222 3455 1710 -1914 -54
2277 -54 4122 2033 -4599 -4479 2653 6018 1298 -3143 -1313 548 339 -158 420 399 564 1541 820 -2808
2295 -2808 -4362 792 5575 2051 -3750 -3271 1793 2077 -2035 -2598 734 2480 818 -1603 -2578 -2289
2311b289K181L006j299m204j065M048J689l348l173L817M399j899n344q62L826
2326e17K121o11j506j199N5J502J114j850k075J528M579l52n876k300M588M188
2342C389k350l802M48L139K23j805j604J30K549K088j044l388j985L100M339j704
2358A723m577J42M347J398m066k645K290M057Q5k925k223P77K508J251j194k720
2374a772K35L796J155l845l643L112M800k96m777j789L369K655j264k687p47K257
2390E59K226o23k904j604K367L663l63m733j351L677K671k005l408K64L757J216
2406C409k430k903N30K772J729j714k815k06K832J743j898l100Q08L556J166l203
2422B76l364J980L754m0k728j832J539K457J76k421j920J298K659O67l028k079
$$ plain form
2311 -2289 -108 2898 1599 -2605 -3670 378 2067 -1281 -4454 -637 3762 1863 -3481 -4343 -517
2326 -517 1604 993 -513 -1712 -1657 -155 959 -891 -2966 -1438 3141 2789 -3087 -5387 -799 3389
2342 3389 1039 -2763 -2315 824 1047 -758 -2362 -2232 317 2405 1361 -2027 -4012 -912 3427 1723
2358 1723 -2854 -2712 1635 3033 -1033 -3678 -1388 2669 2754 -171 -2394 -1617 891 2142 948 -1772
2374 -1772 -1537 2259 3414 -431 -4074 -962 3838 3542 -1235 -3024 345 3000 1736 -951 -1698 559
2390 559 2785 2162 -742 -2346 21 3684 3321 -1412 -2763 914 3585 1580 -1828 -1564 2193 3409
2406 3409 979 -1924 -1394 1378 3107 1393 -1422 -1628 1204 2947 1049 -2051 -1243 2313 3479 276
2422 276 -3088 -1108 2646 2606 -122 -1954 -415 2042 2218 -203 -2123 -825 1834 2501 -527 -2606
2438b606J799L252n39l222q89K405J641n04k860n48K169J814r25k358q93J695
2454e69K434n42k731j228K679K136j509k960j45K936J225j310k256n35K392J884
2470A901j610k437j17K029J919j041l051J98K750J385j718k694J86K836J102j654
2486a6k349M49K531J156k080k101O39K522Q83j832k928J387L123N36k727j979
2502b786J190L017K72k838j509J831K476L27k879j849J833K829J33l471j313K422
2518c15L088j200l123r34K639K633j187l147o90K863J834j320k938k09K885K573
2534C452k185l039n6L380J738k582l100R04L210J469k640k869J010L388Q45k505
2550D20k312R28L196O01k660k287R17L885K46l402j725J955K929m87k985j094
$$ plain form
2438 -2606 -807 2445 1906 -1316 -2205 200 1841 1337 -1523 -2071 98 1912 987 -1371 -2264 -569
2454 -569 1865 1323 -1408 -2636 43 2179 670 -2290 -2435 501 1726 416 -1840 -2375 17 1901
2470 1901 291 -2146 -2263 -234 1685 644 -2407 -2209 541 1926 208 -2486 -2300 536 1638 -16
2486 -16 -2365 -1916 615 1771 -309 -2410 -1771 751 1634 -198 -3126 -1739 1384 1920 -807 -2786
2502 -2786 -1596 1421 1693 -1145 -2654 -823 1653 1980 -899 -2748 -915 1914 2047 -1424 -2737 -315
2518 -315 2773 1573 -1550 -2484 155 2788 1601 -1546 -2236 627 2461 1141 -1797 -2006 879 3452
2534 3452 1267 -1772 -1828 1552 3290 708 -2392 -1488 1722 3191 551 -2318 -1308 2080 2925 420
2550 420 -1892 -964 2232 2833 173 -2114 -1197 2688 2934 -468 -2193 -238 2691 2204 -781 -1875
2566a875K064K503q02k805j275K542K186p45l132j006L086J978j223l394k95K998
2582H05K327k259k741N03K184J819k091k329M31K140J164j541k454K64K403J914
2598B539k201k504L64K993P97k554j408J312J984l01j535j481J097K021N06k017
2614c88j841Q68K524L24k506j506J695K636j079k383q17K046J390l17j484q66
2630a704O83J521M34j526j613J186K733k05l259j143K690K116q70k699j30J773
2646a3Q63q62j276r6J118J623m36k541j255K385K860j012l153l49K771J282k281
2663c72j945J118K645O39k048j546k26J871J912o86k589o74K742J361k335k905
2679c038K212L649J20l236k136J858K017j16j431o40R69J201K39k291j493J361
$$ plain form
2566 -1875 189 2692 1890 -915 -2190 352 2538 1793 -1339 -2345 741 2719 1496 -1898 -2193 805
2582 805 3132 873 -1868 -1365 819 2638 547 -1782 -1351 789 1953 412 -2042 -1778 625 2539
2598 2539 338 -2166 -1802 1191 1988 -566 -1974 -662 1322 1021 -514 -1995 -898 1123 1629 -388
2614 -388 -2229 -1361 1163 1487 -1019 -2525 -830 1806 727 -1656 -2473 -427 963 646 -838 -1704
2630 -1704 -1021 500 934 -592 -2205 -1019 1714 1509 -1750 -2893 -203 1913 1043 -1656 -1786 -13
2646 -13 850 -12 -1288 -1384 -266 1357 921 -1620 -2875 -490 2370 1358 -1795 -2144 627 1909 -372
2663 -372 -2317 -1199 1446 2085 37 -1509 -1735 136 2048 1362 -1227 -1901 841 2202 -133 -3038
2679 -3038 -826 2823 2943 -293 -2429 -571 1446 1330 -101 -741 228 1429 1668 -623 -2116 -755
2695g55L956j8m124k077K835K948r56l377N22L072N80k194k330M44K434J820l36
2712B444k785j989J972K765q19l329O69L675L93l532k780J968L815j49j826j432
2728i40M59J093K77n46j658N41L020P05l447l404K097M430K62l316j286K152J067
2745A506k215j158P71K274R65j012j602k075Q47L120J277k652j855K272J419k163
2761b81l205K099L493P11k761k240M7J288Q93P77m16p50j31J148j259k435Q61
2778b161L763J981l199l413P64K065L75p84L59Q28J89j399n03r19J09K622J951
2795B628j520l478m13K921J117k080k71K272O93k252k405P38J436J588J010q65
2811A119k547j158J662J983j314j073J742K540j937l990m45L723K054o72j510
$$ plain form
2695 -755 3201 3183 -941 -3018 -183 2765 1809 -1568 -1046 2026 2606 412 -1918 -1474 960 2780 2444
2712 2444 -341 -2330 -358 2407 1588 -1741 -1072 2603 2996 -536 -3316 -1348 2467 2318 492 -940
2728 -940 -481 612 889 343 -1315 -774 2246 2951 -496 -3900 -1803 2627 2889 -427 -1713 439 1506
2745 1506 -709 -1867 -1096 1178 2143 1131 -471 -2546 -1699 1421 2698 46 -1809 463 1882 -281
2761 -281 -3486 -1387 2106 2817 56 -2184 -2137 -849 44 821 405 -345 -476 672 -587 -3022 -2161
2778 -2161 1602 3583 384 -3029 -2265 -200 175 -609 -250 578 767 -632 -1135 -2054 -1945 677 2628
2795 2628 1108 -2370 -2783 138 1255 -825 -1096 1176 1869 -383 -2788 -2050 -614 974 1984 1119
2811 1119 -1428 -2586 -924 1059 -255 -1328 414 2954 1017 -2973 -3418 305 2359 1687 177
2826A77q12j23j86Q68ok83J295J433q47l371j752L389L404j064l005J04J749l73
2844E97j769k09K421J167Mj513k373r28K430L001j44k913q06J957N88k805j551
2861b846L503L472j103l696j644R69J929O77J31q58n21P40L36k260j805K944M128
2878D096q11m400j915K339K035r75r86J187J217l22j903j566K93K108K739m21
2894B715l563k043K257K035j170j348J265K528j219l046j602J892K411Q47p74
2909A185j276j533J008R94o57p99J214K282k62l664k152K320L148J26k159m66
2925f91L44P1o26l76K91J688P38k54k468j914J132L298R71k224j046J173O31j950
2943a212j006J567J805J73j078j524q45P34J743Q03p00j392P03R31j230j641O59
$$ plain form
2826 177 -635 -758 -944 -76 -82 -365 930 2363 1516 -1855 -3607 -218 3186 2122 -883 -779 970 597
2844 597 -1172 -1381 1040 2207 2211 698 -1675 -2603 -173 2828 2684 -229 -1035 922 1510 -1295 -2846
2861 -2846 657 4129 3026 -670 -2314 -1345 584 1261 1392 534 13 753 1089 -1171 -2976 -32 4096
2878 4096 3285 -1115 -3030 -691 1344 369 -617 570 1787 1465 -438 -2004 -1711 397 3136 2715
2894 2715 -848 -2891 -634 1401 231 -1117 148 2676 1457 -1589 -3191 -1299 1112 1959 1185
2909 1185 -91 -1624 -616 378 -279 -1078 136 2418 2156 -1508 -3660 -1340 1808 1934 -225 -691
2925 -691 -347 -276 -902 -1278 -987 701 1439 1185 -1283 -3197 -2065 1233 2204 -20 -1066 107 738 -1212
2943 -1212 -2218 -651 1154 1327 249 -1275 -2120 -1386 357 1160 460 -932 -229 702 -528 -2169 -1510
2960a510L415K74j936j765J38J023O25K83n86R1Q9N60o17k338N38L212J364k050
2978H10k522M8K168N79j191r1R93J54n29j187o98O07K204J008j361k386j38K292
2996G60N90j852n71J828J008p66k438l24J882J626j83j401q55K58J181M29j662
3013d90o51J768J693j244k923k41K677J536j058j794K94R51M50r42p11K33J696
3030A244P00j421k117n2K214J506j486j759O63K142r15j259j035J403J553N6j444
3047gj586N27J798O90j116j521P48J661m93j758q81K271J717q47k535k77J613
3064DJ036r03r02m9R01J121j165j264l57J764J358r20j939j14J857O90j011j274
3082a167K20J806J11j273j057J94J484P70q19j202l33J654M56j168j195Q39J479
$$ plain form
2960 -1510 1905 2179 243 -1522 -1384 -361 264 547 -39 52 141 701 84 -2254 -1716 1496 2860 810
2978 810 -1712 -1664 504 1083 -108 -199 794 948 419 -768 -1466 -859 1345 2353 992 -1394 -1532 760
2996 760 1350 -502 -1073 755 1763 997 -1441 -1765 117 1743 1560 159 -696 -438 743 1172 -490
3013 -490 -1141 627 2320 1076 -1847 -2088 589 2125 1067 -727 -433 518 968 26 -685 -452 1244
3030 1244 1944 523 -1594 -1646 568 2074 588 -1171 -508 1634 719 -540 -1575 -172 1381 1437 -7
3047 -7 -1593 -1066 732 1422 306 -1215 -467 1194 701 -1057 -1938 333 2050 1203 -1332 -1609 4
3064 4 1040 137 -765 -814 87 1208 43 -1221 -1578 186 1544 624 -1315 -1429 428 1118 107 -1167
3082 -1167 -947 859 970 -303 -1360 -1166 318 1088 269 -933 -1266 388 844 -324 -1519 -680 799
3099G99L0j514o42R17J121j1j203m96M80R40J02q12q14N14J209K33j384q71Q45
3118e57J311k44j378k74Q67R85l20j072j95P07J208p4j471o41J306J256o75j608
3136h69l17J487Q70p32j242P6J382N88n91j422l2Q87J202n91j398Q0J142R18r56
3155D82j499M80J349N03j433r17L28J817j91r57o93K77J395N56j318j020M77J288
3173I24O19j711r99J072J451j44j482o96R30J102j60j292o29J014J240j76j796
3190g33l63J075J409l91j831k79R81J262n20j584K21J293O51o59j400k02J496
3207D26P69n68j758l6J396Q93j251q36J55J292Q95j384j185J58J553P86j638j152
3225a485J029J207p5r77p41N55J471l34j292q21J057R84L65j318p69P06J152l23
$$ plain form
3099 799 829 -685 -1327 -410 711 700 -503 -999 -519 421 523 -289 -1103 -589 620 853 -531 -1402 -557
3118 -557 754 510 -868 -1142 -275 710 390 -682 -877 -170 1038 964 -507 -1148 158 1414 739 -869
3136 -869 -1186 301 1171 439 -803 -727 655 1243 652 -770 -802 85 1287 696 -702 -622 520 1438 482
3155 482 -1017 -537 812 1315 -118 -1035 -707 1110 919 -38 -731 -454 941 1497 179 -841 -364 924
3173 924 1543 -168 -1167 -95 1356 1212 -270 -966 -36 1066 906 -386 -1015 -1 1239 1063 -733
3190 -733 -1096 -21 1388 997 -834 -1113 -132 1130 610 -974 -753 540 1191 532 -868 -1070 426
3207 426 1195 627 -1131 -1167 229 1122 -129 -965 -810 482 1377 -7 -1192 -1034 519 1305 -333 -1485
3225 -1485 -456 751 676 -301 -1042 -487 984 650 -642 -1463 -406 578 943 -375 -1144 -438 714 391
3243C91j341o8N24J278k78j267m84R18J166m22j091k50J213P17q98j161LJ346
3261B96O47q22j161M15O43P65o32q36MQ14N96r18r79M28J403J26o20j111M2J311
3281D11K80r90m46N02Q78M15j237l97L69R69J05q63j233P76J258q9n15j044J193
3300C42M47m6j021o92J205N26q5r52m56M72J006O38j774l17P33J064p25j357L45
3319f47J051M92n19q85J52M24N59k15o93k48Q08P28n61j400J27J729M39r26j364
3338i49N63Q49J95q19k01jP86P42r59j036M57Q16O60p45j172K56J486k66j021
3357c59o74J162R25n26j194j77Q01M51J83o61j33j53Q24J20j347n00J275R55k67
3376G05j704m02J212Q62o07m37j4Q01n5n37o12k09J220Q54m33j310j017J762R30
$$ plain form
3243 391 -950 -1018 -494 784 506 -761 -1245 -327 839 417 -674 -924 289 1006 108 -1053 -1050 296
3261 296 943 121 -1040 -625 18 783 151 -685 -681 133 729 -189 -1168 -740 663 789 169 -942 -900 411
3281 411 691 -299 -745 -243 635 1050 -187 -584 -215 754 859 -4 -1237 -461 797 708 193 -851 342
3300 342 789 743 -278 -970 235 761 676 -276 -732 -260 746 1384 -390 -707 26 1090 365 -992 -647
3319 -647 404 896 377 -508 -356 68 627 412 -281 -529 279 1007 446 -954 -827 902 1341 415 -949
3338 -949 -386 463 658 -161 -362 -363 423 1165 206 -830 -373 443 1103 358 -814 -558 928 662 -359
3357 -359 -1033 129 1054 528 -666 -843 -42 409 592 -69 -202 -355 469 589 -758 -1258 17 972 705
3376 705 -999 -1401 -189 673 66 -371 -385 416 361 -176 -788 -997 223 1077 644 -666 -1683 79 1009
3395A009q11j027O42R66k62j257o16Q90R70j62l65m49m01N14P51k15r81K33J501
3414I30j04j659n72J243J356m43j176k6J55K35l18K75n72O17J058j84j266r62
3432a413Q04J804k17j429k25Q92K71j232J67P91P67k53o45n06m66K64J418N63
3450A355j162j136J108O89j075j099J134J540R2k300k12Q06O26r6O6K58o72J97
3468A19K54l67r70L45J948J037k730j037Q96J305o38m34R39K62o63r31K10J88
3486b67K06O80P46o47j985Q3J582O14j274l98J925J24j757j032P86J314j50QJ90
3505G48j040o36R12O78l18p29R88R01j505j951K72K324O57j151q42Q41k04o92
3523g47k4J132J76j62J63k5j798o68K174J374j041j564M87J144r25j050Q78J572
$$ plain form
3395 1009 198 -829 -187 779 517 -740 -1356 -466 504 342 -23 -472 -873 -359 392 177 -804 -571 930
3414 930 826 -833 -1405 -162 1194 751 -425 -451 -296 -61 -379 -104 -676 -59 999 815 -451 -1413
3432 -1413 -609 1195 978 -451 -676 216 487 -745 -578 213 980 727 82 -424 -890 -626 792 1355
3450 1355 193 -943 165 854 -221 -1320 -186 1354 1446 -854 -1066 -260 366 270 336 594 -78 119
3468 119 373 6 -964 -619 1329 2366 -364 -1401 -505 800 162 -272 667 929 266 -665 -455 -267
3486 -267 -61 619 1365 718 -1267 -1184 398 1012 -262 -660 1265 1389 -368 -1400 -614 700 550 558 748
3505 748 -292 -928 -16 662 344 -385 603 1504 -1 -1952 -1680 644 1301 150 -692 149 -55 -747
3523 -747 -771 361 537 375 538 513 -1285 -1953 221 1595 554 -1010 -523 621 -304 -1354 -476 1096
3541A096k65j203m26J25j46K61J434K50j452k91P67K00j570m78K488J373j884
3558B79j644M61O56Q9R1L05M00p75l86N92p11o93J344J978n63k744m28J803M68
3577E22q01n8J251M5j855r0M31O43Q4M56L76j004j397O42J773n51j241P07J436
3596A369o97k314M24J409O80n42m04N16p02o73Q01P64l07o26J298J14k166p26
3614a782J753J564n45j581J33J100q04o06O37P74J43m90L09n92j171M89J715O18
3632A664j705p16J083P46j707m18J134J470p40j245J78k66p1O44Q53k28j095L3
3650c86J095m73j203N73J975k81j647m82Q55K41r5n87Q99K21j121K08M85o69k06
3669e98J247P00j220j597R95J106k45j409Q98Q40l97j088K08J87L80L32K38m3
$$ plain form
3541 1096 831 -372 -798 -673 -819 -558 876 1126 -326 -617 150 350 -1220 -1698 790 2163 279
3558 279 -1365 -904 -248 -159 -68 237 637 -138 -524 68 -643 -1336 8 1986 1423 -1321 -1749 54 522
3577 522 -279 -337 914 959 -896 -986 -555 88 172 628 1004 0 -1397 -755 1018 467 -774 -67 1369
3596 1369 672 -1642 -1218 191 871 329 -75 441 -261 -934 -133 631 324 -302 996 1110 -1056 -1782
3614 -1782 -29 1535 990 -591 -458 642 -162 -768 -131 643 786 296 605 13 -1158 -669 1046 1664
3632 1664 -41 -757 326 1072 -635 -1053 81 1551 811 -434 -256 -522 -593 51 904 676 -419 -386
3650 -386 709 236 -967 -394 1581 1300 -347 -829 26 267 172 -415 484 705 -416 -208 277 -392 -598
3669 -598 649 1349 129 -1468 -473 633 388 -1021 -123 717 320 -768 -560 -373 7 339 577 534
3687E34j185l62J049N16r67l09J053Q36j565r19N41J459m11k53r8n5l05o2O00
3706I7K53n38o6J031m64j530K86J491M57j300m91P56O70j027m78R89M48m10l60
3725a86J09k17n66P03J021l99j051R2J283k79j598L13J280K77j044j38K39j35
3743b96J51K26N34q45L8O83k05q87l99J376O03q24r74J02J176J65o34K31J21N
3763C47o68K4K82k13j6R09j52j482K16R71M45o12n22L59J273q95r17L47O37j12
3783B21q1o3j64m76Q06Q3M4p76l4J125k14q07j57P60L45m73l50K33J18m5J08R1
3805B94l50K83J22Q6p48l56N85Q67m52r34J01R36j31q2p99R35J37l3k89l05j25
3826b58J00M45l1n15q8L10M49m18n89O47M89m66l11j89N54L7J17l90m9PM80j39
$$ plain form
3687 534 -651 -1013 36 552 -415 -724 329 1165 -400 -1319 -778 681 270 17 -81 -136 -441 -503 97
3706 97 350 -188 -254 777 313 -1217 -931 560 1017 -283 -774 -18 652 -375 -853 136 584 174 -186
3725 -186 -77 -294 -860 -157 864 465 -586 -494 789 510 -1088 -775 505 782 -262 -400 -161 -296
3743 -296 -145 81 615 -230 -192 491 286 -601 -1000 376 979 155 -819 -717 459 624 -10 221 342 347
3763 347 -321 -297 -15 -228 -244 665 513 -969 -753 218 663 51 -471 -112 1161 266 -651 -304 333 221
3783 221 140 77 -87 -563 243 326 370 -406 -440 685 471 -336 -493 267 612 139 -211 22 140 95 203 294
3805 294 -56 227 349 435 -313 -669 -84 783 331 -603 -502 434 303 221 -578 357 494 461 172 -133 -258
3826 -258 -158 287 256 -259 -347 -37 412 -6 -595 52 541 75 -236 -425 129 166 283 -107 -156 -149 331 192
3848A92k13m49L02O83J11q81k96M95M78k25q01N62M3j1P5j61k73L12L22q5n99
3869d19oL28O64l88l30j90N58j01k35k70k2N74L12j97n19M13n5K54m29m68J53
3890c73K15L78j01o86M77N52j00m05l77M38L14J3l79n25N15L24pl24j42K2M01
3911B30J54n17q26J196M9J51o26NK90N22n83k46K19jL11l30M5k67L25K26j93k00
3933f6j62N79k10k33K5o7N32q2j48m58J63M27n3l9j08l60J33O19l18l25q7P86
3955E48j69n33m38O19M44k33l16J6J70J89j01j74n63M28M72J06o92k36N61K9M4
3976A71l78J57O0K26k47j89j7J57M0J99l70j53J97L63L28p72m51N97M65k81n27
3997d25K10M60L07q87L18r2P3J92p4P0m91N4Q15L6q98q9P53K90p73m82K78P06
$$ plain form
3848 192 -21 -470 -168 515 626 -255 -551 -56 422 197 -604 -42 1 -10 65 -96 -369 -57 265 180 -419
3869 -419 -425 -97 567 179 -151 -341 217 116 -119 -389 -411 163 475 278 -241 172 117 371 -58 -526 -373
3890 -373 -158 220 119 -567 -90 462 362 -43 -420 18 332 345 -34 -559 -44 280 273 -51 -193 -171 230
3911 230 384 -133 -959 237 286 437 -189 -184 106 628 45 -201 18 17 328 -2 43 -224 101 327 134 -66
3933 -66 -228 351 141 -92 -67 -134 398 316 168 -290 -127 300 247 208 100 -260 -127 492 174 -151 -238 548
3955 548 379 -154 -592 27 471 238 -78 -62 108 297 196 22 -541 -113 359 465 -227 -463 98 127 171
3976 171 -207 -50 10 236 -11 -200 -217 -60 -20 179 -191 -344 -147 216 544 -228 -679 -82 383 102 -425
3997 -425 -215 245 552 -335 -17 -109 -36 156 82 152 -339 -285 530 566 -332 -421 332 622 -151 -633 -355 351
4019C51k70l44L9N61m36K08R9j26k35L12J09m35l13J84M87L62r97J15R14k30n50
4040a95l44P27k00p0R2O5q5l80O45J77o01p57J022L49k82p77K25P41l1l62p0P0
4062d1J60l43K70J48k15j06N99m1r87J30Q59K65p11k91N59M08p77m10M59N27J6
4083D78n20L0J0l70R8Q19L02j243L3N75n6r80j24J439L26j444j96J000K12n99
4103b10L00M09l11k42N1N31m11o94L53J164m08j307L02R75l58p83N30P87j94p40
4123b56j9N17l59l58Q64L71j061n36P96P72m47q71N73J228q85j094N56O09k40
4142A60n20O16K13r14O6M93K20n28l94J075L11j422j65P40R07r56l46O32M77j035
4162c70o09Q08N66o92L15L02O0j531J17J725N9j214J31P64k49p10m9Q85M82j079
$$ plain form
4019 351 81 -263 -224 337 -99 109 208 82 -153 159 268 -167 -480 -296 191 553 -444 -329 585 355 -195
4040 -195 -539 188 -12 -82 10 75 -10 -390 255 432 -169 -926 96 445 163 -614 -389 352 321 -41 -111 -41
4062 -41 119 -224 46 194 -21 -127 472 431 -556 -426 433 698 -13 -304 255 663 -114 -524 -65 462 478
4083 478 -42 -12 -2 -372 -274 545 847 -396 -363 212 156 -824 -948 491 817 -627 -823 177 389 -210
4103 -210 90 499 188 -54 -3 528 117 -577 -224 940 532 -775 -473 502 144 -639 -109 678 484 -256
4123 -256 -275 242 -117 -475 389 760 -301 -837 -41 731 284 -587 -14 1214 329 -765 -209 400 160
4142 160 -360 256 469 -445 -379 114 334 -194 -588 487 798 -624 -789 -49 858 -98 -444 188 665 -370
4162 -370 -979 -171 395 -297 18 320 380 -1151 -1034 691 750 -464 -333 431 182 -528 -577 308 790 -289
4182b89j65P32k65q95J06J391j50j274O17R30p93r16M69J287j28j471N36N67o5
4201B24q86Q19N91n16o80J02P46q54k27P18J051j025r67O48J196j035q07J092
4219A90P43o11j335Q36K85n9l23Q16L04j274o11J551L39j208j41J257K26j611
4237f26p53J414R67j143j87Q58K59j406k01R61M83q21O6R29j62j447j2J366M03
4256I48j382q1J355N8j427k72J144K85r91N7J105p83j082R98J043k91j201J69
4274c48J232p04j072N70J467o45r42J67R00n07q65O28J070o99j036P33N98r75
4292d28q37J560R53q29j112N47Q50r42n80J212N02j090o53J055K32j230M3J455
4310G08L83j355q09J316M71r28n32J133L99j058p21J045J87l23MO12J08j262J68
$$ plain form
4182 -289 -454 278 13 -882 -776 615 465 -809 -192 738 -55 -971 -502 785 657 -814 -278 289 224
4201 224 -662 157 748 232 -448 -346 400 -454 -681 37 1088 63 -904 -256 940 -95 -902 190
4219 190 933 322 -1013 -177 108 49 -274 542 846 -428 -1039 512 851 -357 -498 759 985 -626
4237 -626 -1379 35 1002 -141 -328 530 789 -617 -818 143 626 -195 -129 800 638 -809 -821 545 948
4256 948 -434 -515 840 898 -529 -801 343 628 -363 -306 799 16 -1066 -68 975 684 -517 -348
4274 -348 884 180 -892 -322 1145 500 -442 -275 625 118 -747 -119 951 252 -784 -51 547 -428
4292 -428 -1265 295 1248 419 -693 -146 704 -238 -818 394 896 -194 -847 208 440 -790 -747 708
4310 708 1091 -264 -1073 243 714 -214 -746 387 786 -272 -993 52 239 -84 -80 532 640 -622 -454
4329d54Q79P8j076j5J300j63j282J15J063K78j214j4Q85k49r88N27R95l51o66
4348c52K24J089q74j024N36J202p43p50M46J041j000n48L89J116l99n51K31J99
4366B32m65m82J029N49p94l65N38K18o43o38J181O68q37q52N93Q13q97n56R95
4385B87N51q18k93L89K13q21k77J369j24q76k43Q90J27l80k48Q19n9q70p9O65
4405B22P9m96j14P37j84p25j53J033K56j085O00K13K9p54l98J214k09o89M21L59
4425C56k07p51L45M88L8o38R48q5p34n80P36M16J59r78L68O64n68k94q3Q75l16
4446A59p90N52M15q12oN39M23n07l72P23J50n47m12M74O64k29l43o3J06k97Q4
4467h9K27K74n56j10L72L10o17M0L26L18n09l95N77kk04k31J61J46J24j65q6R5
$$ plain form
4329 -454 425 503 -573 -588 712 549 -733 -618 445 723 -491 -505 380 131 -857 -330 665 314 -352
4348 -352 -128 961 87 -937 -401 801 58 -692 -246 795 -205 -753 -364 752 353 -198 33 232
4366 232 -233 -715 314 863 69 -296 242 460 -183 -821 360 1028 191 -661 -68 745 -152 -708 287
4385 287 838 20 -273 116 329 -492 -769 600 476 -400 -643 247 374 -6 -254 565 506 -364 -443 222
4405 222 301 -195 -309 428 244 -481 -634 399 655 -430 170 383 412 -342 -740 474 265 -424 -3 356
4425 356 149 -602 -257 231 269 -369 579 494 -240 -820 -84 332 491 -487 -119 545 -23 -317 -400 475 159
4446 159 -631 -79 336 -476 -482 57 480 -27 -399 324 474 -73 -485 -11 653 424 81 18 124 -173 -89
4467 -89 138 412 -144 -254 118 428 -189 -149 177 495 -14 -409 168 166 -38 -269 -108 38 162 -3 -89 6
4489Fj64J77L91l19n33L20K68j57k46K7K53L6m58J72J05Q8j18J59J29l94J07K03
4511E2N04l06n37N68j58L5n42J54M71J6q2j65K25l12p6J62k04QJ66K09l10J9k09
4534c12L17K10k01J5j5L54k30n31L28M20k39p5J1j88L1J67K09k13p2k98M86j40
4556C4K79o26K32K44k34j27J86R1j49L2j12k7o7L72L15m92l25K99K82J53k76j31
4578d7%J87j29m9M1J05Q2j71J86k81p5M21m2m87J87K45J19m05kJ18L55n76J56
4601f2k09L31j00p3l4M62l68N0J17j91j14J29Q6n4l54L25K5P2k05J34j66L47k03
$$ plain form
4489 6 -158 19 410 91 -442 -122 146 -11 -257 -230 23 59 -399 -227 -122 -34 -152 7 136 -258 -151 52
4511 52 556 250 -287 281 123 158 -384 -230 241 257 175 10 235 -77 -153 9 -195 -187 -21 188 -122 -103 -312
4534 -312 5 215 14 29 14 368 138 -393 -65 355 116 41 52 -136 -105 62 271 58 -14 -312 174 34
4556 34 313 -313 -81 163 -71 -198 -12 79 -70 -38 -150 -177 -244 128 443 -49 -374 -75 207 360 84 -47
4578 -47 -47 140 11 -38 3 108 190 19 205 -76 -151 270 228 -259 -72 173 292 -113 -115 3 358 -218 -62
4601 -62 -271 60 -40 -113 -147 315 -53 -3 114 -77 -191 -62 24 -30 -384 -59 -34 38 -167 -33 -199 148 -55
$$ [...]
8191a1
##END NTUPLES=NMR FID
##END=
