##TITLE=1H_SA_pyram2
 DMSO-d6, 8 sc, 
 12.2.2019
##JCAMPDX= 6.0         $$ Bruker NMR JCAMP-DX V2.0
##DATA TYPE= NMR FID
##DATA CLASS= NTUPLES
##ORIGIN= UXNMR, Bruker Analytische Messtechnik GmbH
##OWNER= root
$$ XWIN-NMR		Version 3.5
$$ Tue Feb 12 14:37:46 2019 Russian Standard Time (UT+4h)  she@DPX200
##.OBSERVE FREQUENCY= 200.1313
##.OBSERVE NUCLEUS= ^1H
##.DELAY= (6, 6)
##.ACQUISITION MODE= SIMULTANEOUS
##.ACQUISITION SCHEME= undefined
##.AVERAGES= 8
##.DIGITISER RES= 18
##SPECTROMETER/DATA SYSTEM= spect
##.PULSE SEQUENCE= zg30
##.SOLVENT NAME= D2O
##.SHIFT REFERENCE= (INTERNAL, D2O, 0, 15.7039)
##AUDIT TRAIL= $$ (NUMBER, WHEN, WHO, WHERE, WHAT)
$$ ##TITLE= Audit trail, XWIN-NMR		Version 3.5
$$ ##JCAMPDX= 5.01
$$ ##ORIGIN= Bruker BioSpin GmbH
$$ ##OWNER= she
$$ F:/spectra/data/she/nmr/H-F/1/audita.txt
$$ ##AUDIT TRAIL=  $$ (NUMBER, WHEN, WHO, WHERE, WHAT)
(   1,<2019-02-12 14:36:21.62 +0400>,<she>,<DPX200>,
      <created by zg, POWCHK disabled, PULCHK disabled
       configuration hash MD5:
       00 E9 B6 7A A2 85 ED C7 34 08 36 98 17 FE 4E 26
       data hash MD5: 16K
       E9 6E 2D CE 98 65 6F 48 7B CC 90 9D 8D 48 7E 88>)
$$ ##END=
$$ 
$$ hash MD5
$$ 21 09 D9 DC C6 89 48 A8 5B EA 18 48 11 A4 65 8B
##$RELAX= 
##$RELAX= 
##$RELAX= 
##$RELAX= 
##$RELAX= 
##$RELAX= 
$$ Bruker specific parameters
$$ --------------------------
##$DU= <F:/spectra>
##$EXPNO= 1
##$NAME= <H-F>
##$PROCNO= 1
##$TYPE= <nmr>
##$USER= <she>
##$AMP= (0..31)
100 100 100 100 100 100 100 100 100 100 100 100 100 100 100 100 100 100 
100 100 100 100 100 100 100 100 100 100 100 100 100 100 
##$AQSEQ= 0
##$AQ_mod= 1
##$AUNM= <au_zg>
##$AUTOPOS= <>
##$BF1= 200.13
##$BF2= 200.13
##$BF3= 200.13
##$BF4= 200.13
##$BF5= 200.13
##$BF6= 200.13
##$BF7= 200.13
##$BF8= 200.13
##$BYTORDA= 1
##$CFDGTYP= 0
##$CFRGTYP= 5
##$CHEMSTR= <none>
##$CNST= (0..31)
1 1 145 1 1 1 1 1 1 1 1 1 1 1 1 1 1 1 1 1 1 1 1 1 1 1 1 1 1 1 1 1 
##$CPDPRG= <>
##$CPDPRG1= <>
##$CPDPRG2= <>
##$CPDPRG3= <>
##$CPDPRG4= <mlev>
##$CPDPRG5= <mlev>
##$CPDPRG6= <mlev>
##$CPDPRG7= <mlev>
##$CPDPRG8= <mlev>
##$CPDPRGB= <>
##$CPDPRGT= <>
##$D= (0..31)
0 1.2 0 0 0 0 0 0 0 0 0 0.03 0 0 0 0 0 0 0 0 0 0 0 0 0 0 0 0 0 0 0 0 
##$DATE= 1549967780
##$DBL= (0..7)
120 120 120 120 120 120 120 120 
##$DBP= (0..7)
150 150 150 150 150 150 150 150 
##$DBP07= 0
##$DBPNAM0= <>
##$DBPNAM1= <>
##$DBPNAM2= <>
##$DBPNAM3= <>
##$DBPNAM4= <>
##$DBPNAM5= <>
##$DBPNAM6= <>
##$DBPNAM7= <>
##$DBPOAL= (0..7)
0.5 0.5 0.5 0.5 0.5 0.5 0.5 0.5 
##$DBPOFFS= (0..7)
0 0 0 0 0 0 0 0 
##$DE= 6
##$DECBNUC= <off>
##$DECIM= 32
##$DECNUC= <off>
##$DECSTAT= 4
##$DIGMOD= 1
##$DIGTYP= 9
##$DL= (0..7)
0 120 120 120 120 120 120 120 
##$DP= (0..7)
150 150 150 150 150 150 150 150 
##$DP07= 0
##$DPNAME0= <>
##$DPNAME1= <>
##$DPNAME2= <>
##$DPNAME3= <>
##$DPNAME4= <>
##$DPNAME5= <>
##$DPNAME6= <>
##$DPNAME7= <>
##$DPOAL= (0..7)
0.5 0.5 0.5 0.5 0.5 0.5 0.5 0.5 
##$DPOFFS= (0..7)
0 0 0 0 0 0 0 0 
##$DQDMODE= 0
##$DR= 18
##$DS= 0
##$DSLIST= <SSSSSSSSSSSSSSS>
##$DSPFIRM= 0
$$ [...]
##$SUBNAM2= <"">
##$SUBNAM3= <"">
##$SUBNAM4= <"">
##$SUBNAM5= <"">
##$SUBNAM6= <"">
##$SUBNAM7= <"">
##$SUBNAM8= <"">
##$SUBNAM9= <"">
##$SW= 20.0189088683792
##$SWIBOX= (0..15)
0 0 2 0 0 0 0 0 0 0 0 0 0 0 0 0 
##$SW_h= 4006.41025641026
##$TD= 16384
##$TD0= 1
##$TE= 0
##$TE2= 300
##$TE3= 300
##$TEG= 300
##$TL= (0..7)
0 120 120 120 120 120 120 120 
##$TP= (0..7)
150 150 150 150 150 150 150 150 
##$TP07= 0
##$TPNAME0= <>
##$TPNAME1= <>
##$TPNAME2= <>
##$TPNAME3= <>
##$TPNAME4= <>
##$TPNAME5= <>
##$TPNAME6= <>
##$TPNAME7= <>
##$TPOAL= (0..7)
0.5 0.5 0.5 0.5 0.5 0.5 0.5 0.5 
##$TPOFFS= (0..7)
0 0 0 0 0 0 0 0 
##$TUNHIN= 0
##$TUNHOUT= 0
##$TUNXOUT= 0
##$USERA1= <user>
##$USERA2= <user>
##$USERA3= <user>
##$USERA4= <user>
##$USERA5= <user>
##$V9= 5
##$VALIST= <valist>
##$VCLIST= <CCCCCCCCCCCCCCC>
##$VD= 0
##$VDLIST= <DDDDDDDDDDDDDDD>
##$VPLIST= <PPPPPPPPPPPPPPP>
##$VTLIST= <TTTTTTTTTTTTTTT>
##$WBST= 1024
##$WBSW= 4
##$XGAIN= (0..3)
0 0 0 0 
##$XL= 0
##$YL= 0
##$YMAX_a= 34115
##$YMIN_a= -63442
##$ZGOPTNS= <>
##$ZL1= 120
##$ZL2= 120
##$ZL3= 120
##$ZL4= 120
##$ABSF1= 10
##$ABSF2= 0
##$ABSG= 5
##$ABSL= 3
##$ALPHA= 0
##$AQORDER= 0
##$ASSFAC= 0
##$ASSFACI= 0
##$ASSFACX= 0
##$ASSWID= 0
##$AUNMP= <proc_1d>
##$AZFE= 0.1
##$AZFW= 0.1
##$BCFW= 1
##$BC_mod= 2
##$BYTORDP= 1
##$COROFFS= 0
##$CY= 11.3945322036743
##$DATMOD= 1
##$DC= 2
##$DFILT= <>
##$DTYPP= 0
##$F1P= 18.9103706918063
##$F2P= -1.10871071338519
##$FCOR= 0.5
##$FTSIZE= 0
##$FT_mod= 4
##$GAMMA= 1
##$GB= 0.15
##$INTBC= 1
##$INTSCL= 1
##$ISEN= 128
##$LB= 0.24
##$LEV0= 0
##$LPBIN= 0
##$MAXI= 10000
##$MC2= 0
##$MEAN= 0
##$ME_mod= 0
##$MI= 1.114404
##$NCOEF= 0
##$NC_proc= 0
##$NLEV= 6
##$NOISF1= 3.799351
##$NOISF2= 2.8
##$NSP= 1
##$NTH_PI= 0
##$NZP= 0
##$OFFSET= 15.70392
##$PC= 1
##$PHC0= -8694.301
##$PHC1= 12.40018
##$PH_mod= 1
##$PKNL= yes
##$PPARMOD= 0
##$PSCAL= 0
##$PSIGN= 0
##$REVERSE= no
##$SF= 200.130013532006
##$SI= 16384
##$SIGF1= 3
##$SIGF2= 2
##$SINO= 400
##$SIOLD= 16384
##$SREGLST= <1H.CDCl3>
##$SSB= 0
##$STSI= 0
##$STSR= 0
##$SW_p= 3612.71676300578
##$SYMM= 0
##$S_DEV= 0
##$TDeff= 0
##$TDoff= 0
##$TI= <>
##$TILT= no
##$TM1= 0
##$TM2= 0
##$TOPLEV= 0
##$USERP1= <user>
##$USERP2= <user>
##$USERP3= <user>
##$USERP4= <user>
##$USERP5= <user>
##$WDW= 1
##$XDIM= 8192
##$YMAX_p= 0
##$YMIN_p= 0
$$ End of Bruker specific parameters
$$ ---------------------------------
##NTUPLES= NMR FID
##VAR_NAME=  TIME,          FID/REAL,        FID/IMAG
##SYMBOL=    X,             R,               I
##VAR_TYPE=  INDEPENDENT,   DEPENDENT,       DEPENDENT
##VAR_FORM=  AFFN,          ASDF,            ASDF
##VAR_DIM=   8192,          8192,            8192
##UNITS=     SECONDS,       ARBITRARY UNITS, ARBITRARY UNITS
##FACTOR=    0.0002496,     1,               1
##FIRST=     0,             0,               0
##LAST=      2.0444736,     0,               0
##MIN=       0,             -63442,          0
##MAX=       2.0444736,     34115,           0
$$ Real data points
##PAGE= N=1
##DATA TABLE= (X++(R..R)), XYDATA
0@%%%%%%%%%%%%%%%%%%qJ6j6J6j6J6k4L2l2L5m3M8n6O4p2Q3r1J04j20J34j48J66
40H8j85K04k26K52k80L10l42L77m15M58n06N55o11O75p44Q23r13J016j134J270
60F72j433J629j873K185k598L182m066N590q948L1860k8779m8028M2097L1299
74B2789q751k4170Q615J1879L002m118l116j4835m181J4558J2051j6226j0329
87a2832K3312K3635k3159l6028N051L2557K901k3499l881K1207R922j0014r551
100c79m103n908K914J4523M025j5357k161K2236P652k7270k0423J7811K1592j0514
114D638j6474J1140J9452n078j7470k805N097k260l81Q258L269o442J853J0193
128A2990n053k0069k106J9424O299j5445l895J9339Q158j8076j4230Q778R484
$$ plain form
0 0 0 0 0 0 0 0 0 0 0 0 0 0 0 0 0 0 0 0 -8 8 -8 8 -8 8 -16 16 -16 19 -24 24 -32 32 -40 43 -48 56 -64 70 -78 88
40 88 -97 107 -119 133 -147 163 -179 198 -217 241 -265 290 -321 354 -390 433 -480 536 -598 672
60 672 -761 868 -1005 1180 -1418 1764 -2302 3288 -5660 26200 -2579 -50607 -8510 22789
74 22789 14038 -10132 -1517 10362 13364 9246 6130 -8705 -12886 1672 13723 -2503 -12832
87 -12832 10480 34115 10956 -25072 -20021 12536 15437 -8062 -11943 9264 19186 9172 -379
100 -379 -4482 -10390 -7476 7047 11072 -4285 -6446 15790 23442 -3828 -24251 -6440 15152 4638
114 4638 -11836 -696 18756 13678 -3792 -6597 -1500 -3760 -4141 4117 7386 944 2797 12990
128 12990 7937 -12132 -14238 5186 11485 -3960 -7855 11484 19642 1566 -12664 -3886 5598
141E598o382m500Q168N569l240o49J365q872r405Q928J4401o089j4062P700J9559
156A8089m335k3718n733J7607Q023j0875o110Q773P203k243m517m479o402J328
170g389J2605M737j3253p297J5635J3621j4765k2108N710K0637K348j4400m141
183h060J0434N955l534n953o152k400Q306J1807l974j5786M26J8776N376k0247
197e026j4688J3603J8519m073j5353j146J1280N107m942q289m679L919J1374M690
211A0296j0877j0740Q422J5562m865j9414k872J7152J0220j0234j1333M455R988
224E760L75p087n984O96O486O764k175j0347k205J0832O438r782j2124N871J4087
239G605M57j2012m610Q486O669n042p306q10N462N115j114n892k747M879N793
$$ plain form
141 5598 -784 -5284 2884 8453 5213 4564 5929 -2943 -12348 -3420 10981 4892 -9170 -1470 18089
156 18089 13754 -9964 -15697 1910 9933 -942 -7052 1721 8924 6681 2164 -2315 -8717 -7389
170 -7389 5216 9953 -3300 -10597 5038 18659 3894 -18214 -12504 8133 10481 -3919 -8060
183 -8060 2374 8329 4795 -1158 -7310 -9710 -1404 10403 6429 -9357 -8931 9845 15221 -5026
197 -5026 -19714 -6111 12408 8335 -7018 -8164 3116 8223 3281 -5008 -9687 -5768 5606 10296
211 10296 -581 -11321 -2899 12663 7798 -11616 -14488 2664 12884 2650 -8683 -4228 5760
224 5760 6135 -952 -6936 -6240 246 7010 4835 -5512 -7717 3115 9553 -229 -12353 -6482 7605
239 7605 8062 -3950 -8560 -74 6595 1553 -5753 -6563 -1101 4014 2900 -2992 -5739 -860 4933
254D933l270r159m71J0236M634q371p425N388Q740k557q892j715P439M742l872
269C80n597j72N189L504l434o109p98O947N237m836q133J397R556K740r336p070
285a0535N828R910n74r469m410O700Q087k758q777l456P493Q254k834j0487l094
300a0122R764Q476o210j1648L52J1689N994q264j0267L052J0613L364q558p964
314i729L516R964L075q661q093M046J0645J490r517p442O091J0328l98j0277n265
329a0227P120Q757j679r359m084O786Q290k581r369k837P970O843l906r224j149
344h649Q359N232m914p655L90P799L457m985o693J547O736K773n148n805K208
359e348O700J526n938m153L087N631N25n579k930L022M899j53n339k293L787M722
$$ plain form
254 4933 1663 -7496 -7967 2269 6903 -1468 -8893 -3505 5235 2678 -6214 -7929 -490 4252 380
269 380 -5217 -5389 -200 3304 -130 -6239 -7037 -90 5147 311 -7822 -6425 3131 5871 -3465 -10535
285 -10535 -4707 5203 4629 -4840 -9250 -2550 5537 2779 -5998 -9454 -1961 6293 3459 -7028 -10122
300 -10122 -358 8118 1908 -9740 -9388 2301 8295 31 -10236 -7184 3429 6793 -1765 -9729
314 -9729 -6213 3751 6826 -1835 -9928 -5882 4763 6253 -3264 -10706 -4615 5713 5315 -4962 -10227
329 -10227 -3107 5650 3971 -5388 -9472 -2686 5604 3023 -6346 -9183 -1213 5630 1724 -7500 -8649
344 -8649 -290 4942 28 -7627 -7237 562 4019 -966 -7659 -6112 624 3397 -1751 -7556 -5348
359 -5348 1352 2878 -3060 -7213 -4126 1505 2030 -3549 -6479 -3457 1442 1289 -4050 -6343 -2556 2166
375B166j560n234j185M360L646k667m751o6M938K913l989m401J603N386R93n047
391b895l091K922M907n63n149j626L708M033j538m621j638L990M201k504n011
406d875q51N396L914m152n686J348O401J371n273m130K747N411Q58m598m127K047
422d199N862J270n715n345L971Q210j49r170m071P435O834m027q431Q2P852M148
438D557m792n957n32N361M662l012p400o41P940O163o218r693K305J0116K031
453D890r397n005O371P373j187p059k778L194M631J102m665m733L081Q485R67
468E270r895n656P514Q848m696r412J218R782L068p276n446K069M774J080k462
483a220k879r3N228L977m072q219L77R170K511q470m691Q253P409n014q621M38
$$ plain form
375 2166 606 -4628 -5813 -1453 2193 -474 -5225 -5291 -353 2560 -1429 -5830 -4227 1159 2152 -2895
391 -2895 -5986 -3064 1843 1280 -3869 -5495 -1787 2246 708 -3913 -5551 -1561 2640 136 -4875
406 -4875 -5726 -330 3584 -568 -6254 -4906 1495 2866 -2407 -6537 -3790 1621 2479 -2119 -6246 -4199
422 -4199 1663 2933 -2782 -8127 -4156 4054 3905 -5265 -9336 -1901 4933 906 -7525 -7443 409 4557
438 4557 -235 -6192 -6724 -1363 3299 287 -7113 -7754 186 6349 131 -9562 -7257 2859 4890
453 4890 -4507 -9512 -3141 4232 3045 -4014 -6792 -3598 1033 2135 -2530 -7263 -4182 4303 5270
468 5270 -4625 -10281 -2767 6081 1385 -8027 -6809 2973 6041 -1235 -6681 -4612 162 1242 -1220
483 -1220 -4099 -4192 1036 5013 941 -7278 -6901 2269 4780 -3690 -8381 -128 7281 2267 -6354 -5916
499e916O040Q97l312q35J587J546K108L15n145m402L810O962k273q057J769R792
515D886J901j0586n334O677N593m206m674L277M615k39j575j937l245p94N002
530f39L235m671m298O699P588n932j1229J675R867N66p977p17P964K879m683l083
546b756j70j176K52M172J398m534r01P859L093j0405q121P303R330m040q119M137
562b678R119j371p673k092J789O7Q30L791l31m003J872O908k414j1860k132J1305
578A127N425q368m458Q432O173o815p616J725L244q70O99L451m06l553K732M352
594E274n793r702L213J1766N77r256n36R743J632r623n386M653L960j321M40L087
610B728j255k588K878P87p694m952Q231R529n155q125M553R137m476j1777n6Q638
$$ plain form
499 -5916 124 1021 -2291 -3126 -1539 7 2115 2430 -2715 -7117 -3307 3655 1382 -6675 -4906 4886
515 4886 6787 -3799 -9133 -2456 3137 -1069 -5743 -2466 2149 1910 335 -1602 -4847 -5641 -639
530 -639 2596 -2075 -6373 326 7914 1982 -9247 -7572 2295 2861 -5116 -5833 2131 5010 327 -2756
546 -2756 -2926 -4102 -3850 322 1720 -2814 -3715 4144 7237 -3168 -11289 -3986 5344 1304 -6815 -2678
562 -2678 6441 5070 -2603 -4695 -2906 -2839 -2009 1782 1451 -2552 -680 6228 3814 -8046 -10178 1127
578 1127 6552 -1816 -6274 2158 8331 1516 -6100 -4375 -1131 -2001 -1302 2149 1743 -1810 922 5274
594 5274 -519 -10221 -7008 4758 5335 -3921 -4457 5286 6918 -2705 -8091 -3438 522 -799 -359 2728
610 2728 1473 -1115 1763 2550 -5144 -10096 -1865 7664 2509 -5616 -1063 8074 3598 -8179 -8235 403
626D03K144l565M10L689j025k551Q84j116n689R0R630M025p757m653Q078M994
642G991r700q722N925R364j356n645K283M214k019l671j35j161k569M245P437
657F481j670q138P82Q769j321j2207k599J1473O689o651n370N524M286m746n175
672c873O41J343N56L308L352m026m490M300M932o241r358M587J1827R0r558j144
688c754P955J310p533l326L129K946L68J890Q3l801j274M753N83q030l667R286
704I18Q053n891q417M340P152l241q544N1O520K354j623k66O0j667K29K178k460
721b54n222K140Q545J862q336l216O594M039o606n862M182O217o01l182o8J030
737A262o25j0K16k736j454M516N415l052o941J294O885m97p811j826P132M217
$$ plain form
626 403 2547 -1018 -608 3081 2056 -495 389 -727 -6416 -6326 3304 7329 -428 -5081 2997 7991
642 7991 -1709 -10431 -4506 4858 3502 -2143 140 4354 2335 -1336 -1471 -2632 -5201 -956 6481
657 6481 4811 -3327 -2545 6224 4903 -7304 -9903 1570 8259 1608 -3762 1762 6048 1302 -3873
672 -3873 -3232 -1889 -1333 1975 5327 1301 -3189 1111 6043 -198 -9556 -4969 6858 6948 -2610 -3754
688 -3754 4201 5511 -2022 -5348 -2219 727 1095 2985 3068 -733 -2007 2746 3329 -4701 -8368 918
704 918 8971 3080 -5337 -997 6155 2914 -5630 -5579 941 3295 1672 1406 1466 -201 28 2206 -254
721 -254 -5476 -3336 5209 7071 -1265 -4481 2113 6152 -454 -6316 -2134 4083 3482 300 232 1262
737 1262 637 627 843 -1893 -3347 1169 6584 3532 -3409 -2115 4770 4273 -3538 -5364 1768 5985
753E985l595l876J671K048j047j178p87m65Q36L779J232m367l485L891M193l644
769A191n622K098O902J97m945j993L313J419j852j463j33P53J610K009j375l817
785a708m46M707J379m993l084M775M741k254n126J40M352M04k782j748R41K098
801A396J501m82k544j595K292L294k275m536Q90N493J528m797l270L419L290j238
817B366l356n28K516K092l93k076j776R87K995M94l642k269L370M422j975n006
833a779l21M475K066l456k993J125L664R35k487k624P39K916J533k766l267J309
849i31M697N25m460k456L041L828j213m424r11L843K428j566l751j94K812K355
865C623j713l310k24L535K285k524l940O25M124J559l353l435K054M071L38l722
$$ plain form
753 5985 2390 -1486 185 2233 1186 8 -779 -1244 -408 3371 4603 236 -3249 642 4835 1191
769 1191 -4431 -2333 4569 4766 -179 -2172 1141 2560 708 -755 -888 -135 1475 3484 2109 -1708
785 -1708 -2154 2553 3932 -1061 -4145 630 5371 3117 -2009 -1869 2483 2887 105 -1643 -702 1396
801 1396 2897 2415 -129 -1724 568 3862 1587 -2949 -2059 3434 4962 165 -3105 314 3604 2366
817 2366 -990 -1518 998 3090 2697 621 -1155 -168 2827 3321 -321 -2590 780 5202 3227 -1779
833 -1779 -2100 2375 4441 985 -2008 -883 2781 3716 1229 -1395 -656 2260 3793 1027 -2240 -931
849 -931 3766 4291 -169 -2625 416 4244 3031 -1393 -2304 1539 3967 2401 -1350 -1544 1268 3623
865 3623 1910 -1400 -1624 1911 4196 1672 -2268 -1643 2481 4040 687 -2748 -694 3377 3715 -7
881gk541K516L527n86l639j622L010L115r75l814j492L732L009j858m004l65M329
898B335K078k903l795J078L963J031l068k684J504L262O36k955k513J795L586
913C350j36l452j782K189L740j021l784j119L328K671j794l483k06L107J945j876
929A677l270K83L440J627k851k919R70L832P44l265k715J984L832l31l434j579
945a975K220K993r77k778r99K298K314p00l174j009K508K401j287l305k04L167
961A493J937k122l055R96K571J090k326j934N08K712R00j955k493P30L071P48
977B871k730k417J932L454j93l675j419L126J786j223k478j00K335J157q66k257
993f97m51J610J924p21k521o04L362J789k708l214J249L231L81k687j416J963
$$ plain form
881 -7 -2548 -32 3495 2909 -730 -2352 658 3773 2798 -1016 -2508 1224 4233 2375 -1629 -1994 2335
898 2335 4413 1510 -2285 -1207 2756 3787 719 -1965 -461 2801 3437 482 -2031 -236 3350
913 3350 3214 -238 -2020 169 3909 2888 -896 -2015 1313 3984 2190 -1293 -1499 1608 3553 1677
929 1677 -1593 -1310 2130 3757 906 -2013 -1043 2789 3533 268 -2447 -463 3369 3038 -396 -1975
945 -1975 245 3238 2261 -517 -1516 782 3096 2396 -778 -1787 721 3122 1835 -1470 -1674 1493
961 1493 3430 1308 -1747 -751 1820 2910 584 -1350 -842 1870 2770 815 -1678 -948 2123 2871
977 2871 141 -2276 -344 3110 2917 -758 -2177 949 2735 1512 -966 -1066 1269 2426 1560 -697
993 -697 -1148 462 2386 1665 -856 -1460 1902 3691 983 -2231 -982 2249 2630 -57 -1473 490
1009D90J683l73j779j022J50J976J628k019k329R95L634K39m226k264L440L362
1025C585k173l613J241L278Nk525j181N16J238J042J0j523j011K096K286k760
1041E11l921P91N015J038m200j820L807K113k414k968M59K003P46n7o80j052L38
1058b91K587J03l861k827M009M708k552m776J598M810k60m960j952L450K346r07
1074A225j355L80Q6L28R42j383l398N65M875J917m637k575M143L401l899n039
1090d424K007M532L48k386k75J181P0p78pj558j461J902M669q12m878k95N214
1107C049O80o192k966N279M187k441l259J567K330j137k158l34j97J74K548K135
1123C265k577l102K059L720k917n664J447O749J046m852j267L681O97l829j342
$$ plain form
1009 490 2173 1800 21 -1001 -851 1125 2753 734 -1595 -600 3034 3273 -953 -3217 223 3585
1025 3585 1412 -2201 -960 2318 2323 -202 -1383 -867 371 1413 1423 -100 -1111 985 3271 511
1041 511 -3410 -2619 2396 3434 -766 -2586 1221 3334 920 -2048 -1589 414 1160 1103 423 -629 -291
1058 -291 2296 2399 -1462 -4289 -280 4428 1876 -2900 -1302 3508 3248 -1712 -3664 -214 2132 1225
1074 1225 -130 250 336 664 1606 223 -3175 -2610 2265 4182 -455 -3030 1113 4514 615 -4424
1090 -4424 -2417 2115 2463 77 -198 983 1053 275 268 -1290 -2751 -849 3820 3008 -1870 -2165 3049
1107 3049 3729 -2463 -5429 -150 4037 1596 -1663 -96 2234 1097 -1061 -1395 -1592 -1418 1130 3265
1123 3265 688 -2414 -355 3365 448 -5216 -3769 2980 4026 -826 -2093 1588 2285 -1544 -2886
1138b886J732Q40j66K295R53k644k443K666K062m344l290M294N623k035n123J075
1154a391M366j688m706J70L202R10p20J430J06k369r34K146L3l886l40O071K654
1171E054m962l303L638K669m131l876L062L917m53j591J092j5k448k18J823q97
1187f39k751K078N111J18n708j325M579N86m871j733M715L034k347j240J128n39
1203A96k243M33J830j618j314L619L687l038n316J474M519j755n098J256N929
1218B561J015l726j073J425k68k058N38J326j116K57L477J252m612k812L375K663
1234B224l580l261L570M862j186m730N62K266q88j918Q73O94j62J398K148j827
1250A045l891j85M158N15m417o71N357K433m203l329K131K238j963j707J523J910
$$ plain form
1138 -2886 -1154 -314 -480 1815 2768 124 -2319 347 2409 -1935 -5225 -931 4692 2657 -2466 -1391
1154 -1391 2975 1287 -3419 -3249 -47 863 143 1573 1679 -690 -1624 522 555 -3331 -3671 2400 5054
1171 5054 92 -3211 427 3096 -1035 -4911 -1849 2068 1615 24 1116 1101 -1347 -1565 258 -639
1187 -639 -3390 -1312 3799 3917 -1791 -3116 1463 2049 -2822 -4555 160 3194 847 -393 735 196
1203 196 -2047 -1614 216 -1402 -2716 903 4590 1552 -3764 -2290 2229 474 -4624 -3368 2561
1218 2561 3576 -150 -1223 202 -66 -2124 -1586 -260 -1376 -1119 2358 3610 -1002 -3814 -439 2224
1234 2224 -1356 -4617 -1047 3815 2629 -2101 -1539 727 -161 -2079 -1206 -512 -674 724 2872 1045
1250 1045 -2846 -3031 1127 1642 -2775 -3446 1911 4344 141 -3188 -1057 1181 -782 -2489 -966 944
1266I44k38L9P32j885k561J536K935j368l489J972M994o47n143j306L705J156
1282A376k929j055K388J640o42m36n46j267n29K209Q63k517j293L532K853l291
1298C56m429K054L938q91l647K27L517J146k318j137L07j59J67J006l45j352P67
1315g93K716j01l813j219L145J977k754k079K275K829j163k390p0P85J30m2M77
1332i0o45m48J663J330j742l010R07L506j81l209n48L214J706k808k026J028J751
1349C98k04n11n77M80L70P05L4j987j047K057J924j684j909R87K628j87k754j003
1367b280J883Q87o02q54K89N64N08j3p46j266L07J939L99k260o04J935J344j028
1385D02k681P65K049L2j338o85R81J007j69q63p07p8J443N02r47j286M38J923
$$ plain form
1266 944 706 745 1477 -408 -2969 -1433 1502 134 -3355 -1383 3611 2964 -2179 -3485 220 1376
1282 1376 -1553 -2608 -220 1420 778 342 -204 -1471 -2000 209 1072 -1445 -2738 794 3647 356
1298 356 -4073 -2019 1919 1028 -2619 -2392 1125 2271 -47 -1184 -877 -1036 -869 137 -208 -1560 -793
1315 -793 1923 1822 -1991 -3210 -65 1912 -842 -2921 -646 2183 1020 -1370 -1440 -655 -525 -567 -90
1332 -90 -735 -1183 480 1810 68 -2942 -2035 1471 1290 -1919 -2467 747 2453 -355 -2381 -1353 398
1349 398 194 -317 -894 -414 -44 661 695 -1292 -2339 -282 1642 -42 -1951 -964 1664 1477 -1277 -2280
1367 -2280 -397 490 -112 -966 -677 -113 395 382 -364 -1630 -1323 616 1015 -1245 -1849 86 1430 402
1385 402 -2279 -1514 535 567 -771 -1456 -475 532 363 -500 -1207 -1285 158 660 -287 -1573 -1135 788
1403G88J32j926j176J724J225m71j306q8J264O01o85p89n24J013J022o47r65q05
1421a613J537J213q75j823J55K130L90j573j015Q57J503k50j167p42N11J352J09
1438F99r96j203R49J398l3j844o28J567J199o31j730j17J313J007q67j419M41
1455h95J124M18o34j014n1J460O94j424j186P51J199M20j368j164R11J727k31
1472G37j449p43J245J294p38j593k36J173J142n39j633K00J439R46j020j728J54
1489a349J630O92j189j429P54J780J21j615q70R41J340N4j360j109J145J376j97
1506G15j344o88J063J242l38j803L9J552R24j361j081O5J515P67j242j177L25
1523h27J275O99j035j444M73J767K55j770o82R99J502l57k063o4J414P12p79q20
$$ plain form
1403 788 920 -1006 -2182 -458 767 296 -1010 -1098 166 767 82 -707 -1231 -218 804 157 -808 -1613
1421 -1613 -76 1137 262 -1561 -1406 724 1114 -459 -1474 -617 886 636 -531 -1273 -762 590 699
1438 699 -297 -1500 -551 847 814 -1030 -1658 -91 1108 477 -1253 -1370 -57 950 83 -1336 -895
1455 -895 229 647 13 -1001 -1052 408 1102 -322 -1508 -757 442 862 -506 -1670 -759 968 737
1472 737 -712 -1455 -210 1084 346 -1247 -1483 -310 832 293 -1340 -1140 299 1245 225 -1503 -1349
1489 -1349 281 973 -216 -1645 -891 889 1010 -605 -1475 -534 806 860 -500 -1609 -464 912 715
1506 715 -629 -1317 -254 988 650 -1153 -1114 438 1362 1 -1080 -1015 500 1267 25 -1152 -827
1523 -827 448 1147 112 -1332 -859 908 1163 -607 -1289 -290 1212 855 -1208 -1272 142 854 75 -745
1541g45L45O86O40o54r78k42R40J014m71j687k6J939P35j741j037J070J288j95
1559H81j497j69Q07N77r7p13j055P55J341J99j322r01R39J358m69j933j32K314
1577H83N64j572p03P60Q17m99p33j2K96L40N01J44j124l49R24Q93j275j488J053
1596e80J960j91j831l7J024M65r97n95O98j8N11M29n74r58m9J515J91j967m41
1615a445K287J060j308j937R70J566p68j569J04J184M94j6o3l68r12K75J082l49
1633B87j632M95K517J00k523o67J835P05j810o25J377J006k78p99Q03p80q82M69
1651d02J262j087j015J560K141j157k892M23K459o10k323J25K629Q32j535q80
1667d70Q11m61p47N14P77q04j81J884Q35k405j575J687J779j788j794J857K538
$$ plain form
1541 -745 -400 286 926 272 -706 -948 -8 1006 535 -1152 -1178 761 1496 -245 -1282 -212 1076 881
1559 881 -616 -785 22 599 502 -211 -1266 -511 830 1029 -293 -1194 -255 1103 634 -1299 -1431 883
1577 883 1447 -125 -828 -68 749 250 -483 -495 -199 141 642 786 -338 -687 237 1130 -145 -1633 -580
1596 -580 1380 1189 -642 -679 345 810 -187 -782 -84 -102 409 838 264 -694 -743 772 963 -1004 -1445
1615 -1445 842 1902 594 -1343 -373 1193 425 -1144 -1040 144 638 622 559 191 -721 -446 636 287
1633 287 -1345 -850 1667 1767 -756 -1423 412 1117 -693 -1318 59 1065 787 -12 791 11 -871 -402
1651 -402 860 -227 -1242 318 2459 1302 -1590 -1167 1292 682 -1641 -1516 1113 1945 410 -470
1667 -470 341 -120 -867 -353 424 -380 -561 1323 2158 -247 -1822 -135 1644 -144 -1938 -81 2457
1684B457j120j995J31R62o19p72R11L75l50L56J689n75l020j19K268Q87k657o83
1702a874L131J831k513k008J201J092j075r12R95Q49l60L11O66j104j888Q05J854
1719A001m55k073Q30L220l4l452r37K325N84j825l04J796P05p19k30L96j176j319
1737a667J349J573j137j615J956K479j893k970O03K404n13k068J129J697P5j228
1753A74%J39j169n84J589P77j290l03K186Q21k412k426K132J744j458j306J841
1770D55K102j892j258M25L53j235J91J629N96j575R0J620j69k739o55K528Q43
1787A309j864n10K236J041j945j306O13P68j084J66J434J37r39N10J034j391j955
1804a746N74K437n15j621N08K459m28k587n98K097j68j224M72J368q3r72M62N42
$$ plain form
1684 2457 1337 -658 -527 435 -184 -956 -45 330 -20 336 2025 1450 -1570 -1689 579 1466 -1191 -1874
1702 -1874 1257 3088 575 -1433 -232 860 -215 -1127 -132 717 357 668 1334 230 -1658 -853 1001
1719 1001 546 -1527 -697 2523 2489 -963 -1900 425 1009 -816 -1120 676 1381 662 432 828 -348 -1667
1737 -1667 -318 1255 118 -1497 459 2938 1045 -1925 -1322 1082 569 -1499 -370 1327 1402 174
1753 174 174 313 -856 -1440 149 926 -364 -667 1519 2340 -72 -2498 -366 1378 -80 -1386 455
1770 455 2557 665 -593 -168 185 -1050 -859 770 1366 -209 -119 1501 1332 -1407 -2062 466 1309
1787 1309 -555 -1065 1171 2212 267 -1039 -426 342 -742 -576 858 995 56 566 1600 209 -1746
1804 -1746 -1172 1265 750 -871 -363 2096 1668 -919 -1517 580 412 -812 -340 1028 945 -27 435 977
1822I77j699j101J847J691j307j470J493J786j679j988O15J495j79j045O43R18
1838I97l75n84N75n32j227L93J714L27j863k08J807J007k349j553J539J472q46
1855B94j008R04R19n08n78K0r9q16P39J481m34j454L3J671j35k233j03J547Q13
1874A053q40r16R89P34o86n27P9k06j22O79P61q33r71R37J253j107j605O78J914
1893A264k93j417j04J322K26j089p58R35J95l31J46L51o54K9P54K13j407m69J437
1912C50O94p98p90N55O87n13q16L37M41J8j78L76Q9n29J84P2k92m22J7J406j78
1933G10j174j28J011J86j045l41M00R66j82r53N96L76k72K17m18l65pQ33N31q75
1953F6o20N15R55o00j036q1J138M95p92n95J29P49j59j99m91J80L40N81L1r31
$$ plain form
1822 977 -722 -1823 24 1715 408 -1062 431 2217 538 -1450 -835 660 481 -564 79 997
1838 997 622 38 613 81 -1146 -753 961 1288 -575 -783 1024 2031 -318 -1871 -332 1140 294
1855 294 -714 190 1109 601 23 43 -56 -872 -133 1348 914 -540 -507 1164 1029 -1204 -1307 240 1053
1874 1053 213 -703 286 1020 334 -193 -114 -320 -442 237 998 165 -806 131 1384 277 -1328 -650 1264
1893 1264 971 -446 -550 772 998 -91 -849 86 281 -50 96 447 -207 -178 576 789 -618 -1087 350
1912 350 1044 246 -544 11 698 185 -631 -294 147 165 -13 363 452 -77 107 179 -113 -535 -518 888 710
1933 710 -464 -592 419 605 -440 -781 -381 585 403 -550 46 422 150 367 -51 -416 -423 410 941 66
1953 66 -554 -39 916 316 -720 -801 337 832 40 -555 -426 323 164 -35 -526 -346 -6 575 606 -325
1973c25m45J131P86j000j067N56J003P4r92k94M48O64j41p56l1J04R79k85l97
1992A2n56K66P49J06j101j78O25N06j56o08j97M74M67j43l77k06K32O68j39o68
2012b24l48M58P21m40n33j66R12K41m03n09M1L81K59k20l64L7M72j15m06l54L62
2033a98P10l84k28q1J82L60k38k31n2M10o7j47k29K87n9K21n68K56K03K8O6k78
2055c7r4LK16Q5l06j86L76K09l71k94K81J03M27p13k47N13M48q6n30k37K92M87
2077C39m4m95m50N57P64l58o26J5M06L86m58o43K79N45K77m42m13l5J28O94k36
2098A90o50k28N33R15n58r28O0J004M35p60p17M62N25K96p07l57J4P29J24j36
2118B46r05m1J238K13p72o27L37J066j91j007l1P69K65l70l43j89Q2L26L14m79
$$ plain form
1973 -325 -770 361 1147 147 -920 -364 639 713 -279 -573 -125 539 398 -358 -389 -285 694 409 12
1992 12 -544 -278 471 577 -524 -702 -77 429 273 -335 -532 -58 409 266 -111 -317 -85 583 444 -224
2012 -224 -572 -114 607 167 -366 -532 380 621 218 -291 -250 131 390 170 -194 -157 315 200 -206 -560 -198
2033 -198 512 128 -100 -181 1 361 123 -108 -160 250 183 36 -193 94 35 256 -312 -56 147 175 241 -37
2055 -37 -131 -128 88 173 -133 -319 57 266 -105 -399 -118 -15 412 -301 -548 -35 413 327 -203 -440 -148 339
2077 339 295 -200 -650 -93 671 313 -313 -298 108 494 36 -607 -328 217 494 52 -361 -396 -268 426 190
2098 190 -460 -688 -155 760 202 -726 -666 338 773 13 -704 -242 283 579 -128 -485 -471 258 382 246
2118 246 -659 -700 538 751 -21 -648 -311 755 564 -443 -474 295 560 190 -153 -342 -260 66 380 -99
2138i9p19O57N68q7o93m15M94Q94n65m81L37L84L1n72K36N2j2j33K34K5l71N6
2160a79P11o87l51R0N85J02n23o6P54J35q58K0N02l52l34K5M91L81l40m6J55J9
2182B34o92J48N05l53l04L26R33r14p42L35R64j49p70n0J103R4p54j0J37m34r8
2203d91M98L94l48l63R95j45o39j419J087J130n33q52N24J187l36q95m9L11n02
2222d46K34M19k4o50K88R49k24j146m41J037R91r97o99J141N14p14o37kL58l52
2242d01L8O27r9n85M84O68m82j456J45J538J69j281r3J223K49j096l49L66K4l81
2262f92N63Q81n06q15O74K87q12o21M08J426l01j023N03Q64n26j044O1Q03k70
2281a40m12Q84O99j094p20Q91j14l10p37J067R45o40q28R23N05r85r81O87Q80
$$ plain form
2138 -99 -818 -161 407 320 -373 -788 -294 600 35 -446 -109 275 306 -266 -30 22 10 -123 111 136 -235 -179
2160 -179 532 -155 -506 -416 169 271 -252 -318 436 571 -287 -267 235 -117 -451 -426 65 446 106 60 215 234
2182 234 -458 -310 195 -158 -462 -136 797 -117 -859 -524 440 291 -479 -529 574 668 -86 -96 41 -393 -491
2203 -491 7 401 53 -310 685 540 -99 -1518 -431 699 166 -686 -162 1025 689 -206 -255 56 -446
2222 -446 -212 207 183 -467 -179 770 546 -600 -1041 -4 987 -10 -709 432 946 232 -405 -407 -49 -401
2242 -401 -363 264 165 -420 64 732 250 -1206 -1061 477 646 -635 -728 495 744 -352 -701 -335 -311 -692
2262 -692 -129 752 246 -569 105 392 -420 -1041 -633 793 492 -531 -28 836 310 -734 -673 130 -140
2281 -140 -552 332 1031 -63 -783 108 -6 -316 -1053 14 959 319 -509 414 919 -66 -1047 -360 520
2300E20p43m3O91O56j013p17O20J62n81J8Q04N06j158J19Q71k51j616m3J419L37
2320E58r86Q8J274j84j294q0L54K58m44N34N61k30p75L57O35q28j168P90J219
2339F39J2j006R0J290o65r65k17N68J64l48M89P66o99n93P94j17p55q51J388Q23
2359H07p23p99P35P89k01j612N64M87k91J70N32O5p30j37M96K1o88l45J163P97
2379A100j058n66N07N68q07o75O93N69k08J64O7J18p12MM49l62p46L24J395k7
2399G97j062m1P11r8r03j26J069J26n96J48N04l88r51N99O51o80j47L59N54j23
2419D03q16L33M61m89l34M45L76k29k68Q3N26m76m53K98K21k59N8L67K98m51n88
2440d94O21J98p60N9M69M05m00m77N54P0l42k22L64J63k14k89L36K94n88o3L65
$$ plain form
2300 520 -223 -266 425 1081 68 -649 -29 133 -448 -430 374 880 -278 -159 712 461 -1155 -1198 221 558
2320 558 -428 -340 934 750 -544 -624 -270 -12 -456 78 639 409 -366 -9 626 -202 -1370 -580 639
2339 639 651 -355 -265 1025 360 -605 -822 -254 -90 -438 51 817 118 -475 319 202 -553 -1404 -16 807
2359 807 84 -715 20 809 608 -1004 -440 47 -244 -74 458 523 -207 -344 152 173 -515 -860 303 1100
2379 1100 42 -524 -17 551 -256 -931 -238 331 123 287 354 472 -240 -236 213 -149 -895 -571 824 797
2399 797 -265 -306 405 307 -596 -722 347 473 -123 25 529 141 -810 -211 440 -240 -387 -28 526 403
2419 403 -413 -80 381 -108 -442 3 379 150 -118 -35 491 15 -438 -140 81 -178 -120 247 545 94 -494
2440 -494 127 325 -435 -376 93 498 98 -379 175 245 -97 -319 45 208 -6 -295 41 335 -253 -316 49
2461D9J22r40O66N56k0m50m85O64J65p62R2K85J88M6j72K80k14m89K94L38m41
2482b28o9K19N75j52o83m2M08L89n02j42J46Q7L7j23Q2R1l23K13J93l75r2M15
2504A24M31n54l78L50K19k62O0n07L84K76J8j16k07NjL61j37j52j39L80p8k47
2526a70j46M12M17n46q7j2J59l3k21L03J42m12K47J4k41j7J51J82K9j00j65J15
2548B1j62M0K99n1k99J05J13J19n9k35lJ42Q5M5q9j91O7o4K00J09q7m13L54o0
2572a4kj9j82K38R0k91l2K46J58r4j65j92J88J32O0j37j55K90j36l4o8J32j05
2595i2L78k71n4l5K33j49J32l21K01J03m2n2j46J14R0J3p4j35m7K71q0M7k70p6
2619b62K05K94m75m4J58K50o0Nj41j38J32M35k36k28J2M70m93R1j59K58JJ15j24
$$ plain form
2461 49 171 -769 -103 453 433 -17 -502 162 327 -435 -343 -58 130 176 4 284 70 -419 -125 213 -228
2482 -228 -297 -78 497 345 -338 -380 28 417 -85 -227 -81 6 43 -80 2 93 -230 -17 176 -199 -291 124
2504 124 555 1 -377 -27 192 -70 -10 -517 -133 143 161 45 -162 -157 -158 203 66 -86 -225 155 77 -170
2526 -170 -316 96 513 -33 -120 -132 27 -6 -227 76 218 -194 53 67 -174 -191 -40 142 171 71 -94 21
2548 21 -141 -101 198 147 -152 -47 66 185 126 -109 -112 30 115 160 71 -120 -53 -117 83 192 105 -308 46 -14
2572 -14 -16 -35 -217 21 111 -180 -212 34 192 98 -67 -259 -71 61 121 -16 -171 119 -17 -51 -119 13 -92
2595 -92 286 15 -39 -74 159 10 142 -179 22 125 83 31 -115 -1 89 102 28 -107 -154 117 37 84 -186 -262
2619 -262 -57 237 -238 -282 -124 126 66 71 -70 -208 -76 359 123 -105 -93 377 -116 -25 -184 74 75 190 66
2642F6j92J30K1J97j85l44J69k4K24J2j27j8K09rk24n7J17J00j14K38nK5k37n2
2666h0m1r3K96k37J56Q4m24M59k35L9j94M39j18j88o0K01J41j02l00L66o0k8p2
2689e1O7lP2Rl9M9l06m5L15q5R5o9nL22l53j48J82k73J41Q7M9J07j17K27k72J43
2715I9l05K7M80k56l05K45K25j76l04j5N55j52k53j5J07nK5L8k9n5n02P57K96
2738D82n50P2Q9J92k12r4r0M72l32q8J52P7j30N3J00q3k30j67L53M69p37J42J24
2761F4No41K62K55J03l7k64M02j0k55j44M51j07n83M74K03j18n4k26N78m23n64
2783f29M84M98J9n78M8O14l43l26j6L49k57j46L93L45j60p00K86K27k25m48K68
2804b97P97m20l00L75J4j64j89K4M99k71j61N31L9m25l78J37M15n34k0N46L45
$$ plain form
2642 66 -126 4 25 222 37 -307 -138 -162 62 74 -53 -71 138 129 -95 -152 -35 65 -49 189 184 209 -28 -80
2666 -80 -121 -214 82 -155 1 85 -339 120 -115 -76 -270 169 51 -137 -197 4 145 43 -257 109 49 21 -51
2689 -51 16 13 85 94 55 104 -202 -247 68 -17 78 9 4 326 -27 -175 7 -266 -125 -38 11 118 1 228 -44 99
2715 99 -206 -179 301 45 -260 -15 210 34 -270 -285 270 118 -135 -150 -43 -48 -23 15 -14 -69 -571 186 482
2738 482 -68 4 93 285 73 -21 -111 361 29 -59 93 170 40 93 193 110 -120 -287 66 535 -202 -60 64
2761 64 69 -572 -310 -55 48 11 -253 149 139 -116 -260 191 84 -499 -25 178 60 6 -220 358 -65 -629
2783 -629 -145 353 372 -206 -158 456 113 -213 -229 120 -137 -283 110 455 295 -405 -119 108 -117 -565 -297
2804 -297 500 80 -220 155 169 5 -184 -160 339 68 -93 438 477 52 -326 -189 226 -308 -328 218 563
2825E63m57j91J71K23o38K7K34M89o38J52K96J81m69k73O89m77j36N8O50l0n92
2846a68R2K97j56l54j96M27M19n78J85L40j43p37J16L66K27n64M45L28j43n12
2866c09M53J18l36k87J2P92j19m62K42K61n90j04K6N13k19j49K89O59o11o01M34
2887A2Q9m57j59N81K27K3n40K27J37j42l85L82M64m02l38M56L4k22k79L91l3k26
2909a60q4L88J71m87O9L71k72m82K37O62l17n09L71J07R8p37K64N51k03m30N7
2930c35J022l14m74J24Lm2k23j8O82j88m04L11L1L9m98L10J59j44l57J52N70j50
2952B56n94L03K07k88j80M8O72k55k90J06J40l77k61L10O06k91j24J97K15m60
2972f0l36L98J01k65k06P55k80j07j33Q2L40n48M2K7L64r6j25L10P8o64j00L23
$$ plain form
2825 563 106 -85 86 309 -329 -302 -68 421 -217 -65 231 412 -57 -330 359 -118 -254 -196 454 424 -168
2846 -168 -76 221 65 -289 -485 -58 361 -217 -32 308 165 -572 -456 -90 137 -427 18 346 203 -309
2866 -309 144 262 -74 -361 -349 443 324 -138 104 365 -225 -329 -303 210 -9 -158 131 790 179 -422 12
2887 12 101 -356 -515 66 293 316 -224 3 140 -2 -387 -5 459 57 -281 175 209 -13 -292 99 66 -160
2909 -160 -244 144 315 -172 -103 268 -4 -486 -249 413 96 -413 -42 65 163 -574 -310 241 38 -392 -335
2930 -335 687 373 -101 23 26 -16 -239 -257 425 237 -167 144 175 214 -284 26 185 41 -316 -164 406 256
2952 256 -338 -35 172 -116 -296 -248 424 169 -121 -15 125 -252 -513 -203 403 112 -12 185 400 -60
2972 -60 -396 2 103 -162 -368 387 107 0 -133 -51 289 -259 -217 -190 174 78 -47 263 341 -323 -423 -100
2994a00J98l35K19M45Q5n46l09N20k09p3q6K54r9J13K56k46j07k16L13N0j81j30
3016a84J44J68J80n35j17M73j29P5j96L21j25p2k9J0j10J8L26Nm00p8qM78j92
3039B3l25K04K19jj53J07m6L4j88J87L2N2l33M76k69k4o0O09k87m95K32L0J81
3062B05l57K39QK30k33m18O23j89j06m4K73k27j00k2K02k4j89k37N44j70q3Q1
3084FL11j47k15J30k44j3J96k17J20K08j73lJ75n0k86K11J13j21j48L05l69K20
3106IO8j57K09rk38N12m65R6j92J97k6K81l50O7Q4oj22k78M42j48p8N6M3j22K92
3131A65l01K03r1j73N1K94l23O0K26j81m5K05p3N3l10L33J83l63m4M6lJ60M6j74
3155e6J61J13k49kk29J84r4J80L85k59r0oQ1p5k64QL20K3k87J03k27L28Q3Qj87
$$ plain form
2994 -100 98 -237 -18 427 512 -34 -343 177 -32 -105 -191 63 -36 77 333 87 -20 -236 77 127 -54 -184
3016 -184 -40 128 308 -227 -344 129 0 75 -121 200 75 3 -26 -16 -126 -108 218 223 -177 -255 -263 215 23
3039 23 -302 -98 121 120 -33 74 28 62 -126 61 93 145 -188 288 19 -5 -65 544 257 -238 -6 24 205
3062 205 -152 87 95 325 92 -326 297 108 2 -42 231 4 -96 -118 84 60 -129 -366 178 8 -75 6
3084 6 317 170 -45 85 -159 -172 24 -193 -73 135 -38 -41 134 84 -202 9 122 1 -147 158 -211 9
3106 9 77 -80 129 120 -118 394 -71 25 -167 30 4 285 -65 2 86 80 -42 -320 122 -26 -104 -48 -5 -127 165
3131 165 -136 67 -24 -197 -146 148 -175 -115 111 -70 -115 90 17 70 -240 93 276 -87 -131 -85 -88 72 118 -56
3155 -56 105 218 -31 -33 -262 -78 -172 8 393 134 44 38 119 44 -220 -212 108 131 -156 -53 -280 48 131 139 -48
3180d8J98J05l03M60l57o7J01j48PJ96j16J5j28J4R7Mm6k34K51n3l62L18K55j41
3204A8O3k32J04m8K16r0Q2R6m34K51l6J66k03k1J41m2j31J13jj89J79J47k21J06
3228C4j65L07j07j36J8o7K29j83j17K93j27L32n64L56q0J28m1k07K08j39J7J03
3250I2K06k68l6R2J65k83j15L18l61o3K66j51L01L8k10L08j74k91N4P8K50j79
3272C7M2k44Q9K03j74P7K48j95k33M5K48l66j78O04l30j03K03Q0J70K8j24j97
3294g0N0m0k47M88J52l36j10K19j09k72j6M12j27J0j04L76k36j16Q3J40j97n8
3316a08%L15k89N5P0K83j70k46j57K72j81R0n7N66k44k49j58M10j62l53K23M90
3338D00k77j05l3j07J16k89M42J59j69k35K93Kj5l07J5mK75m7O0m6j18k97L89
$$ plain form
3180 -48 150 255 -48 412 55 -12 89 -59 -52 144 28 43 -85 -71 26 30 -16 -250 1 -52 -414 -96 159 18
3204 18 81 -151 -47 -95 121 31 113 209 -225 26 -10 156 -47 -68 73 31 -100 13 12 -177 2 149 -72 34
3228 34 -131 176 69 -67 -49 -116 113 -70 -187 106 -21 311 -253 103 23 151 110 -97 111 -28 -11 92
3250 92 298 30 -6 86 251 -32 -147 171 -190 -253 13 -138 163 201 -9 299 125 -166 -112 -34 216 37
3272 37 79 -165 -76 127 -47 30 278 83 -150 -105 143 -223 -401 203 -127 -230 -27 53 223 251 127 -70
3294 -70 -20 -60 -307 181 333 -3 -113 106 -3 -275 -291 121 -6 4 -100 276 40 -76 7 147 -50 -108
3316 -108 -108 207 -82 -27 43 326 156 -90 -247 25 -156 -66 -123 443 199 -50 -208 202 40 -313 -90 400
3338 400 123 18 -15 -122 -6 -295 147 306 137 -98 195 197 182 -125 -110 -114 161 114 174 128 10 -287 102
3361A02J07k67j91K72K77k71R6o0J33k27k21K78j1k64K58J69K73m45j94J09o8
3382a45O0N2O3k7nl1J73Kl18j11L83p7k20J41K64k10k51K93P9j42k27L26J40k38
3406b6j70K52J60n03M9K01K43j07l25J96K61o38K13n0L21j32k69L89j02J37m67
3427c67K01L38j32j48R9J93k26J3K58r3m0k55K32o4R0q5Q0J36k60j61K27J6l42
3450b90J22J66J64j77j51L52n0j98J54j44J09j81L07o0l5k00l5n1J96r6O5K38
3472B05j75k47K53Jj46J24j56J65L9p4J85J58m26j11J88O5J39m08kL99q3r4l3
3495c4R4m8j7J04J8k45m4Q5J27r7j78M10j82l49J97L65n2k12K7k6J75k37J19r9
3519i9M27n36N1M6J72l05r1M84j50k08L59n0j9r1J69k9j16q7j0L14j20j4o4N6
$$ plain form
3361 102 209 -58 -249 23 300 29 125 65 198 -29 -250 28 17 -247 11 180 453 8 -186 -77 -145
3382 -145 -85 -33 30 3 -2 -33 140 142 -176 -287 96 19 -201 -60 204 -6 -257 36 115 -27 -254 72 212 -26
3406 -26 -196 56 216 -287 -238 -37 206 99 -226 -30 231 -407 -194 -244 77 -55 -324 65 -37 100 -367
3427 -367 -166 172 40 -108 -9 184 -42 -29 229 136 96 -159 73 9 99 14 94 230 -30 -191 36 52 -290
3450 -290 -168 -2 162 -15 -166 186 136 -62 92 -52 57 -124 183 123 88 -112 -147 -198 -2 -98 -33 205
3472 205 30 -217 36 37 -109 15 -141 24 63 -11 174 332 -94 -205 -17 48 187 -221 -223 176 93 -1 -34
3495 -34 60 12 -5 99 117 -128 -172 -87 40 -57 -235 175 -7 -356 -159 206 154 -58 -31 -57 118 -119 0 -99
3519 -99 328 -208 -157 -111 61 -244 -335 149 -1 -209 150 100 81 -10 159 130 14 -73 -83 231 111 97 33 89
3543H9j72K0q0m4J46l1L9M71l01k17J73K32n45N9J64J29J28k86J53j92P1m22J96
3566b20M68L5j01J01p9m18K75j43M91m02rJ4K76m89K58j17MJ48j41L8m9M2Q7o9
3590@j77rO8K18j08P6k54K36q7J03J0j38K86m02J81j05J86J35l52K88j65R1J2
3613I3j07j39K3mL51j57k71O6R6j3j05K41R1k62j4K51k92J20J25p3K43l38j70
3636b45M8K39o5j56J24K34q4m0P4j17J79j49K2j81J92PL64n57r8K29J15j86K12
3659A61k03J40Q5l55M66k16r3q5K15k14MJ45j11N7r4pqN0j78J30L5P0J57o0k33
3684a42Q1R3o9J37j82P6J44j32J97j95q3Q4J10R8k14q9Q0j63L44k64K44l01J58
3707A2j07O3m6O2l0j6l8o9J31J27j31j66J99J11j12k19K58k30M31j58o5K6m8r3
$$ plain form
3543 89 -83 -63 -143 -187 -41 -72 -33 438 137 -80 93 325 -220 -161 3 132 260 -26 127 -65 6 -416 -220
3566 -220 248 283 182 283 204 -214 61 -82 409 7 -2 12 288 -201 57 -60 -56 92 -49 -11 -60 -18 69 0
3590 0 -177 -186 -118 100 -8 68 -186 50 -37 66 76 -62 224 -178 3 -102 84 219 -133 155 -10 81 93
3613 93 -14 -153 -130 -134 217 60 -211 -145 -49 -62 -167 74 165 -97 -111 140 -152 -32 93 20 263 -75 -245
3636 -245 -197 42 -23 -179 -55 179 95 55 129 12 191 42 64 -117 75 82 446 -111 -209 20 135 -51 161
3659 161 -42 98 183 -172 294 78 -15 -100 115 -99 -95 50 -61 -4 -98 -105 -113 -63 -241 -111 -76 -6 151 91 -142
3684 -142 -61 32 -37 100 -82 -6 138 6 203 8 -75 9 119 217 3 -86 -6 -169 175 -89 155 -146 12
3707 12 -95 -32 -78 -16 -46 -62 -100 -169 -38 89 -42 -208 -9 102 -10 -229 29 -201 230 72 7 33 -15 -108
3731a08q1J69j28O6k2J14j25j4J14N9o3O3j61p8K25l08K34J6J51j55j86M11k92
3754i9J70M4K35l02j03j84K75On4J42O3l74J38J38Jj20o2Q3j3l4Qj68K32j43L30
3779B09m20M14l34R9N6p7J44P2j18J28j56K14j17P4l88N9J51o6Q1n3J17j79K8
3802f2J92l0J28k51k41J33J4J23r8Q7j09p9J38Q6o5O9p8J52k31q1K83k26J51Q7
3826I2n9J01k87j60L22J51j32j64J36R4j87Q1qj39J10L38q3j83J40n4o4k02N3
3849a04J02P3Q5k05L7N8j69Q6r2K69k30j51M67j31k17qJ51J89k74J82k63M24k12
3872F7K7l9l2M9m8Ml10K04K6L1L0J1K07m39K69j39Q9J33m1j92J95j0k3j44JK57
3898A83l62N07l91J39j32J88j29r0L4k5J26l8L3mJ10k54L21k02m9J47n9Q1k25
$$ plain form
3731 -108 -189 -20 -148 -82 -104 10 -115 -129 -15 44 -19 44 -117 -195 30 -278 -44 -28 123 -32 -218 193 -99
3754 -99 71 115 350 48 -55 -239 36 42 -12 130 193 -181 -43 95 96 -24 -86 -3 -16 -50 -42 -210 22 -121 209
3779 209 -211 203 -131 -32 24 -53 91 163 45 173 17 231 114 188 -200 -141 10 -56 25 -28 89 -90 -62
3802 -62 130 100 228 -23 -264 -131 -117 6 -92 -5 -114 -193 -55 31 -34 35 -43 109 -122 -203 80 -146 5 92
3826 92 33 134 -153 -313 9 160 28 -136 0 94 -93 -12 -20 -159 -49 289 206 23 163 109 45 -157 -104
3849 -104 -2 71 156 -49 -12 46 -123 -37 -129 140 -90 -241 226 95 -122 -130 21 210 -64 118 -145 279 67
3872 67 94 55 23 72 24 28 -282 -78 -52 -21 9 20 227 -212 57 -82 7 140 99 -93 102 92 69 -75 -74 183
3898 183 -179 328 -63 76 -56 132 3 -87 -53 -78 48 10 43 39 149 -105 216 14 -35 112 53 134 -91
3921i1N9R0q3J08k12J61J12K34k86j23L8m5J19j35k6K41O9j25k60O3J34N3k46
3944a51n6L00j50M8J93j5m05M5K58K9k18n8M38k13r4J08j18K34l56k7L40o2j96
3967a26J15M7l9k1l9J90r0J01k72K76r7k79L6M7M10m61J83J52j95L26l66QK69
3990A75l88K30N0r3p8k2L45k02J54l68M01k09m5M1Rp1J68k84J58J8j63J9N11o43
4014b87L56K85k95J94l70R1J55k60j84L71K58m55p3L37j1J69l31K45p6j15m6m1
4036h3J10Q4k57K57r7j7k57M41r9q1l91K49J61k7Q2J04l7nj53K1o4Mok9J20j11
4062h1J41J14k3j65p0K29j35J2j46O7L29m29J9K28o4j55K6J29n1k8J16Q0r2J45
4086A96k92O0o1P1O5K8j6l8N3k22m5J95L7L2Nl50N52p8k27l57L75J68j1j8j57
$$ plain form
3921 -91 -32 58 -25 83 -129 32 144 378 92 -31 7 -38 81 -54 -80 161 230 105 -155 -92 42 95 -151
3944 -151 -207 93 -57 -9 184 169 -236 -191 67 96 -122 -180 258 45 -49 59 -59 175 -181 -208 132 70 -126
3967 -126 -11 36 -3 -24 -63 127 37 138 -134 142 45 -234 -198 -151 259 -202 -19 133 -62 264 -102 -94 175
3990 175 -213 17 67 -26 -104 -126 219 17 171 -197 204 -5 -50 -9 0 -71 97 -187 -29 -11 -174 -155 356 -287
4014 -287 69 354 59 253 -117 -26 129 -131 -315 56 314 -141 -214 123 112 281 -50 195 119 4 -42 -83
4036 -83 27 111 -146 111 14 -3 -260 181 82 1 -390 -141 20 -7 75 179 142 137 -16 5 -59 -55 -61 -90 30 -81
4062 -81 60 174 151 -14 -84 145 10 22 -124 -57 272 -157 -138 90 26 -129 -103 26 -25 -53 63 143 51 196
4086 196 -96 -36 -97 -26 39 67 51 13 66 -156 -201 -6 31 63 68 -282 270 192 -35 -392 -17 151 140 122 -35
4111c5Q9J52n5o3j34J86j02n2R9k02k4K72n8p6j86K81j32N8P9m1J57l92K38j06
4135d7o0L5J64k25J04k24J61K35k32K6KJ16j66j41R5K99j81j2J30j56o2k7N6J88
4159G8j92K56k79K47R7j8k27k5J76J17K2j1l20Q1j2j59M20r9l48J01K23r1P5j09
4183Cp3lJ20l70K35Q1J8j4J11j93K92k51J82l05J63J12J22p4k37J3l0J83l6j66
4207a17q3Q6J26N5j30J00j45M90k84K5j45K3J02k63K72l65n5M23k6k80J61j41
4229a71pK78j95J77J8j52r6k0J50m4J13j45J59q4j11K51m1J15p2j38j05K6K46
4252A52p0J19j8l10J25K32m2n4j35rJ29j60r2J97N1j87m0K48JP2k23R8oj97K46
4277A27n0o3j30k7J31q1L9M6kn8N3J3j49r1K51L8k03N1p0N4K50j01J15j73L8m7
$$ plain form
4111 -35 54 206 151 88 -46 140 38 -14 85 -117 -141 131 73 -3 -189 92 -40 18 97 56 213 -179 59 -47
4135 -47 -107 -72 92 -133 -29 -253 -92 143 -89 -63 -61 55 -111 -252 -157 142 -39 -51 79 -77 -139 -166 -110 78
4159 78 -114 142 -137 110 207 189 -38 -63 113 230 252 241 -79 2 -10 -169 251 152 -196 -95 128 37 112 3
4183 3 -70 -73 47 -323 -88 -7 11 -3 108 -85 207 -44 138 -167 -4 108 230 156 -81 -68 -98 85 49 -117
4207 -117 -200 -114 12 67 -63 37 -108 382 98 123 -22 1 103 -160 112 -253 -308 115 89 -191 -30 -171
4229 -171 -178 100 -95 82 100 -52 -148 -168 -18 -62 51 -94 65 -19 -130 121 80 195 123 -15 -120 -94 152
4252 152 82 201 183 -127 -2 230 188 134 -1 -10 119 -41 -133 64 115 -72 -112 136 137 209 -14 84 78 -119 127
4277 127 77 14 -116 -143 -12 -93 -54 -8 -10 -68 -15 -2 -151 -242 9 47 -156 -105 -175 -121 129 28 143 -30 8 -39
4303c9J2M7r6N4P0j01n4J02K38m60R1K38O5l79K35L7k33J85%K3n5j50L47k36K68
4328B09k14k1P8k39K44j72K22k7J17k54K36j90J10n2j98L16Mj82K01l57K68p6
4350B3K10k75j75J60J32N4k21k53P8J02J87J2k70L69M5l10k4J54kP4k34J23J10
4373F9j6Nj00J49l5j33K15r2m9k31OJ61m7k51K80o9J88k01O7M7J05m7L8Q0rj67
4399c7J33L7k86K53P1k25q3MP5j87Q2J53J5kk37j17M09j79L65l37K4j08K27k25
4423a75M41k06k59L65n7j42jJ19n3J7j28r0R9p6K53q5Q8k29K72n5P6r7j90J13
4447@Q4M5k55K71k33J27o0l3j8K01o6j01J88k45K05k31Q4n6J84o6n6q5l7O3R7
4472Gk5J9M8j28L4Q1N0m8j53K48q6j35j5J13K30l20J59j46l3O8J29k0n2q9J40
$$ plain form
4303 -39 -27 20 -76 -22 48 -53 -107 -5 233 -227 -136 102 167 -212 23 60 -173 12 12 35 -20 -170 177 -59 209
4328 209 -5 -26 52 -187 57 -115 107 80 197 -57 179 -11 99 47 -151 165 169 -13 188 -169 99 23
4350 23 233 -42 -217 -57 75 129 -92 -345 -267 -165 22 34 -236 133 178 -132 -156 -2 -4 70 -164 -41 69
4373 69 53 58 -42 107 72 -61 154 62 13 -218 -212 -51 -98 -349 -69 -138 50 -151 -84 -37 68 21 59 139 130 -37
4399 -37 96 133 -153 100 171 -54 -137 -133 -58 -245 -163 -10 5 3 -234 -351 58 -121 244 -93 -69 -177 50 -175
4423 -175 266 60 -199 166 109 -33 -34 85 32 49 -79 -169 -70 -146 107 22 110 -119 153 98 174 77 -113 0
4447 0 84 129 -126 145 -88 39 -21 -54 -72 129 63 -38 150 -95 110 -121 -37 -93 91 25 -31 -116 -153 -90 7
4472 7 -18 1 49 -79 -45 36 86 38 -115 133 47 -88 -103 10 240 -80 79 -67 -100 -32 97 77 25 -64 76
4497G6L5l24K53l5j33L0J62k13J9m4K45J33k17L3mr6K65k88J3J33j86K69k82K20
4521F4J10k49q5L53m0l40K13kj37K70m26J90k24N11n44K88j11K64L3l17K18j14
4543g5K36k81K26j05o0lK04j93j02r0M38k03K98j99J38j83N4l7j06K81m18J14
4565f6L85k19j59J48J79l47k11L47k22J89j9j79J04K31k18J88j2m4j8p7j3p3J82
4588G6k84L47j75N3M8o8j22J61Q5R3k61n6K73l7j05p6J62J10l81K06j50R9R0j31
4612d3l8Q4J21J20m79J75J07j09K37l51L50k44n5M31l03M8p7P0j92L19k45K02
4634A28j21J08k8j01r4j36J48J61j97J41M9K8l00J60J33j49L47j77k4r1o9K88
4656B04k34L1n1L8n5l3l15M22K09j94l7J07k8k59K88M8m07P4J58P8k7K3j17J14
$$ plain form
4497 76 111 -213 40 5 -128 -98 64 -149 -130 -174 71 204 -13 20 16 -80 185 -103 -90 43 -143 126 -156 64
4521 64 174 -75 -160 193 153 -187 26 24 -113 157 -269 -79 -303 208 -336 -48 -159 105 138 -179 39 -75
4543 -75 161 -120 106 1 -59 -62 142 -51 -153 -243 195 -8 290 91 229 46 100 63 -43 238 -180 -66
4565 -66 319 100 -59 89 268 -79 -290 57 -165 24 5 -174 -70 161 -57 131 119 75 57 -20 -33 -106 76
4588 76 -208 139 -36 17 65 -3 -125 36 121 214 -47 -103 170 133 28 -48 114 224 -157 49 -101 -2 88 -43
4612 -43 -81 3 124 244 -235 -60 47 -62 175 -176 174 -70 -125 306 3 51 -26 44 -148 171 -74 128
4634 128 7 115 87 -14 -108 -244 -96 65 -132 9 58 86 -214 -54 79 -70 277 100 76 -15 -84 204
4656 204 -30 1 -50 -12 -67 -100 -415 7 216 22 -15 92 64 -195 93 141 -266 -192 -34 44 17 40 -77 37
4680C7JL3m6j24J88j5j15K81l07N7j28K53j45N8l8K7J9Rn8J05k22J9K71k65J9
4705h6K54k55k5J28q5J56o8K06k75J72k77J33KjN1j30j32K93r9j1j18K17q9M8
4729In6j0J33k77L7J90M6j1OJr6p7J37Q6R5j90k8J51k64J81L7k18K12k76pJ00
4755h9J98R0j43r3J93k19p7R5J03l27N6J52P4k79K39N1j58O3K31r1k53L19k02
4778f7J19l22J25L3J10J30j34j12K24l13K55J17j31j72N5J19j55L20k03j82K72
4799H8N4k62J14J01j08m5O9j48R6p3J84p9o1j21K6J77j21J50j78J91J02pk58J16
4823Gj45K43R8k35k51K03J34j6J65k44j86K58p7N6j51J29N0j2p7J49J0j6O2k03
4847d9q8J49J76k95R4j32Q3J11J85j42k43O9J07k43M72j86k30K3L81k20k81M45
$$ plain form
4680 37 38 71 25 -99 89 74 -41 240 -67 -10 -138 115 -30 28 -10 17 36 45 -13 92 -130 -111 160 -105 -86
4705 -86 168 -87 -112 16 -69 87 19 225 -50 122 -155 -22 -20 -21 30 -100 -232 61 -38 -49 -167 50 -39 9
4729 9 -47 -57 76 -201 -164 26 72 61 67 68 -28 -105 32 118 213 23 -5 146 -118 63 100 -118 94 -182 -189 -89
4755 -89 109 199 56 -37 156 -63 -140 -45 58 -269 -213 -61 13 -266 -27 24 -134 -71 160 69 -184 135 -67
4778 -67 52 -270 -145 -112 -2 128 -6 -118 106 -207 48 165 34 -138 -83 36 -119 201 -2 -184 88
4799 88 142 -120 -6 95 -13 -58 11 -137 -41 -114 70 -9 -70 -191 -165 12 -109 41 -137 54 156 149 -109 7
4823 7 -138 105 203 -32 -283 -80 54 38 203 -41 -227 31 -46 10 -141 -12 38 26 -51 98 108 92 154 -49
4847 -49 -137 12 188 -107 -13 -145 -62 49 234 92 -151 -82 25 -218 254 68 -162 -139 242 22 -259 186
4869A86k05N6o9j8j7p6K87k56J07O4k82K00o5J01J99j51m2k0j41K14j66OR0J21
4893A23l11J82J43j91Jk9l5J35j88J29j62J39R8P4j54j51j43M82j32K62l48K95
4915B19m5j51J15n9k98M07k43J34o6M4N6j0r1J4L0lk01J66k4j84K5L87k38j75
4939a91K44j37J76j75M10k88k93M31j18J26k94q4J84P9k75J77R5J3j00j70K6L01
4961A37j60J2J78r0k50J1rk5M45l75K00p2k52K24J01L1J09Mo02K16j11M46j33
4984C5j16k46L25j0l6J95l6k00j63K42k1l2M4J54l00J08O9q3K43q8j55J33r7j8
5008e3K49k40J78r0n0J40P2j87Pj26J1M55k63Q6l01R6L5l3oP8mOk36K14J50l89
5034b01J82J30j92m1K34K0n4k22k28M01j67J75J56k66k9J80K0l3M9k38K38k18
$$ plain form
4869 186 -19 37 -32 -50 -67 -143 144 -112 -5 59 -223 -23 -88 13 212 61 19 -1 -142 72 -94 -88 2 123
4893 123 -188 -6 137 -54 -53 -82 -117 18 -170 -41 -203 -64 34 108 -46 -197 -340 142 10 272 -76 219
4915 219 174 23 138 79 -219 188 -55 79 13 57 113 103 12 26 56 53 -148 18 -6 -190 -165 222 -16 -191
4939 -191 53 -84 92 -83 327 39 -254 177 59 185 -109 -193 -9 70 -205 -28 67 80 -20 -190 -164 137
4961 137 -23 -11 167 77 -173 -162 -171 -196 249 -126 74 2 -250 -26 75 106 215 219 -383 -167 -278 168 35
4984 35 -81 -327 -2 -12 -48 147 111 -89 -252 -10 -31 -63 -19 135 -165 -57 12 -71 172 84 -71 62 -35 -53
5008 -53 196 -44 134 44 -6 134 206 19 26 -100 -89 366 103 189 -112 -16 19 -14 -20 58 54 60 -176 38 188 -201
5034 -201 -19 111 -81 -122 112 132 78 -144 -372 29 -138 37 193 -73 -102 78 98 65 114 -124 114 -104
5056a04K80N9k35J07j38o9o6K00N5j30K0Mk9L49k61j24J36j67K33j77j4K46k29
5079e4J58j49j40K51L7m53J87K36R0l4k8j35PK3l64L64k14L06m8j03K83j48k5
5102D7j15j29J16J46n8R9l29K38L7j42M16k13j73J16k10J39l6qL11q6k47J08J63
5125A90j73P5P2l5J90k32l15L27j31j84K70j32M8j41L0q8L39j37N3M4P3k23J48
5148F8k93R7L78l87J22j4k67J01N4J25N5J40J0k23K59L0l53J16K37k12K1J24k16
5171b8K6J01j22O5j2L1o3J47j65j04J55J47k55J43k78K10JJ83j41J35m6J02R6
5194C28n27K04r0J51j39P2K3%j11J49K87l75J12rp8j31nJ01J77l26K08j60J25
5217a4o6J7J20j0k6K9kk69K4K54M0N0r9k77M39q5k57j0K05k43P5j4K64l12K48
$$ plain form
5056 -104 176 235 0 107 -31 -100 -166 34 89 -41 -21 -17 -46 303 42 -82 54 -113 120 -57 -71 175 -54
5079 -54 104 -45 -185 66 103 -350 -163 73 163 129 101 -34 -27 -4 -368 -4 -218 88 40 -63 220 72 47
5102 47 -68 -197 -81 65 7 106 -223 15 52 -90 326 113 -60 56 -154 -15 -51 -59 252 166 -81 27 190
5125 190 17 92 164 129 319 87 -228 99 -32 -216 54 -78 -30 -171 -141 -229 110 -27 26 70 143 -80 68
5148 68 -225 -128 250 -137 -15 -29 -296 -195 -141 -16 39 179 189 -34 225 255 -98 18 255 43 64 188 -28
5171 -28 -2 99 -23 42 30 61 -2 145 -20 -124 31 178 -77 66 -212 -2 -1 182 41 176 130 232 328
5194 328 -199 5 -85 66 -73 -1 22 22 -89 60 347 -28 84 75 -3 -134 -139 -38 139 -187 21 -139 -14
5217 -14 -80 -63 57 47 21 50 48 -221 -197 57 97 147 48 -229 210 125 -132 -142 63 -180 -105 -119 145 -167 81
5242H1q2l6K22j70J22p2j37K31m7j03J11l92M00oj28mJ59j64ON1j7j06J17M1N1
5267A28J60l43N5Q6j96M20n13M05k15L0p4J71k39K22M2Pm1j15m2R8j91J27J98
5290A80k55Q4p8N3l6J17j90J29j36J10p3R8k18L59j28j02J41K3o3k8L6R0j10j88
5314a85K71k18J0l7R1q4L9P8Q3k57L0K52Q1k52K02j88K0j29K79m3m2R3j52K21
5338A63l55L81m0m5J6k6j49J76q6l6J25p0N9k16N4k0J71Lj36n0n2J6N3P2q9J96
5364A15l3l00J84J61rj40K40l10J24o4j08J39P4K08j90r9P4l7%L9Ol44L98j64
5388c6J08k26L20l00o0J79O4k72J65n7k1L23j54K11l9k32m7j09K57r1K8P3j33
5411d9J25j89J13k84J51L95l6l4l7k00J43j25%M5m1K0m6j33J12O9p7K14k42K87
$$ plain form
5242 81 -1 -37 185 15 137 65 -72 159 112 9 120 -272 128 122 -6 -10 149 -15 -9 42 25 -81 36 77 128
5267 128 288 -55 0 86 -110 310 -203 202 -13 17 -57 114 -125 97 139 146 105 -10 -52 46 -145 -18 180
5290 180 -75 9 -69 -16 -52 65 -125 4 -132 -22 -95 3 -215 144 16 -86 55 78 15 -13 23 113 3 -185
5314 -185 86 -132 -122 -159 -68 -152 -113 -35 48 -209 -179 73 154 -98 104 -84 -64 -193 86 43 1 94 -58 163
5338 163 -192 189 149 104 120 94 -55 121 35 -1 124 54 113 -103 -49 -69 102 105 -31 -81 -133 -117 -64 8 -81 115
5364 115 82 -218 -34 127 118 -22 218 -92 32 -32 -140 -1 73 281 91 -8 66 29 29 68 74 -270 128 -36
5388 -36 72 -154 166 -134 -194 -15 49 -223 -58 -115 -136 187 33 244 205 -27 -74 -183 74 -17 11 84 -49
5411 -49 76 -113 0 -284 -133 262 226 192 155 -45 98 -27 -27 18 -23 -3 -49 -182 -70 -1 -78 136 -106 181
5435A81k50J29k4J21k48J11Q7k72J62Q5j06o4J62j71J15n7O3m4q6N9P4P4n6k85
5459b40K56k3l23K18n1L03P8j28m2k85L20J54j69j84J53Nl01J80K21q9Lk4j01
5482f9J91k45M1q8J23m9k3J13j59J23k93K34j29J52J56J06k84j58LN0L24J30k45
5505DmJ11j02l5J56q6j33j55J97Q7jN3P6l8m6q3o1j34K95j03j34J76J14k43J78
5530H9k39J35L33n88N35j71k78L42po0j14k25K41J89j87J39l10K95j27J0J8K14
5552B34k17J3j3o8K10k50L02l21M7j8K55l41R2QR8k4J73j92L5M7k08Q4M7k18J61
5577f4J42k29J43k65M23j29Pj84L16k85J37n5OL43m40K57l76K67RJL9nl0p4N4
5602Hj94O7QJ87l43J11P4k1K14q1j50j05n7M27j97K51l18K28K20k53j49k51M34
$$ plain form
5435 181 -69 60 36 157 -91 20 107 -165 -3 82 -24 -88 74 -97 18 -39 24 -20 -106 -47 27 101 45 -240
5459 -240 16 -7 -330 -112 -163 140 218 90 48 -237 83 237 68 -116 37 42 -259 -79 142 53 56 32 -69
5482 -69 122 -123 -82 -170 -47 -96 -119 -6 -165 -42 -335 -101 -230 -78 78 184 -100 -258 -255 -205 119 249 4
5505 4 0 111 9 -26 130 44 -89 -244 -47 40 39 92 168 130 84 1 -60 -194 101 -2 -136 40 154 -89 89
5530 89 -150 -15 318 -270 265 94 -184 158 151 91 -23 -248 -7 182 -5 134 -176 119 -8 2 20 234
5552 234 17 30 17 -51 159 -91 211 -110 -63 -81 174 -167 -75 -67 31 7 180 -12 23 70 -138 -54 -7 -225 -64
5577 -64 78 -151 -8 -273 150 21 28 -156 160 -125 12 -43 -37 306 -134 123 -253 14 23 24 63 58 28 -46 8
5602 8 -186 -119 -111 76 -267 -156 -82 -103 111 30 -120 -225 -282 145 -52 199 -119 109 329 76 -73 -324 110
5625A10k02o7m5N0J52J67j61L6j09j00R6j07J94O4j05P9m5o7J65J74k80j17K81
5648A63q4j64J8R5o2k04M77k82K19l0l03K55q1j45K76q8k8l12N73l96J11m7m0
5671g9J16j71J92O6P9l18K7Q9J89l19n6L7j4Q1J40k46K14j00j7j23O5qP4J23P6
5696A17o7j5J42k47MP9q5K26m0o6j71J61m3M7j20K5L74l43J36p6r4L35k84K91
5720B86l11mJ00J05k12l07M39K0r3r2Kp8K15q2J04k82N06j74J81l07j09J29qL8
5744F6J73k92P8K81k99L5R5j56j62J88j17j17K74j62L15k78J23j64L41O2m25R1
5766e0k4L4J86j12p7Oj80J96k8k4J06K16j32j22J1J65j85J59l1K9k68j01P2K47
5790I3r2j74j56K58pn6nJ65Q1N4k13J59n1J37k78K04j21K5R2k75J65J3j46R9K39
$$ plain form
5625 110 -92 -159 -204 -154 -2 165 4 40 -69 -169 -73 -180 14 78 -27 52 7 -60 105 279 -1 -118 163
5648 163 79 -85 -67 28 -34 -238 239 -43 176 146 -157 98 17 -128 148 60 32 -280 293 -103 8 -39 -79
5671 -79 37 -134 58 124 203 -115 -88 1 190 -129 -185 -148 -162 -81 59 -187 27 -73 -90 -213 -148 -156 -82 41 117
5696 117 50 35 177 -70 -66 13 -72 154 114 48 -123 38 -5 42 -78 -53 321 -22 114 38 -56 279 -5 286
5720 286 -25 -29 71 176 -36 -343 96 116 23 -69 -67 -145 70 -12 92 -190 316 142 323 16 -93 36 28 66
5744 66 239 -53 25 306 7 42 137 -19 -181 7 -110 -227 47 -115 200 -78 45 -119 222 284 -141 -50
5766 -50 -74 -40 146 34 -43 -37 -217 -21 -49 -73 33 249 117 -5 6 171 -14 145 114 143 -125 -226 -154 93
5790 93 1 -173 -329 -71 -78 -134 -139 26 107 161 -52 107 56 193 -85 119 -2 23 115 -160 5 18 -128 -29 210
5815B10m12L30r7K20j37J38j19l49p6J01J49n4k18K10J89R8j07J8j45Q4J49k20
5837c8J15j7j86j11K56r7J64m53M48j78J53l9l7M9K7j32OJ61j05p3J77O7R4k91
5861d0j23K88n2mq9J68j04j10K42j09k41J10O4j86K53j24J22j15k13K82K60k74
5883Ek3Q0p5Pk24J69j4P2J21j25J46k86J5L5j62PL48o8j07o5N9J69j3J68l56n0
5909a67J57Q7l2j9j99N0n2K55m1n0K9L79l99L5J49k13k8J98l47N61l79J34j23
5932a5j31J08M1KR9M4l74L53q6P0q1R9j76mJ62j52k8m5O0M6q4r2L82k70M2l2p4
5959a36L16r1P5l80K34M8k35L1J29p8K78j52j8K26k77j59J33K00K0k69J40j5M9
5982F9J2j63K29k14K33j31j19K32k32O9j9P5j34R5j68M8M3l2NN4J13l0J45j73
$$ plain form
5815 210 -202 128 31 251 114 252 133 -216 -292 -191 -42 -96 -314 -104 85 183 76 94 -51 33 182 -38
5837 -38 77 60 -126 -237 19 -78 86 -367 81 -97 56 17 -20 29 56 -76 -70 91 -14 -87 90 157 251 -40
5861 -40 -163 125 73 69 -20 148 44 -66 176 67 -174 -64 0 -186 67 -57 65 -50 -263 19 279 5
5883 5 -18 62 -13 -6 -230 -61 -75 -3 118 -7 139 -147 -132 -97 -259 -252 96 28 -79 -144 -85 84 71 239 -117 -167
5909 -167 -10 77 45 26 -173 -123 -175 80 39 -11 18 397 -2 33 182 -31 -59 139 -208 353 -26 108 -15
5932 -15 -146 -38 3 5 104 148 -226 127 41 111 30 129 -47 -51 111 -41 -69 -114 -54 -8 -92 -184 198 -72 -30 -62 -136
5959 -136 180 89 164 -216 18 66 -169 -138 -9 -87 191 39 21 247 -30 -189 -56 144 164 -105 35 20 69
5982 69 81 -82 147 -67 166 35 -84 148 -84 -15 -34 41 -93 2 -166 -118 -75 -107 -102 -48 65 35 180 7
6006GM0k28J37J51N9k58K60j04J9k30J61J06pm4j8J0n5k6m5L19j39j72MP1l45
6031c27L37J8J02j8J0l6j83N0J21N2j63l7j7j64N17j65j01k5J12j95l6K2K80k05
6055e1J20j9J92l06j36K60k29J43l45O78k00j67j1q8K18j1lm5J39k35n3J17J99
6078A67j26j0m9n4m3m2j28J31L8O3j24K09l7l6j5Q0J2KM5m6l8j4O8p3O2o2j3O
6106b7Q3L9k12J06j05J00j78J25N4J34NJq2k31J07j2L01j94J5M0k31o0K26r6p1
6131a63M03L5l56j1J12R3j15p4J44k5O5p4j13L3p6K08N8j89J20q3J14Q2n6k56
6155a24J60k92J95r1J10Lj08j17J20k2K38P3l21J78j7j90L09j39K77l16j28N2
6177a50J86n6k10o0J62K70j9j31%p8n0J87j55r2K84P2Q0l30J36k4q4M3p7J22l5
$$ plain form
6006 7 47 -181 -44 107 166 -92 168 64 83 -147 14 120 113 69 51 61 6 -20 -65 254 115 -57 -53 18 -327
6031 -327 10 28 130 112 122 86 -97 -47 74 126 -37 -74 -91 -255 262 97 -4 -29 83 -112 -148 -126 154 -51
6055 -51 69 50 242 -64 -200 60 -169 -26 -371 307 107 -60 -71 -159 59 48 45 0 139 -96 -149 -32 167
6078 167 41 31 -18 -72 -115 -157 -285 -154 -116 -53 -177 32 -5 -41 -56 24 36 38 83 37 -1 -15 53 -20 42 -20 -33 -27
6106 -27 56 95 -117 -11 -116 -16 -194 -69 -15 119 124 125 43 -188 -81 -93 208 14 29 69 -162 -222 4 -92 -163
6131 -163 240 275 -81 -92 20 113 -2 -76 68 43 108 34 -79 -46 -122 86 144 -45 75 -8 106 188 132 -124
6155 -124 36 -256 -61 -152 -42 -39 -147 -264 -144 -166 72 145 -176 2 -15 -205 104 -35 242 -74 -202 -150
6177 -150 36 -20 -230 -290 -128 142 123 -8 -8 -86 -136 51 -104 -196 88 160 240 -90 46 22 -62 -19 -96 26 -9
6202iK6j0J29j22p2L12l96K93q9M8J42k92J68K08k92O2j76q9K45j80N5J52o4J96
6226B45l91j7Q4r8P4j21J45K97m2j21M7q7k14N97k82l16O1m7L43l36M1n0J72m9
6250f5J17j27Qk5J00j74J05K40l40K69J89k51k62O3J41J63n5J6k20Q5K83j79j8
6273F3j39L09j65k16K38jJ68j63r6j54K9j56K67J2j76J02m8J27J39l02J89j38
6295a11q5J85n1N1M1l6Q5R0o4Nq9k4Q7l5nj52M8n8Q8k14K00n3K30k93J31J10o8
6322A3J30k83N7J65J3j79J56k69K41n9J80k13j25O9J51j4pJ3j45K71l70J39J24
6345E8k58K92j71q0j5J88J18k15Q9k3j18L50l57K57k01J48m9k16L48k39K31k97
6367a60J74nK06k80L33k00l8j91K3J0K27k3j19k47L27j32J26R0ol71K14k31M11
$$ plain form
6202 -9 17 7 136 14 -58 254 -142 151 62 110 252 -40 128 336 44 106 -70 -159 86 -94 -39 113 49 245
6226 245 -146 -163 -79 -177 -103 -224 -79 218 176 55 102 15 -199 398 116 -200 -139 -186 157 -179 -138 -188 -16 -65
6250 -65 52 -75 -67 -92 8 -166 -61 179 -161 108 297 46 -216 -153 -12 151 96 112 -108 -23 260 81 63
6273 63 -76 233 68 -148 90 89 257 94 -2 -156 -127 -283 -16 -4 -180 -78 -126 1 140 -162 27 -111
6295 -111 -196 -11 -62 -11 30 -6 79 169 105 110 21 -3 84 49 44 -108 -60 -118 -30 -244 -44 -97 133 -160 -29 81 13
6322 13 143 -140 -83 82 95 -84 72 -197 44 -15 165 -48 -173 -104 47 33 26 39 -106 165 -205 -66 58
6345 58 -200 92 -79 -159 -174 14 132 -83 6 -17 -135 215 -142 115 -86 62 13 -203 145 -94 137 -160
6367 -160 14 9 215 -65 268 68 30 -161 -138 -128 99 76 -43 -290 37 -95 31 121 115 -256 -42 -273 138
6390A38j88mJ04K1J42p3o9l18P6J76J2M9qo9j17J45j38q6J27j07Q8m5P0j8p2o2
6416b26M95l53JM8j07L18k0j26j14K42k71m3J92p9K57j41k3m9k1q1N7j39J97m6
6440c2J05nj82L03k25J82J29l03L00k79p9mJ53J18k8k14k9J79L1r5j29J04J28
6463A28j49M8J60k62O7pQ8P4l47K42k57M21M2j12p9j50L27k12j50J09k8P7j09
6486g9j3K1J17j06K70j26k55Q4J6k7k9K22r2O1K5k48J79N1l4j08P0J86j11J2K4
6511A10k13L7J71J79k07Q1k09o0K81N0j58J11m20Q3O3K40k29Jn5K20N8k41J30
6534B3j65K35M3j38J8R8j90RK3j13L55l75K12MQ4k73R7R6j32K05m6M9j95J17P9
6559A20k28J21L18m19j0L64l25K19j26Q2o9q3j30k34O82j32k84J18J4l4o4LN5
$$ plain form
6390 138 -50 -54 50 71 213 140 71 -247 -171 5 17 66 58 -11 -128 17 -121 -207 -80 -187 -99 -144 -74 -92 -164 -226
6416 -226 269 -84 -83 -35 -142 176 156 30 -84 158 -113 -156 36 -43 214 73 50 1 -20 -101 -44 -183 14 -32
6440 -32 73 68 -114 189 -36 146 275 -28 272 -7 -86 -90 63 181 153 -61 -90 89 120 25 -104 0 128
6463 128 -21 27 187 -75 -8 -15 73 147 -200 42 -215 206 248 136 57 -93 234 22 -128 -19 -47 30 -79
6486 -79 -92 -71 46 -60 210 84 -171 -87 -71 -98 -127 95 3 64 89 -159 20 71 37 -71 -1 185 74 86 110
6511 110 -103 -66 105 284 77 158 -51 -111 170 220 62 173 -247 -164 -101 139 -90 -89 -144 76 134 -107 23
6534 23 -142 93 136 -2 16 114 -76 -67 -44 -157 198 -177 35 39 123 -150 -53 43 -89 116 70 119 -76 41 120
6559 120 -108 13 331 -88 -98 266 -59 160 34 116 47 -36 -166 -400 282 150 -134 -16 -2 -36 -100 -97 -42
6582d2J96o6j7l40L03J56n7j47m8j84J56K77j79j69L24k12J42Rj87j93J73J62
6604E7l1j3p6J48j69J2K58k30P5j71O6J20o5J5J32J60m78K49q9K91m51K34j87
6627a43Q9J96l06J49R2k27J00J73Lk34L12j90J58l7K5p3oj75R1J89l66N22m01
6650e9J04j40O8k78J66K70M4j46j32k48L52j6Q0m01L40j24q8O8Q3O5m6o0K08j30
6674b0j03L35l62J57j7K9J40l65K02Nk04L63k53K9J36l90L81K38m68m3K42l9n1
6697e8KJ09l4M6k46J66L9j5J08l4n8L5p1l6Q2l4rK31k67m0J54no1m4J64k1Nj96
6725h8J92N2k66p3K13J84k39L8O5k17L4J82O3k74J52J29j73j7K0j78J56J16n3
6748A8J80m91M05j19J25M4qP2j86K08j49l5K4L04n65K14l38J42O6j6L16O2l30
$$ plain form
6582 -42 154 88 71 -269 34 190 133 -14 -62 -246 -90 187 8 -161 163 -49 93 102 -85 -278 -105 57
6604 57 26 13 -63 85 -84 -72 186 -44 31 -140 -74 46 -19 -4 128 288 -190 59 -30 261 -190 44 -143
6627 -143 -54 142 -164 -15 77 -150 -50 123 126 -108 204 14 172 135 160 87 81 -94 -3 186 -180 342 -59
6650 -59 45 -95 -27 -305 -139 131 175 29 -103 -351 1 -15 65 -336 4 -120 -208 -140 -57 8 -38 -98 110 -20
6674 -20 -123 212 -150 7 -10 19 159 -206 -4 1 -203 160 -93 -64 72 -318 63 301 -167 -210 32 -7 -58
6697 -58 -56 53 19 65 -181 -15 24 9 117 83 25 60 -11 -47 35 1 -8 223 -44 -84 70 65 4 -40 124 103 108 -88
6725 -88 104 156 -110 -183 30 214 -25 13 78 -139 -105 77 140 -134 18 147 -26 -43 -23 -201 -45 71 18
6748 18 198 -293 112 -7 118 162 154 226 40 248 99 64 88 392 -173 41 -297 -155 -89 -105 211 273 -57
6771e7j3N8j07No6J23l3J75R9n9k43J64O8j76j01K24k15L64j27j34Rm7K57o9k36
6796a37n5J95p9J03rj39L56j71k0k31lK50J22j31j23K74k47j8J65P8r9J15m90
6819b94L74n6n9J00j32J66l31L46J90m59J54m0p7M4L50k75k61K56j16J49J02k09
6841g8J99l13J73J55k43jKK40l77N9J29n2M5J78k00RP5m0K79m07K61o8p0o1j54
6866b60K53M6l79N21k13J59O8k15M3m3J57j89K8J36J8k58K63j97j6rJ17J53k17
6889c4J07j52K81m15K08J19k01Q2J40J09k77j37J37N4j43R5O0j4J2m3k76M47N3
6912B12j76P7j59J57nj56n2N5o1K22k83K08M6j06j92K55p0j03M8J77O4j82j93
6935b17K23J51j92J33k56J83j20J93o4N2n7j15M6j16J89j70r0O0K05p4K42k57
$$ plain form
6771 -57 -70 -12 -119 -114 -180 -57 -90 85 184 125 -118 46 114 -62 -163 61 -154 210 83 -51 -42 -89 168 99 -137
6796 -137 -192 3 -76 27 18 -121 235 64 44 -187 -190 60 182 51 -72 202 -45 -63 102 180 81 196 -294
6819 -294 80 24 -35 65 -67 99 -232 114 304 -155 -1 -41 -118 -74 276 1 -260 -4 -120 29 131 -78
6841 -78 121 -192 -19 136 -107 -108 -106 134 -243 -184 -55 -107 -62 116 -84 -75 0 -40 239 -168 93 25 -45 -106 -260
6866 -260 -7 39 -340 181 -32 127 195 -20 23 -20 137 -52 -24 112 130 -128 135 -62 -78 -87 30 183 -34
6889 -34 73 -79 202 -213 -5 114 -87 -5 135 244 -33 -170 -33 21 -122 -27 33 19 31 -12 -288 159 212
6912 212 36 113 -46 111 106 -50 -102 -47 -108 114 -169 39 85 -21 -213 42 -28 -131 -83 94 158 -24 -217
6935 -217 6 157 -35 98 -158 25 -95 98 34 86 29 -86 -40 -156 33 -137 -227 -167 38 -36 206 -51
6957e1P7J02l6q3l0l8j9j43L9N19k51M5j80m9K09l54L81j14L1k2p6m4K00k19K41
6982A35l4l6k3l13L05j7K4k04L87p1j41m7mL33K7l56O3R2j2L0k40K37k27J47o2
7007gK5N6j81L5J82q7M2L0j81N3K34j33r6J49l92K94L8j06n6J82j00q0O4J01k01
7032a35R7j07k5J96m2M4j26O4J29j29J91j76j62L21k50J26ok0j41K07p2m0k1j0
7056h7L23l72K71o8L6k60K02k28J31NM2L1O1p7j1J11k86L65l12n6J75J25r2J15
7080A44lK2j06n8j46L13k15k4l14N30m3l4j9k18J59p4J43l33M86m76K97n9J35
7103A07l04L67r3o7k56K88j27J02L7m0J73k88J40K4j83J7K9J03m3J50P3j05j48
7126d4k21J91J54j91k4J76k80J94J63k1j77J7J03p0J45j96J47j70p6J83M3j45
$$ plain form
6957 -51 26 128 92 9 -21 -59 -78 -221 -182 337 86 131 -49 -98 111 -243 138 24 55 33 -43 -87 113 -106 135
6982 135 101 65 42 -271 34 17 41 -163 224 153 12 -35 -39 294 321 -35 28 120 108 138 -102 135 -92 55 -7
7007 -7 18 74 -107 -72 110 23 65 95 -86 -33 201 68 -28 121 -271 23 61 -45 -101 81 -19 -99 -35 66 -135
7032 -135 -38 -145 -170 26 -16 28 -98 -34 95 -34 157 -19 -181 140 -110 16 10 -10 -151 56 -16 -56 -77 -87
7056 -87 236 -136 135 67 103 -157 45 -183 -52 -47 -5 26 87 10 -1 110 -176 189 -123 -179 -4 121 29 144
7080 144 141 163 57 -1 -147 166 -49 -73 -387 143 100 66 47 -171 -12 -86 57 -276 210 -266 31 -28 107
7103 107 -197 170 77 10 -246 42 -85 17 54 14 187 -101 39 63 -120 -103 -74 29 -14 136 209 104 -44
7126 -44 -265 -74 80 -111 -135 41 -239 -45 118 97 -80 -63 40 -30 115 -81 66 -104 -180 3 46 -99
7148i9o4M07q5q0J05m09M81m27J4L51k76K68j11j25j5L49j93k3M2n0j60L42l91
7171a49L13k72p7K21M3J32j4k64l6K07R9j5r2j84J58k15K33l5P1l25N5J39J88
7194A81l43L42l32J57p6j96J46O4l8J11m3K96k76J01j66o7n4J52j84J45N5k5Q3
7217C3k91m0M71k08kr5KN6J56k90K33O0k88J62q4L88j56r9L7l4Lj08N8P6k57L54
7243A37j49L25l32l83N11k5J61j35j77o0O4L9M17m43M3j13P5j18K85L1l89L78
7265A42p5j0L3jL0j87LJ00J64k37K12j60M7Q2M8q9k28K67o7j69PL1MR2K14m62
7291b09J26N9k8J94j28j67K77L2j47O6j31L3O4k02Q3J47m9m4L0J55k53q7J19J11
7315E1o4j88p8L80j90j12P8K33j63l6n3K0o4K83k03J04k04K53l3j97J57o7K2M65
$$ plain form
7148 -99 -163 244 159 79 184 -225 256 -171 -157 194 -82 186 75 -50 -65 284 91 68 110 60 -100 242 -149
7171 -149 164 -108 -185 36 79 211 197 -67 -103 104 203 188 96 -88 70 -145 88 53 124 -201 -146 -7 181
7194 181 -162 180 -152 5 -71 -267 -121 -57 -95 16 -27 269 -7 94 -72 -139 -193 -41 -225 -80 -25 -50 33
7217 33 -258 -298 173 -35 -37 -132 -130 -74 82 -208 25 85 -203 -41 -125 263 107 8 45 11 14 -94 -36 40 -217 137
7243 137 -12 313 -19 -402 109 84 245 110 -67 -127 -63 -24 393 -50 -7 -120 -45 -163 122 153 -236 142
7265 142 67 57 90 89 119 -68 -65 35 199 -38 174 14 61 143 191 102 -126 141 74 -95 -88 -57 -53 39 253 -209
7291 -209 -83 -24 -52 142 14 -153 124 156 9 75 -56 -23 41 -161 -78 69 20 -24 6 161 -92 -179 -60 51
7315 51 -13 -201 -279 101 -89 -201 -123 110 -53 -89 -142 -122 -186 97 -106 -2 -206 47 14 -183 -26 -93 -71 394
7339C94n45o4J03K28j47o7j1J00r3MJ27j84K28j40R8l8J9m7L4J06j57n4L69l17
7363e4K21k30Q4k12J83J4p9j7Qp8j03K18J30N4k22K9r8m5K05Q5J63j07j39J21
7387A31l27J74M3Q8k8r1Q1K5j94L1q2K78j26j0K4j81L18m03K72r8J45J9k21j5
7411a47P0J32K7j93J20J42n2k40J42J66l23J03J99j90O5Nn5J73k47K80o3j93O8
7434a1o4J94R7k77P6J28j13j02J36j30P1Q3r4o5j02J69j67r0K95o5lJ30j68J63
7458I1j15o0J88N1r5R1l8j5L6J5L6m25L14k9j84L80m08K90j34J51l31L59l47K27
7482D8k08O7J01L7J2o0K66j74q5k8K02j95k7J42j28L4k17M6J96j37L2j12J80q9
7506i7R3K66j10k12l0J26M6j45j22M02k48J48j01J55k67L0N5j19J69k39J9J32
$$ plain form
7339 394 -151 -215 -112 116 -31 -98 -109 -9 -102 -98 29 -155 73 -67 31 -7 12 -35 -1 105 -52 -106 263 -54
7363 -54 167 -63 21 -191 -8 6 -73 -90 -82 -160 -263 -45 85 139 -83 -54 -152 -197 8 93 256 149 10 131
7387 131 -196 -22 21 109 81 -10 71 96 -98 -67 -149 129 3 -7 17 -164 154 -249 23 -75 70 89 -132 -147
7411 -147 -77 55 82 -111 9 151 99 -141 1 167 -156 -53 146 -44 21 26 -29 144 -103 177 114 -79 -11
7434 -11 -75 119 216 -61 15 143 30 -72 64 -66 5 88 -6 -71 -173 -4 -171 -261 34 -31 -34 96 -72 91
7458 91 -24 -84 104 155 60 151 113 98 134 149 185 -240 74 45 -139 241 -167 123 -11 140 -191 168 -179 48
7482 48 -160 -93 8 45 57 -3 263 89 4 -24 178 -17 -44 98 -30 4 -213 -167 29 -108 -76 -188 -8 -97
7506 -97 -4 262 152 -60 -90 36 82 -63 -185 217 -31 117 16 171 -96 -66 -11 -130 39 -200 -181 -49
7528d9K03l08J70K78l44J14k7kj06o0P3J84k70J58j33J74J08j15k7N0p8J76k16
7551d7J82j71J01k4J68j98J21j32rJ78m74K57P6KQ5m4K67l96m2%J31j21Q1mL61
7576C48l65l36K63j03N6J98q9P1l8P4l15L70j33R6j70J68O4m19O4L43j26j73J77
7599B5o6J19j07P8j46NM40m76J40kl7K85j79Q1m9Ml9q8k8M0J47m7kj4o0Lq2o0
7627a15J10J97l60K94k09J91J23j25k0j44k5o4m4K31Q0l7m7j46M05l38L99m18
7649f2J77Q0k66k8P1P7k02K70k8o6r1M1L7L6j2J25k48L45j69p0r0R1j21M1L11
7674B49k81P0k8P0j74K11p6M0k62m7K21k01J68m5J31Qj06j16j1J67l8J06k51K62
7698F7j07n2Q9J6j56P3m3R5NM7J16L2O5j41m5r6P8K9J83k74k9J31Q5l15K15j06
$$ plain form
7528 -49 154 -154 16 294 -50 64 37 35 -71 -131 -58 126 -144 14 -119 55 163 48 21 71 -7 169 -47
7551 -47 135 -36 65 41 209 11 132 0 -9 169 -305 -48 28 30 115 71 338 -58 -100 -100 31 -90 -9 -13 348
7576 348 -17 -353 -90 -193 -137 61 -28 43 5 79 -236 134 1 97 -73 95 159 -260 -196 147 21 -152 25
7599 25 -41 78 -29 49 -97 -92 348 -128 12 10 -27 258 79 160 111 115 76 -12 -40 0 147 100 98 84 24 27 -55 -115
7627 -115 -5 192 -168 126 -83 108 231 106 86 -58 -83 -147 -191 40 120 83 36 -110 295 -43 356 -62
7649 -62 115 195 -71 -99 -28 49 -153 117 89 23 -68 -27 10 46 34 159 -89 256 87 17 -73 18 -103 -62 249
7674 249 -32 38 10 80 -94 117 41 81 -181 -228 -7 -208 -40 -85 46 54 -52 -168 -179 -12 -50 56 -195 67
7698 67 -40 -92 -3 13 -143 -70 -113 -18 -13 34 150 182 247 106 61 -35 43 72 255 -19 -48 83 168 -147 68 -38
7724c8k2j28N9j08K49Nn9K9J95k47J3J40m7O6n2Rj60J11j24Q0N3o9k09M65j20
7749I1j43P7J1L1O5L3k98J35o2Q4k43J18K79k83N1m7N7M2l10L25p2J7J0r0L42
7774B20l25K3M2P1k32L67p1j24J14j85O2J80o6k29J12J25k09P3J46J32p5j30j8
7797CJ38r7k54M24k08On3n6K46j01K30k46J21j88l7J95Pl00j04N03j80k58L29
7820A20j04j71j44L54k41J71O4j12L5K9J19k04J86L2k61L3k38K00K73j47m3J18
7842F9l09j9L47k9K18k57k07K02j66K6K18k17J3J23j66j4K19o2K4m6J56n6jj23
7866e7N3j01m8L63m97J98K52k0k21O3M8j80K5N6R8p7Q1j28J75k00J07m3K50j18
7890G9J44l36K39o3nj44N4OM7l62O43l72j43J15J57k96M09j68j29Q5J49mj64J76
$$ plain form
7724 -38 -60 -188 -129 -237 12 17 -42 -13 182 -65 -52 88 41 107 55 64 -96 15 -109 -29 24 -45 -254 211 91
7749 91 -52 25 36 67 132 165 -133 2 -60 24 -219 -101 178 -105 -54 -101 -44 -2 -312 13 -59 -42 -32 -122 220
7774 220 -105 -82 -40 31 -201 166 95 -29 85 -100 -38 142 76 -153 -41 84 -125 -52 94 226 151 21 3
7797 3 141 44 -210 214 6 12 -41 -97 149 48 278 32 153 -35 -72 123 130 -170 -274 229 49 -209 120
7820 120 16 -155 -299 55 -186 -15 49 -63 -28 1 120 -84 102 134 -127 -94 -332 -132 141 -6 -49 69
7842 69 -240 -259 88 59 277 20 -187 15 -151 -125 93 -124 -111 12 -154 -168 51 -11 13 -33 123 67 66 -57
7866 -57 -4 -105 -153 210 -287 -89 163 143 -78 -15 33 -147 -122 -66 32 -45 36 -92 83 -117 -10 -53 197 79
7890 79 223 -113 126 63 58 -86 -32 -26 21 -341 302 -70 -213 -98 59 -237 172 4 -125 -40 109 105 -59 117
7914A17O0l51J80mr4K18j23k4j83J75j33L30m92M27j63l5N2R9j00j83K32j8kK03
7938A88n1j43J44j24O0j4j99j1J35J5j58J26j00R7j80J07L23l02L08q2J4j34p
7961A2n1L6j13J71k70J71l5J58M7k59K03j98M9L1J79k33R1j63K74O5n8r9k54K61
7985A5J71j40m0r8L64j0j67m3k8l1k56M5K89J36r3m06J22K19r0n2J47k97R5J55
8009Gn4l08K64J07k7l1J94k19q7J85j30l2J46n6j78J98R1m5k6n1K82l54J06J06
8033H8j91K56q5J32j46K1j17O4k57K19o2K12J0j46j13K16j8n0K6kJ1k07K00J9
8057H0J08k85r4J82j97J70M2J0K54l28K59k89J28k57K65K00j20p0j07N6N9pQ8
8080A47j23J19l6J73k63J69j60J2j83p6K79pj59o9K86m56N53p5Lo9q6K08l77K18
$$ plain form
7914 117 177 -174 6 2 -92 126 3 -21 -204 -29 -162 168 -324 103 -60 -95 -43 56 -44 -227 5 -13 -15 188
7938 188 137 -6 138 14 74 60 -139 -150 -15 0 -158 -32 -132 -35 -215 -108 215 -87 221 139 153 19 12
7961 12 -39 -3 -116 55 -215 -44 -79 79 126 -133 70 -128 -79 -48 131 -102 -11 -174 100 165 107 8 -246 15
7985 15 186 46 6 -92 272 262 95 52 24 -7 -263 -218 71 207 114 -292 -170 49 -41 -93 54 -243 -148 7
8009 7 -47 -355 -91 16 -11 -42 152 -67 -154 31 -99 -131 15 -41 -219 -21 70 25 -1 -52 230 -124 -18 88
8033 88 -103 153 68 200 54 75 -42 22 -235 -16 -78 134 144 -2 -115 101 83 33 59 57 68 -139 61 80
8057 80 188 -97 -191 -9 -206 -36 6 16 270 -58 201 -88 40 -217 48 248 128 58 -49 7 66 59 147
8080 147 24 143 107 280 17 186 26 38 -145 -221 58 51 -108 -177 109 -347 206 131 134 65 -21 187 -190 28
8104B8l0k55M15k44N8j70J33j42J99p6M4k8k9K8m8j13M16l86J86R2r8k9K03r7
8128E7K27l59k1J1j2K2K58o2k12L99k86p6j77L65l1o7lj94J68Q9l20J51rP4q9
8153i7L00l93L25jl09J43k02K33J1j99J06J04j25J31r3K51j66Q2m6R7j80Q7Nj4
8177E0p6j80K25l1N7p7L43k35P1j07J10r1J35k07
$$ plain form
8104 28 -2 -257 158 -86 -28 -198 -65 -207 -8 -84 -40 -68 -97 -69 -117 -230 186 -200 -14 78 -20 -49 154 57
8128 57 284 -75 -96 -85 -97 -75 183 121 -91 308 22 -54 -231 134 103 36 33 -161 7 96 -224 -73 -82 -8 -97
8153 -97 203 -190 135 134 -175 -32 -234 -1 10 -189 -83 21 -104 27 -66 185 19 101 55 152 -28 59 64 50
8177 50 -26 -206 19 -12 45 -32 311 76 147 40 150 59 194 -13
8191a3
$$ Imaginary data points
##PAGE= N=2
##DATA TABLE= (X++(I..I)), XYDATA
0@%%%%%%%%%%%%%%%%%%Qj6J6j6J6j6K1k9L2l4M2m8N5o4P3q2R1j04J15j26J40j57
40h3J76j99K21k45K73l00L31l65M01m42M89n39N92o52P21p99Q85r85J100j236
60f56J401j598J845k166K601l227M202n965J0163m1180k8862O3790K7434j6846
74A0936k7906J0562J3163j062j0621l570p522J473J5243J0922j5399r499J8948
87E668J5681k6305l1337J4035L6952L33k6578l634K3121O118j7358j1851J787
100a3368K717N715J1988J616j5196l226J7455L368k6302j4170K3746K2939j2748
113D534j8670J0999J7269r817j9887O4J1476J599p79O412K274p841j855P165n209
128b266j5611K393K1193N541j6561n093J6999M871k0345j2308J3830J2539o512
$$ plain form
0 0 0 0 0 0 0 0 0 0 0 0 0 0 0 0 0 0 0 0 8 -8 8 -8 8 -8 13 -16 16 -18 24 -24 31 -33 40 -42 49 -55 60 -66 74 -83
40 -83 93 -106 115 -130 143 -157 174 -191 210 -232 257 -282 310 -342 379 -420 465 -520 580 -656
60 -656 745 -853 992 -1174 1427 -1800 2402 -3563 6600 -34580 -63442 348 27782 10936
74 10936 -16970 -6408 6755 5693 -4928 -8498 -16020 -14547 696 11618 -3781 -13280 5668
87 5668 21349 -4956 -36293 -22258 14694 15027 -11551 -15185 7936 14054 -3304 -15155 -13368
100 -13368 -10651 -4936 7052 8668 -6528 -9754 7701 11069 -15233 -29403 -5657 17282 4534
113 4534 -14136 -3137 14132 4315 -15572 -15508 -4032 -2433 -3212 3200 5474 -2367 -4222 2943 -2266
128 -2266 -17877 -15484 5709 11250 -5311 -10404 6595 11466 -8879 -21187 -7357 5182 -1330
141a330n591P600M776o264m469J143m758m909J0062J2852o620j4067O315J5778
155A0518p093k2682p16K1519Q290j3454o965R831O163o101p101k281o62M421J0922
170D609J895j2822o607J4515R711j6554j8198J0673K2993p11j7503l568J2326
183G59N117p858p294j325K655Q620P775o574j4081J908J7439K058k0617j0165
197b1583J8416J7475q560j7358J057J2893L137q567p320N53P312Q541K51j1367
211e120q340R993J2912p377j7630J020J9713P357j4509j1227P139J0659j876q942
225f228l391M086O865L970n138r129k66J0594M723j0749r307Q270J3491k445j3465
240h119l152J0345N617o765p470K482P123L127l887n520j001N458M285m299p487
$$ plain form
141 -1330 -6921 679 5455 -809 -5278 -4135 -8893 -13802 -3740 9112 2492 -11575 -5260 10518
155 10518 3425 -19257 -19973 1546 9836 -3618 -10583 -752 5411 -690 -7791 -10072 -10734 -6313 4609
170 4609 6504 -6318 -12925 1590 11301 -5253 -23451 -12778 10215 9504 -7999 -11567 759
183 759 5876 -1982 -9276 -10601 -7946 674 8449 1875 -12206 -10298 7141 9199 -11418 -21583
197 -21583 -3167 14308 5748 -11610 -10553 2340 5477 -3090 -10410 -9857 -2545 5996 6247 -5120
211 -5120 -13460 -3467 9445 2068 -15562 -14542 5171 12528 -1981 -13208 -6069 4590 2714 -6228
225 -6228 -9619 -5533 1332 5302 164 -8965 -9231 1363 6086 -4663 -13970 -5700 7791 5346 -8119
240 -8119 -11271 -926 4691 -2074 -9544 -7062 61 3188 -699 -6219 -7220 -1762 2523 -1776 -9263
255i263J739J0297K395r298o246O657Q157l967q887M37Q297L837n399n636J663
270e217N515J800m308n061J556O797L443o309o963L309R200N03r573m787P656
285b439R074l383j0204j758Q633O168m887q335o05Q380O246n173j0332K15J0449
300B049N640p862j0452L078J2445K814j0382q320N640J1021M07j0075o142O217
314c922R460q4r635n851O492R717j011j0696n019Q308R106l116j0403k764Q892
329e26O945m019r371j237Q430O172m698r360m62R288M999n667q566J256R358L347
345E889o841p059K861Q281J581o468n443L408P120Q87o516m528M050O582n46o504
361c246k757M456N423j593n484j968M772M340k048n219j090M687L466k685n042
$$ plain form
255 -9263 -7524 2773 5168 -4130 -10376 -3719 4438 471 -8416 -7979 318 4155 -1244 -6880 -5217
270 -5217 298 2098 -2210 -7271 -5715 1082 4525 -1784 -8747 -5438 3762 4265 -5308 -10095 -2439
285 -2439 6635 3252 -6952 -8710 -77 6091 1204 -7131 -7736 644 6890 1717 -8615 -8400 2049
300 2049 7689 -173 -10625 -7547 4898 7712 -2670 -10990 -5350 5671 6078 -3997 -10139 -3922
314 -3922 5538 5454 -4181 -10032 -3540 6177 5166 -5530 -10549 -2241 6865 3749 -6654 -9418 -526
329 -526 6419 2400 -6971 -8208 222 6394 1696 -7664 -8126 1162 6161 494 -8072 -6816 2542 5889
345 5889 -952 -8011 -5150 3131 4712 -1756 -7199 -3791 3329 4216 -2300 -6828 -2778 3804 3258 -3246
361 -3246 -6003 -1547 3876 2283 -3201 -5169 -397 3943 1895 -3324 -4414 273 3739 1054 -3988
376c988K21M906K755l403m666J320N126J443m482l857K979N096m56m984k515M113
392c92M343k082m822o76M515K613k338m398j83M148L068l256m649Q05N536K483
408D715n254m963K815O152L91n979k992M241M948r35n314k729L888M877l35o015
424b489l488N432O997k208r337j736Q157N886n805p870K319Q623J962o684n240
439e481J956O068K783m444n856J245Q081L188p868p696M609J0072L01j0073l786
454f901Q335O389l989p642j073N187M290r76m839k476L927O635j417r365l719
469g634Q829P871o074r077K967R890Q78r169m544M586N732m46l639j768J324M006
485C732K033n336o589K701R106J122q810l410Q590O020p189q647K731P652N26
$$ plain form
376 -3988 -3767 1139 3894 491 -4175 -2855 2271 3714 -768 -4625 -1646 3450 2994 -1990 -4505 -392
392 -392 3951 1869 -2953 -3629 886 3499 1161 -3237 -3420 728 3796 540 -4109 -3304 2232 4715
408 4715 -539 -5502 -2687 3465 3856 -2123 -5115 -874 4074 3139 -2175 -4904 -1016 3861 3526 -2489
424 -2489 -5977 -545 6452 4244 -5093 -6829 1328 7214 1409 -6461 -4142 4481 6443 -241 -5481
439 -5481 -3525 2543 5326 882 -4974 -3729 4352 7540 -328 -8024 -3415 6657 6958 -3115 -6901
454 -6901 1434 7823 3834 -3808 -4881 306 4596 3620 -1219 -3695 232 6867 5450 -3915 -7634
469 -7634 1195 9066 2992 -6085 -3118 6772 7650 -1519 -6063 -1477 4255 3809 170 -1598 -274 3732
485 3732 5765 429 -6160 -3459 5647 6769 -2041 -5451 3139 9159 1970 -6677 -3946 3706 4232
500D232m318j120K675J553l24j488l681k467N016O160k807p420K074R106o76j0741
516d226l774Q736O017m974n034M029M667k200l672j380j97O39M328K344m315l783
532b795N703N313o792r727L766J1036K23q678n45P919J672o801m017K267J552
547I6Q59K681J206m283j458N993J140r473n925R345R821n429q461M074P982k940
563E228q934q40M763J869k30K494l44m163O89N086k973r366J44J2136M629r634
579E54m933Q000N272q517p548M232O239n52p20K340q08m100J213K868m285o995
595g740N517J1762j187j0576q58R131K00j0326l580P614N681k435j190J889j419
610B483k761J080J281n365k013Q649P798o801r099M590Q398n342j0699K233J1254
$$ plain form
500 4232 -86 -1206 1469 3022 2698 1210 -2471 -4938 78 6238 3431 -3989 -1915 7191 6515 -4226
516 -4226 -8000 736 6753 1779 -3255 774 5441 3241 -431 -1811 -2008 -1369 2959 5303 988 -2795
532 -2795 2908 8221 1429 -8298 -4532 6504 6727 -1951 -2496 5423 7095 294 -3723 -1456 96
547 96 955 3636 4842 559 -899 5094 6234 -3239 -9164 181 10002 4573 -3888 186 8168 5228
563 5228 -3706 -4546 217 2086 1856 4350 4006 -157 532 5618 2645 -6721 -6577 5559 10188 554
579 554 -4379 3621 8893 376 -7172 -2940 3299 2747 2027 4367 3559 -541 672 3540 -745 -7740
595 -7740 -2223 9539 8352 -2224 -3082 6049 6249 -4077 -7657 -43 5638 3203 2013 3902 2483
610 2483 -278 802 2083 -3282 -5295 3354 11152 4351 -4748 -158 8240 2898 -7801 -5568 5686
625E686J948n948j119L363j114l890O51O27k741J297Q795K110r541m426P363M101
641G162r131p055Q561J0305l105p547J134M349k624m345N23J662j96L700M821
656H214l069q179P79P859j467j0331n60J2637N374r075o406N557M344n484n009
671d816K915L949Q44J316J437m675m434L815M325n121o983O338J1075j678j1060
686b753j377Q192R39p880k412N875L966o26q44m24l480r88M081L80n928j325R298
703D694N762p782q191M116P499l431q074J819Q196J725l665k066L39r87j63J961
719A752j054l320K732P357p87q496l092P262L649o957m535N733O698k158n065
734b81l35J805n15n22N51j047p23M163L370l900o423J556O865p06p522k07P615
$$ plain form
625 5686 7634 1686 567 3930 2816 -1074 -423 204 -2537 -1240 7555 9665 124 -4302 3061 7162
641 7162 -1969 -9024 -463 9842 6737 -810 324 4673 2049 -2296 -1773 -111 -307 3393 8214
656 8214 5145 -3034 -2255 5604 4137 -6194 -6754 5883 11257 2182 -4224 1333 5677 193 -4816
671 -4816 -1901 2048 2892 4208 5645 970 -3464 351 4676 -445 -7428 -1090 9985 8307 -2753
686 -2753 -4130 4062 5001 -2879 -5291 584 4550 3924 3080 2656 -824 -1812 2269 2649 -3279 -4604 4694
703 4694 10456 2674 -5517 -1401 6098 2667 -5407 -3588 4608 6333 2668 602 941 -46 -209 1752
719 1752 698 -2622 110 7467 6680 -1816 -4908 2354 6003 -954 -5489 244 6942 4784 -281
734 -281 -616 1189 674 152 703 -344 -1067 3096 6466 2566 -3857 -2301 4564 3858 -3664 -3871 3744
751C744L005n284m270K373K824j279j704k9R01R03K549k99m620k385M054L896
767D379l574m617L268O229j504n810j328M033J479k153j474J000J277R56R10j826
783A245l393M12M333P96m988j759N107M221l962n347J220M919J65l274j413K114
799C96K189L32j855k408j33K856J995k266l626J297N364J66n468k243L756L517
815C869j937l511L41K945J289j507k221j027J871K409j73l648j012L245L401k566
831A768m859P31N107R61l891k856K390L669l53l245k090J780L325K73l215k471
847b976K476L463l27m221j953L788L567k184m470J73M101K040k784l376P00L547
863A564J368k647k888R21L627J465l397l211J575M190K42l765k470K738L993p57
$$ plain form
751 3744 6749 1465 -2805 -432 2392 1113 -591 -620 281 1184 3733 3434 -1186 -3571 483 4379
767 4379 805 -3812 -544 5685 4181 -1629 -2957 1076 2555 402 -1072 -72 1205 2161 3071 1245
783 1245 -2148 -1736 2597 3393 -1595 -3354 1753 5974 2012 -3335 -2115 2804 2969 -305 -1718 396
799 396 2585 2917 1062 -1346 -1479 1377 3372 1106 -2520 -1223 4141 4307 -1161 -3404 352 3869
815 3869 1932 -1579 -1238 1707 2996 1489 -732 -1759 112 2521 2348 -1300 -2312 933 4334 1768
831 1768 -3091 -2360 2747 3708 -183 -3039 -649 3020 2667 -578 -2668 -888 2437 2710 -505 -2976
847 -2976 -500 2963 2636 -1585 -3538 250 3817 1633 -2837 -2664 1437 3477 693 -2683 -1983 1564
863 1564 2932 285 -2603 -1682 1945 3410 13 -3198 -1623 2567 2809 -956 -3426 -688 3305 2548
879B548m131j477L258L156j676l885n57L509K645k017l814o2L841K220l077l630
895c149J010M136J299l792k697J932L761Q9l411k161K544L065o16l290j493K660
911a13K845q80l437j255L120K671j838l685l03L842K014k932l142R45L614J014
927B480k716k871J526L357O15l057k771K074L449pl571j905K728L362j241l506
943b054j038L082K203j439l216k50K998J850j715k870J39K865J615j964l050P36
959b108K998J429l049k290J550K948L29k542j808J424K583N3k421j665J580K636
975A647J29k951j811K694K703j283l577m42L280K006k353k426P75K313P30j723
991b89j707J06J800J810j320k673L39K841J049k865k707J793L659k42k954j167
$$ plain form
879 2548 -1583 -3060 198 3354 1678 -2207 -2764 745 3390 1373 -2441 -2503 1338 3558 481 -3149
895 -3149 -2139 1997 3296 -496 -3193 -1261 2500 2589 -822 -2983 -439 2626 2010 -1280 -2773 -113
911 -113 2732 1852 -1585 -2840 280 2951 1113 -2572 -2875 967 2981 49 -3093 -2148 1466 2480
927 2480 -236 -3107 -1581 1776 2391 -666 -3437 -1363 2086 2079 -1492 -3397 -669 2693 1452 -2054
943 -2054 -3092 -10 2193 754 -2462 -2712 286 2136 421 -2449 -2310 555 2170 206 -2844 -2108
959 -2108 890 2319 -730 -3020 -1470 1478 1807 -735 -2543 -1119 1464 1517 -904 -2569 -989 1647
975 1647 1776 -1175 -2986 -292 2411 1128 -2449 -2891 389 2395 42 -2384 -1609 704 1434 -289
991 -289 -1996 -1890 -90 1720 400 -2273 -1934 907 1956 -909 -3616 -1823 1836 1594 -1360 -2527
1007b527K351J552j076k080m08J191J842J49j727j859J259K999o07m166q33M303
1023C63K613k758l395J394L219l47l143n81J436J556M22r93j304m63K185J439
1039A643k538l437K332M333J12m487j458M051J644l549k367J817K504O06j032
1054A74p93o58L36J544J57l564j151L997L950l079m949J339N269p35n285o76M103
1071b1K644k235j652N05L95MK55j085j898J124M452P25m732k619L923L246m066
1088a035m378K949N256l08m130n1J604k25j087j05k33k78K061L213j738m827p
1105c319M634N22n388j551N727M045l772m223J784K671j492k493N03J461L04J735
1121A148J136k683l389K335L312k354m853K686O525k62n472j549L895R36l879
$$ plain form
1007 -2527 -176 1376 300 -1780 -2188 -997 845 994 -733 -2592 -1333 1666 1059 -3107 -3940 363
1023 363 2976 218 -3177 -1783 1436 1089 -2054 -2635 -1199 357 779 -214 -1518 -1981 204 1643
1039 1643 -895 -4332 -2000 2333 2445 -2042 -3500 551 2195 -1354 -3721 -1904 600 1206 174
1054 174 -619 -1277 -941 603 760 -2804 -3955 42 3992 913 -4036 -2697 2572 1837 -3448 -4124 -21
1071 -21 2623 388 -1264 -759 -364 -360 -105 -1190 -3088 -1964 2488 3213 -1519 -4138 -215 3031 -1035
1088 -1035 -5413 -2464 2792 2484 -1646 -1697 -93 -318 -1405 -1510 -1743 -2021 40 3253 1515 -3312 -3319
1105 -3319 1315 1837 -3551 -5102 625 4670 898 -3325 -1541 1130 -362 -2855 -2352 -891 -587 1148
1121 1148 2284 -399 -3788 -1453 1859 -495 -5348 -2662 3863 3601 -1871 -3420 475 1411 -2468
1136b468j062K746J865p26N94M20k836j959K546K285l349k095M571M601l444n487
1152c798J075M208j306m297J212L975J167j752m46J91j906j021K365N52l026N89
1168b218N271J532n927l235L587L213m012k877L724M381j685l090P47N54k245
1183b280k64K562j46j911J833M369j692o293n17N109R54m822p13N144K819l652
1199E00k697J117L02j635O20K000n30r80K789J984l546m721K145M784j902m358
1215d128K095N547p0m789j500K412Oj430P18J902o76j83J836L24m175k713M476
1232c48K946l590k669M280L795k737m903N68L030n40j443Q81J850m12j93J062
1248A577j736l415O58M626L19m205j98N061J548n299l368L408K924k242j978K104
$$ plain form
1136 -2468 -3530 -784 1081 355 949 1369 -1467 -3426 -880 1405 -1944 -4039 532 5133 1689 -3798
1152 -3798 -2723 1485 179 -4118 -2906 1069 2236 484 38 229 -1677 -2698 -333 219 -2807 -2218
1168 -2218 3053 4585 -1342 -4577 -990 2223 -1789 -4666 -942 3439 1754 -1336 -589 -35 -2280
1183 -2280 -2544 18 -128 -2039 -206 4163 2471 -3822 -4339 770 1724 -3098 -3811 1333 4152 500
1199 500 -2197 -1080 -778 -2413 -1793 207 -323 -1303 1486 3470 -76 -4797 -2652 2132 230 -4128
1215 -4128 -2033 3514 3444 -1345 -2845 -433 -427 -1857 -1139 763 87 -96 1740 2064 -2111 -4824 -348
1232 -348 2598 -992 -3661 619 4414 1677 -3226 -2658 372 -168 -1611 -730 1120 708 515 1577
1248 1577 -159 -3574 -2916 1710 2029 -2176 -2374 2687 4235 -1064 -4432 -1024 1900 -342 -2320 -216
1264b16J967q03j021J61j418j416J709K786j150l059J885M205j691n416l39M360
1280E44J555l278q18K735J662j916j357j69l59j54J989Q98k209p98K997J672l669
1297f75l677K612M220j072l760R84L762k70l187p44Q71O93M7M71N3j064M85J892
1315A641l22l753o16L598K179k928k283K584K520j618k832R3J869J67k73k42J19
1332i7k63J027P23j841k201J355L238l64l263k67L324J310k783k478J494K379
1348A293m43j157j32M10O54M50r35j490J05J720J300j773j897J444K291o25k813
1365a598k62K135J277j411r95O46R38Mn36q13m44N93J982l72j846p02J963J125
1383A684j682k077J358K010p9j611q20J492Q12n70j113n59Q54J247J93j287j121
$$ plain form
1264 -216 1751 948 -73 88 -1330 -2746 -1037 1749 599 -2460 -575 3630 1939 -3477 -3816 544
1280 544 2099 -1179 -1997 738 2400 484 -873 -1042 -1401 -1555 434 1332 -877 -1675 1322 2994 -675
1297 -675 -4352 -1740 2480 1408 -2352 -1368 2394 2124 -1063 -1807 -936 -243 -196 275 328 -736 -251 1641
1315 1641 1319 -2434 -3050 548 2727 -201 -2484 100 2620 1002 -1830 -1737 132 299 26 -216 -97
1332 -97 -360 667 1390 -451 -2652 -1297 1941 1577 -1686 -1953 1371 2681 -102 -2580 -1086 1293
1348 1293 850 -307 -439 -29 625 1075 140 -1350 -1245 475 1775 2 -1895 -451 1840 1215 -1598
1365 -1598 -1860 275 1552 141 -854 -208 730 734 198 -615 -1059 -466 1516 1144 -702 -1404 559 1684
1383 1684 2 -2075 -717 1293 1214 -397 -1217 275 1087 517 -596 -1155 -301 946 1139 -148 -1269
1400a269Q68J705j45k013n67J652J331j209j557Q51J209J81j045m78K42O62Q67
1417A285q04r45k74J376O91j220j462N41K194R0j572j069J236J385m01j696l05
1434i50Q79J396o03j213k76J068J065m68j676k41J498J248j023j836K07J976J21
1451A172j168j025N51J110N05j119j122R72J127J74j394o64O06J350R2j419q97
1468a149J377R39k02j831k23J578Q68o55j590J27J461P78j041j455N89J461O78
1485A710j333j597R74J449K73j667r31J280J433l13j763l09J101J060m55j323
1501d11l16J011J152o47j335k84J337R00r75j265o2J506O35j202r91L88J639o8
1519A012j039o97O62J028K51j466o63O72J660mj910p32J602J296j057j864L20
$$ plain form
1400 -1269 -401 1304 1159 -854 -1421 231 1562 353 -1204 -353 856 1037 -8 -486 -244 418 1285
1417 1285 481 -464 -738 638 1329 109 -1353 -812 1382 1472 -100 -1169 67 1452 1051 -645 -950
1434 -950 -71 1325 722 -491 -767 301 1366 898 -778 -1019 479 1727 704 -1132 -925 1051 1172
1451 1172 4 -1021 -470 640 1145 26 -1096 -124 1003 1177 -217 -881 -275 1075 1167 -252 -1149
1468 -1149 228 1167 965 -866 -1089 489 1357 702 -888 -761 700 1478 437 -1018 -429 1032 1710
1485 1710 377 -1220 -246 1203 1476 -191 -1122 158 1591 1278 -485 -794 307 1367 912 -411
1501 -411 -727 284 1436 789 -546 -830 507 1407 432 -833 -895 611 1246 44 -947 -559 1080 1012
1519 1012 -27 -724 -62 966 1217 -249 -912 -240 1420 1416 -494 -1226 376 1672 615 -1249 -929
1536i29J997J45p93j188P37O33K51n50p68q9J323P24j061j331N29J464J32j268
1554d2j254J512J251m92j455j60J160L56k94p31j90N90P50P7j103r79R79J403
1572A378p29j793M84J862K42j366r57J364N23o49m14lK62M73L89l98r50l11J388
1591G95K60j107j074J049J923r50j483q9J497K56j222m39P63O01m25K87n08r36
1609h02L70J283k3j760J4K139P48j931j735J372J773q21j588M67J837n40n49m
1627B50k04o63K37J348n88j145N09K192m22k270j029K211Q90j761p33J551J351
1644A724j169p89L13j98m61M66J177p47j019J218J518j689k370J109K421l65k108
1661i69J29K441K78j991p01Q61J45n56L55Q40n51j26J172J45k101j847K256J802
$$ plain form
1536 -929 1068 1213 420 -768 -31 602 853 303 -465 -554 769 1493 432 -899 -370 1094 1226 -42
1554 -42 -1296 216 1467 975 -480 -640 520 876 582 -149 -339 251 1001 1078 -25 -1004 -25 1378
1572 1378 649 -1144 -660 1202 1444 78 -879 485 1008 359 -55 -58 204 677 1066 668 -282 -593 795
1591 795 1055 -52 -1126 -77 1846 896 -587 -676 821 1077 -145 -584 179 780 355 642 134 -802
1609 -802 -432 851 828 -932 -918 1221 1969 38 -1697 -325 1448 627 -961 -494 1343 803 254 250
1627 250 46 -617 -380 968 380 -765 -256 1936 1514 -756 -1785 426 1316 -445 -1178 373 1724
1644 1724 555 -234 79 -119 -580 -114 1063 316 -703 515 2033 344 -2026 -917 1504 1139 -969
1661 -969 -840 1601 1879 -112 -813 48 193 -363 -8 832 281 155 1327 1472 -629 -2476 -220 1582
1679A582j240j677J477K395j379k405J42J616n67n50P49Q17o96j53J242n83k502
1696a732L96K448M63k250m84K883R01k679k025J244J886r10j157J430J191j025
1712E80n01N65q69j555J297J899m95k087R78K772q67l537m41K751O91j561p27
1729a107K075P22j415l83K90q73r30J757J498j424j423J806J746k056k833J003
1745a547K863l45j768N82K006o02j825l38Q01n57o2J456Q46j218p39J522M33k707
1763a199j366K570J842j520j215J535J174j270j876L84J091o37m4J899j98j379
1779b09k33J651o10k233J2K437R52k111q11K429L22k125j297J260J192q59Q2J400
1797A249k54j365J09R24q83j621J201K210p76j623Q45J495o55k531p9J934Q90
$$ plain form
1679 1582 342 -1335 142 2537 1158 -1247 -1105 511 -56 -606 143 960 264 111 1353 770 -1732
1696 -1732 -1336 1112 1575 -675 -1159 1724 2625 -54 -2079 -835 1051 141 -1016 414 1605 580
1712 580 79 644 -225 -1780 -483 1416 921 -1166 -188 2584 1717 -1820 -2261 490 1181 -380 -1107
1729 -1107 968 1690 275 -108 182 -691 -1621 136 1634 210 -1213 593 2339 283 -2550 -1547
1745 -1547 1316 971 -797 -215 1791 1189 -636 -974 -173 -730 -792 664 1510 292 -447 1075 1508 -1199
1763 -1199 -2565 5 1847 327 -888 647 1821 551 -1325 -941 150 -487 -531 1368 1170 -209
1779 -209 -442 1209 599 -1634 -1622 815 1767 -344 -1155 1274 1596 -529 -1826 -566 626 -233 -151 1249
1797 1249 995 -370 -261 663 -220 -1841 -640 1570 794 -829 16 1511 856 -1675 -1754 180 1070
1814A070j329J48J159l76j173L92J65o26r58J748J409j196j437J084J561j513
1830A28k090J032K239m05j440M52Q73m79p35L4J18n35L63J566K44j920l11J480
1848F14P37k506q70J879J685o31j823Q62P98l50j223N97O9o26P72J139n04j561
1866i42M50J345j72j861l92K478M75j171p83O07O38q20o63M62l8L02P60K22j097
1885b00o58J022O42j124j289J103J687j79j765M1J189k24p30m40O46L54J01J1
1903A87K31p18k90P74R3o81n98J329P73j066r72P20O36l63r69O27N90L73o48j22
1923i4J20k17L29R0n34l25N52O26k86j038Q3Q32K69r12o38J110J011o11j073J45
1943e61Q30j50o9k89j58L01K15L43r30k00R02L93l68r59K0J113M77j247m67L34
$$ plain form
1814 1070 -259 -111 1048 672 -501 -109 56 -570 -1528 220 1629 433 -1004 80 1641 128
1830 128 -1962 -930 1309 904 -536 -84 789 310 -425 -391 -273 -808 -445 1121 1365 -555 -866 614
1848 614 1351 -1155 -2025 -146 1539 908 -915 -53 745 395 -828 -231 -162 -788 -16 1123 619 -942
1866 -942 -492 853 681 -1180 -1572 906 1381 210 -573 34 672 -148 -811 -349 -387 -85 675 897 -200
1885 -200 -858 164 806 -318 -1607 -504 1183 1004 -761 -720 469 245 -485 -925 -279 75 176 187
1903 187 418 -300 -590 184 277 -404 -1002 327 1100 34 -938 -218 418 55 -914 -287 303 676 28 -94
1923 -94 26 -191 138 228 -306 -631 -79 547 261 -777 -694 138 407 -505 -1143 -33 978 367 -706 -561
1943 -561 269 119 50 -239 -397 -96 119 462 -468 -668 234 627 259 -700 -680 433 910 -337 -804 -470
1963d70Q21r5l35l85K9N52L21k08q39o4J043K04q06p73O64J203l11q13o63P51
1983a74P12n51n87P1K95Q65m16o40l92O61M62j2p00l96P83N27k60n25l77P10M13
2004D69m55k78K17R0K09j75m61OM13N53o17n42J24P54K97m81p35K75N80k6n98
2025c81J90J52K76j61k23k31J43M48p8l53o1M99j9l25l01K96K49l4k34p5k96N78
2047E9rj81J68k69L25j41nm31M52M15m02k28j65N17J56l70k28K16M03k14k06m67
2069f05O46R8K3m48LJ39N91k38o05qK53M73k80q18K15Q39K29n98m84L11M52K76
2091D64q99j47M54K67J06k5p44N04K27M32m17j013L03Q33J54r14l73R45M65k42
2111C80o25j27J71N18P6k22p49K62P18K18q83l36L57R17m32j089L00Q50K59p54
$$ plain form
1963 -470 351 256 -79 -464 -435 117 438 230 -609 -673 370 574 -232 -1005 -341 862 551 -262 -925 -174
1983 -174 538 -13 -600 -529 -234 631 215 -425 -817 -156 306 294 -406 -802 -19 508 248 -277 -654 56 469
2004 469 14 -264 -47 43 252 77 -384 -378 35 588 -29 -571 -447 307 604 123 -612 -337 243 217 -381
2025 -381 -191 -39 237 76 -147 -378 -235 213 135 -218 -279 220 201 -124 -425 -129 120 86 -148 -223 -519 59
2047 59 50 -131 37 -232 93 -48 -53 -484 -32 383 -19 -247 -412 105 261 -109 -337 -121 282 68 -138 -605
2069 -605 41 139 162 -286 -283 -144 447 209 -396 -404 -151 322 42 -776 -561 278 507 -91 -575 -264 188 464
2091 464 -435 -582 -128 139 245 220 -524 -20 207 639 222 -791 -488 345 499 -415 -788 157 622 380
2111 380 -245 -372 -201 317 393 171 -578 -316 402 620 -263 -599 -242 675 243 -846 -546 304 563 -191
2131a91k78J32K52P7J33q0n20N04M25k1r30l69J086J38n17l37N16L92k37o73J88
2152c10k5M01L8R5k33j91J87N16m18q35L35Q19j8m60k87O03J39p49j47N35M09
2173D04p21q6N09L56p19m0K69j6n19M15L32q9m56N20M62p92o56N60O82k22q70
2194f77Q08O23j69p95k16J46K31l13M26M51n47j8L63L30j314n67J158Q42p84p96
2214h18O28J076p53q27K39M98k46J42M15m3o58k3Q94j53j451l6J417M63q17n92
2234f45P93N92q33q93M65O23j20k7Q31m29n36Q8P71o82j264L12J778K87j464l80
2254g33J383K43j328l83P23N21o63N67J80l95q42N32P34p85q06R32J334n96j447
2273h29M84R37k24j322K74R96k5l72M01M33p63r22P72M91q48l49J359O58q76q25
$$ plain form
2131 -191 -469 -337 -85 -8 125 45 -475 29 454 433 -497 -866 220 358 -159 -496 20 412 175 -498 -310
2152 -310 -335 66 104 199 -34 -225 -38 478 60 -775 -440 379 361 -99 -386 217 356 -393 -540 -5 404
2173 404 -317 -403 106 462 -257 -297 -28 -44 -563 -148 184 95 -361 159 621 -171 -827 -267 415 193 -677
2194 -677 131 754 585 -210 -426 -280 -49 -362 64 515 -32 -50 313 643 -671 -1238 -80 762 -22 -818
2214 -818 -190 886 133 -694 -455 43 -203 -61 354 311 -347 -370 524 371 -1080 -1116 301 764 -53 -645
2234 -645 148 740 -93 -986 -521 102 -18 -45 786 357 -179 -91 680 -2 -1266 -954 824 1111 -353 -733
2254 -733 650 893 -435 -818 -95 426 -237 330 510 115 -727 -195 539 -246 -1052 -120 1214 618 -829
2273 -829 -345 592 368 -954 -680 316 291 -81 320 753 -10 -932 -160 331 -517 -866 493 1151 275 -550
2293e50O19L75q84o51J058P43n67l12O38K03q71n53O54L60n55J1Q34L30j025j53
2313b96O26k55q81k5J470M88j161l41R31Oj118m82J129L29o49L66N29k41r43N71
2333E3L67p59o42Q04J198j90j446L02Q45j55j334R9J039l8j1K71N6n65m44N87
2353C7J91q28l25J168Q62q63j319R01R97p79q71N01P65N7j41PL3q16M5M92po26
2375e19L5J224L54j170o25R71K28r26k66O57N16j60m37M34k42n38Q6N86j50l81
2395c23J26J181l21j081j95Q74l4p93K13O62J62o80J2L58j13o13K70P54j73o07
2415c21M09O84n17r74J24J040k03p28O78M10m85l02J74K75m01l01K93M52j43j44
2435B0J34L67n56l86M53K37n13k21Q36K46o60k61K08L91k79m62K72Q31n71j83
$$ plain form
2293 -550 69 444 -440 -1091 -33 710 143 -169 469 672 -199 -752 -98 262 -293 -282 552 882 -143 -296
2313 -296 330 75 -806 -831 639 1127 -34 -375 556 562 -556 -1038 91 420 -229 137 666 425 -518 53
2333 53 420 -339 -981 -177 1021 831 -615 -313 532 377 -957 -858 181 143 132 403 459 -106 -550 37
2353 37 228 -600 -925 243 1105 242 -1077 -176 821 42 -829 -328 437 494 353 360 393 -423 -378 114 107 -519
2375 -519 -484 740 1094 -76 -701 270 498 -428 -694 -37 479 319 -118 316 74 -464 -378 208 58 -323
2395 -323 -197 984 663 -418 -613 261 227 -566 -353 309 471 -209 -197 161 48 -565 -295 459 286 -321
2415 -321 88 772 255 -719 -595 445 242 -486 192 602 117 -185 -11 264 -137 -438 -145 307 164 20
2435 20 154 521 -35 -421 32 269 -244 -465 371 617 -43 -304 -96 295 16 -446 -174 657 86 -97
2455i7J44J27m93M8K93j5m39J38N49J78o26j02N12R4m99k67N89j89K70j09Qj34
2477b0j08M0N20l16m71K85Q31l46p81J80N45P8o19m0M11K75k20n36L19j16J6J21
2499D8K92k10m77M20K35m34k36K15M13om37j30N70K3k95k35J21R6J14J4j42J01
2521F0j84O25k37m89O3j58M20k56k62P24L30o81o2J18J28j62m9m6M00l63K01L7
2543A57m79J54O7K12k05J22j9j09L10l29J84L5K19l20L9R4n32L73k12K82J20k45
2565h2J27K42k51k3J0L36k54k35mK70M8l31J19r8L26j87J13l13K02j66N6J11q3
2588f7j40R3K05k8j84K78K9r5j32k36M50nk23P6l5J20l9k5K0k97R8M67j92m02
2612b64J00K03L4j53l28L09K36j64J64l73K93r6M53k66j86J60q8q0N5n1j70L16
$$ plain form
2455 -97 47 174 -319 -271 22 7 -432 -294 255 433 -193 -295 217 311 -188 -455 134 -55 215 106 114 -20
2477 -20 -128 -88 432 116 -355 -70 761 415 -366 -186 359 437 -182 -222 189 464 244 -292 27 -89 -73 48
2499 48 340 130 -347 73 308 -126 -362 -147 266 260 -177 -307 263 286 -9 -244 -123 -27 87 101 -41 60
2521 60 -124 501 264 -225 -162 -320 100 -156 -418 306 636 -45 -107 11 139 -23 -72 -118 282 -81 120 157
2543 157 -322 -168 -101 111 -94 28 9 -100 210 -119 65 100 319 -1 38 132 -400 -27 -239 43 163 -82
2565 -82 45 287 36 13 23 359 105 -130 -134 136 184 -147 -28 -126 200 13 126 -187 15 -151 -95 16 -67
2588 -67 -207 -114 91 63 -121 157 186 91 -41 -277 173 168 -55 21 -14 106 67 42 62 -235 -137 330 138 -264
2612 -264 -164 39 73 -80 -408 -99 137 -27 137 -236 57 -39 414 148 -38 122 34 -46 9 -42 -212 104
2634A04M1k65j2K95K2l57O9J54Mj43J75j1n3o2m8L57l24j11J03J77q2j62m4K64
2658I1o6k2m9J77q4k2J37k60J58j4J74j31J5k8j71J97k69JJ37L37k63k54L53l0
2682A14p7j77J36q1J41j21Q6mj59J8J92k8n32L82J77o9p5j1L63q1k22l11L70j24
2706i3q6K81r4J75J7j68J75k32l60M15R1M2l51J39K54k55k27N5N81m52O9k8M29
2729C77l00m44L95N3J0l60L21J08J97n20K18K79m40l12L90J56K3k97Q2J25m40
2750c79L77j1j28o3O4J58N14p25k1K42N3k89o2K25L85k46k42L23j03l71r5K97
2772i7L33l75n2N31k18m75J22P21n96r4l2O83J2m83j24L26j67n45K33M10j05k46
2794b38K70K00l43l08L75M66n11l74L58O85k70m62J57J59k15k36K09M42J8m75
$$ plain form
2634 104 145 -120 -132 163 185 -172 -103 51 55 -88 87 76 23 -39 -87 270 -54 -165 -62 115 33 -129 -173 91
2658 91 25 3 -46 131 47 25 162 -98 60 46 220 89 104 76 -95 102 -167 -166 -29 308 45 -209 144 114
2682 114 37 -140 -4 -85 56 -65 21 17 -142 -124 68 40 -492 -110 67 -2 -77 -88 275 194 -28 -339 31 -93
2706 -93 -179 102 8 183 200 32 207 -25 -385 30 121 163 -188 -49 205 -50 -277 -222 359 -93 -24 -52 377
2729 377 77 -367 28 81 91 -269 52 160 357 -163 55 334 -106 -418 -28 128 151 -146 -64 61 -379
2750 -379 -2 -13 -141 -204 -140 18 532 -193 -214 28 81 -208 -270 -45 340 94 -148 175 72 -299 -394 -97
2772 -97 236 -139 -191 340 122 -353 -231 490 -106 -200 -232 451 463 -20 -144 182 15 -530 -297 113 8 -238
2794 -238 32 232 -111 -419 -44 422 -89 -463 -105 580 310 -152 5 164 -51 -287 -78 364 382 -93
2814i3L69k1k99l93J57K85j09L1L59J83l15m71L93J95o67o1O14L39l43j10L36
2835C79j97n00j6N04j4n10N00K09m5m38j80M96J57o46k9O67L81j032J80N24l16
2856G4n42K03M99j22l64M92N17o61n47L28M30n84j39N08O22o37k47J30K18l59
2876a81k93L11O45l26j29m9M02m81l34M85K61l13m64O88L03n64l57M50L18n69
2896a97j75L46N02n04J5N9J30l97j34M22J55k91L4L39j81O0n96M21L96q35J30
2917c01M21P7k92j2N14k14n63l4N06J18m92N5N19j11k91k28N37k80o7QM60j88
2939A42l64K08K43k42m68K77L93k13k46K83K57o2o16M05L43k53m07L98K86j48
2959B16m27Q0K52l34O8O6L82k82k08M56O9o13p9J26N08l35l54N52K79m67j88K85
$$ plain form
2814 -93 276 255 -44 -437 -280 5 -104 -73 286 469 154 -317 76 271 -396 -457 157 496 153 43 379
2835 379 182 -318 -334 170 156 -354 146 355 310 -128 -308 188 345 -301 -330 337 718 -314 -134 390 74
2856 74 -468 -265 234 112 -252 240 757 96 -451 -123 307 -277 -416 92 714 77 -170 -40 178 -181
2876 -181 -474 -163 482 156 27 -22 380 -101 -435 50 311 -2 -466 222 525 -39 -396 54 372 -197
2896 -197 -372 -26 476 -28 -13 46 176 -221 -355 67 222 -69 -35 304 123 183 -413 8 404 -431 -301
2917 -301 120 197 -95 -107 407 193 -370 -404 102 220 -272 -217 302 191 -100 -328 209 -71 -138 -130 330 142
2939 142 -222 -14 229 -13 -481 -204 189 -24 -270 13 270 208 -408 -3 340 87 -320 78 364 216
2959 216 -211 -131 121 -213 -145 -79 303 21 -187 269 338 -275 -354 -228 280 -55 -409 143 422 -45 -233 52
2981E2j0j29k91M07J97m2k96J03J58k85J83K93k68k41K25L81l68m00k4N41l5m05
3003b54K55P6K94m09o8N18l91k28P7N51j98m05l2N05j66l55l9K25k1k75J16L41
3025A17j88p9K50J32l09q0L02K6p5k30K13J08J9n73M01j75K49j10Q2K28k81k61
3047b34K52p3r9j48M26q9m1J5k23K65j04P1nK30r0k74K75k21J86j18o9J24j01
3070d5M1K1J19j63n6J58r7j04q7N18m6l40r7K78Q2k55o8r8M67k74n9K02N0jn29
3095c83L53L51l22L3m4J1QM1Q3p6j45K57l73K59j03J48J14k40J94j28J61k39R2
3118E2O6J19l13O6J30J30j88m7P2J15k43r6J48M0q1p1J45j04K13k40K10K7l64
3141b14OJ83j9j4j01J31m5J63J34q0lj85J23j70L81q0l31P7l1J07Mq5N2p0J57
$$ plain form
2981 52 42 -87 -378 29 226 184 -112 -9 149 -136 47 340 72 -169 56 437 69 -331 -355 186 151 -254
3003 -254 1 77 371 -38 -106 412 21 -207 -130 421 223 -182 -214 291 125 -230 -269 -44 -65 -340 -224 117
3025 117 -71 -150 100 232 -77 -157 145 171 96 -134 79 187 206 -367 34 -141 108 -2 80 308 27 -234
3047 -234 18 -55 -154 -302 124 35 -6 9 -214 51 -53 18 13 243 153 -121 154 -67 119 1 -68 56 -45
3070 -45 -4 17 136 -27 -83 75 -22 -126 -213 305 259 -81 -178 100 182 -73 -141 -239 228 -46 -105 97 147 146 -383
3095 -383 -30 321 -1 32 -12 -1 7 48 131 55 -90 167 -206 53 -50 98 212 -28 166 38 199 -40 52
3118 52 118 237 -76 -10 120 250 62 15 87 202 -41 -137 11 51 -30 -101 44 -60 153 -87 123 150 -214
3141 -214 -208 -25 -44 -58 -159 -28 -73 90 224 144 141 -44 79 -91 290 210 -121 -44 -75 32 36 -49 3 -67 90
3166I0K9J38l14J0k74N19k88J36k41K96r2J09l9p4m5n2J66o7n4Q3J26j24n4J96
3190A80O1j47j44J27J07l38n7N6K3k3L9J14J79k83M85l32j80L01j70p8J07N7j28
3213d4K01j70j09J35J8m5P4k66J64J81r6j29J12rj7j56L77j62r7r8L0Q2K95m05
3237a34J71J62l15L9K08l6q6k55J47M15m69J21J39q5j24N5J14j34R1l1o3L44k78
3260dN4J72l3r4j90K55k35M9J75k40J83m04K36K48l26J53O0M1P6l24J10L49n72
$$ plain form
3166 90 119 257 -57 -47 -321 198 -90 46 -195 101 9 118 79 5 -40 -92 74 7 -47 36 162 38 -16 180
3190 180 241 94 -50 77 184 -154 -211 -155 -132 -155 -116 -2 177 -106 379 47 -133 168 -2 -80 27 84 -44
3213 -44 157 -13 -122 13 31 -14 60 -206 -42 139 43 -86 26 17 0 -156 221 59 -38 -136 -106 -24 271 -134
3237 -134 37 199 -116 -77 131 95 9 -246 -99 316 -153 -32 107 22 -102 -47 67 -67 24 -7 -70 274 -4
3260 -4 50 222 189 95 -95 160 -75 -26 149 -91 92 -312 -76 172 -154 -1 59 100 176 -148 -38 311 -261
$$ [...]
8191A16
##END NTUPLES=NMR FID
##END=
