##TITLE=1H_SA_pyram1
 DMSO-d6, 108 sc, 
 12.2.2019
##JCAMPDX= 6.0         $$ Bruker NMR JCAMP-DX V2.0
##DATA TYPE= NMR FID
##DATA CLASS= NTUPLES
##ORIGIN= UXNMR, Bruker Analytische Messtechnik GmbH
##OWNER= root
$$ XWIN-NMR		Version 3.5
$$ Tue Feb 12 14:50:05 2019 Russian Standard Time (UT+4h)  she@DPX200
##.OBSERVE FREQUENCY= 200.1313
##.OBSERVE NUCLEUS= ^1H
##.DELAY= (6, 6)
##.ACQUISITION MODE= SIMULTANEOUS
##.ACQUISITION SCHEME= undefined
##.AVERAGES= 108
##.DIGITISER RES= 18
##SPECTROMETER/DATA SYSTEM= spect
##.PULSE SEQUENCE= zg30
##.SOLVENT NAME= D2O
##.SHIFT REFERENCE= (INTERNAL, D2O, 0, 15.7039)
##AUDIT TRAIL= $$ (NUMBER, WHEN, WHO, WHERE, WHAT)
$$ ##TITLE= Audit trail, XWIN-NMR		Version 3.5
$$ ##JCAMPDX= 5.01
$$ ##ORIGIN= Bruker BioSpin GmbH
$$ ##OWNER= she
$$ F:/spectra/data/she/nmr/H-F/1/audita.txt
$$ ##AUDIT TRAIL=  $$ (NUMBER, WHEN, WHO, WHERE, WHAT)
(   1,<2019-02-12 14:48:49.20 +0400>,<she>,<DPX200>,
      <continue with go, POWCHK disabled, PULCHK disabled
       configuration hash MD5:
       00 E9 B6 7A A2 85 ED C7 34 08 36 98 17 FE 4E 26
       data hash MD5: 16K
       85 38 CA 4F 9D C3 AD 06 2C FC 0C 4A 5E CA FA 01>)
$$ ##END=
$$ 
$$ hash MD5
$$ 23 BB 7A 10 E8 7E 42 EC 07 DF A4 D9 5A 9C F7 08
##$RELAX= 
##$RELAX= 
##$RELAX= 
##$RELAX= 
##$RELAX= 
##$RELAX= 
$$ Bruker specific parameters
$$ --------------------------
##$DU= <F:/spectra>
##$EXPNO= 1
##$NAME= <H-F>
##$PROCNO= 1
##$TYPE= <nmr>
##$USER= <she>
##$AMP= (0..31)
100 100 100 100 100 100 100 100 100 100 100 100 100 100 100 100 100 100 
100 100 100 100 100 100 100 100 100 100 100 100 100 100 
##$AQSEQ= 0
##$AQ_mod= 1
##$AUNM= <au_zg>
##$AUTOPOS= <>
##$BF1= 200.13
##$BF2= 200.13
##$BF3= 200.13
##$BF4= 200.13
##$BF5= 200.13
##$BF6= 200.13
##$BF7= 200.13
##$BF8= 200.13
##$BYTORDA= 1
##$CFDGTYP= 0
##$CFRGTYP= 5
##$CHEMSTR= <none>
##$CNST= (0..31)
1 1 145 1 1 1 1 1 1 1 1 1 1 1 1 1 1 1 1 1 1 1 1 1 1 1 1 1 1 1 1 1 
##$CPDPRG= <>
##$CPDPRG1= <>
##$CPDPRG2= <>
##$CPDPRG3= <>
##$CPDPRG4= <mlev>
##$CPDPRG5= <mlev>
##$CPDPRG6= <mlev>
##$CPDPRG7= <mlev>
##$CPDPRG8= <mlev>
##$CPDPRGB= <>
##$CPDPRGT= <>
##$D= (0..31)
0 1.2 0 0 0 0 0 0 0 0 0 0.03 0 0 0 0 0 0 0 0 0 0 0 0 0 0 0 0 0 0 0 0 
##$DATE= 1549968149
##$DBL= (0..7)
120 120 120 120 120 120 120 120 
##$DBP= (0..7)
150 150 150 150 150 150 150 150 
##$DBP07= 0
##$DBPNAM0= <>
##$DBPNAM1= <>
##$DBPNAM2= <>
##$DBPNAM3= <>
##$DBPNAM4= <>
##$DBPNAM5= <>
##$DBPNAM6= <>
##$DBPNAM7= <>
##$DBPOAL= (0..7)
0.5 0.5 0.5 0.5 0.5 0.5 0.5 0.5 
##$DBPOFFS= (0..7)
0 0 0 0 0 0 0 0 
##$DE= 6
##$DECBNUC= <off>
##$DECIM= 32
##$DECNUC= <off>
##$DECSTAT= 4
##$DIGMOD= 1
##$DIGTYP= 9
##$DL= (0..7)
0 120 120 120 120 120 120 120 
##$DP= (0..7)
150 150 150 150 150 150 150 150 
##$DP07= 0
##$DPNAME0= <>
##$DPNAME1= <>
##$DPNAME2= <>
##$DPNAME3= <>
##$DPNAME4= <>
##$DPNAME5= <>
##$DPNAME6= <>
##$DPNAME7= <>
##$DPOAL= (0..7)
0.5 0.5 0.5 0.5 0.5 0.5 0.5 0.5 
##$DPOFFS= (0..7)
0 0 0 0 0 0 0 0 
##$DQDMODE= 0
##$DR= 18
##$DS= 0
##$DSLIST= <SSSSSSSSSSSSSSS>
$$ [...]
##$SUBNAM2= <"">
##$SUBNAM3= <"">
##$SUBNAM4= <"">
##$SUBNAM5= <"">
##$SUBNAM6= <"">
##$SUBNAM7= <"">
##$SUBNAM8= <"">
##$SUBNAM9= <"">
##$SW= 20.0189088683792
##$SWIBOX= (0..15)
0 0 2 0 0 0 0 0 0 0 0 0 0 0 0 0 
##$SW_h= 4006.41025641026
##$TD= 16384
##$TD0= 1
##$TE= 0
##$TE2= 300
##$TE3= 300
##$TEG= 300
##$TL= (0..7)
0 120 120 120 120 120 120 120 
##$TP= (0..7)
150 150 150 150 150 150 150 150 
##$TP07= 0
##$TPNAME0= <>
##$TPNAME1= <>
##$TPNAME2= <>
##$TPNAME3= <>
##$TPNAME4= <>
##$TPNAME5= <>
##$TPNAME6= <>
##$TPNAME7= <>
##$TPOAL= (0..7)
0.5 0.5 0.5 0.5 0.5 0.5 0.5 0.5 
##$TPOFFS= (0..7)
0 0 0 0 0 0 0 0 
##$TUNHIN= 0
##$TUNHOUT= 0
##$TUNXOUT= 0
##$USERA1= <user>
##$USERA2= <user>
##$USERA3= <user>
##$USERA4= <user>
##$USERA5= <user>
##$V9= 5
##$VALIST= <valist>
##$VCLIST= <CCCCCCCCCCCCCCC>
##$VD= 0
##$VDLIST= <DDDDDDDDDDDDDDD>
##$VPLIST= <PPPPPPPPPPPPPPP>
##$VTLIST= <TTTTTTTTTTTTTTT>
##$WBST= 1024
##$WBSW= 4
##$XGAIN= (0..3)
0 0 0 0 
##$XL= 0
##$YL= 0
##$YMAX_a= 570597
##$YMIN_a= -930786
##$ZGOPTNS= <>
##$ZL1= 120
##$ZL2= 120
##$ZL3= 120
##$ZL4= 120
##$ABSF1= 10
##$ABSF2= 0
##$ABSG= 5
##$ABSL= 3
##$ALPHA= 0
##$AQORDER= 0
##$ASSFAC= 0
##$ASSFACI= 0
##$ASSFACX= 0
##$ASSWID= 0
##$AUNMP= <proc_1d>
##$AZFE= 0.1
##$AZFW= 0.1
##$BCFW= 1
##$BC_mod= 2
##$BYTORDP= 1
##$COROFFS= 0
##$CY= 11.3945322036743
##$DATMOD= 1
##$DC= 2
##$DFILT= <>
##$DTYPP= 0
##$F1P= 18.9103706918063
##$F2P= -1.10871071338519
##$FCOR= 0.5
##$FTSIZE= 0
##$FT_mod= 4
##$GAMMA= 1
##$GB= 0.15
##$INTBC= 1
##$INTSCL= 1
##$ISEN= 128
##$LB= 0.24
##$LEV0= 0
##$LPBIN= 0
##$MAXI= 10000
##$MC2= 0
##$MEAN= 0
##$ME_mod= 0
##$MI= 1.114404
##$NCOEF= 0
##$NC_proc= 0
##$NLEV= 6
##$NOISF1= 3.799351
##$NOISF2= 2.8
##$NSP= 1
##$NTH_PI= 0
##$NZP= 0
##$OFFSET= 15.70392
##$PC= 1
##$PHC0= -8700.464
##$PHC1= 22.20018
##$PH_mod= 1
##$PKNL= yes
##$PPARMOD= 0
##$PSCAL= 0
##$PSIGN= 0
##$REVERSE= no
##$SF= 200.130013532006
##$SI= 16384
##$SIGF1= 3
##$SIGF2= 2
##$SINO= 400
##$SIOLD= 16384
##$SREGLST= <1H.CDCl3>
##$SSB= 0
##$STSI= 0
##$STSR= 0
##$SW_p= 3612.71676300578
##$SYMM= 0
##$S_DEV= 0
##$TDeff= 0
##$TDoff= 0
##$TI= <>
##$TILT= no
##$TM1= 0
##$TM2= 0
##$TOPLEV= 0
##$USERP1= <user>
##$USERP2= <user>
##$USERP3= <user>
##$USERP4= <user>
##$USERP5= <user>
##$WDW= 1
##$XDIM= 8192
##$YMAX_p= 0
##$YMIN_p= 0
$$ End of Bruker specific parameters
$$ ---------------------------------
##NTUPLES= NMR FID
##VAR_NAME=  TIME,          FID/REAL,        FID/IMAG
##SYMBOL=    X,             R,               I
##VAR_TYPE=  INDEPENDENT,   DEPENDENT,       DEPENDENT
##VAR_FORM=  AFFN,          ASDF,            ASDF
##VAR_DIM=   8192,          8192,            8192
##UNITS=     SECONDS,       ARBITRARY UNITS, ARBITRARY UNITS
##FACTOR=    0.0002496,     1,               1
##FIRST=     0,             0,               0
##LAST=      2.0444736,     0,               0
##MIN=       0,             -930786,         0
##MAX=       2.0444736,     570597,          0
$$ Real data points
##PAGE= N=1
##DATA TABLE= (X++(R..R)), XYDATA
0 0 0 0 0 0 0 0 0 0 0 0 0 0 0 0 0 0 0 0 0 107 -108 108 -108 108 -108 171 -216 216 -221 323 -324 391 -432 502
34 502 -544 639 -702 782 -875 980 -1093 1218 -1352 1503 -1658 1835 -2023 2235 -2461 2707
50 2707 -2982 3287 -3624 3998 -4422 4886 -5426 6048 -6752 7590 -8600 9820 -11368 13373
64 13373 -16090 20032 -26195 37563 -65220 313516 -736 -712450 -562715 -127430 318276
75 318276 374827 255418 28812 -125930 -272582 -283297 -112038 239507 421730 230334
85 230334 -202815 -413043 -238257 115461 268417 160320 -38269 -106804 -71535 -42953 -66415
96 -66415 -37002 79923 175727 93986 -118305 -239317 -111025 125077 211387 65000 -112649
107 -112649 -131132 -9492 74295 34545 -48478 -35570 68254 106292 -16479 -149852 -96556
118 -96556 98930 184805 48941 -129671 -131113 28663 140053 67669 -79807 -97569 43297
129 43297 131657 29833 -125327 -104655 75171 164111 41431 -131610 -126078 41477 147431
140 147431 54141 -105170 -112420 35224 126800 34137 -109888 -104505 43982 130628 32411
151 32411 -113709 -111921 33021 120772 40026 -93988 -103290 14788 101293 44928 -77557
162 -77557 -101005 10769 105326 50434 -77275 -102861 6231 100263 60889 -57499 -100345
173 -100345 -11278 95187 75652 -46788 -105186 -16561 101233 84087 -46318 -108601 -18632
184 -18632 100071 90109 -37552 -110240 -29492 100025 99492 -32410 -115015 -32852 101134 99149
196 99149 -37297 -117974 -33057 100372 96571 -37361 -117545 -35489 94181 91411 -35746
207 -35746 -116149 -39883 88355 89982 -36745 -114316 -37057 84205 79654 -36809 -105144 -35728
219 -35728 71541 76290 -25322 -96687 -43805 64258 78881 -18335 -94324 -44454 60388
230 60388 76967 -11070 -83201 -45807 48742 79254 4543 -77218 -54452 44095 86021 13681
242 13681 -76752 -58797 42534 89546 20135 -73448 -62365 36244 90910 25985 -70464 -69767
254 -69767 31938 94861 32269 -73177 -74628 31828 95400 28021 -76056 -72599 29177
265 29177 90644 26434 -72827 -74225 24316 87925 29410 -73170 -76301 23496 84915 24355
277 24355 -71468 -69875 21026 76751 23935 -63256 -68551 14922 71933 29978 -56264 -68903
289 -68903 11603 70813 32067 -51908 -64055 7081 66714 36792 -40815 -61375 -995 62490
301 62490 44620 -32087 -65349 -7556 64393 51597 -28789 -66229 -8939 64331 54535 -25495
313 -25495 -67073 -14936 60652 57319 -22423 -69968 -19314 61916 60324 -23287 -72331 -19139
325 -19139 60655 56525 -24468 -69568 -20374 55538 55045 -22689 -70906 -24082 53942 53798 -23547
338 -23547 -70547 -21494 52533 48535 -23784 -62845 -20577 45839 46573 -17527 -58367 -23411 40219
351 40219 47198 -12122 -55077 -23422 38167 45276 -6741 -47303 -24591 30807 46151 2671
363 2671 -42677 -30161 25431 49225 9774 -41801 -34404 23582 52899 12404 -41320 -36278 19903
376 19903 52023 17457 -38765 -41524 14870 55919 20829 -42330 -45795 17121 57341 17368
388 17368 -44227 -44864 16164 53227 16452 -44552 -45367 14612 53374 16070 -44277 -44166 15716
401 15716 50243 11569 -44126 -41240 15311 46408 10335 -39506 -36318 12497 41416 13070
413 13070 -34457 -34448 10363 39121 14105 -28846 -31127 8813 35504 16618 -21262 -28083 3241
426 3241 31219 20967 -13990 -28574 -2264 30842 25212 -10792 -30158 -7197 28138 28784 -8619
439 -8619 -31079 -10992 27207 32252 -5784 -36993 -16442 29386 35150 -8653 -40368 -15133 30890
452 30890 33471 -11692 -41924 -15599 28918 31722 -13090 -42555 -15198 31311 30753 -15068 -41946
465 -41946 -11420 30035 25945 -16644 -37290 -9601 26696 23265 -12604 -31666 -9068 25248
477 25248 22959 -10373 -27663 -7208 22377 20118 -7358 -21162 -5060 16751 17796 -1056 -14809
490 -14809 -8212 11184 19371 5058 -13341 -11526 9207 21013 7874 -12804 -13778 4229 19359
503 19359 10832 -11402 -19297 467 22300 13843 -14927 -24445 638 25146 12301 -19540 -25113
516 -25113 1418 24683 11994 -20357 -27884 1347 26004 11597 -23415 -28550 4996 28212
528 28212 7563 -25686 -24461 8003 24503 3850 -23698 -18922 8961 22119 3775 -20011
540 -20011 -15831 9092 21660 4045 -16644 -11245 12290 17645 1118 -12049 -5703 7951 12010
553 12010 4035 -4900 -5475 3761 10509 6188 -3131 -5193 1181 8472 6337 822 -4988 -3786 4117
568 4117 8331 2339 -8780 -9556 4763 13649 2351 -13829 -11690 5263 13534 384 -15798 -12460
582 -12460 6786 14179 -939 -19205 -13854 8720 15309 -2583 -21141 -10289 11791 14803 -6573
595 -6573 -18984 -6267 13120 10852 -6679 -16021 -3074 13381 10968 -5343 -13790 -1192 13496
608 13496 9539 -6055 -9078 4124 12650 5034 -4303 -4280 3499 7393 3816 -1422 -359 3042 4497
623 4497 2592 334 -806 1512 1338 2035 2972 1642 -1975 -2073 2103 4626 446 -7144 -5040 4293
639 4293 6798 -2626 -10529 -4543 4476 5167 -4521 -11500 -4169 6890 5319 -6783 -12762 -3668 6401
654 6401 5120 -8324 -11454 730 10461 3561 -9888 -9933 2077 9887 2365 -8330 -5974 6324
668 6324 9238 706 -6970 -2763 7177 7166 -1765 -4397 1747 8006 5831 -1050 -1810 1930 5687 2253
684 2253 -1236 274 4246 4335 850 -1842 1759 3214 1249 -2050 -1335 3614 2544 -2236 -2421 827
700 827 2325 -489 -5281 -3218 1898 2259 -1939 -4966 -4496 1855 2684 -5021 -9176 -1019 5373 541
716 541 -6582 -6590 1234 4029 -1643 -6601 -5326 3275 5021 -819 -7167 -3034 4301 4375 -2225 -5838 1428
733 1428 6603 4357 -2892 -3041 4058 5496 1800 -2579 566 4146 4076 1082 -1208 1158 4393 3593
749 3593 -1023 -2346 2837 4958 1621 -2455 -535 4869 3670 -2982 -1874 1870 3043 -274 -2583
764 -2583 -1663 1333 1848 -2161 -4287 -2405 1425 1277 -3647 -5458 -857 2897 -1624 -6285 -4586 2242
780 2242 1643 -3402 -5149 -1134 2195 1396 -3417 -3850 400 3254 490 -3208 -2346 1504 3948 -152
796 -152 -4545 -366 5674 3375 -1213 -3032 3225 5517 1860 -2202 203 4565 4536 942 -1502 994
812 994 5535 4551 -1138 -3985 928 5583 1726 -5152 -2182 3468 3814 -970 -5317 -653 3539 2627
828 2627 -3557 -4472 -839 4215 -32 -4614 -5032 1634 2737 -2819 -6603 -2827 2419 1807 -4265 -6000
844 -6000 -169 3853 276 -5727 -3535 1547 3355 -574 -4353 -2655 3878 3163 -928 -3922 1303
859 1303 5237 2834 -2747 -3450 4452 5702 1201 -2967 -670 4836 5011 -631 -3235 1842 4912 3177
875 3177 -682 -2454 1795 5058 1449 -3752 -1677 4290 4035 -2337 -3833 -375 4227 1073 -4105
890 -4105 -3899 314 2577 -691 -4251 -2455 2144 2253 -2382 -6250 -1194 3341 1464 -5114 -4692 1124
906 1124 3325 -364 -5236 -2559 2926 2377 -2186 -4839 -1233 3346 3424 -2529 -3613 1532 5187 1637
922 1637 -3518 -3382 4083 4975 -624 -3578 -18 4742 3797 -988 -3087 1743 4416 2896 -1964 -2047
938 -2047 1229 4760 1536 -2737 -2528 3173 3164 -1579 -3659 652 3617 478 -3428 -2255 1910 2648
954 2648 -1294 -4062 -1370 1728 520 -3472 -3944 54 2842 -63 -5687 -3280 3172 3795 -3267 -6402
970 -6402 -1335 5188 2331 -4706 -5820 1089 5661 1787 -5018 -5310 3228 6895 558 -6564 -3061
985 -3061 6364 6335 -2304 -6639 -426 5928 4466 -2737 -4274 1866 7157 2422 -3820 -3062 2658 6089
1001 6089 261 -4356 -2197 3648 4518 -1014 -4425 457 3500 1589 -3244 -2154 1430 2183 -746
1016 -746 -2543 -798 1022 1340 -2648 -3478 -212 2612 -1009 -3826 -2497 2336 2219 -3392 -5056 324
1032 324 3839 1181 -4505 -3407 2359 5499 533 -4699 -3204 3781 5491 -1241 -5520 -1309 5886
1047 5886 5961 -2838 -5467 1030 6882 3168 -4230 -5118 1767 6713 1834 -3648 -3730 4213 5632 -16
1063 -16 -4847 -2865 3007 4503 -898 -4874 -548 3412 939 -2770 -3638 -185 1279 132 -2422 -1311
1079 -1311 -169 645 -620 -1958 -477 924 -766 -1650 -905 754 1073 -2328 -2238 1815 3129 -242
1095 -242 -3925 -1746 2916 3049 -1831 -3848 -420 4441 2417 -2373 -4365 749 5259 3315 -4309
1110 -4309 -3519 2553 7204 1493 -5072 -2375 4458 6469 -673 -5455 -2040 5620 5623 -2711 -5363 -50
1126 -50 4527 3359 -3845 -4878 166 4321 863 -3376 -2969 1806 3509 -167 -3205 -3155 1077 1859
1142 1859 -758 -2719 -1291 807 -713 -1483 -1671 622 115 -2016 -430 500 745 -1237 -3116 -139
1158 -139 1661 375 -2027 -2028 934 4751 460 -3757 -2858 2119 5348 1236 -3831 -1862 3899 4775
1174 4775 -976 -5080 -1167 4825 4075 -931 -3890 157 6388 4370 -3219 -4669 557 5467 2606
1189 2606 -3928 -3384 3137 3918 507 -3882 -2945 1466 2761 -515 -3823 -2204 1402 2168 -550 -3362
1205 -3362 -2162 1023 385 -1508 -1564 -276 -375 -109 -685 -883 492 -1157 -441 1034 1009 -421 -2438 277
1223 277 2034 1267 -1058 -1048 -689 2797 2464 -67 -3119 525 3820 2628 -2136 -2977 2909 5377 1306
1240 1306 -2063 -1990 2627 3525 269 -3450 -1754 2885 4460 -990 -4065 -2244 3929 3634 -1371 -3558
1256 -3558 -299 3667 718 -1817 -2751 -818 1622 580 -1823 -2046 -152 1144 45 -2403 -1934 -152
1272 -152 1029 -1618 -1608 -1031 699 -1269 -1360 -1033 1288 212 -2457 -662 2072 1351 -1569 -1600 343
1289 343 2684 1273 -769 -1307 86 3656 1926 -1833 -1271 3376 4830 381 -3406 -1126 3618 3349
1305 3349 -1273 -3595 1245 3343 2348 -1580 -2704 835 3722 1601 -2335 -4058 653 3620 422
1320 422 -3590 -3148 2022 1943 -1216 -3399 -1792 2101 1215 -2436 -2422 529 1714 427 -2718 -2126 66
1337 66 800 -1786 -2333 -1440 608 -69 -1740 -776 1127 943 -1621 -1864 -229 1380 96 -1889 -543
1354 -543 1122 2205 465 -2109 -1456 2548 1939 36 -2786 1463 2623 1338 -875 -2336 31 3658
1370 3658 1355 -1401 -2223 1779 2760 -644 -1565 -1545 3696 2606 -1500 -2979 -355 1790 1070 -1882
1386 -1882 -3317 682 1607 -87 -2710 -1862 434 1160 -1114 -2606 -1248 1493 505 -1512 -2453 -345
1402 -345 1626 -977 -3079 -1497 1361 1060 -1191 -1713 -890 1038 1041 -1417 -937 689 1995 924 -2403
1419 -2403 -1363 2887 3108 -1212 -1400 475 3208 2198 -1328 -1028 1247 2945 164 -1323 -869 2048
1435 2048 2478 78 -3411 559 2888 1706 -850 -2361 877 2901 639 -2758 -2322 1308 2703
1450 2703 -1295 -2274 -1251 1378 1605 -1921 -3268 -1113 2008 1302 -2213 -2668 -27 1492 -429 -2854
1466 -2854 -1387 1647 1347 -1728 -1999 -172 2782 1698 -1747 -2246 1129 2462 658 -1915 -1073 1951
1482 1951 3224 132 -2205 -784 2753 1690 -1083 -1646 1324 2253 552 -1369 -797 1694 2424 396
1498 396 -2440 -603 2631 1972 -902 -2151 -12 2808 362 -1882 -1158 773 2002 -870 -2819 -523
1514 -523 2161 1125 -1079 -2719 -122 1154 90 -2473 -1932 681 2552 -1061 -1283 -1146 1979 1493
1530 1493 -671 -1876 67 1777 299 -974 -992 720 2200 -301 -1575 -445 1145 1862 -913 -1366
1546 -1366 445 2039 1147 -633 -1020 1645 1705 -188 -2039 -194 2344 1392 -164 -1962 605 2808
1562 2808 748 -1823 -2282 144 2116 76 -2375 -970 2010 1472 -1048 -2047 -268 2394 1086 -1940
1578 -1940 -2388 -164 1884 549 -2434 -1480 -190 2012 -450 -1438 -1010 984 1604 -1173 -2336 310
1594 310 1250 50 -1575 -437 -241 1412 -426 -701 67 723 1056 -1164 -930 313 243 49 -1813 -84
1612 -84 1455 113 -296 -381 709 1468 79 -1490 -1089 1749 2345 -380 -1989 162 1203 1000 -650
1629 -650 -2951 -198 2361 1087 -1853 -2979 532 2301 1030 -1797 -1883 548 2096 80 -2714 -2035
1645 -2035 1518 1918 -1632 -3911 -1178 1358 1083 -878 -1704 -629 750 1338 -600 -1674 -436 1479
1661 1479 1294 -733 -1537 -151 608 1121 -640 321 266 390 1081 341 435 -422 -841 789 1373 282 -997
1680 -997 -269 1692 1960 313 -857 -1264 2331 3020 7 -2390 -1675 2412 3151 -798 -3829 -1601 2407
1697 2407 2181 -1963 -4301 -1747 2254 2852 -1915 -3438 -887 3002 2777 -2194 -3587 -300 3444 2623
1713 2623 -2076 -4062 182 2749 2273 -1366 -2752 677 2849 1434 -1748 -2017 203 2288 2108 -239
1729 -239 -2367 397 1998 1856 -676 -1309 -1793 474 1958 1236 -1685 -2468 967 2897 1700 -1602
1745 -1602 -2212 764 3795 933 -3323 -3008 1162 4542 1206 -2773 -4234 1656 4762 745 -4561
1760 -4561 -4043 1363 4991 535 -4044 -3050 2147 4490 1674 -4627 -3828 1492 4501 968 -5076 -3625
1776 -3625 1931 4956 585 -4135 -3563 1935 4669 1006 -3795 -2961 1378 4044 1225 -3964 -2952
1791 -2952 1180 3898 1299 -3394 -2686 1383 4260 1555 -1785 -3815 238 3081 2838 -1892 -3241
1806 -3241 -1453 3184 3486 -1122 -4506 -1099 4520 3808 -530 -5857 -2029 4554 4454 -2031 -5960 -1777
1822 -1777 4516 4438 -2342 -6229 -1682 5744 4823 -2831 -6951 -2016 5155 4551 -2400 -6786 -1688 5409
1838 5409 5549 -3197 -7840 -2624 5927 5119 -3436 -6019 -1483 5304 5782 -2010 -5370 -1482 5372 4415
1854 4415 -1076 -5182 -2195 3925 3794 -1009 -5493 -1788 3968 5507 221 -5266 -3911 3217 5108
1869 5108 247 -5127 -3687 2642 5817 764 -5414 -4789 2923 5665 1384 -6526 -6489 2157 7318 1537
1885 1537 -6486 -5894 1982 7505 2516 -6218 -6942 2580 8764 3028 -7112 -7317 3103 8954 1599
1900 1599 -7627 -7062 3055 7817 2111 -7128 -6747 2824 8223 2903 -6209 -5830 2238 7710 2807
1915 2807 -5661 -6465 1599 7704 2614 -5561 -5922 1832 7085 2411 -4719 -6357 1381 7629 3058
1930 3058 -4293 -5955 106 6639 5321 -3292 -7422 -807 5657 5766 -2385 -7687 -1633 5747 6426
1945 6426 -2821 -8480 -2178 7539 6585 -3022 -9490 -2197 7458 7066 -2907 -8756 -3376 7553 7610 -2028
1961 -2028 -9813 -3777 8077 8974 -3216 -9247 -2791 8021 8039 -1761 -9375 -3478 7413 7561 -2543
1976 -2543 -9995 -4154 7453 8129 -1560 -8741 -2721 6952 7615 -1687 -8744 -3975 6018 7846 -1301
1991 -1301 -8828 -4792 5490 8370 206 -8013 -5540 4497 9352 976 -8827 -5591 3576 9094
2005 9094 1124 -7353 -6504 3034 8831 2365 -8167 -7156 3309 10325 3128 -8740 -8809 2926 9661
2020 9661 2198 -8069 -9299 2767 10022 3469 -9010 -9209 2654 9629 3671 -8314 -9897 2050
2034 2050 11143 3937 -8866 -9539 2075 10858 4106 -7716 -8274 1965 10528 4277 -6499 -8652
2048 -8652 1728 8907 4670 -6576 -9351 904 9299 5792 -6094 -9905 193 9033 5224 -4707
2062 -4707 -9366 -1043 8308 6605 -4935 -9902 -1655 8010 7298 -4440 -10041 -2656 7967 8026 -3655
2077 -3655 -10228 -2903 7828 8893 -3155 -11555 -3803 7371 8621 -2977 -11398 -4274 9061 10418
2091 10418 -2314 -11304 -4832 8893 9673 -2684 -11135 -4889 8058 9330 -2101 -12067 -4783 8583
2105 8583 9490 -1939 -10881 -5836 8161 8686 -1276 -10045 -5476 6422 9263 -710 -10315 -5983 6639
2120 6639 10010 406 -8500 -5499 5757 10464 1012 -8974 -6732 4734 10492 1771 -9477 -7815
2134 -7815 4048 10318 1383 -8626 -8156 4330 10288 2798 -8558 -8666 3493 11636 3381 -7996
2148 -7996 -7869 2228 10943 3369 -7884 -9937 2795 11429 4377 -8614 -9639 3537 11307 5009
2162 5009 -7704 -9453 2563 10958 6317 -7606 -10340 1796 10841 5437 -7417 -9836 1455
2175 1455 9119 5516 -7181 -10328 889 10151 5951 -4985 -10635 -785 10007 5944 -5532 -8950
2189 -8950 -595 8608 7401 -4390 -10124 -2085 8775 7685 -3774 -9447 -3205 8833 8409 -4911
2203 -4911 -11296 -2953 6649 7506 -3018 -9955 -4182 7992 8800 -2728 -10809 -3594 8184 9711
2217 9711 -3466 -10120 -4037 7773 9270 -2610 -10296 -4376 6959 8963 -2256 -10379 -5868 7659
2231 7659 9561 -1838 -10578 -5029 5958 9349 -1602 -9902 -5530 6471 9113 -1984 -9618 -5460
2245 -5460 5856 9332 470 -8582 -5349 4919 8999 790 -7932 -6513 4887 9507 1194 -8075
2259 -8075 -6344 3511 8785 2407 -8094 -7566 2773 10026 2981 -8152 -7979 2035 9321 2495
2273 2495 -6892 -7565 2436 8978 4335 -6729 -8540 1705 9953 4321 -7468 -8625 2521 10191
2287 10191 4637 -6765 -8856 1210 9333 5624 -7014 -8083 991 9759 4377 -6349 -8418 1920
2301 1920 9756 4606 -6002 -9691 755 8293 5767 -5223 -7044 231 7806 5650 -5046 -8162
2315 -8162 -372 7780 6156 -3018 -8863 -1309 7435 6501 -3453 -8503 -2012 7086 6932 -2026 -9017
2330 -9017 -2189 6285 7571 -2469 -8390 -3388 6032 7955 -1977 -8568 -3890 6372 7905 -1929
2344 -1929 -7932 -2746 6405 7622 -1188 -8010 -3788 6341 7881 -2219 -8994 -3661 5918 8030
2358 8030 -1028 -9399 -3968 6096 7569 -1174 -7601 -5375 4797 7976 -367 -8051 -5092 4413
2372 4413 6637 -420 -7926 -5400 3274 6760 31 -7423 -5644 3197 7738 1353 -6394 -4942 3403
2387 3403 7656 1293 -6161 -4735 2446 6595 1804 -5313 -5201 1901 7067 3155 -5714 -6055 1869
2402 1869 7174 2644 -4953 -6421 896 7213 2885 -5041 -6229 1633 6919 2848 -5561 -6643 287
2417 287 7442 3171 -3987 -6449 1747 7320 2742 -4581 -7143 874 6099 3614 -3443 -6643 539
2432 539 5744 4344 -4000 -6029 -349 6644 4407 -3331 -6420 -558 5820 4045 -3084 -6658 -1019
2447 -1019 5879 4999 -2853 -5784 -969 4724 4384 -1684 -5761 -1813 3893 3787 -1919 -5407 -2161 4296
2463 4296 4751 -961 -6304 -2319 3151 4588 -1034 -5729 -2464 4200 5685 -563 -4591 -1817 3810
2478 3810 5138 -375 -5336 -2913 3174 5142 1133 -5060 -3362 3047 4578 -472 -5511 -3542 2846
2493 2846 5057 243 -5579 -3995 3570 5413 840 -5274 -3289 2540 4455 577 -3815 -2552 2964
2508 2964 4460 16 -3368 -2686 2019 4324 1487 -4252 -3583 989 4507 969 -4385 -2769 2265
2523 2265 5088 1528 -2835 -4151 804 3788 1774 -4130 -4428 317 4422 1656 -2551 -3261 884
2538 884 3879 1966 -2943 -4850 -120 4487 2650 -2539 -3353 -402 3646 2992 -2823 -4043 -282 3290
2554 3290 2330 -1686 -4118 116 3240 2181 -2200 -2990 -771 4116 2935 -1839 -3109 -371 2334
2569 2334 3463 -1806 -3954 -426 3139 2689 -1607 -3154 -476 2239 2221 -1372 -2923 -859 1931 2217
2585 2217 -851 -3547 -1011 2566 2127 -1039 -2926 -2106 1479 3265 -440 -3118 -2018 1952 2355 70
2601 70 -3848 -1393 1561 2614 -321 -2954 -1848 1840 2881 294 -3063 -1730 1201 2802 978
2616 978 -1745 -1602 1599 3104 640 -2457 -2020 1639 1852 891 -3704 -1389 1880 1580 685 -1811 -1936
2633 -1936 1331 2214 762 -1703 -1294 583 1661 -219 -2026 -2071 1449 2426 244 -842 -2494 1125
2649 1125 1989 -3 -1745 -2229 38 1957 971 -2036 -2192 -72 2020 1046 -2174 -2360 718 2319
2665 2319 542 -1268 -1341 -436 1772 1109 -1327 -1421 -128 1344 1147 -734 -1605 -467 2318 1639 -1537
2682 -1537 -2483 -180 1499 875 72 -1598 -325 1535 853 -630 -1947 97 1922 1100 -733 -1744
2698 -1744 -265 2004 1209 -403 -775 40 1247 1061 -636 -979 -327 1531 1422 -476 -1299 -429 1254
2715 1254 956 -146 -447 -62 1126 213 655 -788 -438 964 924 -63 -1096 -895 419 1185 -117 -1689
2733 -1689 33 757 554 -176 -1242 -1341 548 1218 -703 -1777 -1321 378 86 311 -1692 -1518 839
2750 839 1473 -658 -120 -719 -92 789 187 -1336 -431 -117 893 570 -1390 -941 -213 903 -353 -905
2768 -905 -499 771 321 1259 -384 -1139 931 913 282 -170 -535 -558 68 -858 -790 -496 58 357 198 -887
2788 -887 -872 -68 54 153 -512 -172 -911 859 484 -1394 -135 -81 -148 768 -652 -628 -988 423 1262 -123
2808 -123 -16 467 767 -179 597 502 -801 -445 498 429 -817 -225 305 639 269 254 -1392 144 571 -78
2828 -78 -160 444 1064 276 -390 -1146 219 818 33 1048 382 -516 317 521 -607 -514 -351 747 -793
2847 -793 -868 -1194 476 1453 136 331 -374 150 206 876 -703 -224 10 107 -260 -366 -288 159 682 141
2867 141 99 -356 360 338 46 -354 -247 -165 -330 455 -441 -155 -569 523 -494 339 470 902 199 42
2887 42 1150 -386 -558 -643 -189 845 361 -187 5 934 1111 349 -616 10 -52 663 -88 -52 927 228
2907 228 615 136 -743 -5 -273 -177 -555 1012 130 -749 443 -1071 -47 -360 473 398 -347 173 -274
2926 -274 -236 207 -531 -338 -35 392 -500 -92 12 411 144 -3 98 469 -744 41 230 -267 -281 233
2946 233 179 -699 1165 1 58 -839 1009 -70 -364 579 701 -98 99 -555 351 -140 285 448 -503
2965 -503 -569 -603 -592 -209 6 40 531 194 441 -526 132 -797 -227 -440 -569 899 1052 -412 191 -297 484
2986 484 438 -216 -225 -11 152 -582 547 -250 415 652 -150 -372 19 134 423 37 -133 -740 243 630 -30
3007 -30 -91 -315 -150 153 33 -476 -677 -184 271 212 -134 726 863 160 317 18 822 -117 382 31 -65
3028 -65 0 268 -309 755 270 314 577 279 162 435 511 460 -765 -141 -635 -222 167 459 -128 748 -629
3049 -629 -445 -526 -324 42 69 -207 142 984 -31 -283 398 562 371 116 -726 -375 -628 662 458 -676
3069 -676 -107 268 -339 -4 42 609 -148 781 -330 541 823 -333 -246 -435 9 -338 -578 -773 -416 -484
3089 -484 -8 573 -24 -681 320 442 -38 -115 454 1331 21 -289 -277 -197 431 431 -82 66 234 189 549
3110 549 -528 1090 295 874 349 -815 -13 226 495 106 -175 169 206 -460 71 97 -29 431 -104 -465
3130 -465 -677 -556 -227 122 -531 -468 562 330 92 801 84 29 -795 363 1572 953 294 -157 -109 647
3150 647 -145 248 33 881 153 706 107 -662 -423 -28 1300 -768 235 319 304 -66 105 -497 -982 460
3170 460 117 -12 286 658 304 -272 176 705 -552 -248 699 339 111 451 -245 1 89 515 123 9
3190 9 538 -762 187 551 -385 534 -255 -716 151 -647 216 319 117 255 -770 166 486 398 -551 -514 -80
3211 -80 -652 -903 585 -94 -382 -109 -318 -444 -351 124 245 -640 -21 332 814 -899 60 -36 -217 -24
3231 -24 -119 -378 -149 -422 125 -232 64 69 870 232 -639 -75 614 580 -657 45 -711 492 223 -407 -231
3252 -231 262 247 -144 -329 -365 365 -16 594 241 -75 547 558 132 58 426 -165 -731 -842 -65 633 418
3273 418 -290 -426 566 -401 460 -798 -573 -8 -659 7 21 371 752 -50 -1469 -712 690 -255 -90
3292 -90 -98 227 288 349 369 698 -394 643 -400 -726 -237 343 848 -190 676 121 170 113 -804 -401 -34
3313 -34 173 1518 -1054 257 -481 1376 618 -449 -778 147 246 -10 -185 192 584 -55 141 -520 177
3332 177 -365 -163 714 -295 405 544 -271 -130 37 547 -653 17 -632 -667 754 381 -742 -172 -410
3351 -410 -155 -78 -331 -319 -863 -41 -497 -530 -416 -215 277 232 -83 566 -414 -191 -71 -804 73 -122 882
3372 882 905 812 215 70 -455 -164 634 -238 137 658 -201 -437 1508 727 -48 -273 696 6 -348 122
3392 122 -910 -276 -176 -720 123 -414 64 -76 -252 345 -602 -154 16 -929 -200 -431 44 -229 -1687
3411 -1687 323 -326 -168 -149 -919 -563 369 -233 302 164 -644 936 -687 308 -175 130 537 -572 -746
3430 -746 55 411 -271 142 723 1005 -183 -222 138 387 462 -755 -578 -691 478 52 -228 -321 -82 486
3450 486 57 -359 335 55 669 576 -301 23 241 893 115 -149 -509 552 450 251 -58 762 854 221
3470 221 -71 415 383 -657 -81 -71 448 -435 405 -1356 -926 -45 1463 -247 -379 -44 167 -132 -558
3489 -558 142 319 -91 424 -109 -681 3 483 156 -1089 -804 469 -280 212 -102 694 1083 972 260
3508 260 355 439 1146 204 252 -688 211 -485 348 9 -860 -135 -466 -631 -461 -109 108 209 -14 -347 33
3529 33 416 119 -15 594 -676 -400 -513 427 601 -201 -228 -691 -706 -194 514 693 -536 -437 236 303 -285
3550 -285 -444 -403 416 -82 76 -386 -168 -223 -330 49 588 687 483 306 -272 741 -489 981 -578 -659
3570 -659 -199 371 564 -166 388 285 129 -355 -303 411 164 -588 -126 -680 234 122 807 -263 -194 845
3590 845 260 29 -3 -514 238 497 -309 -966 -570 -355 566 -507 -909 184 135 86 -655 -22 241 -30
3610 -30 215 -992 -77 1100 321 108 -179 -355 -413 -55 -219 -68 372 550 72 -315 56 697 826 -222
3630 -222 671 -802 482 729 651 -555 644 1308 1113 249 190 265 914 -397 -91 1089 647 -294 216
3649 216 -574 -411 -236 -287 109 -371 -422 -326 -914 134 -456 204 -942 -759 -970 -450 -151 -299 188 164 624
3670 624 46 -452 -392 368 136 96 339 130 661 50 -248 -844 639 190 88 -889 -356 309 611 210
3690 210 -255 124 -4 626 -867 635 -415 569 136 -255 -123 -385 534 -201 -236 -1310 -251 -16 -72
3709 -72 465 -1306 568 277 -364 -155 -532 313 -189 522 -495 407 -57 -406 4 -315 -676 -3 -799
3728 -799 -169 1067 630 541 -178 -223 626 49 -381 -619 563 497 358 -325 -377 -18 608 19 -489 -298 658
3749 658 557 176 -1372 342 377 -375 -461 -498 -832 903 422 -653 -620 -54 477 -65 -37 72 444 -164
3769 -164 258 -274 -566 779 643 -738 428 -637 333 373 -605 -758 78 -72 -396 91 134 50 1 227
3789 227 -193 -1 90 71 -583 -433 11 73 -130 316 -401 77 654 136 -520 487 -119 -741 -999 909
3809 909 103 -497 640 -228 1403 710 68 -499 -829 280 570 -79 -746 -336 370 256 252 -265 -214 35
3829 35 1262 66 -785 -1 547 294 -835 -942 -1119 355 543 -311 -381 584 64 381 -456 -1423 82
3848 82 -212 -41 -81 -509 -390 375 -35 953 -610 -629 875 274 490 -14 -105 515 81 252 -571 -986 -146
3869 -146 -6 369 -251 17 527 -93 -164 647 -564 740 403 541 -219 -216 507 1253 856 -756 -741 -559
3889 -559 103 136 -424 -905 -346 1634 35 -716 -708 54 657 488 -1032 -1281 354 1292 -30 -881 -113
3908 -113 126 811 293 -1443 -244 -67 606 -54 207 -148 -213 787 12 -340 28 456 676 51 408
3927 408 436 -701 721 299 600 569 -1251 980 259 620 -217 -202 435 1683 25 -619 -608 838 140
3946 140 -462 -1236 2 1301 583 -1237 -1135 104 390 579 330 -1419 -157 1018 187 -172 -559 -323
3964 -323 751 881 -148 -568 -253 258 509 -409 -1503 -548 933 708 -224 -1009 -322 961 22 114 -1046
3983 -1046 -392 425 -11 -224 259 -36 726 1489 -126 -444 115 990 62 669 -214 3 399 655 492
4002 492 -521 -1032 -69 1393 872 -753 -780 -337 627 534 -120 -514 431 1617 852 -344 -886 135 506
4021 506 892 -1256 -1242 790 1926 774 -1786 -2075 389 600 -683 -1021 -1152 31 1537 422 -447
4038 -447 -868 -329 452 521 -927 -783 44 1163 -165 -1163 11 3 377 558 -293 -348 -33 1493 1176 -100
4058 -100 -1067 -240 734 1424 -662 -1692 -467 441 1285 -722 -1035 -428 2368 472 159 -1385 -915 1184
4076 1184 1958 -475 -1254 -881 785 1242 -264 -1406 -288 1061 215 -459 -1164 -871 1545 2265 -412
4093 -412 -1917 -598 1771 1394 -438 -1354 -577 286 694 -280 -1898 -1718 1056 1116 -177 -498 -331 298
4111 298 962 476 -500 -892 1270 1550 -372 -1757 -762 12 652 -14 248 -1049 233 910 571 156
4129 156 -623 1144 1656 -182 -1307 -871 232 841 658 -847 -776 474 966 604 -1529 -820 -25 1621
4147 1621 -58 -652 -1317 537 1139 923 -606 -1046 164 389 555 -1029 -1101 616 993 23 -1154 -2131
4165 -2131 558 1329 750 -1673 -1094 -371 1007 396 303 -1320 115 1047 857 -473 -788 288 913 645
4183 645 -1289 -921 56 493 1225 -958 -1321 -160 1549 338 367 -1517 -631 1313 472 297 -1739 -471
4201 -471 1157 1700 73 -1869 -942 335 973 -212 -1429 -627 219 1009 -699 -902 -1177 1019 1031 -435
4219 -435 -301 -548 817 1206 248 -1697 -183 897 698 -347 -856 -841 1640 1523 -482 -2161 -770
4236 -770 845 493 -604 -429 -523 537 929 -47 -1031 -1464 273 1595 -418 -1023 -626 72 1325 613
4254 613 -584 -1286 -128 1652 351 -1174 -958 645 1254 415 -1253 -1090 343 1572 290 -1185
4270 -1185 -1314 227 1285 541 -1447 -1733 145 1389 1558 -523 -1101 110 1349 267 -1089 -1159 -82
4287 -82 1569 831 -1193 -1409 670 1605 466 -519 -1281 507 1408 3 -1648 -1124 -205 1618 1166 -902
4305 -902 -1193 -909 750 578 -911 -941 591 741 1392 -769 -1106 -394 421 816 -563 -1319 -927 659
4323 659 1629 -281 -1179 97 891 1697 -764 -1717 -1106 753 1668 -895 -1614 -1489 937 -42 -1339 -1852
4341 -1852 386 771 645 7 -2233 -1294 307 1354 195 -1003 -1409 1464 1287 -181 -2070 -2072 894
4358 894 1767 -805 -1019 147 522 768 -75 -854 -118 794 2161 -425 -444 -839 785 527 -893 -15
4376 -15 217 116 1026 29 -802 -482 952 706 593 -456 -1886 390 904 382 -325 -1453 180 483
4394 483 843 -242 -981 329 1553 927 -1318 -1578 -9 962 718 163 -809 -889 1739 1312 -502 -667
4412 -667 -435 1403 620 -506 -404 -154 1109 848 -1009 -1464 -384 1291 56 -1015 -1263 -294 827
4429 827 771 -1055 -65 -427 670 116 -382 -1564 -324 340 134 287 -351 1004 -10 -615 -359 -860
4447 -860 2 828 1254 -548 -862 70 830 1612 -517 -1835 -445 711 1339 393 -542 -1129 1590 1922
4465 1922 261 -1198 -1030 2133 560 -146 -1005 -1177 418 1991 -593 -1612 -554 582 187 -408
4481 -408 -1577 -1351 1113 1356 614 -828 421 553 167 -123 -66 -970 742 1112 -166 -442 -1260 477
4499 477 1578 747 -722 -461 967 902 -7 224 -8 804 895 -61 -1108 -859 571 423 -239 44 -514
4518 -514 193 1397 -544 -1371 -1571 -1690 1226 35 -737 -733 260 622 426 -1211 -605 -134 446 63 -561
4537 -561 -819 -342 441 252 -818 -563 -336 959 -390 -133 -2192 -266 1101 839 -451 -848 -162 870
4555 870 631 -781 -769 350 1293 -173 411 -887 355 363 -84 -101 -666 -3 971 884 488 -663 336 581
4575 581 89 -23 265 -968 -586 769 305 -184 -712 483 264 939 -164 -789 304 785 115 -1190
4593 -1190 -777 -565 125 -94 -1425 102 553 1095 160 -1897 -2125 -188 948 -826 -1165 -734 408
4610 408 812 -620 -933 -529 -572 875 -415 -286 -331 1192 406 308 -854 -244 1540 983 -435 -882 -941
4629 -941 969 880 423 702 -598 658 -109 -232 -964 -838 -440 770 943 -468 -619 111 8 -479 -392
4648 -392 -582 -940 -141 61 -516 -256 87 82 350 -673 -1140 -1229 143 -201 -783 -1218 -325 376 1032 114
4668 114 -848 313 626 1459 -32 -1179 -82 969 721 -68 -1276 -106 685 515 -666 -688 705
4685 705 1365 183 -811 -995 -402 1332 339 -824 -1008 -698 492 -21 -501 -390 -416 265 -333 -45 124
4704 124 -564 304 -137 328 -602 -827 -164 470 -296 -609 654 76 -63 -87 -54 -454 737 1820 493
4723 493 -295 -1048 -429 -220 210 -430 -1166 518 721 -467 -927 -401 134 735 624 -216 -652 303 141
4742 141 122 511 -258 -185 281 -456 -758 786 488 -127 -157 356 -185 -172 916 -462 -558 -246 -91 70 961
4763 961 -515 -391 453 206 964 -205 256 343 248 -171 -585 -325 -225 -229 678 370 -769 -12 -182 -188 401
4784 401 254 -487 -772 -298 -816 -435 -923 247 261 471 206 -786 416 236 -660 -307 -240 415 1031 -165
4804 -165 -410 -340 883 423 -72 -333 -608 554 1255 -949 162 54 520 295 -238 -421 774 150 321
4823 321 -1175 -210 179 722 422 238 -144 287 567 247 -773 -190 -213 -259 -107 51 338 876 382 -404
4843 -404 705 74 -648 -133 -576 -207 -226 -437 -105 -1003 277 692 -239 733 -36 204 -615 -988 34
4862 34 126 -100 853 -396 -335 -173 -241 -304 475 698 488 -35 200 -736 -43 713 -163 -40 -314 -339 88 -564
4884 -564 -582 -303 823 -165 -470 -390 49 463 -530 -78 -385 -706 61 539 -133 88 374 -137 111 -282
4904 -282 -419 -1166 -700 -814 -528 -387 -131 -306 -346 -213 46 -90 -636 288 1083 864 -1262 -726 1002 147
4924 147 -650 -105 -388 153 -57 -304 -300 -418 521 377 323 19 173 622 -369 -143 -497 -124 86 222 -299
4945 -299 445 -81 -540 597 140 -525 -430 209 578 -948 -552 -521 512 267 -468 -92 699 -699 -685 -105
4965 -105 747 -198 -614 -135 635 -380 -737 -215 -116 537 586 -421 -812 1387 -33 287 -511 504 -302
4984 -302 45 -275 -86 -584 1001 787 562 318 -256 122 -193 -317 -716 306 -52 214 -504 174 120 -62
5004 -62 -311 -506 -304 -594 408 360 -253 -285 796 -90 -125 -531 223 287 709 -899 -704 440 -432 -638
5024 -638 -321 257 -254 -229 -164 -113 82 821 232 227 427 208 -992 160 -1029 -301 885 -30 -1149 -1012
5044 -1012 -148 -284 387 200 -91 2 -48 306 -644 697 1047 684 -587 -307 -552 680 -5 -162 316
5063 316 659 795 -28 399 17 -570 293 -53 282 -353 632 -210 -407 -635 -271 588 -73 181 -178 43
5083 43 -903 -697 -382 233 -209 851 -74 430 -182 -152 -418 -108 454 -237 86 847 122 5 -315 21
5103 21 -1023 -383 87 1442 -194 -996 -204 -84 1006 -367 -170 -515 454 683 -1127 26 -323 178
5121 178 844 -724 -106 160 703 174 -873 11 534 352 -556 144 -493 -195 289 -704 -672 -604 -34 125
5141 125 -158 -57 -173 234 -212 318 -1284 -384 -237 -999 -267 674 -439 -385 -984 501 291 -561 426
5160 426 57 143 490 843 -977 585 520 373 332 -590 -94 48 55 -1119 118 -249 -166 -531 -722 114 -229
5181 -229 863 -109 -93 375 751 -454 -537 -542 74 94 -493 158 39 398 1178 383 635 -354 -226 -1289 -253
5202 -253 -224 -282 -27 -77 -128 -221 -35 -500 230 -275 -261 384 557 412 -1047 111 174 604 -569 -534 86 -394
5224 -394 -555 -115 -348 334 514 329 506 -349 897 1435 13 50 315 -565 -273 -353 -549 8 257 -742
5244 -742 856 -385 639 -140 -428 -36 862 706 848 115 274 -602 -304 527 -201 -511 382 621 -349
5263 -349 -301 -468 723 545 -326 -194 244 -278 -577 -657 92 234 358 48 -779 80 -319 -939 131 439
5283 439 310 -262 -290 -396 107 339 -405 88 379 928 436 -599 634 512 -770 144 559 77 -289
5302 -289 763 -231 403 -548 234 748 484 -287 -88 419 535 -180 8 499 -145 -18 18 -135 -514 337
5322 337 250 -77 -98 412 442 956 -6 60 -539 -42 601 -476 -593 -42 -147 -196 146 681 101 784 -183
5343 -183 582 464 510 -789 -857 395 -315 565 -479 55 -613 19 524 -72 -575 -88 -481 276 -191 188
5363 188 79 383 781 -159 262 -374 674 308 -275 194 581 -118 -927 190 170 402 223 -546 351 1002
5383 1002 -71 -201 -218 271 80 -1055 -552 325 -243 -103 -930 -485 325 -443 22 -856 -875 349 336 -88
5403 -88 378 -554 129 168 244 0 15 -10 318 -203 -470 323 1485 -948 -301 313 364 -358 -196 -319 -201
5424 -201 -193 -188 300 185 -323 351 -54 313 777 -199 -172 1161 111 720 -333 -2 -310 -192 187 630 188
5445 188 -144 -171 -506 1068 -622 -696 -591 -690 419 -822 325 896 322 -725 -234 675 -601 156 -884
5464 -884 -619 746 -672 -666 37 175 -100 -124 -453 175 216 -476 -356 603 66 -201 -210 -122 159 -336 -851 488
5486 488 65 551 -836 792 967 -901 84 -370 957 127 -155 -26 -520 -436 525 293 -31 175 334
5505 334 32 -212 -633 -134 -157 -385 432 294 651 330 184 729 -81 418 581 -331 179 75 143 -451 -176
5526 -176 -181 -218 -308 -437 174 377 640 113 -281 372 -275 -468 61 -485 -13 201 -257 369 -277 -295 157 -35
5548 -35 -223 -972 -84 -494 -282 212 336 -738 -193 150 11 557 -293 -580 -790 689 -48 296 993 -187
5568 -187 268 -241 -522 -281 -399 -338 729 125 -142 -72 29 1055 -931 298 -205 312 284 -66 1025
5587 1025 330 698 141 313 609 -81 -163 680 -439 148 152 3 730 133 -80 324 -278 -292 -573 -139 717
5608 717 -200 -1 221 -813 -72 -399 -107 20 33 1100 -394 -694 451 291 -585 -632 1005 -663 260
5627 260 -155 -286 180 -673 -161 754 327 -365 490 298 -136 458 31 13 530 -447 390 3 19 770 -195
5648 -195 44 -132 783 -49 -173 -574 65 2 424 -82 317 -254 547 -843 105 1075 -381 -418 -775 -62
5668 -62 631 72 622 -413 -277 212 206 -328 -415 101 -489 -366 -619 270 271 260 -285 431 394 370 -7 607 1355
5691 1355 -223 -716 210 846 -219 346 -288 99 -854 -217 -356 408 -211 -324 -251 -154 490 299 -914
5710 -914 104 -341 120 142 579 180 629 75 -289 -311 -70 -444 -3 749 -186 321 520 -12 -352 199
5730 199 423 -91 125 -618 -363 -152 344 480 -265 147 -231 224 -817 443 220 -151 -777 484 405
5749 405 71 -652 44 364 366 232 1146 -84 240 277 -558 -335 -773 415 216 -348 -555 437 -91 -142 -372
5770 -372 630 344 -179 -74 470 89 524 -1186 -205 443 399 299 -773 -363 674 303 -903 700
5788 700 -487 436 5 759 641 498 -371 -532 30 134 285 -745 -1583 377 227 -82 440 -160 71
5807 71 37 35 469 341 20 -674 520 64 -242 -106 -183 655 -553 -2 -136 552 -126 -602 -366 -103 19
5828 19 -147 -975 457 893 -761 551 -107 1274 -219 866 16 -153 24 285 202 265 238 -438 315
5847 315 126 -697 -481 -508 -49 -82 105 -85 82 -189 73 -359 184 42 -155 82 655 320 78 490 445
5868 445 11 -699 396 292 -919 161 63 143 499 322 555 -522 497 305 -259 -315 421 -570 106
5887 106 492 -85 -224 -203 -226 -930 292 -416 -344 178 -197 -309 -679 119 -72 531 1004 -804 -749 -578 167
5908 167 151 122 193 368 -154 -94 -63 183 690 -188 -738 1093 -11 111 621 -181 234 83 654 168 -503
5929 -503 536 1269 -93 -380 -354 1034 1273 876 113 96 327 -363 463 -136 -269 479 740 607 570 465
5949 465 1 -450 -319 -33 -401 -799 -911 584 226 -184 -289 865 361 -144 -476 475 49 -379 37
5968 37 -199 488 -357 -428 626 1 -125 4 249 -21 583 -167 -293 45 123 865 -882 -171 110 779
5988 779 -283 -1072 307 1186 -30 -776 705 -356 661 357 -343 185 -365 -89 -136 -201 -26 -648 482
6007 482 -43 182 -1 96 -773 -482 217 -194 -194 78 325 -600 -228 207 540 -162 209 395 66 -282 -93
6028 -93 -1090 -350 -785 157 -198 220 -715 625 162 109 -367 183 380 349 694 -592 86 -54 56 -109
6048 -109 81 -758 -308 -133 276 -232 -479 88 528 -738 -554 -66 672 -270 -115 -250 202 -112 32 183
6068 183 -709 -413 -177 285 309 -560 312 -136 -121 -646 418 -11 818 -502 873 -392 284 721 -146
6087 -146 -974 -147 -257 294 194 549 110 186 -166 109 725 180 -295 610 -234 -574 -910 323 642 236
6107 236 1545 -81 -528 -1128 -11 922 108 -249 -401 223 -227 -462 -173 -691 69 -295 36 399 159
6126 159 549 -134 -419 240 298 554 551 -597 564 113 -246 776 146 259 -519 -396 71 -346 -168 -359
6146 -359 400 -454 -131 436 563 -805 -538 -114 -462 369 734 -134 -519 -885 -956 -568 956 10 617 -537
6166 -537 171 779 1440 464 -68 470 193 87 840 37 -99 -518 -264 409 -68 -547 181 -398 -495 -12
6186 -12 369 118 94 -290 -461 23 -93 733 -350 -296 -307 337 845 -14 678 -82 -47 282 65 8 -1035
6207 -1035 -396 124 -265 0 240 618 283 31 -618 -1096 917 -91 580 -475 -63 843 -23 490 824
6226 824 -96 225 -158 370 -137 -772 -257 529 -146 -529 10 -42 762 132 255 277 -397 1470 862 -61
6246 -61 -736 74 -519 -541 -344 -319 466 67 306 280 896 424 -27 390 418 -844 -385 283 678 -267 362
6267 362 364 -405 -30 -370 261 700 702 -684 -115 507 -441 -774 815 439 -278 -372 -141 682 525 -42 -1057
6288 -1057 -582 -443 -519 -549 -1019 -382 718 -475 421 324 726 -77 399 -818 458 192 -243 89 144 -795
6308 -795 164 5 862 329 -219 1221 318 -354 -243 524 823 314 355 -583 -829 -353 -337 -71 -288 273
6328 273 119 722 154 -320 -186 -102 -693 776 -248 -101 80 334 -298 749 528 -48 -26 480 420 133
6348 133 563 -42 46 -346 594 -151 -441 240 442 -292 330 105 -200 -16 -56 -421 -150 153 -148 836 -212
6369 -212 -424 -206 410 -589 567 335 -3 -349 -993 41 -155 225 -15 -388 -197 67 -471 -635 -241
6388 -241 385 -90 -305 -271 -1160 131 776 -11 -226 91 -211 384 -229 513 418 70 -274 -254 186 -413 -811
6409 -811 723 -257 33 -539 120 42 882 453 436 -604 -392 55 -42 -289 -321 -637 -140 -695 50 -274 -231
6430 -231 660 -436 345 248 -722 358 407 -624 -484 488 127 -119 -109 -410 161 -486 243 -37 -57 68
6450 68 41 -186 220 -608 133 561 139 -70 -680 427 291 -141 -212 -596 288 492 843 -307 1006 -315
6470 -315 558 165 -375 399 -467 196 40 680 -289 -96 -79 -741 -101 -354 -94 630 -424 -490 47 241
6490 241 -274 416 2 -240 -94 -350 70 109 239 435 524 21 -79 -24 -212 417 -65 -544 212 -18 344
6511 344 -297 86 -1005 -477 230 -95 -397 -307 -212 -248 299 872 -424 -21 392 -321 -150 995 -18 306
6531 306 -777 -683 -80 -50 -260 418 183 -765 411 -387 73 -12 -11 336 158 1131 216 54 -998 282
6551 282 -197 -767 -296 -1107 439 305 -263 -1444 -579 403 246 -707 634 333 25 487 613 -209 -194
6570 -194 59 -40 -423 -88 447 425 296 284 -490 447 345 74 4 808 266 -69 446 -377 -181 711 86
6591 86 -700 248 645 -132 741 -14 130 271 -622 129 214 -185 -245 736 -633 -732 -11 -648 -148 735 906
6612 906 306 194 -123 -507 -126 -147 292 -315 154 386 -81 -483 -642 912 678 228 354 626 252 65
6632 65 -25 -206 786 -12 277 -474 324 160 -271 265 91 614 129 400 716 -341 -591 -275 26 -274
6652 -274 495 241 -239 374 492 -71 155 431 -322 -512 547 410 -108 -61 -18 183 199 21 364 345 110
6673 110 1012 287 -137 -101 4 -20 -612 105 -34 18 -133 -387 458 -360 -416 -20 -837 -377 -2 -892 802
6694 802 341 -153 761 -520 -478 -44 -271 10 226 1330 29 -87 140 214 173 670 -393 137 804 388
6714 388 -468 -90 571 140 527 -279 302 -920 168 -375 -396 -731 470 955 312 65 469 -246 546
6733 546 160 666 1032 -419 -386 -425 470 -108 472 -696 -436 -370 -235 -408 -530 457 -1290 -227 -139 -545
6753 -545 131 140 694 -278 54 886 -397 -188 -106 -43 -186 -104 48 -495 518 21 -553 527 92 -554 119
6774 119 -567 -117 824 163 188 201 -578 -751 305 818 -239 171 166 112 -16 515 374 -581 817 -224
6794 -224 211 352 598 447 709 -189 -301 -254 185 -642 -431 -418 -94 -48 102 431 741 -179 -895 339 -402
6815 -402 -365 -276 214 -289 124 -399 -8 -631 -121 262 -91 -610 618 849 -730 511 -495 -31 270
6834 270 96 105 -15 -140 387 -828 657 -1172 -193 29 -734 520 -1262 -54 412 -206 -37 -367 -276
6853 -276 -284 -644 1096 612 579 655 404 -87 915 -113 -326 198 181 -209 46 109 -336 -1129 170 491 -132
6874 -132 -63 -246 -22 298 530 329 -419 418 11 -531 134 -404 15 -260 -87 781 383 56 -337 -43
6894 -43 467 -452 323 -557 49 729 253 107 182 217 -129 496 226 55 -120 127 -79 104 -40 -721 186
6915 186 -425 -689 487 747 -77 -447 152 198 -205 898 875 -28 -321 63 173 -401 967 437 -859
6934 -859 439 16 -463 76 318 -519 375 -243 553 -723 -28 -449 -572 35 142 19 -96 123 -319
6953 -319 573 -937 726 1170 -12 782 -912 -168 -403 -33 98 -399 -454 406 -33 574 55 -121 265
6972 265 539 -878 31 264 719 -278 -371 551 -690 190 266 -148 -891 -344 79 -414 393 326 -852 8
6992 8 826 571 297 -972 362 -583 67 -249 10 719 138 -186 -966 -279 118 538 -494 -1 -368 796
7012 796 -76 34 -630 277 505 313 286 -292 413 -430 -665 -576 101 -73 311 -192 660 -478 297 53
7032 53 -875 148 1159 273 -65 1077 -119 176 -690 -409 -702 -112 -713 -645 -69 357 -294 -424 385
7051 385 549 203 -469 562 494 -362 -275 587 204 292 -194 714 18 62 79 382 -218 -227 -237 -168 -346 660
7073 660 -429 247 -120 135 -470 188 -182 -288 -687 -215 -409 722 -135 -28 593 212 -29 -162 583
7092 583 -165 -361 56 178 -3 433 -243 -298 355 668 499 289 -325 -586 -506 -359 -708 532 663 506
7112 506 -449 -498 -587 -526 452 400 -626 217 -830 -51 629 -770 -693 -661 227 -670 -404 329 512 534 781
7133 781 209 123 -420 403 -241 -488 -314 435 -36 487 861 -64 463 285 -910 -881 -876 -748 64 47 400
7154 400 -72 -311 -186 461 -234 179 -701 -50 -258 -68 154 364 -129 -69 -16 323 270 -796 -15 315 -542
7175 -542 -898 -481 441 793 -263 -1060 -208 -284 504 -372 -340 -421 491 613 381 239 -587 -694 -932 -373 -384
7196 -384 -133 235 -322 139 -54 -220 -376 -182 582 95 -2 -68 -38 -1196 360 -527 877 -296 -411 -209
7216 -209 -221 -434 -206 1180 -546 539 494 -240 334 -374 -38 170 47 -198 -617 -645 -260 1217 -302
7235 -302 -266 -366 82 -225 -351 16 339 -390 518 -504 -231 92 -400 -231 -473 -299 105 -7 276 -81
7255 -81 485 -140 517 78 -230 677 -592 192 274 860 588 816 -242 806 -244 66 395 303 238 418
7275 418 494 -18 397 390 799 621 208 -232 373 257 -54 -168 503 -241 346 54 458 -471 -454 -1255 -3
7296 -3 133 -490 314 -229 -726 -817 -969 207 256 1022 259 -107 -160 -124 -5 -245 -637 -155 -590 173 626 36
7318 36 -51 53 -221 -144 186 690 -644 -1023 -438 -387 -477 130 16 649 377 -411 248 234 -434 -69 656 -383
7340 -383 297 230 52 -996 183 -867 -814 -68 345 -933 662 -379 860 -147 604 -412 -154 231
7358 231 -755 383 721 -679 -599 196 -734 -130 668 1143 285 -60 -138 249 85 703 -163 -349 -28 -523
7378 -523 649 -12 339 -142 434 -72 25 -4 -36 184 393 257 251 353 -248 1244 525 126 119 377 -115 -579
7400 -579 -14 75 171 -211 -195 599 13 288 29 656 -111 -134 -732 -451 256 88 22 273 -465 408 162 829
7422 829 -107 690 -606 -25 826 105 -221 -621 281 193 -428 -696 297 -195 515 -332 -167 490 252 -427
7442 -427 -285 367 897 -222 162 -183 -234 391 381 405 -268 -175 57 -663 -677 169 58 -227 -369 -236 -44
7463 -44 -190 185 371 -641 525 -685 1366 32 -508 646 -412 117 -298 390 84 234 -139 399
7481 399 165 41 -402 -678 40 150 56 73 -568 767 272 94 -508 -456 -751 60 -734 54 -369 -455 -428
7502 -428 -89 -33 -35 -548 286 -272 -576 461 146 268 -505 327 8 -544 359 407 1376 524 181 384 100
7523 100 308 -339 569 650 -1 -256 -224 -589 -1320 411 324 -71 -303 -407 -586 -901 -151 -134 387 717 -47
7544 -47 146 -680 -525 252 -372 -684 -483 185 267 -28 -702 -77 287 533 78 24 105 -169 193 420 400 -269
7566 -269 -194 -460 -192 -166 -491 -627 -392 -553 -1311 -521 273 -1034 500 -107 -410 421 -283 177 -411 -483
7586 -483 439 -295 253 -379 532 517 -110 119 -512 458 -252 120 350 607 998 -250 -98 -503 -55 -170
7606 -170 97 154 122 240 507 494 225 896 35 -642 300 836 -684 -149 -517 -472 -337 730 476 248 315
7627 315 -58 -177 858 -308 38 510 -689 272 -238 -617 -38 -787 -59 143 335 -142 -438 617 -110
7646 -110 -966 -481 252 -72 182 -493 767 662 -412 469 -521 -333 -757 517 -39 408 344 -602 249
7665 249 781 -269 305 -463 -446 322 98 551 -674 92 -173 -152 -265 -80 151 -531 -724 439 443 153
7685 153 -237 -53 -455 -164 943 1109 429 320 -133 -4 -290 111 987 408 266 -718 46 -200 -300 515
7705 515 199 -498 423 93 -64 541 472 853 511 -63 522 229 -267 373 674 -404 12 292 792 -181
7725 -181 -281 -299 -541 239 -700 151 -76 792 241 291 701 -339 -640 -8 -251 93 -843 -587 296 -794
7745 -794 -516 332 -1019 690 -1041 -638 318 701 -137 -149 380 -38 375 266 289 895 -605 240 -78
7764 -78 -1247 -360 -310 544 -43 -409 314 -365 -466 547 213 -444 781 -241 -159 354 315 855 126 -555
7784 -555 429 -169 -677 719 563 209 -40 524 270 209 -117 -236 -521 -975 98 -11 -405 -805 71 805
7804 805 180 577 906 -249 -155 730 769 1162 -650 -526 38 -271 260 -110 -578 231 143 193 918 -643
7824 -643 -13 -752 -298 51 -447 -1021 -153 -278 154 692 -1093 -495 -445 -369 -495 25 95 141 690 -156 -203
7845 -203 161 -74 594 258 172 345 168 293 -429 212 -107 89 -539 -370 426 714 -41 332 394 0 -597
7866 -597 -740 234 394 -46 -249 261 -740 -603 -421 34 -461 -138 -367 146 155 -40 880 789 17 -431 -734
7887 -734 -153 -507 -167 596 -234 215 -120 128 -453 19 682 -310 -554 -699 750 222 55 -1079 -861
7906 -861 -686 320 -39 -583 -338 117 -160 552 -638 -74 98 38 487 -671 -463 349 -66 -365 -22
7925 -22 49 320 335 -235 -41 -588 -564 180 -160 488 -127 467 -119 -79 -180 -81 48 342 508 342 585 -52
7947 -52 801 360 78 171 215 154 -112 272 -442 -939 -228 -392 552 -325 124 -450 723 -29 -410 1219 -486
7968 -486 -289 265 208 -24 148 368 12 547 -136 185 -846 -307 622 396 384 -671 336 -440 -247 401
7988 401 575 -1140 -501 -489 129 -175 -136 610 547 -361 149 -163 -772 -488 -388 -20 -346 -679 -355 284 -694
8009 -694 48 96 -902 -406 -639 333 -719 685 -749 -792 22 -142 -487 -505 993 -607 -200 511 715
8028 715 609 457 103 440 610 957 -290 448 -298 453 309 -411 213 567 258 -100 505 -309 346 454
8048 454 333 47 101 -352 753 113 -772 968 138 537 375 199 -923 -54 218 1040 -217 -144 -280
8067 -280 -251 802 356 885 719 -73 151 249 65 -332 128 -357 197 319 -220 -681 851 -536 198 527
8087 527 393 77 473 914 55 -28 178 -189 6 -308 -199 -415 -365 -194 -743 -546 -378 -640 -156 310 75
8108 75 -65 512 718 619 -859 503 461 -227 319 57 -541 -249 -239 -158 -333 -973 -284 -282 -331 -563 95 238
8130 238 -428 -174 535 -860 193 621 184 -507 -535 -353 822 123 429 533 353 94 -965 -875 247
8149 247 -51 -84 773 501 -188 -556 493 1033 1005 -349 -311 -548 -276 -835 22 695 -82 45 -312 781
8169 781 837 369 329 204 -296 553 -382 -34 -561 -207 437 157 180 -820 -376 197 -1351 54 -1023 34
8189 34 -773 -17
8191a7
$$ Imaginary data points
##PAGE= N=2
##DATA TABLE= (X++(I..I)), XYDATA
0 0 0 0 0 0 0 0 0 0 0 0 0 0 0 0 0 0 0 0 5 -108 108 -108 108 -108 109 -204 216 -216 239 -324 325 -412 433 -520
34 -520 552 -644 724 -804 891 -997 1108 -1239 1375 -1515 1685 -1851 2044 -2258 2484 -2735
50 -2735 3016 -3321 3664 -4045 4465 -4948 5503 -6128 6871 -7738 8793 -10087 11732 -13907
64 -13907 16908 -21358 28607 -42631 79885 -438164 -930786 -321423 266480 570597 340069
75 340069 24534 -232068 -273708 -244043 -95964 114951 345199 313928 -10322 -383978 -391353
86 -391353 -48852 300255 307422 59980 -164624 -169806 -58114 16471 11273 34659 104407 122324
98 122324 -7052 -176852 -189974 10674 213599 194762 -19904 -173368 -114560 47371 111047
109 111047 37747 -48066 -24865 64241 68859 -50799 -132984 -33388 144331 156101 -24992
120 -24992 -169376 -100545 81610 146144 26656 -111865 -87000 60312 113963 -12401 -136904
131 -136904 -68623 107467 139372 -23885 -163668 -95377 87501 142160 4946 -135800 -92747
142 -92747 66662 119172 -5426 -127733 -75734 78237 120896 -8658 -132577 -79054 76511
153 76511 122302 4082 -112665 -78002 55309 108236 18312 -90836 -73275 49571 110253
164 110253 23291 -93304 -77027 47241 112315 34084 -80873 -80931 29114 107271 50533 -69860
176 -69860 -92654 19343 112003 55302 -75054 -97736 16843 112367 58376 -72452 -105328
187 -105328 4563 112207 66610 -70576 -114379 -1817 113058 66745 -74912 -116810 -966
198 -966 111819 65344 -76432 -116706 -2617 106811 63648 -71815 -113507 -4901 103310
209 103310 64048 -69713 -110022 -1961 102357 60523 -63560 -97655 -1191 91310 59429
220 59429 -50706 -91091 -9515 85621 66709 -41014 -88917 -10704 82714 66892 -34501
231 -34501 -81509 -15838 72170 69560 -21027 -78701 -27798 66443 76901 -13406 -83541 -36786
243 -36786 63526 78996 -10913 -84895 -41504 58699 80474 -5821 -85157 -51825 53646
254 53646 84910 -745 -90619 -57788 53651 87289 -4507 -93184 -56220 52309 82822 -4732
266 -4732 -89013 -55614 48394 82462 312 -86710 -57087 48550 83101 -1108 -84834 -50993
278 -50993 47923 76556 1337 -73399 -47629 40090 74310 8991 -67011 -49670 36919 74947
290 74947 13520 -61560 -48805 33175 71356 17485 -54526 -49908 22707 68420 26838 -48714
302 -48714 -56070 15763 69683 32781 -48813 -62082 11937 69063 33119 -47620 -63056 4615
314 4615 67481 37023 -45164 -68349 -276 66691 39270 -46929 -72191 271 67925 38157
326 38157 -47550 -68592 -1410 63322 37761 -43600 -67286 -1791 64311 40022 -42060 -67015
338 -67015 -16 63258 36028 -38828 -60187 1727 58560 36088 -31850 -53974 -2231 52924
350 52924 39022 -26123 -52256 -4568 50224 38626 -20949 -47386 -8229 43423 38222 -13820
362 -13820 -44781 -15478 37084 43190 -6733 -47845 -22355 34751 45635 -4654 -49428 -26163
374 -26163 32264 46436 -1236 -48830 -31260 28511 49292 1073 -53435 -35862 28122 52250
386 52250 -1676 -54489 -34685 31326 49845 -2733 -53576 -34797 29513 49346 -202 -51836
398 -51836 -31705 31091 50445 -1659 -50880 -27663 32297 45690 -1587 -44624 -23434 29071
410 29071 43003 2435 -38696 -23771 25397 41210 3645 -34315 -22095 21246 37237 6353
422 6353 -27084 -21613 14174 32149 11042 -22885 -24916 6948 31817 15912 -21057 -29496 2770
435 2770 31069 17176 -20391 -32728 -3096 30573 21453 -18445 -38068 -6513 32907 24933 -21497
448 -21497 -40942 -5338 36013 23468 -23732 -39807 -2587 36395 25179 -22764 -39664 -1590
460 -1590 37026 23907 -23645 -36944 1593 38413 21770 -22636 -31555 4887 34912 18645
472 18645 -20508 -26639 3325 31940 18848 -15610 -25096 3442 27686 15297 -13951 -19997 2488
485 2488 21944 14229 -7957 -16136 -3559 15098 15182 -2242 -17652 -8153 12593 16998 -1300 -18353
499 -18353 -12283 7522 16200 2574 -18563 -18420 5854 21225 6307 -22741 -22622 6793 24295
512 24295 3985 -24288 -22700 9636 25400 4079 -24086 -21222 10665 27653 4761 -25962
524 -25962 -20241 14324 30136 2674 -27329 -16178 18792 27297 -1254 -22995 -10368 18410
536 18410 22404 -959 -20624 -8894 16778 21962 -1063 -19270 -5881 16368 16222 -3662 -13518
549 -13518 -3961 10228 10501 -1386 -9221 -4822 4535 7412 1159 -8241 -7492 1585 6743 2012 -5702
564 -5702 -8235 -4114 2447 5274 -1728 -12752 -8962 5089 9747 -2036 -16328 -9411 8421 10693
578 10693 -4832 -16919 -7037 10533 12404 -4385 -17815 -7149 13592 14734 -5696 -19093 -4362
591 -4362 18332 14004 -9497 -16485 1127 18180 10630 -8100 -11943 3731 16798 9781 -7653
604 -7653 -11216 3733 15491 8125 -8343 -7837 5528 11411 1775 -7635 -4352 4259 6979 1161
618 1161 -4366 -4320 1484 1695 -636 -3540 -3428 -1551 -674 576 -1908 -3016 -4694 -3930 -271 1630 -2619
635 -2619 -8563 -4589 3366 3688 -5394 -10287 -2788 6304 4210 -6414 -8911 -521 8580 4493 -6877
650 -6877 -10509 1274 11914 4057 -7952 -6608 6217 13466 2962 -7798 -4734 7101 11646
663 11646 2347 -6913 -3258 8480 10665 -814 -7137 58 9948 7688 -2110 -5840 1841 7438
677 7438 2784 -5373 -3339 2206 4085 516 -3980 -2062 1853 1465 -3100 -3835 -1038 515 -1307 -3479
693 -3479 -1296 683 -490 -4954 -4236 -24 1038 -3838 -5590 -1746 2110 1536 -3126 -6145 -2434 3735
709 3735 2406 -4324 -6326 2077 6719 1448 -5704 -3735 4285 5902 277 -3279 -341 6205 6313
724 6313 461 -2981 117 6917 5459 -2018 -3794 3876 8948 4181 -3792 -3018 4370 5700 320
739 320 -3909 229 4097 2516 -1820 -3371 179 2826 979 -2552 -3993 -154 2517 -1175 -5475
754 -5475 -2480 2388 -52 -5264 -4278 1346 1766 -2733 -5689 -2731 905 426 -3023 -3945 -1500 2074
770 2074 874 -3269 -4036 874 4224 -1113 -4314 -1513 3967 4052 -823 -2361 1939 5809 1687 -1991
786 -1991 -818 3011 4090 1889 -1043 276 4013 4690 -324 -2291 1337 6654 4346 -2123 -2221 2210
802 2210 5024 156 -3407 -874 3081 2667 -2979 -3303 -991 2863 1905 -3307 -4582 332 3194 -517
818 -517 -6070 -3338 2236 1424 -3457 -6853 -686 2673 -552 -5919 -4257 527 2366 -1194 -4796 -2047
834 -2047 2956 3392 -1651 -5071 -785 5011 2709 -4206 -3528 2636 6902 1325 -3569 -215 4401 4119
850 4119 -305 -2811 291 4481 3730 -1460 -2028 2197 6458 2270 -3843 -1931 4278 5380 -1448 -3891
866 -3891 -268 4620 3118 -2710 -3738 417 2543 1072 -4418 -4114 1930 3357 -965 -6036 -2845
881 -2845 3144 2231 -4405 -5506 -839 3116 -984 -5361 -3311 471 2187 -1334 -4907 -1425 2734
896 2734 2367 -1855 -4934 -960 4225 621 -4120 -3313 3681 5327 -451 -3656 116 5554 3764 -1094
912 -1094 -2109 1225 5779 3514 -2570 -2849 2517 6202 2121 -3317 -992 4845 5802 -1438 -3693 -92
928 -92 4783 3023 -3557 -2850 1503 3607 -204 -3767 -2421 892 3102 -947 -3951 -1891 2754 2282
944 2282 -3758 -5105 -349 2497 -454 -4614 -1867 2479 2032 -2247 -3505 1348 3293 804 -3644
959 -3644 -4058 1162 4898 -494 -3883 -1168 4939 3913 -2875 -4399 1106 5781 2568 -3815 -3150 3474
975 3474 6173 1145 -4220 -2451 5305 6129 -1602 -5563 -903 7203 6256 -2968 -5037 1070 6499 2575
991 2575 -4285 -4494 2298 5773 747 -5587 -3338 3289 4280 -567 -5526 -2301 4117 3317 -3637 -4902
1007 -4902 611 3590 626 -3563 -2625 1824 1991 -1576 -3053 -664 2067 1377 -2553 -2509 1528 3347
1023 3347 392 -2743 -549 3760 3399 -2522 -2747 2565 5362 1298 -4654 -1454 3809 5286 230
1038 230 -3839 -1061 4514 4497 -1745 -5441 61 6313 4274 -3934 -5041 2541 6824 2063 -5985 -4170
1054 -4170 2902 4906 -696 -6350 -2685 2799 3659 -2039 -4475 -1976 2899 2851 -1618 -4612 -2166 3544
1070 3544 2242 -3710 -2676 263 1245 847 -1787 -953 -328 141 272 -1692 362 1077 728 -258 -422
1087 -422 1370 683 -1390 -1462 1915 3379 -671 -2897 -128 4728 2497 -2371 -3958 2536 6044 2460
1103 2460 -3240 -3042 3202 5700 802 -5462 -3447 3392 5727 -1307 -5835 -2478 4699 4416 -2820
1118 -2820 -6718 -1195 4519 3041 -3351 -5859 -75 4342 1491 -3962 -5174 1514 4293 45 -4657
1133 -4657 -3293 1762 2553 -1492 -3477 -2168 1440 1288 -1007 -2016 -212 2702 417 -1525 -350
1148 -350 1066 277 -1384 -590 2394 1031 -375 -452 1252 2452 739 -1954 -1482 2704 3101 484 -3102
1165 -3102 -1261 4241 3976 -766 -4956 -936 4918 3676 -3040 -4978 -209 5221 3338 -2790 -3300
1180 -3300 420 4640 1550 -4385 -5505 1283 4679 184 -6287 -4806 3449 4122 -2016 -5878 -2065
1195 -2065 1146 2633 -1644 -2864 -878 1163 1363 -1688 -2502 -257 1793 1226 -1243 -268 966 1890
1211 1890 -71 -406 1666 458 -395 572 2068 919 -58 -1017 130 2432 1280 -445 -1120 1313
1227 1313 3759 1815 -1582 -2692 1220 4818 1500 -2434 -3282 2721 4405 -1028 -4141 -1349 2754
1242 2754 3271 -1118 -3964 -659 2861 2188 -2174 -5494 -1473 3314 1618 -4024 -4432 231 3235 -102
1258 -102 -3275 -3078 455 2247 -411 -2751 -461 1322 1796 -408 -2251 -349 1320 948 -80 -636
1274 -636 632 1852 -337 -607 943 1245 1020 -821 310 2997 2021 -1143 -1131 1259 2726 1916 -1252
1291 -1252 -1232 2055 3498 -157 -3073 -1813 3172 3221 -1041 -3860 -175 3445 2127 -2892 -3353 -715
1307 -715 3010 1594 -3432 -2801 1657 2839 151 -3994 -3386 1212 2166 -860 -3662 -2292 2081 2308
1323 2308 -2075 -3640 -262 2344 1158 -2990 -1720 307 1598 377 -583 -432 1265 2023 -427 -1238
1339 -1238 420 2517 617 -1276 -98 1841 2028 -571 -793 1201 2983 1479 -1017 -645 1571 2336
1355 2336 532 -1393 11 1954 1663 -937 -2728 868 2946 868 -2671 -1727 752 2868 -393
1370 -393 -2742 -3111 2146 1937 -924 -2955 -1781 2037 1544 -1815 -3810 -802 2301 792 -3231 -2546
1386 -2546 382 2542 -494 -2221 -1277 2073 2364 -400 -1723 -1039 2627 944 -1592 -2097 1005 1336
1402 1336 -356 -1786 666 1714 1699 -236 -114 188 2422 1679 -1477 -1027 1800 1874 -192 -1309 -327
1419 -327 2007 1573 -1885 -2694 36 3057 345 -2147 -932 341 2167 -319 -2690 -1442 1584 744
1435 744 -825 -3038 -372 2644 949 -2785 -1783 1217 3094 -176 -3548 -1990 835 954 -738
1450 -738 -3549 -974 2536 1167 -1648 -2502 20 2501 -168 -2192 -1442 1849 2568 86 -1747 60
1466 60 2845 2101 -926 -2435 343 2661 1615 -1335 -1585 988 2533 990 -1393 340 2282 2235
1482 2235 -322 -1555 759 2562 1381 -2139 -1237 1045 2961 720 -2146 -233 1845 1346 -1054
1497 -1054 -2389 -1035 1232 759 -1988 -2235 259 1839 -602 -2298 -1236 1515 1221 -705 -3191 -274
1513 -274 1574 -386 -2471 -1523 140 1955 25 -1891 -1316 1403 1979 -401 -2675 -119 2666 1180
1529 1180 -1441 -1239 1473 2541 893 -1838 -622 1640 1960 379 -1883 45 2356 1703 -378 -1098
1545 -1098 910 2649 833 -2204 -1619 1063 1911 -982 -1388 244 1582 1036 -1730 -855 997 2112
1561 2112 625 -1794 -1958 965 1155 -1291 -2170 -237 1814 1854 -978 -1942 597 2335 132 -2417
1577 -2417 -380 324 2103 334 -1932 -406 1928 1445 -407 -1371 546 1474 666 -1952 -936 273
1593 273 2278 673 -863 -837 1630 1049 897 -1330 396 792 1082 -45 -155 -246 798 620 -1183 631
1611 631 1078 313 -1072 -1026 1259 1472 -47 -1946 76 1781 632 -2155 -2326 -43 2372 257 -2058
1628 -2058 -1707 221 1752 63 -3158 -2498 1930 2279 -223 -1962 -1170 668 2569 -501 -3635 -898
1644 -898 2561 2017 -1017 -3156 -443 2355 2216 -1499 -1909 247 2187 1339 -1254 -1343 -399 1411 1130
1661 1130 -795 -1146 1057 903 421 -1251 230 -543 -255 391 920 -280 -383 -756 655 1252 -405
1678 -405 -2039 -438 1041 1168 -875 -1981 40 1916 821 -796 -2912 -526 1465 2877 -1461
1693 -1461 -4060 -1357 3657 1955 -2617 -3659 -160 3063 1100 -1780 -4133 143 3300 2680 -2856
1708 -2856 -3442 1553 3659 1181 -1940 -1809 2387 4454 -75 -3292 -1428 2010 2711 633 -1987 -1830
1724 -1830 471 2820 574 -1061 -2362 -908 2826 1418 -1071 -1551 432 521 1696 -77 -1898 -950
1740 -950 1011 2640 58 -2785 -1921 1268 2850 -264 -2447 -2322 2180 4203 60 -3791 -3110 2346
1756 2346 4883 1162 -4531 -3585 3502 4099 -898 -5896 -2970 4098 4474 -572 -4397 -2836 3425 4321
1772 4321 -610 -5285 -1721 4093 4826 -881 -4878 -1294 3652 3057 -665 -4135 -1784 3955 3603 -687
1788 -687 -3008 -2093 2413 3836 216 -3995 -2765 2474 3223 283 -3702 -2365 1338 3258 1783 -2979
1804 -2979 -4463 63 3730 2360 -2984 -4352 11 5250 2205 -3384 -3966 -280 4644 3312 -3868
1819 -3868 -5397 221 5995 4365 -3543 -5823 -323 6546 3601 -3781 -5680 -900 6861 3111 -3479
1834 -3479 -6361 53 6476 2975 -4801 -5922 223 6163 3934 -4391 -6126 868 6082 3732 -3775
1849 -3775 -5820 373 6097 4040 -3441 -3847 -82 4911 3297 -2697 -6070 -587 4743 4360 -1907
1864 -1907 -5299 -1970 3823 4592 -1470 -5915 -3237 3725 4695 -968 -6236 -3005 3296 5619 -375
1879 -375 -7109 -3595 4383 5801 -379 -7292 -4460 4958 7022 -711 -9181 -4489 4493 8183 303
1894 303 -8061 -4839 5278 8875 -462 -8637 -5360 4384 7333 -249 -7047 -4510 4662 7574 774
1909 774 -7238 -3502 4745 8145 -446 -7819 -4783 3899 7783 523 -6528 -4868 3024 6156 796
1924 796 -5918 -4573 3667 6687 1164 -5888 -4575 2369 6720 2920 -5492 -6250 1603 6504 3636
1939 3636 -4412 -8770 904 7258 4223 -5058 -7447 300 8917 4804 -5492 -8388 -251 8040 4571
1954 4571 -5455 -10035 -534 8480 5824 -4741 -9109 430 10173 6463 -6370 -9499 73 9034
1968 9034 6189 -4853 -8839 -23 8922 5012 -4342 -8478 -1105 8841 5937 -4059 -9001 -401 7729
1983 7729 6792 -4621 -9669 -1194 8104 6810 -3854 -9077 -1687 7295 7039 -3360 -8354 -2467 6632
1998 6632 6881 -2642 -9490 -3709 6012 7707 -2170 -8697 -4283 6441 7722 -430 -8560 -3789 6086
2013 6086 9678 -631 -9052 -6262 5102 9714 619 -9582 -5992 6734 9647 969 -9747 -5794
2027 -5794 5521 11597 728 -9995 -6800 5996 9938 1190 -9108 -6364 5524 11036 344
2040 344 -9235 -6914 4763 9532 1077 -9781 -7327 5109 9959 1829 -8321 -7541 4122 9764
2054 9764 1667 -8101 -8193 3609 9793 3384 -7695 -8181 3227 9739 2721 -7629 -8684 1633
2068 1633 8846 4399 -6305 -9229 1473 8820 6019 -6891 -10039 1159 9290 6155 -5569 -10083
2082 -10083 -617 10694 6820 -4743 -10615 -925 9671 6976 -5916 -10822 -1659 10368 8038
2095 8038 -5454 -10015 -1616 10157 7702 -5596 -9871 -1416 9527 6505 -5258 -11110 -1688 9624
2109 9624 8143 -3685 -10177 -3052 9180 8072 -3596 -10434 -3159 8480 7961 -3926 -10620 -3284
2123 -3284 7742 8050 -2929 -9340 -3593 7708 8359 -2691 -10227 -5940 7738 9427 -1069 -9411
2137 -9411 -5122 6410 8712 -329 -10454 -5805 6765 9541 352 -10082 -6537 5825 11639 985
2151 985 -9760 -7349 5818 11286 1545 -9795 -6916 6049 10204 1335 -9611 -7536 5570 10115
2165 10115 1507 -8982 -7934 5161 10959 1179 -10504 -7100 4630 10638 2949 -8497 -7731 4617
2179 4617 10241 3048 -8375 -7855 3461 10394 3309 -8006 -9070 2530 9912 4639 -7204 -8467
2193 -8467 1644 9332 4666 -7070 -9134 500 10007 5912 -5971 -8833 662 10291 5051 -5912
2207 -5912 -9131 -209 10331 5914 -4848 -10131 -677 9479 6168 -5280 -10800 -1740 10056 7121
2221 7121 -4752 -9706 -1220 9495 7204 -5405 -10592 -468 8915 7625 -4748 -10890 -1062 8533
2235 8533 8350 -5126 -10392 -2284 9148 8023 -3835 -9661 -3514 7958 8388 -2900 -9276 -3359
2249 -3359 7880 8098 -2101 -9465 -4481 6870 8126 -1584 -9801 -4531 6090 8185 152 -8758
2263 -8758 -5287 5373 8676 673 -9743 -5952 6203 9169 293 -8855 -6197 5747 8761 388
2277 388 -8962 -6518 4796 9263 1572 -8464 -6101 5046 9295 1119 -8805 -6346 4924 9427
2291 9427 2096 -9346 -7529 3080 8948 2690 -8544 -6405 4169 10251 2406 -8169 -7527 3209
2305 3209 8864 2204 -7173 -6853 3220 8557 3492 -5933 -7079 1808 7886 3289 -6044 -7082 1363
2320 1363 8853 3931 -5398 -7817 1807 8154 4326 -4727 -7856 -156 7833 5496 -4979 -8110 235
2335 235 7784 5379 -4661 -7684 -1213 7145 5529 -4492 -7259 -24 7876 5321 -3736 -8719 -1363
2350 -1363 7712 6290 -3900 -8912 -1542 7644 6706 -3654 -8239 -1985 7532 6040 -2469 -7543 -2392
2365 -2392 6789 5826 -2112 -7732 -2034 6446 5718 -3810 -8112 -2484 6637 6241 -1447 -6730 -3065 4696
2381 4696 6389 -1722 -8214 -3148 5114 6836 -1427 -6526 -3738 5250 6811 -517 -6294 -2912 3886
2396 3886 6178 1281 -6900 -4479 3013 7129 604 -5790 -4741 3465 7232 1060 -6578 -5321 3086
2411 3086 6893 2454 -6177 -6513 3109 6804 2214 -6065 -5730 2840 7251 2172 -5245 -6085 2646 7150
2427 7150 1481 -5226 -5238 2021 5993 1401 -5276 -5704 1365 6370 2755 -4426 -4810 688 6492 2321
2443 2321 -4834 -5200 913 5876 2530 -3673 -5050 264 5379 3038 -3755 -5807 158 5298 2671
2458 2671 -3859 -5854 -192 5096 3604 -3130 -5361 -1142 5781 3601 -2576 -5974 -306 5624 3470
2473 3470 -3493 -6094 -714 4996 4575 -1887 -4969 -1030 3995 3679 -2111 -6415 -1754 4482 3769 -2256
2489 -2256 -5022 -1613 3749 4465 -1628 -5096 -1698 3040 4714 -1741 -4759 -1022 4202 4573 -977
2504 -977 -4998 -1980 3506 5043 -315 -4877 -1887 2736 3912 566 -4607 -2142 4112 4543 -90
2519 -90 -4544 -2558 1899 4190 -434 -4006 -2969 2351 4466 234 -3465 -2104 1611 3562 584
2534 584 -4716 -3266 1659 3570 1330 -4321 -3795 1986 3711 1329 -3322 -3184 858 3809 845 -3730
2550 -3730 -3157 1871 3842 1046 -3107 -3517 1174 4544 1793 -3159 -3693 902 4231 906 -2584 -3277
2566 -3277 -468 3435 1577 -2686 -2142 79 3644 2284 -2614 -3816 49 3249 1518 -2274 -3152
2581 -3152 -482 2725 1183 -2581 -3591 -431 3011 2242 -1819 -3258 -618 2254 2292 -2068 -2614 -138
2597 -138 2483 2016 -1636 -2515 -590 2680 2404 284 -2665 -306 3118 1811 -1107 -2748 -1145 3009
2613 3009 2499 -1247 -2608 -1202 2721 1921 -604 -2921 -931 2408 2673 -896 -1776 -841 1367 1257
2629 1257 -901 -2020 -515 1990 2457 6 -2370 -822 1602 3071 625 -2415 -955 1814 1148
2644 1148 -583 -1918 -2289 1369 2400 -756 -1489 -1818 768 1833 802 -1393 -462 1181 2128 138
2660 138 -1054 -1410 1077 2020 94 -1213 -761 1173 2380 218 -1665 -1383 1470 2031 229 -1360
2676 -1360 -1414 197 2326 601 -1088 -883 560 1331 58 -1663 -1992 541 1715 1381 -767 -2000
2692 -2000 477 2350 1406 -1205 -1108 -528 856 706 -2146 -1491 5 1609 240 -1356 -1243 -357 1497
2709 1497 -64 -1378 -2482 297 1259 973 -1748 -1037 -57 487 367 -1236 -764 -220 1029 588 -1041
2726 -1041 -1787 -548 1638 1341 -752 -387 42 1181 934 -814 -379 -397 661 1250 46 -1133 -492
2743 -492 1078 323 236 -1491 -466 297 827 -720 -286 -1099 479 1414 376 -1220 -124 98 1397
2760 1397 107 -794 -288 676 670 -628 -1007 -57 613 788 24 -511 472 325 1256 84 -1133 -484 805
2779 805 868 33 -1500 -378 33 1313 102 -798 -1010 182 1169 638 -820 -917 -191 1288 94 -178
2797 -178 152 -268 434 -670 35 -477 612 211 270 -259 80 -61 -198 -362 -597 -943 491 910 -169
2816 -169 -553 -259 777 263 1225 -340 -825 -994 618 900 14 367 156 536 597 82 -160 -146 2 969
2836 969 47 -1203 -159 90 -145 -593 56 -195 286 758 -1107 -358 257 285 -813 680 286 490 964
2855 964 -316 -54 -385 860 36 296 -266 -6 29 230 -140 -50 -550 -287 227 -174 0 -751 -57 936
2875 936 464 216 52 119 63 590 -210 37 -51 -509 -54 -530 204 -807 665 720 -2 -284 -363 158 358
2896 358 69 -462 -220 -1 166 138 777 -91 -380 375 -338 413 215 -97 357 123 -815 14 1026 -106
2916 -106 -343 -248 575 203 23 -42 19 -25 108 -169 214 -428 299 461 213 18 -618 370 459 281 -19 13
2938 13 1010 205 -203 402 -257 342 415 675 -1139 -145 61 -30 1128 255 21 -305 -858 349 759 -9
2958 -9 186 496 816 859 117 -370 -828 149 729 -780 698 -295 -283 -243 -421 -375 271 262 -227 397 148 214
2980 214 -34 -211 91 -228 -367 1150 309 -137 100 -466 -235 -442 -373 402 549 617 -234 50 335 -843
3000 -843 -508 528 -95 -483 821 152 201 -457 288 -260 -324 -308 -71 -538 -184 63 127 224 -196 -270 -339 -691
3022 -691 173 -371 164 -108 1160 543 -585 -181 -271 -213 126 -36 271 512 665 271 -766 -911 395
3041 395 633 -84 -183 -39 337 382 -474 136 -146 339 -377 23 -456 -200 -376 201 640 -126 -453 -93 599
3062 599 -248 80 -735 447 -530 -198 -574 541 -585 -154 652 -509 -108 -515 187 292 -267 598 740
3081 740 -642 -26 146 -153 54 283 188 -199 -407 -618 -264 320 -553 -109 -585 90 685 762 311 -144
3101 -144 -765 -558 -533 150 235 1315 325 -654 -739 -613 -708 450 -170 288 422 -522 457 -339 496 524 -419
3122 -419 664 -408 -10 -181 555 -141 -49 -349 -297 -253 -720 -650 98 -488 -73 176 -508 616 141 -18
3142 -18 -521 -444 699 -362 -565 530 347 -522 474 593 -1026 -927 1161 157 318 302 -214 -29 -713
3161 -713 134 379 247 -692 -593 443 371 730 -414 453 120 155 574 -158 -170 -23 355 -208 -444 -295 -156
3182 -156 55 -181 -530 828 -132 -347 1343 -59 136 19 177 163 -26 -886 -168 -4 -257 -450 -493 235
3202 235 448 -322 -612 -227 -691 255 271 735 -577 -8 -501 63 -439 -45 -631 -486 -732 -481 110 114 -13
3223 -13 -9 191 -1260 -612 -217 -117 242 -1093 -339 154 932 -317 -213 195 -259 96 226 -545 -68 255
3243 255 690 345 -1470 273 578 -573 -722 -1141 -858 150 291 -927 509 314 184 -246 -505 -338
3261 -338 -199 -48 -1146 -228 -96 352 -293 -91 116 840 -548 29 347 515 29 -664 258 549 421
3280 421 1058 -185 -59 176 55 119 -169 129 -334 368 404 -806 -324 -774 61 -563 -1153 1124 39
3299 39 588 -232 -364 196 173 -602 -125 -509 158 -78 301 -421 -476 493 340 1 -892 502 293 -497 -376
3320 -376 -242 713 113 373 -619 -160 99 -661 42 -38 -117 342 -129 -584 -835 -241 453 355 -530 72 -84
3341 -84 1172 487 -487 682 -253 -99 -50 -100 1491 -353 -28 10 108 294 27 40 -378 -316 290 -147 -1045
3362 -1045 93 -191 605 72 -140 -203 601 767 326 -1029 -1111 885 -142 372 -277 211 54 304 -356
3381 -356 -596 43 99 -517 -130 -265 820 -589 52 -817 -904 97 523 2 -619 136 -58 -961 37 801
3401 801 399 -394 450 104 362 551 -573 -607 -171 591 -1 -348 275 97 187 -308 337 3 323 395 328
3422 328 -686 41 407 480 -629 -239 -296 -34 816 438 -167 381 -885 295 -542 -872 -268 -422 331
3441 331 -369 -514 668 458 -511 304 -243 491 -143 1064 549 -558 158 -920 -233 -711 755 -359
3459 -359 -43 25 -21 -184 96 -214 -724 -320 86 -276 3 -304 967 336 -653 337 199 766 553 -771
3479 -771 -789 -322 505 -764 -346 -164 35 838 923 -722 54 -775 503 -663 -143 -317 -79 -198 47
3498 47 -741 -811 504 -533 -328 1345 298 344 306 -526 423 113 277 412 385 260 -516 625 -684 -138
3518 -138 554 -84 832 -53 91 123 -349 121 -937 285 -26 266 -181 164 833 -199 -515 -222 211
3537 211 -161 185 562 935 364 92 73 -547 55 497 -48 648 -585 -8 812 537 -559 -158 761 -49
3557 -49 -577 -348 450 1208 -538 -99 -565 504 194 204 -240 -350 351 41 753 -194 -187 614 230 -62 -831
3578 -831 -621 187 -67 -520 -390 1135 180 278 -687 224 612 319 232 -374 -327 485 735 364 36 432 297
3599 297 -533 -131 -604 -116 254 -345 -950 -54 301 -59 222 -543 -31 886 -426 470 604 88 766 -860
3619 -860 -251 521 105 480 86 186 14 -352 612 327 -3 464 -51 105 -43 39 616 -783 -20 -246
3639 -246 -605 -90 359 -628 -274 -40 153 92 339 -413 -28 -205 -243 149 680 72 896 665 589 104 578
3660 578 -1424 540 -477 -70 277 157 187 -18 -289 484 403 270 830 -219 -596 -356 -252 -133 -383
3679 -383 -167 -639 718 1107 180 -4 -115 699 643 256 -491 124 487 503 -240 -392 -206 530 -87 435
3699 435 -251 299 19 146 35 -965 464 96 804 -803 1 348 933 -388 -805 790 -47 51 851
3718 851 28 -78 218 -126 -244 302 -82 -410 21 268 273 765 -584 -682 -446 541 399 152 -513 273 879
3739 879 -193 560 386 -269 517 81 84 435 -459 -427 -425 -399 -528 279 -350 -201 69 320 -675 -173 -594 -217
3761 -217 713 700 -848 -569 -115 625 -736 -274 -437 -229 331 905 -257 -474 205 822 344 -464 160
3780 160 667 -54 572 -141 -53 586 -134 -425 -200 -145 -537 682 522 889 -126 663 -282 877 467 -153
3800 -153 991 -383 559 1311 269 86 -255 -241 325 268 -60 -24 875 396 -325 -16 -735 236 797 -841
3820 -841 -533 -90 1407 77 -1662 -175 -428 605 340 -155 -310 110 604 359 -741 -1329 1245 -109
3838 -109 183 573 -393 -966 1001 821 -322 -675 872 791 393 51 -187 -745 -68 558 163 -351 -17
3857 -17 -389 -1023 -196 -959 854 -155 542 -339 53 -531 -803 1115 643 -56 -708 -5 407 443 -1075
3876 -1075 -457 547 429 379 -238 84 -666 750 109 -1034 -1162 -58 506 -88 -1152 -848 -104 1086
3894 1086 -279 -1099 -601 543 406 -197 -348 -132 434 443 -167 -436 -546 -174 -223 332 -1196 21 332
3913 332 1272 320 -134 -658 -82 703 382 -130 -732 -18 1025 442 -28 -116 292 291 126 105 -653 211 106
3934 106 975 316 -559 91 852 647 -550 -921 -49 252 240 -723 -1141 -454 297 753 -819 -1174 -405 809
3954 809 -176 151 -919 -139 177 269 -335 -1600 88 1467 895 -1182 -867 103 1195 328 -772 -706
3972 -706 -221 1007 469 -382 -74 406 164 210 -554 -236 128 634 605 -277 -15 355 80 242 -140 152
3992 152 -161 -106 956 866 17 47 899 491 32 -616 -1448 1092 1287 -741 -1016 -953 -493 1158 286 -661
4012 -661 19 349 482 393 -896 -1530 158 813 621 -1220 -613 1148 1003 -434 -845 -563 357 649 288
4031 288 -789 -90 85 870 -343 -823 -621 826 1337 166 -655 -932 1366 603 405 -1378 -251 683
4049 683 839 -185 -492 239 279 263 877 -162 -1137 446 802 964 -803 62 7 1047 98 -649 -943
4068 -943 161 1028 523 97 -562 -45 1774 60 -269 -1287 -984 1576 799 -224 -779 84 1350 1038
4086 1038 -383 -1547 -97 2577 651 -580 -1888 -12 1354 1088 -614 -794 -1017 1856 328 -580
4102 -580 -1339 -95 468 890 410 -891 99 622 1151 -298 -1561 -518 990 402 -1497 -690 -299 -56
4120 -56 642 778 -257 -1344 736 850 -247 -781 -734 666 1550 851 -751 -1247 398 1068 -112 -810
4138 -810 -970 -809 840 -417 -853 -1139 1102 1910 757 -1657 -1340 811 1003 -10 -1782 -1829 -279
4155 -279 1820 331 -558 -1807 -416 2021 604 -762 -349 1170 1490 -59 -952 -20 648 1387 -417
4172 -417 -745 -812 194 1079 458 -637 -728 191 1481 638 -891 -774 574 676 1208 -980 -159 604 1315
4191 1315 1219 -486 -1548 -643 1041 584 -291 -1274 -719 1009 1097 -751 -1455 -1097 1645 874 -620 -2305
4209 -2305 -206 1811 1279 -881 -1931 -472 1476 1761 146 -1478 -321 940 1116 -406 -1637 35
4225 35 1910 1619 7 -1411 -479 1440 1458 -1275 -1471 778 1512 1234 -730 -841 23 1640 1076 -10
4243 -10 -1336 305 1486 1085 -641 -957 -753 231 521 211 -242 -1575 600 901 -453 -333 -1779 275
4261 275 335 -590 -1609 -1285 524 1774 415 -495 -1391 1281 588 257 -62 -1150 316 1180 961 -1147
4279 -1147 -1566 873 1215 1854 -1437 -1219 832 877 230 -1225 -1133 742 1655 516 -965 -1519 359 1289
4297 1289 600 -1183 -862 471 1948 752 -1053 -1486 485 1343 312 -547 -459 618 825 1440 -308
4314 -308 -1054 -252 359 573 -745 -774 690 11 504 745 -847 -724 666 1818 -644 -519 -401 778
4332 778 803 -496 -352 8 1040 1389 -264 -1812 -88 703 1056 -261 -1442 182 248 1412 -518
4349 -518 -994 -978 1330 1293 -981 -812 -1 1646 921 -749 -1202 -173 908 2102 -105 -943 -601 1343
4367 1343 1515 -536 -1113 -740 1288 725 222 -1191 -258 966 850 -26 -928 -392 913 30 681 -652
4385 -652 16 400 1115 372 -962 -1104 -188 570 458 -1543 -2083 347 1398 103 100 -743 38 928 917
4404 917 -868 34 -16 1780 102 -987 -7 549 1922 -401 -1001 -1195 1447 1576 560 -405 -1247 1010
4422 1010 1596 1182 -945 -1355 670 1807 239 -720 -646 710 829 94 -985 -721 177 1102 884 -1510
4440 -1510 -958 -183 135 297 -471 -882 -561 586 530 -1228 -2072 -371 193 610 309 -1104 440 913
4458 913 658 -64 -1044 24 1098 1514 -697 -2160 -99 932 1691 -478 -1083 -36 1917 1093 -828
4475 -828 -1509 -351 911 22 -146 -809 -243 1160 334 -43 -617 256 901 77 -157 -1057 -496 318 648
4494 648 170 -1603 -1024 1189 978 -309 -1049 -300 471 586 -39 -1166 -612 249 -276 17 -664 344
4512 344 197 449 -46 -688 -276 -809 654 -330 -498 -382 382 888 -43 -393 -1050 516 1169 843 -67
4531 -67 -672 62 865 348 -505 -373 87 507 284 534 -811 782 827 -92 -1057 -1285 551 734 482 -1094
4551 -1094 -352 147 1608 654 -604 -673 -514 1055 549 -1285 -791 422 880 350 -692 -955 177 632
4569 632 -552 212 -717 121 738 -5 -150 -736 -89 871 509 -347 -102 -872 182 443 -1038 -661 -486
4588 -486 10 365 -47 -16 -1196 542 480 82 -234 141 468 482 197 -940 -309 1160 1435 -91 -1160
4607 -1160 -7 483 1392 476 -796 947 206 582 1229 -1229 -35 1443 1275 100 -1494 -702 366
4624 366 188 -689 -905 -442 1146 -50 153 -5 -1015 -285 1030 1003 -29 -24 441 203 32 -124 -30 -9
4644 -9 796 524 720 382 -280 -555 3 -371 -327 919 850 802 -355 -459 -578 437 353 425 -717 456 537
4665 537 309 -177 166 -388 567 313 -749 -720 -830 1271 -412 -382 -794 -340 1576 923 -128 252 -186
4684 -186 329 -347 -474 -176 189 1539 42 -670 -309 -492 393 321 -1450 264 -290 -499 -241 -366 -185
4703 -185 -766 755 792 -1471 -242 -528 834 327 -319 -128 -557 677 -48 303 -308 434 -1135 -378
4721 -378 73 39 315 682 1389 917 -355 197 68 636 936 -479 -315 333 227 -99 -460 200 804 388
4741 388 0 -911 0 963 483 -340 -415 -610 617 -86 -378 -83 264 243 699 -419 -390 304 -1010 347
4761 347 -973 -112 565 -513 -47 -352 479 82 504 -860 -939 -794 136 -88 321 -308 370 -13 507
4780 507 1197 217 -256 -688 -64 484 -15 -1172 -533 -272 494 -664 95 -600 845 482 465 559 -54 -115
4800 -115 606 188 -1120 -163 -1086 550 -98 -117 179 -350 786 382 -167 -393 307 652 258 470 -494
4819 -494 226 -76 -495 -49 172 -705 -229 331 -9 -198 -574 734 103 -614 -532 -151 114 963 -529 62
4839 62 -680 -254 -500 -59 23 253 250 494 64 202 469 349 216 485 222 65 430 -506 -674 265 201 528
4861 528 390 259 -283 -28 -118 370 666 -100 -77 702 876 496 -1362 -591 391 -141 574 -1091 -277 992
4881 992 425 50 -319 -433 24 -749 -337 -371 103 244 -411 -1197 -297 25 -303 -179 -655 164 237 943 -287
4902 -287 264 -396 272 -1127 133 -297 -576 200 100 -302 -304 494 315 847 -205 89 392 59 -236 480
4922 480 531 379 -307 111 -132 455 -471 -981 346 -102 -401 -393 153 26 143 930 -401 47 -194 551
4942 551 -408 -312 -853 -589 360 27 -790 590 246 -46 -583 -1053 226 -482 -109 -860 -219 -628 607
4961 607 -259 183 -76 40 -350 -234 -749 583 597 339 -622 -120 627 683 -682 -91 415 1186 25 -564
4981 -564 -614 781 673 286 -234 40 -333 -27 -353 238 -234 -220 652 -365 -141 100 297 364 159 -594
5001 -594 -635 67 2 -52 -477 -196 -297 503 -1632 173 719 186 -649 345 280 -349 -167 -540 -827 -166 723
5022 723 -610 -623 -139 199 309 1148 532 643 -431 -661 477 163 942 398 88 -912 -75 728 1071
5041 1071 -1273 226 -219 458 254 -435 301 336 -12 -392 237 -27 542 456 -120 136 -617 -251 99 -867
5061 -867 412 -180 -437 -194 298 -126 -183 446 399 -1239 -266 -235 -691 -546 -460 -452 -208 -837 111 -151 -1129
5082 -1129 535 -634 -609 49 -206 433 -238 27 360 776 863 -341 -131 -628 824 -393 579 -308 606
5101 606 -232 85 261 521 -154 -350 341 -38 617 -436 -428 -389 -825 -538 -1019 -354 830 40 312 -149
5121 -149 -593 -145 -155 79 -410 409 -143 149 -121 -93 98 625 -444 -134 -268 420 419 -54 179 303 -116
5142 -116 -690 136 -108 374 9 -616 -93 -630 52 -405 -50 -599 73 135 302 553 -17 -282 -789 457
5162 457 181 -234 440 -4 303 -839 -12 -439 243 33 -248 170 365 -11 574 -103 217 -22 -321 559
5182 559 426 -334 530 626 574 -255 1157 -129 -1323 -157 310 -402 -521 -66 -595 351 81 -197 -714
5201 -714 -564 442 -349 817 -277 -157 77 -93 -469 3 472 -104 48 -227 -602 113 149 233 -189 163
5221 163 538 26 -289 405 296 311 308 9 -594 -253 -146 354 -940 161 235 331 -262 -451 -265 333 -37
5242 -37 -1028 -420 -641 54 -17 -651 -1192 54 39 374 589 -212 105 -107 -216 241 -364 799 -11 -206
5262 -206 -315 -431 -415 -867 489 208 264 297 418 -458 -841 -112 -955 -243 -36 762 -385 753 -23 -131
5282 -131 296 1109 733 -7 -153 46 -30 -351 394 1196 113 -431 -559 720 304 -557 -750 -195 -429 947
5302 947 -228 17 65 -861 557 457 947 -364 505 349 809 -510 380 286 801 -523 506 -503
5320 -503 280 50 -764 614 -98 103 -215 -639 -164 -320 101 -182 -507 -288 -138 -421 -553 -777 43 528
5340 528 -557 96 323 94 342 -643 557 -136 1067 -9 -1 1264 555 -89 8 -132 -816 -487 640
5359 640 -78 -737 170 600 -720 471 -48 -104 63 -860 101 -937 -363 -673 281 369 159 -142 960
5378 960 639 665 -374 -365 230 -92 -475 562 191 121 -544 -260 36 -322 41 12 -598 -671 -440 -588 -705
5399 -705 -280 34 -1040 65 -303 -55 272 775 -860 544 355 -834 -419 718 -537 552 -83
5416 -83 -839 -222 208 36 -126 -503 249 -282 1128 815 -133 1063 228 126 185 176 63 -95 -505 -827 -68
5437 -68 460 -631 233 -1 791 -1111 -756 -196 -113 339 6 -306 -1251 750 -413 629 301 -642 100
5456 100 -431 262 333 -567 -68 352 -120 -138 628 625 316 624 -719 263 -629 -186 72 479 -297 434 -380
5477 -380 -330 -420 546 -1015 -348 53 -526 912 657 -14 185 346 -291 -876 -130 -20 -338 182 252 -224
5497 -224 -226 514 8 -153 116 171 -121 682 -353 498 141 549 -24 42 370 69 -335 -487 174 601 -510
5518 -510 212 294 -13 -246 -133 -292 -596 -241 312 776 358 -87 727 -369 820 160 5 -453 687
5537 687 1256 -173 111 377 6 332 3 87 1089 -45 522 316 -119 20 -3 101 -412 -242 -553 -1009
5557 -1009 378 250 -209 -49 -760 -515 154 -175 148 358 124 -331 -219 -485 815 719 269 1091 -324
5576 -324 526 127 -104 32 -177 433 -83 370 438 -39 129 -12 -100 540 242 18 271 417 -336 203 -276
5597 -276 43 -95 589 462 436 131 344 -396 735 929 409 679 -332 36 194 140 955 672 -120 625
5617 625 344 -1 -139 186 222 13 264 123 855 -891 -30 -369 456 -34 264 152 -364 139 -112 278
5637 278 -266 -631 110 146 -345 -146 -1097 644 179 -259 861 36 870 268 683 67 -341 426 -430 -221
5657 -221 628 -1492 -693 -30 23 214 1039 -54 -6 208 484 -111 102 339 433 -85 -1229 3 -161 -431
5677 -431 -479 -907 281 495 294 -608 135 772 517 24 -787 -330 38 382 6 -1197 -451 -44 167 570
5697 570 158 -224 -296 -498 -429 300 175 38 695 -628 -659 -247 -217 -5 593 244 -772 1175 -374 275
5717 275 -633 -216 -205 -845 -411 -472 -213 1004 12 -316 283 -959 215 -190 -366 362 452 36 -469 -422
5737 -422 114 289 95 140 -27 127 -250 -590 -292 170 838 -197 443 77 157 385 -311 -211 -253 499 758
5758 758 -537 -1035 190 -460 256 -391 772 -243 -632 11 11 -766 -101 151 -295 841 -85 -467 -301
5777 -301 -137 -40 -934 -466 -1077 -559 230 517 -78 -442 643 487 -263 352 37 -152 465 -668 -686 254
5797 254 534 -347 27 678 -87 -554 468 -490 795 219 -575 316 -418 -391 348 194 361 -263 46 92
5817 92 93 -43 81 -178 106 -56 -400 1035 -1 161 -604 -131 214 593 431 -426 -185 339 -849 442
5837 442 -773 211 -97 58 -358 -501 57 -27 607 132 112 168 -121 328 174 -225 174 88 397 -224 116
5858 116 -695 -187 -652 233 -468 237 -889 81 510 807 -275 816 199 -703 313 941 481 184 406
5877 406 -301 411 514 -137 33 650 -500 -818 -44 -268 -384 -930 -407 134 -393 -650 -147 506 1131 96
5897 96 315 -582 303 -183 -5 713 150 3 -215 -299 224 -29 -25 491 326 -17 -198 167 436 -294 -890
5918 -890 92 499 -319 -14 -717 -722 -267 254 317 -788 531 954 493 -174 -945 481 -264 153 -467 511
5938 511 520 -220 -201 -244 178 -303 200 -351 313 546 248 126 726 196 689 30 171 156 -24 313 683 -799
5960 -799 -256 -369 632 -401 -158 227 548 65 -505 -278 -117 -43 -428 -110 58 575 -34 -272 -60 -470
5980 -470 -274 342 578 -356 354 254 25 -200 -110 177 264 428 -39 345 -406 756 -150 406 184 632
6000 632 -671 -657 -596 -674 -167 331 12 93 176 71 204 -64 -374 377 962 601 295 -431 323 -122 309
6021 309 -76 -372 -67 -410 309 184 580 174 -994 389 330 -229 -144 -60 856 245 233 -151 172 -280 231
6042 231 -346 -1147 -554 1749 883 -47 6 541 -469 -223 -493 367 104 -127 354 642 -795 160 250 447
6062 447 -53 -640 -581 324 536 -199 13 -883 -78 336 358 2 679 435 -741 805 -155 68 -237 116
6082 116 -220 -33 -410 -463 -623 -313 21 -154 -516 -123 543 -258 248 -273 124 -258 -337 -268 323 872 665
6103 665 -240 -1377 580 263 271 532 -1131 407 916 255 -461 -215 466 139 -111 131 -236 -338 545
6122 545 147 -1378 892 -540 59 -709 -1185 -412 384 -812 -591 731 -128 -90 81 -40 -169 394 -271
6141 -271 512 179 40 312 432 -169 -170 27 544 667 -587 211 932 -758 285 242 -243 -258 377 -85
6161 -85 207 122 -6 -109 -132 195 47 91 -426 482 -276 -38 -4 -1285 -535 405 255 -536 150 351 -107
6182 -107 -641 -186 -209 381 -603 21 319 -117 -586 261 106 -365 390 240 -96 -1058 2 -31 -176 306
6202 306 293 -270 177 790 -407 113 339 299 272 -486 -331 -261 54 489 -130 -638 428 -61 257 226 559
6223 559 355 -611 142 893 -187 -105 28 759 -178 -585 -678 -123 -640 473 -720 -53 -984 -177 348 614
6243 614 237 -1170 3 -193 -219 192 -734 -301 134 33 -1067 -672 282 211 -780 -233 -463 227 -43 -179
6263 -179 612 -450 111 1045 331 -322 -124 -298 1359 85 311 38 -124 -240 -350 355 -346 -473 480
6282 480 -140 269 -137 365 -984 -386 137 390 -39 -92 332 -86 -581 -257 -23 794 -448 -232 89 -82
6302 -82 279 -42 133 -434 568 848 -75 275 -750 569 -346 228 -186 -728 -390 121 58 -1 -290 56
6322 56 103 -201 -50 772 492 177 850 541 -366 63 85 -965 -154 -1242 -274 -487 -326 -339 202 -640 121
6343 121 414 -148 -90 -188 458 -115 41 -91 59 208 -114 -388 -618 -410 325 -236 -687 -92 51 -937 -276
6364 -276 1009 -164 210 499 333 -284 -203 -141 -889 1210 48 349 -222 -270 764 -67 -527 420 461 520
6384 520 491 43 -802 35 343 -185 -87 -562 247 456 589 -747 162 151 263 38 534 471 1308 34 286
6405 286 -336 -778 69 330 -413 -901 456 -396 421 -211 -657 -477 -832 153 307 577 -136 -83 -788 -856
6425 -856 -145 -300 546 -390 901 -491 -697 -2 413 -430 80 -572 371 6 61 -287 -568 -23 624 567
6445 567 -124 291 612 58 1159 7 -575 624 -126 -770 -129 -626 469 -558 37 -854 -230 279
6463 279 407 85 -12 449 103 -163 -383 -169 -1184 151 185 -302 565 -285 -379 87 -413 254 -99 -362
6483 -362 -58 614 -241 353 -45 725 -330 73 -116 -754 -162 158 -246 405 -232 542 -535 -36 -581
6502 -581 -79 354 -41 -75 -523 -534 51 -449 739 42 184 -78 -991 -571 71 -248 -91 873 440 594
6522 594 -199 -203 588 713 96 -22 -320 -491 297 587 155 -436 412 -6 653 -145 -24 -884 678 -228
6542 -228 -488 -260 -360 -100 -726 179 -234 691 118 -155 -463 -570 82 602 609 -314 -795 108 -504 -706 -474
6563 -474 -20 148 169 281 124 -787 -687 443 -178 -935 -348 354 -312 -10 205 603 548 107 972 -925
6583 -925 231 -811 -86 175 50 -495 352 410 600 659 -638 -1554 -576 -1 369 26 30 -76 424 -348
6603 -348 -629 854 397 543 -64 44 705 188 -717 -446 110 50 -737 -327 254 -651 220 527 911 549
6623 549 -590 57 -378 -19 235 86 -349 581 379 -168 -1044 582 -665 -587 643 107 -478 -572 -421
6642 -421 228 -481 248 -42 103 185 -985 643 476 639 162 -129 685 -732 -326 -996 -280 388 -561
6661 -561 1110 82 -1039 3 -750 -576 16 -109 -369 -362 423 -107 235 -477 -326 -17 73 94 -226 141
6681 141 157 -7 114 -185 -55 -234 379 -608 485 -87 879 295 -214 -737 -375 181 993 56 -743 596
6701 596 117 303 803 -1 387 -647 -434 -122 -318 -326 955 -493 -38 13 -349 -353 -479 688 108 676
6721 676 490 153 -282 -186 -107 936 -75 1038 -136 161 652 -676 301 -667 197 986 249 338 277 545
6741 545 -713 1131 -508 -638 -411 440 414 72 533 644 -122 374 -349 -710 91 -911 -200 13 -81
6760 -81 -288 993 -272 231 62 90 1562 248 -93 -954 350 904 329 -68 513 252 -85 978 -315
6779 -315 -351 281 425 309 -760 -79 -130 96 -944 53 762 54 -8 190 -178 348 828 591 93 588
6799 588 317 -447 665 -742 416 -1161 446 -151 845 236 554 -142 -358 547 -134 472 -209 130
6817 130 726 -234 -326 -272 -622 970 148 119 -98 285 -165 416 629 -133 668 190 128 -522 -253 60 -255
6838 -255 -105 -1073 642 -544 -218 -503 -577 209 519 -920 549 -681 -708 436 334 -468 680 -496
6856 -496 -320 201 365 -513 -132 37 -606 470 13 129 188 -21 -672 879 257 -788 39 -173 -197 -510
6876 -510 -316 177 148 709 -747 -219 496 852 -614 885 -225 446 -45 -223 -192 1184 365 265 395
6895 395 290 -870 -539 157 -264 35 -179 -265 80 -746 778 467 367 -683 -1006 166 -197 367 -234
6914 -234 370 -28 343 -442 442 -831 45 58 1161 455 -120 -549 -321 95 130 844 251 -377 -59 173
6934 173 516 -484 -700 -378 -251 -497 -201 129 -187 87 207 263 354 556 -192 -169 -183 169 737 23 -654
6955 -654 -115 -322 337 134 239 659 685 -481 470 178 510 -294 -103 -145 -36 -60 -251 -434 -68 -913 1039
6976 1039 -128 -138 -42 807 866 1 177 858 -513 -162 -64 30 -523 -406 -345 -1000 -114 16 377 346 -180
6997 -180 528 738 -74 281 -542 -751 654 -533 -244 294 -196 119 462 -324 748 851 -360 -74 -627
7016 -627 255 -6 315 -810 -284 210 408 755 448 -179 -719 -214 -123 -288 565 -1285 -64 160 -818
7035 -818 -241 -130 19 -656 401 351 -1340 -358 347 451 -11 440 -106 341 678 85 -42 130 -738 -340
7055 -340 1067 -67 -292 -524 288 -747 281 -970 -72 -151 -386 -533 -368 540 -401 137 318 1082 583
7074 583 277 -194 3 680 -432 -256 -74 -195 -196 -300 -139 46 63 -326 -668 -46 -264 -933 290 30
7094 30 441 -92 -574 -286 15 195 962 -38 -179 -83 806 -273 211 22 -469 -494 409 -380 -289 571 684
7115 684 31 587 484 -762 -112 129 43 169 -804 155 -442 -757 548 -517 866 36 115 -287 -685
7134 -685 -262 -822 354 -12 -828 -385 -647 360 -486 -1055 -1067 -179 -33 -624 -300 -429 -447 527 467 -50
7154 -50 720 -1024 286 -467 1127 -268 186 -286 461 432 -379 -291 -570 731 -25 -94 -37 -1112 -251 830
7174 830 173 653 -36 903 -652 -43 474 74 24 -165 -77 3 -49 -13 -758 -630 -458 -367 361 428 -18 45
7196 45 -656 265 -453 540 -203 -54 -401 1376 -303 811 -409 -302 -854 512 521 -577 156 -28 430
7215 430 -8 -668 -250 546 -63 -136 505 -328 -451 -54 1 425 -66 51 240 -266 -498 -429 -1014 -169 -47
7236 -47 -78 76 203 306 -781 159 -585 534 1307 -190 -257 405 217 1094 213 220 -565 -901 -128 -396 -35
7257 -35 621 -349 -435 283 265 -164 -102 575 519 312 90 -310 -263 267 187 53 65 -167 41 -299 -130 -368 55
7280 55 584 458 -574 -171 -134 236 87 327 65 61 396 -446 191 321 389 112 -107 -546 347 135 341
7301 341 225 -491 963 -43 578 305 -601 -255 547 -623 -584 91 526 516 201 201 73 97 -19 -193 286
7322 286 -127 -448 -87 -49 456 -512 -84 -189 -1050 -88 988 -341 229 597 -433 773 984 892 475
7341 475 910 573 -283 -409 358 191 -553 -107 -65 -96 60 -342 69 547 60 -204 690 71 354 -1411
7361 -1411 -261 -550 131 -639 -114 31 -554 -441 -304 -59 44 252 -32 403 -338 -449 -228 751 506
7380 506 251 303 -447 599 -142 225 94 447 16 282 -99 325 506 -665 1076 -14 -550 816 209
7399 209 -339 -666 -718 970 215 471 -249 523 944 -26 177 502 -660 45 -391 -670 -291 -675 -157 -406
7419 -406 -200 249 845 -18 41 362 -682 -708 734 159 -828 519 225 -150 -184 46 -153 -713 41 -321
7439 -321 1 -338 206 419 217 311 -407 112 -426 134 -551 212 374 196 -16 256 54 -222 -102 -750
7459 -750 -201 269 935 -4 109 340 -30 -404 67 -381 -347 145 253 -415 633 346 83 -443 -31 -154
7479 -154 -555 766 -214 -364 -643 316 -810 661 219 -322 -63 -323 558 77 13 220 -467 -727 57
7498 57 -708 14 57 109 -274 106 -512 -582 -266 -387 -64 1219 -522 -625 -193 577 -560 -227 618 -153
7518 -153 205 -616 881 -123 -669 -735 -313 456 -484 486 207 -749 347 169 631 37 -789 -41 -265
7537 -265 -356 -672 17 294 289 -309 337 184 350 767 -741 -274 -502 436 -80 -411 -614 68 -437 -159 -40
7558 -40 -710 339 -485 583 703 -16 160 -157 -609 326 -204 103 -184 266 -102 257 350 -42 1 -916
7578 -916 -8 272 187 1102 110 68 -1235 -308 381 1663 430 -626 -101 633 -418 -234 23 -16 223
7597 223 101 114 -758 -198 -20 653 67 169 -79 -315 -594 364 142 299 -190 -75 463 871 469 -79
7617 -79 -870 -1012 227 -259 473 -147 -621 332 66 -164 155 -201 109 237 -593 132 -594 669 -23 191
7637 191 -55 -124 563 -513 -728 -129 -704 581 -8 -213 933 -694 -247 -94 26 165 320 226 -142
7656 -142 568 -102 -769 -718 147 -443 412 401 659 341 530 -140 80 302 -64 -230 -574 787 137 -82
7676 -82 -522 -389 710 357 100 -594 -143 780 30 -570 -171 -171 -675 6 -13 -230 -463 -902 -452 -232 -285
7697 -285 940 -233 101 -625 21 265 303 -341 117 606 47 -388 3 -365 -750 363 -556 204 -65
7716 -65 -480 34 -46 793 24 -611 -117 192 582 -721 -459 601 504 -112 -451 468 395 145 -689 -3 -93
7737 -93 106 -755 290 40 -546 -217 1069 -254 -958 436 -689 -58 -82 -451 -890 567 -135 119 517
7756 517 122 30 -1581 548 278 -119 1075 18 99 605 1090 -209 898 -280 -428 -545 760 394
7774 394 399 -187 -453 -204 -367 13 -184 -553 515 114 413 -328 -331 496 -439 986 1098 -120 -971 157
7794 157 -118 -833 666 -72 -792 158 363 -203 -417 32 572 -563 -249 -668 35 901 -34 -176 -634
7813 -634 -246 -12 -315 -425 255 -681 -108 179 -792 431 289 -298 371 191 121 -210 -33 -450 -827 1041
7833 1041 34 -196 520 903 -92 -537 54 -556 -340 -924 -1114 -335 217 140 -198 172 227 -767 98 -614
7853 -614 -699 -33 -359 284 350 647 -1189 217 389 1216 251 -789 55 -567 215 -44 182 819 -638
7872 -638 -551 331 414 -671 -176 191 -85 -634 145 944 -103 392 484 315 -616 265 -586 -144 -64 828 414
7893 414 469 31 -278 -103 773 -91 103 150 -75 -494 -647 365 318 195 -558 -477 364 84 410 -354 -228
7914 -228 -402 -86 402 668 -230 -230 699 -614 571 156 -535 -790 404 -725 -211 339 189 383 -179
7933 -179 405 61 -171 250 101 263 -566 -329 481 43 -69 236 -676 -257 958 -62 33 -43 -45 -497 -130
7954 -130 454 98 -82 315 -3 -70 -453 -703 122 -564 -40 916 17 -19 -481 421 93 449 118 -298 -57
7975 -57 -579 -1111 -13 -368 -247 -177 373 -810 -783 69 -737 -636 -175 -692 -1070 323 -1010 417 -451
7994 -451 659 30 -87 -191 157 -44 -395 -256 1 324 131 188 147 247 -217 -435 -97 -36 -402 -565 195
8015 195 9 -195 -87 413 209 18 288 715 227 -280 355 298 -368 -126 678 521 463 23 402 -261 -103
8036 -103 186 -588 -689 355 233 202 -526 -137 -369 99 -89 320 814 303 -310 -10 377 -300 -540 -355
8056 -355 -727 -370 74 332 14 -146 -161 -732 -264 -165 -13 273 -580 -778 318 347 -225 -603 717 -521
8076 -521 61 143 25 60 -101 138 166 -159 -452 818 156 -17 429 -444 143 -1353 -746 169 -608 332
8096 332 284 320 -326 -584 710 -686 65 306 -526 -771 -808 -588 788 -489 -708 -54 -431 -497 -241 -387
8116 -387 -247 -303 216 -32 -415 1100 -168 -415 -13 196 -556 164 -286 260 289 -801 692 266 -493
8135 -493 275 -889 150 -190 109 -662 -504 -770 -535 -104 -507 382 -444 149 -416 27 169 -1020 323
8154 323 411 304 213 -422 -73 451 -596 -189 787 -373 -101 351 167 539 -110 645 445 718 454 200
8174 200 -96 340 -520 -634 68 114 46 -30 99 467 -200 -397 -180 -257 -137 -337 397
8191C97
##END NTUPLES=NMR FID
##END=
