##TITLE=1H_SA_hitpyr
 DMSO, 8 sc, 
 8.2.2019
##JCAMPDX= 6.0         $$ Bruker NMR JCAMP-DX V2.0
##DATA TYPE= NMR FID
##DATA CLASS= NTUPLES
##ORIGIN= UXNMR, Bruker Analytische Messtechnik GmbH
##OWNER= root
$$ XWIN-NMR		Version 3.5
$$ Fri Feb  8 17:36:10 2019 Russian Standard Time (UT+4h)  she@DPX200
##.OBSERVE FREQUENCY= 200.1313
##.OBSERVE NUCLEUS= ^1H
##.DELAY= (6, 6)
##.ACQUISITION MODE= SIMULTANEOUS
##.ACQUISITION SCHEME= undefined
##.AVERAGES= 8
##.DIGITISER RES= 18
##SPECTROMETER/DATA SYSTEM= spect
##.PULSE SEQUENCE= zg30
##.SOLVENT NAME= CDCl3
##.SHIFT REFERENCE= (INTERNAL, CDCl3, 0, 15.7039)
##AUDIT TRAIL= $$ (NUMBER, WHEN, WHO, WHERE, WHAT)
$$ ##TITLE= Audit trail, XWIN-NMR		Version 3.5
$$ ##JCAMPDX= 5.01
$$ ##ORIGIN= Bruker BioSpin GmbH
$$ ##OWNER= she
$$ F:/spectra/data/she/nmr/H-F/1/audita.txt
$$ ##AUDIT TRAIL=  $$ (NUMBER, WHEN, WHO, WHERE, WHAT)
(   1,<2019-02-08 17:35:10.75 +0400>,<she>,<DPX200>,
      <created by zg, POWCHK disabled, PULCHK disabled
       configuration hash MD5:
       00 E9 B6 7A A2 85 ED C7 34 08 36 98 17 FE 4E 26
       data hash MD5: 16K
       80 43 14 50 D6 BA 4D B8 F5 2D 3B 3D 4D 24 53 95>)
$$ ##END=
$$ 
$$ hash MD5
$$ 3C 46 69 5E 78 E8 4D BD F1 78 C3 A8 C6 AD 7B FF
##$RELAX= 
##$RELAX= 
##$RELAX= 
##$RELAX= 
##$RELAX= 
##$RELAX= 
$$ Bruker specific parameters
$$ --------------------------
##$DU= <F:/spectra>
##$EXPNO= 1
##$NAME= <H-F>
##$PROCNO= 1
##$TYPE= <nmr>
##$USER= <she>
##$AMP= (0..31)
100 100 100 100 100 100 100 100 100 100 100 100 100 100 100 100 100 100 
100 100 100 100 100 100 100 100 100 100 100 100 100 100 
##$AQSEQ= 0
##$AQ_mod= 1
##$AUNM= <au_zg>
##$AUTOPOS= <>
##$BF1= 200.13
##$BF2= 200.13
##$BF3= 200.13
##$BF4= 200.13
##$BF5= 200.13
##$BF6= 200.13
##$BF7= 200.13
##$BF8= 200.13
##$BYTORDA= 1
##$CFDGTYP= 0
##$CFRGTYP= 5
##$CHEMSTR= <none>
##$CNST= (0..31)
1 1 145 1 1 1 1 1 1 1 1 1 1 1 1 1 1 1 1 1 1 1 1 1 1 1 1 1 1 1 1 1 
##$CPDPRG= <>
##$CPDPRG1= <>
##$CPDPRG2= <>
##$CPDPRG3= <>
##$CPDPRG4= <mlev>
##$CPDPRG5= <mlev>
##$CPDPRG6= <mlev>
##$CPDPRG7= <mlev>
##$CPDPRG8= <mlev>
##$CPDPRGB= <>
##$CPDPRGT= <>
##$D= (0..31)
0 1.2 0 0 0 0 0 0 0 0 0 0.03 0 0 0 0 0 0 0 0 0 0 0 0 0 0 0 0 0 0 0 0 
##$DATE= 1549632910
##$DBL= (0..7)
120 120 120 120 120 120 120 120 
##$DBP= (0..7)
150 150 150 150 150 150 150 150 
##$DBP07= 0
##$DBPNAM0= <>
##$DBPNAM1= <>
##$DBPNAM2= <>
##$DBPNAM3= <>
##$DBPNAM4= <>
##$DBPNAM5= <>
##$DBPNAM6= <>
##$DBPNAM7= <>
##$DBPOAL= (0..7)
0.5 0.5 0.5 0.5 0.5 0.5 0.5 0.5 
##$DBPOFFS= (0..7)
0 0 0 0 0 0 0 0 
##$DE= 6
##$DECBNUC= <off>
##$DECIM= 32
##$DECNUC= <off>
##$DECSTAT= 4
##$DIGMOD= 1
##$DIGTYP= 9
##$DL= (0..7)
0 120 120 120 120 120 120 120 
##$DP= (0..7)
150 150 150 150 150 150 150 150 
##$DP07= 0
##$DPNAME0= <>
##$DPNAME1= <>
##$DPNAME2= <>
##$DPNAME3= <>
##$DPNAME4= <>
##$DPNAME5= <>
##$DPNAME6= <>
##$DPNAME7= <>
##$DPOAL= (0..7)
0.5 0.5 0.5 0.5 0.5 0.5 0.5 0.5 
##$DPOFFS= (0..7)
0 0 0 0 0 0 0 0 
##$DQDMODE= 0
##$DR= 18
##$DS= 0
##$DSLIST= <SSSSSSSSSSSSSSS>
##$DSPFIRM= 0
$$ [...]
##$SUBNAM2= <"">
##$SUBNAM3= <"">
##$SUBNAM4= <"">
##$SUBNAM5= <"">
##$SUBNAM6= <"">
##$SUBNAM7= <"">
##$SUBNAM8= <"">
##$SUBNAM9= <"">
##$SW= 20.0189088683792
##$SWIBOX= (0..15)
0 0 2 0 0 0 0 0 0 0 0 0 0 0 0 0 
##$SW_h= 4006.41025641026
##$TD= 16384
##$TD0= 1
##$TE= 0
##$TE2= 300
##$TE3= 300
##$TEG= 300
##$TL= (0..7)
0 120 120 120 120 120 120 120 
##$TP= (0..7)
150 150 150 150 150 150 150 150 
##$TP07= 0
##$TPNAME0= <>
##$TPNAME1= <>
##$TPNAME2= <>
##$TPNAME3= <>
##$TPNAME4= <>
##$TPNAME5= <>
##$TPNAME6= <>
##$TPNAME7= <>
##$TPOAL= (0..7)
0.5 0.5 0.5 0.5 0.5 0.5 0.5 0.5 
##$TPOFFS= (0..7)
0 0 0 0 0 0 0 0 
##$TUNHIN= 0
##$TUNHOUT= 0
##$TUNXOUT= 0
##$USERA1= <user>
##$USERA2= <user>
##$USERA3= <user>
##$USERA4= <user>
##$USERA5= <user>
##$V9= 5
##$VALIST= <valist>
##$VCLIST= <CCCCCCCCCCCCCCC>
##$VD= 0
##$VDLIST= <DDDDDDDDDDDDDDD>
##$VPLIST= <PPPPPPPPPPPPPPP>
##$VTLIST= <TTTTTTTTTTTTTTT>
##$WBST= 1024
##$WBSW= 4
##$XGAIN= (0..3)
0 0 0 0 
##$XL= 0
##$YL= 0
##$YMAX_a= 93889
##$YMIN_a= -253882
##$ZGOPTNS= <>
##$ZL1= 120
##$ZL2= 120
##$ZL3= 120
##$ZL4= 120
##$ABSF1= 10
##$ABSF2= 0
##$ABSG= 5
##$ABSL= 3
##$ALPHA= 0
##$AQORDER= 0
##$ASSFAC= 0
##$ASSFACI= 0
##$ASSFACX= 0
##$ASSWID= 0
##$AUNMP= <proc_1d>
##$AZFE= 0.1
##$AZFW= 0.1
##$BCFW= 1
##$BC_mod= 2
##$BYTORDP= 1
##$COROFFS= 0
##$CY= 11.3945322036743
##$DATMOD= 1
##$DC= 2
##$DFILT= <>
##$DTYPP= 0
##$F1P= 18.9103706918063
##$F2P= -1.10871071338519
##$FCOR= 0.5
##$FTSIZE= 0
##$FT_mod= 4
##$GAMMA= 1
##$GB= 0.15
##$INTBC= 1
##$INTSCL= 1
##$ISEN= 128
##$LB= 0.24
##$LEV0= 0
##$LPBIN= 0
##$MAXI= 10000
##$MC2= 0
##$MEAN= 0
##$ME_mod= 0
##$MI= 1.114404
##$NCOEF= 0
##$NC_proc= 0
##$NLEV= 6
##$NOISF1= 3.799351
##$NOISF2= 2.8
##$NSP= 1
##$NTH_PI= 0
##$NZP= 0
##$OFFSET= 15.70392
##$PC= 1
##$PHC0= -8681.649
##$PHC1= 10.60018
##$PH_mod= 1
##$PKNL= yes
##$PPARMOD= 0
##$PSCAL= 0
##$PSIGN= 0
##$REVERSE= no
##$SF= 200.130013532006
##$SI= 16384
##$SIGF1= 3
##$SIGF2= 2
##$SINO= 400
##$SIOLD= 16384
##$SREGLST= <1H.CDCl3>
##$SSB= 0
##$STSI= 0
##$STSR= 0
##$SW_p= 3612.71676300578
##$SYMM= 0
##$S_DEV= 0
##$TDeff= 0
##$TDoff= 0
##$TI= <>
##$TILT= no
##$TM1= 0
##$TM2= 0
##$TOPLEV= 0
##$USERP1= <user>
##$USERP2= <user>
##$USERP3= <user>
##$USERP4= <user>
##$USERP5= <user>
##$WDW= 1
##$XDIM= 8192
##$YMAX_p= 0
##$YMIN_p= 0
$$ End of Bruker specific parameters
$$ ---------------------------------
##NTUPLES= NMR FID
##VAR_NAME=  TIME,          FID/REAL,        FID/IMAG
##SYMBOL=    X,             R,               I
##VAR_TYPE=  INDEPENDENT,   DEPENDENT,       DEPENDENT
##VAR_FORM=  AFFN,          ASDF,            ASDF
##VAR_DIM=   8192,          8192,            8192
##UNITS=     SECONDS,       ARBITRARY UNITS, ARBITRARY UNITS
##FACTOR=    0.0002496,     1,               1
##FIRST=     0,             0,               0
##LAST=      2.0444736,     0,               0
##MIN=       0,             -253882,         0
##MAX=       2.0444736,     93889,           0
$$ Real data points
##PAGE= N=1
##DATA TABLE= (X++(R..R)), XYDATA
$$ [...]
1763a303J629J119j322j123R94J355j842j506J176J789m34j348O58O83p93p10
1779i78N78Kl78P96J115l60j638K55J515n07j935J82K244L28j422l04O24jq47
1798g31J92M96l41k78J325O02j705m10Q42O03r19j123J536J007p30r79O01K77
1816B65o75m59O65N11o40L55Q34o75q77N4J357q58p77P17J189l63j139l1Q28l23
1836d2p93K82P61j68j47O68k99o86m69J031K75r54K38J068K04r42q42Q01J24l64
1856b54l33P20J58k60M57k37l66l72M24O62p10o43Q83R80j017r52M32N83o1m09
1876c15NN61Q3k77K87n59k77L69M06l74k41J27P35l59o36k81Q22L15n75j70J45
1897b09L53k13J94k70k26R3O48m0n25j18N07K78n80n92R06J77m29LJ12Q0l8j31
$$ plain form
1763 -1303 326 1445 123 -1000 -6 1349 -493 -1999 -823 966 532 -816 -158 525 -268 -978
1779 -978 -400 -398 -776 20 1135 775 -863 -608 907 400 -1535 -1353 891 1219 -203 -507 117 116 -731
1798 -731 -539 -43 -384 -662 663 1265 -440 -850 -8 595 -324 -1447 89 1096 366 -613 -12 265
1816 265 -410 -869 -204 307 -333 22 856 181 -696 -642 715 -143 -920 -203 986 623 -516 -547 281 -42
1836 -42 -835 -553 208 40 -107 561 262 -424 -893 138 413 -541 -303 765 969 27 -815 -14 110 -254
1856 -254 -587 133 291 31 488 251 -115 -487 -63 599 -111 -754 129 1109 92 -860 -428 155 94 -315
1876 -315 -310 251 334 57 344 -215 -492 -123 283 -91 -332 -205 530 171 -465 -746 76 391 -184 -354 -209
1897 -209 144 -69 125 -145 -371 -278 370 330 -195 -313 194 472 -108 -700 206 383 -46 -43 69 149 111 -20
1919b0J14k68j4K75J26j57l48M47J24k51n54L29K28j63k62L45M7j1J62Q6j07r5
1941C3K86o1j14j23K9k66M00j17k83QM37j70N6k74M06r9k51L5K45j32R5k31J47
1964E6j86K26L71q43J47K94J87k58k07K12K95K1n64N8J75L46k98o4q8k4N55l26
1986H5p0n76M36L51j46l30O7J89J67k06j42p8N03J38l75j83J70J07R6l49k04J53
2008a97Q0M32l31j94J04J54J07k86K33k40M08p1m25j1L13jl9j80Q5K22Q8n1j68
2031C2J5o0Q6r2K02j44P7M5j83o1kR4O1j45K58j16j82J36j12k1K44j46OM3k1r9
2057h5N2j94J74k00L22J03k25Q1j29L69j9l30N3r4L32k54j20L5Q6lO2O3k90L22
2081A11Rj53k9L2J01m7J5L5l82N39k12L7m9k4LO1p1p5K55j03J51k44R2j36O3J57
$$ plain form
1919 -20 94 -174 -188 87 213 56 -292 155 279 28 -526 -197 31 -132 -394 -49 -2 -13 149 235 128 33
1941 33 319 258 144 21 50 -216 184 67 -216 -208 229 59 115 -159 247 148 -103 -68 177 45 140 -91 56
1964 56 -130 96 467 -376 -229 65 252 -6 -213 -1 294 315 -249 -191 -16 330 32 -32 -120 -144 411 85
1986 85 15 -561 -125 226 80 -250 -183 6 173 -33 -175 -253 250 388 13 -170 0 107 203 -146 -350 -197
2008 -197 -117 315 -16 -210 -106 48 155 -131 102 -138 270 199 -226 -237 76 75 36 -144 -59 163 251 200 32
2031 32 47 -13 73 -19 183 39 116 161 -22 -83 -85 9 70 -75 183 67 -115 21 -91 -112 132 -14 -8 35 14 -85
2057 -85 -33 -227 -53 -253 69 172 -53 28 -101 268 249 -81 -28 -122 210 -44 -164 -129 -43 -46 16 79 -211 111
2081 111 120 -33 -62 -30 71 24 39 74 -308 231 19 56 7 -17 -14 47 -24 -99 156 53 204 -40 52 -84 -21 136
2107A36j01M8r6J80k11j05J13Q3l2O3J24r4M0o4J27m20K95o8M4j40q7L63p0j97
2131f9J83k15K49j70RJ81m5l17L29j77q2rO8L69k83K7k8J36j16LJ17j94K9j44
2155a49L0N4J99l37K83j64O2MM4N6k08OJ79J9j77J08k7k58J13L38j84l67K69L23
2179B16n7o9j71J63j57p4j11J46J95j01K91n6k85j51Q4L69l89K13J9k64K45k31
2201a75J80j4J61j84Q8R9k72j19L48l8J1kJ4J46l22K73q4J6k86R0L7K9J60l36
2225a80M23k83k0J89j43j40Q4J47r4j18J05K23m15K71j52J0j06J38j67J44j8k3
2247a25Q7Nr2n3K05O9j13Q4K42m35J14J5O4j48k8K56j39j65J97P1Ok24l9J43O0
2272E7l09N24k56J85q8l43L23J8o1J22k01R5K9P2J55o14J03K04n3J18r0J94K9
$$ plain form
2107 136 35 83 -13 167 -44 -149 -36 47 15 78 202 108 148 84 211 -209 86 18 62 -78 -165 198 128 -69
2131 -69 114 -101 148 -22 -13 168 123 -194 135 -42 -124 -133 -65 304 21 48 20 156 40 43 160 -34 -5 -149
2155 -149 -119 -65 134 -203 80 -84 -22 -18 26 82 -126 -120 59 78 -99 9 -18 -276 -163 175 -9 -376 -107 216
2179 216 159 90 -81 82 -75 -149 -260 -114 81 -20 271 215 -70 -221 -137 232 -157 56 75 -189 56 -175
2201 -175 5 -9 152 -32 56 155 -117 -236 112 74 85 83 97 243 -79 194 110 126 -160 -70 -33 -4 156 -180
2225 -180 243 -40 -60 129 -14 -154 -70 77 -17 -135 -30 193 -222 49 -103 -93 -199 -61 -228 -84 -102 -125
2247 -125 -38 -33 -125 -178 27 96 -17 67 309 -126 -12 3 67 -81 -109 147 8 -157 40 111 117 -107 -146 -3 57
2272 57 -252 272 16 201 113 -230 93 111 50 172 -29 66 95 167 322 -292 -189 15 -38 80 -10 184 213
2295B13n68L29l1K90k73M9L25p7m70k06M99Q5n57L28Q0J91l73k31N24Mk82J52
2317AN7JO6k44J12O7k08J95J36k26J62l0r1j39K05j44K40l21N4J4J36j66J40J39
2341A56l9k74l2M85l72j13J42M44j2m52R4L77l07j46J39K01m20J99r7J75l26o5
2363b43L17K06k66k45L79k5j92n6K50q9p5j51J61n3N0j90L90j32l60K30Q0RkL08
2387C01K4k64l78K36K88k74kQ4K1M7j92LK49j96p4ML46j87j43N33j28o05J16K90
2411I9O0m57K96n3K60n56M6M67l51J38J38J42j86k77L33j62n9m99L93O17n95j65
2433c71M62k43J13p7J80M9m65K39L89n9m29K68J05l36n3j80M99J00j17J00l9J5
2455A50k35k0L6L0n3K44K72m03r0J51j58K2k68L89p8j37O7J55j00j6J74q5q7k1
$$ plain form
2295 213 -355 -26 -57 233 -40 9 334 257 -213 -419 80 165 -392 -64 16 207 -166 -397 127 131 -151 1
2317 1 58 59 125 -119 -7 60 -148 47 183 -43 119 89 -2 -141 64 -80 160 -161 -107 -93 43 -123 17 156
2341 156 117 -157 -189 296 -76 -189 -47 397 385 -67 27 404 97 -49 90 291 -129 70 -27 148 -178 -243
2363 -243 74 280 14 -231 148 123 -69 -125 125 36 -39 -190 -29 -82 -32 -222 168 36 -324 -94 -14 -5 -7 301
2387 301 325 61 -317 -81 207 -67 -69 15 36 83 -109 -106 143 -53 -127 -123 223 36 -107 426 298 -307 -191 99
2411 99 159 -298 -2 -55 205 -351 -305 162 -189 -51 87 229 43 -234 99 -63 -122 -621 -228 389 -206 -371
2433 -371 91 -152 -39 -116 64 113 -352 -113 276 217 -212 56 161 -175 -228 -408 91 191 74 174 135 150
2455 150 -85 -105 -69 -39 -92 152 424 21 -69 82 -76 -54 -322 67 -11 -148 -81 74 -26 -42 132 47 -40 -61
2479f1N4l0P9m24K16K07k80J52M8K45j21m71M42N8j88J9K18r8J0l14L40q1j0N8
2503F8M6o5o5M1N8J29m19Q5J32J83l66m0P4J62Q0l1P2o7l25M40J32m03j35K55
2527D1j59J52k12M2J55m2J59JL4j45P9o0M4J28L4k88k15K38K40%n4j36n8J45j59
2552c6J95o2J64j8m02K39M1r6L9j15j05J82J18k35K77k59m1J32J23j73J34j38
2574c6K68J29n94K38j17K21j31O9J5k41J20l3J5o0J65j79L7p2J15J07P4j37J80
2597A53k37o9K93l18k13K55L35k27k28K66J47l1j5j67J12j8j1j03K52j71j6q2
2619i3M3J3N3j1J39j47k55K5J88J34j39m4J13p3J05m4M4L3j51J94k7o8j03J32
2643F1Mn6L1kJ29o0m91L65J78rk86K56k32J18k35J60o8J39R2j42n3oP0M4L2k76
$$ plain form
2479 -61 -7 -37 42 -382 -166 41 -239 -87 -39 206 85 -386 56 114 -74 -55 163 65 75 -239 101 20 10 68
2503 68 114 49 -16 25 83 212 -207 -122 10 193 -173 -213 -139 23 103 72 144 77 -248 192 324 -79 -214 41
2527 41 -118 34 -178 -136 19 -23 136 137 171 26 105 45 89 217 251 -37 -252 -14 226 226 172 36 -22 123 -36
2552 -36 159 97 261 243 -159 80 121 25 64 -51 -156 26 144 -91 186 -73 -114 18 141 -32 102 -36
2574 -36 232 361 -233 5 -112 109 -22 47 62 -179 -59 -92 -77 -137 28 -151 -114 -186 -71 36 110 -27 153
2597 153 -84 -153 140 -178 -391 -136 199 -28 -256 10 157 126 111 -56 56 38 27 -76 176 5 -11 -93
2619 -93 -50 -37 16 5 144 -3 -258 -233 -45 89 -50 -94 19 -54 51 7 51 84 -67 127 100 32 -71 61
2643 61 65 9 40 38 167 107 -384 -19 159 150 -136 120 -112 6 -229 -69 -137 2 94 -48 -101 -107 -37 7 39 -237
2669b37L76n8l9Mk22J41K90k11k2Q1l42k14M03K03j47J51k47K50l12J1J53K9j
2692D0k85M47j88k6P3j77L29j13m5lk46jK42j92J59j37n2K97k14k49M43l8k44
2715a80J23J95K7j34k54K59q1r8J61j50k5J81O9K46j52k75L7j33K44l31N0K96
2737G5J72k96K1P8k13j8N52k23k77J7L59j13k42p5L46n8k90J14L25k46n3P3j38
2760a10K47m71J14L33K21j29k01M89l27m12K06J9j47N8K59R8l62R5NJ57j70j01
2782a29J77j14M3j72M58j50k69K5O6K08l92N21j11M0n09K31j28K52k74K83J68
2803B24k67j97M64j94j66m60L52M67j76j60K31P8k49k56L79m06L63r8K58J1k59
2824f1J82j1k46l15M84O8P2n67N85L52n55o3k68K37J7R5L0J46j17j24N7K9p4k31
$$ plain form
2669 -237 139 81 42 46 -176 -35 255 44 22 103 -239 -453 -50 153 6 157 -90 160 -152 -141 12 41 40
2692 40 -245 202 14 -12 61 -116 213 100 55 52 -194 -195 47 -145 14 -123 -175 122 -92 -341 102 64 -180
2715 -180 -57 138 165 31 -223 36 -45 -143 18 -132 -157 24 93 339 187 -88 -51 -184 60 -271 -221 75
2737 75 247 -49 -28 50 -163 -181 371 148 -129 -112 247 134 -108 -183 163 105 -185 -71 254 8 -45 28 -110
2760 -110 137 -334 -220 113 334 205 4 493 166 -246 -40 -21 -168 -110 149 247 -115 -20 -15 142 -28 -129
2782 -129 48 -66 -23 -195 263 113 -156 -131 -65 143 -249 272 161 201 -308 -77 -205 47 -227 56 224
2803 224 -43 -240 224 30 -136 -596 -244 223 47 -113 118 196 -53 -309 70 -336 27 -71 187 198 -61
2824 -61 121 110 -136 -451 33 101 173 -394 191 543 -12 -75 -343 -106 -89 6 36 182 65 -59 -2 27 -47 -278
2848b78P22n7n55M7K80L9m48J85L01l74J2L25K15n57n7L13m0O4l70K04L59j97
2870A33o1pp7j02j71K38M0N5k7L12N1n11J74J86j66j34p6L90l4k99J56K15k39
2893D6l17M16k89L61l42L56J40k88j60l4L5k23M07J91m6k17J7o6J71l85M9L23
2915A45J6n4j34J70n0l42K95r0K32m19J89L08o5k32k01L80l19k7R6K81Jq4J45
2938B41k80j73j14L91N4m60K35M02k35j34PJ85r1l02K02J99Q2l32l3L05k22R4
2960B1k0L26l72m9L49j89j15l1K62p5j14m9j04K72j10K22k14L2j36J43j74L41
2982B16j22j92L51k77j46J74o4j59L4L80j17j02M3l18M24k49K48l8j90O1N8j32
3004a17J39j03J19p6K12l97R2M55k80K2j59l9J19j98J65M01k99J07p2J18k28k39
$$ plain form
2848 -278 444 387 -168 -121 159 198 -250 -65 236 -138 -126 199 414 -143 -200 113 73 137 -233 -29 330 133
2870 133 72 65 -12 -114 -285 -47 -7 48 21 333 384 -127 47 233 67 -67 -143 247 213 -86 70 285 46
2893 46 -271 145 -144 217 -125 231 371 83 -77 -111 -76 -299 108 299 253 36 53 -13 158 -227 -178 145
2915 145 161 107 -27 143 93 -249 46 -44 188 -231 -42 266 201 -31 -232 148 -171 -198 -102 179 180 96 241
2938 241 -39 -212 -326 65 119 -341 -106 296 61 -73 -66 119 28 -274 -72 127 209 -123 -156 149 -73 21
2960 21 1 327 -45 -94 255 66 -49 -80 182 107 -7 -56 -160 112 2 224 10 42 -94 49 -125 216
2982 216 94 -98 253 -24 -170 4 -60 -219 -185 195 78 -24 19 -299 125 -124 124 86 -104 -43 15 -117
3004 -117 22 -81 38 -38 174 -223 -131 324 44 66 -93 -132 -13 -211 -46 355 56 163 91 209 -19 -258
3026b58L35L2j01j79J30K33l31q2L0M15j41j53n0J81j04j24J14l5L7Q1RO9k20
3049a12J73oJ36j78Q9J47j58j96K29k74J86J5p4L38l82J10k42M72k13j5J33k57
3071g9N4M1J13L6k48K17j49p3L7l3l8P2O4J60l30r4L12j85J00j14NM5J97j21q1
3096i2J15j9L9J3j7j48J43L4J32j30m1l81M28n0o1k1J30j56K45l38J64J20N6j54
3120A1l9J34m1ll4n6K34k82K16k13J8J60N8k30q1J68Q9j72k59K98J12M0j61n7
3144i0J14K5K4j28K18j32p9J19K3P7j88k26L16j67M81k33j50j21K21j12N5Nj91
3167a39K80K3j58L53l68J97j67j74L53o1L3j80r7L6J95l44J76N6J3p4q9k77L56
3190e7J65q0p4k8K11j47m4j22M89l88k55J91M0m2J94j6K17j74j81k78L82J46r5
$$ plain form
3026 -258 77 109 8 -171 -41 192 -139 -221 -191 224 83 -70 -120 61 -43 -167 -53 -88 -51 30 39 108 -112
3049 -112 61 55 191 13 102 249 91 -105 124 -150 36 51 -23 315 -67 43 -199 273 60 45 178 -79
3071 -79 -25 16 129 165 -83 134 -15 -88 -51 -84 -122 -50 14 174 -156 -250 62 -123 -23 -137 -132 -87 110 -11 -92
3096 -92 23 4 43 56 39 -109 34 68 200 70 29 -352 76 26 -35 -56 74 -82 163 -175 -11 109 165 11
3120 11 -28 106 65 62 28 -28 206 -76 140 -73 -55 105 163 -67 -148 20 109 -63 -322 -24 88 128 -33 -90
3144 -90 24 49 73 -55 163 31 -48 71 94 171 -17 -243 73 -94 387 154 4 -117 104 -8 47 52 -139
3167 -139 141 164 6 359 -9 188 21 -153 200 139 172 -8 -105 -69 126 -218 -42 14 27 -47 -136 -413 -57
3190 -57 108 28 -46 -74 137 -10 -54 -176 313 -75 -330 -139 -99 -141 53 37 254 80 -101 -379 3 149 54
3213E4k46O5L38l01O0J17qj17K80k57L1P6m7QNJ87j00r4M1o8J13j72K96j67l67
3238b73K47n4L26k71K43n4m7m09qK50J52k33R1J64Kl52J96PM0q4j29L30k2j52
3262d0k61N18k68J26j41J80lk29Q2J73Oj51M2n0J14N3k83L30q3k47K87j4r2OJ2
3287F7k05rM28j03j4k00k91K52J93m49K60K23J81m35J28J07k93J63J73r1K7R7
3309B09K6j05N8m49J08J85n2J42j34O9j83q1K41r6R6l9J64k42L08j55L1l47J29
3332a17R9J09k42j0m16N76k5L9J57o4j17J93L2m15L23j95P3j84J64n1L08l28Q2
3355iK2q8qk41L27qJ48l52O2J99o6j06J01P2j70P0J9K71o33J00oM00l08J99K32
3380B27j56k89K85R8j06k89K90J64q5n9K3j56N3k32L17M4k32N7K91j72Q8j62N1
$$ plain form
3213 54 -192 -127 211 -90 -30 87 79 -38 242 -15 16 92 45 53 58 245 145 51 92 24 137 -35 261 94 -273
3238 -273 -26 -80 246 -25 218 164 117 -292 -300 -50 102 -131 -40 124 126 -226 -30 -23 17 -67 -196 134 112 -40
3262 -40 -301 217 -51 75 -66 114 111 -118 -36 137 143 -8 34 -16 98 151 -132 198 115 -132 155 141 49 55 67
3287 67 -138 -147 281 178 164 -36 -327 -75 118 -331 -71 152 333 -102 26 133 -160 3 176 85 112 209
3309 209 235 130 188 -261 -153 32 -20 122 -12 57 -126 -207 34 -62 34 -5 159 -83 225 70 101 -246 -117
3332 -117 -18 91 -151 -161 -577 -1 -26 13 170 106 -11 182 214 -201 122 -73 0 -184 -20 -71 237 -91 -9
3355 -9 13 -75 -83 -324 3 -5 143 -209 -147 52 -14 -120 -19 53 -117 -47 -28 243 -390 -290 -296 104 -204 -5 227
3380 227 71 -218 67 165 59 -230 60 224 139 80 103 -53 0 -232 85 129 -103 -46 245 73 161 -1 50
3403E0j33j47P0K09nj94k9J26J95l40k47N43k83J05J89m9J88j88J25l27J72j74
3425a44L2J92j89k9K63j65j82j7M55J0p5n9p1mo1R4N0K40l76l0K52k53m9J11L3
3450B8j17k2m6L29Lp9M2j57k92oM34k0j07k74M39P0j82k37N66m37m2Q3P1R6k52
3475a09L19p3j74k5j39M01k26Q9j83M8K01k68O6J60q4K01J5j29k86j30N35k6l38
3498a55L2K35mk29K05J21j6m63J74K99N5l80L72j69p2k3p0K96j23k48L26j08Q
3521F3j65K01j25j34r1L25M1n4NJ82k04j84j44J31P9k0k67N56Kl92N9L18k7k89
3545a34j25L02j82J62Q1J08k55M3J12k25j4L29P8j45j94k29O5J03J00m5R2j10
3567h3J61k84L77j30k26L74K24n29j36J46L01j15j62p9K24k29O5k1K39J33l03
$$ plain form
3403 50 -83 -230 -160 49 44 -150 -179 -53 142 -198 -445 98 -185 -80 109 60 248 60 185 -142 30 -144
3425 -144 -112 80 -109 -138 125 -40 -222 -239 216 226 151 92 21 17 -44 50 100 340 -36 -66 186 -67 -116 -5 28
3450 28 -89 -111 -157 172 175 96 138 -19 -311 -317 117 97 -10 -284 155 225 43 -194 372 -65 -107 -24 47 143 -109
3475 -109 210 137 -37 -62 -201 200 -26 63 -120 -72 129 -139 -73 87 3 204 219 90 -196 -326 209 183 -155
3498 -155 -123 112 108 -121 84 205 189 -274 -100 199 254 -126 246 77 5 -18 -88 208 85 -163 163 55 63
3521 63 -102 99 -26 -160 -251 74 115 61 66 248 44 -140 -284 -153 -74 -94 -361 195 197 -195 -136 182 155 -134
3545 -134 -259 43 -139 23 104 212 -43 0 112 -113 -127 202 280 135 -59 -288 -223 -120 -20 -65 27 -83
3567 -83 78 -206 171 41 -185 189 413 -116 -252 -106 195 80 -82 -161 63 -166 -101 -122 117 250 -53
3588e3K5P7J95j82M5o0p0j37K73m9J21j52k52L59l47L36j2Rm1jj35J26K8QOJ18
3614B35m5k88J65j45K04N7J28m78o3J6J35p9L15J43j82r6J85n8q5J07j01L53k72
3637A51l03K03J93k41j16J05L15k88Qr5J33p6RL99k06k47J38J80j24k61r5L23
3659A05J50k58j90M07l27Q6J4n8PL10k77J02j03j27j81M31l20Q2K66N0O9l03m7
3682a12K69R9m56L14P1l11J08K30j83p1M4Q5k99N08l12m0J25Qj42Q0O0j16m3J50
3706F6m1P1Q9m03L42k06k5J57J15j03Kl9j93K43k98K95k55K17j09M93k92n6r1
3729b1R1l97K96o1l0QJ99J30l56K38l88K88p8M0k8K57m7K2j73J27j45K17j36j81
3753a28n6K46k01Q6j88L77o2r9j02j13L74j78j49P5J30K7k7k06K11K06r0k22J58
$$ plain form
3588 -53 -28 49 244 62 107 47 -23 -160 113 64 185 33 -219 140 -207 129 117 126 85 84 -51 75 103 111 117 235
3614 235 190 -98 67 -78 126 183 311 -167 -230 -214 -79 -158 157 300 118 22 207 149 64 171 70 423 151
3637 151 -152 51 244 3 -113 -8 307 19 27 -68 65 -11 -2 397 191 -56 82 262 138 -123 -218 105
3659 105 255 -3 -193 214 -113 -27 -13 -71 -64 246 -31 71 -32 -159 -340 91 -229 -147 119 169 238 -65 -112
3682 -112 157 256 -200 114 185 -126 -18 212 29 -42 2 87 -212 296 -16 -56 69 77 -65 15 75 -41 -84 66
3706 66 25 96 185 -218 124 -82 -107 50 165 62 64 25 -168 75 -223 72 -183 34 -75 418 126 70 -21
3729 -21 70 -327 -31 -92 -122 -114 85 215 -141 97 -291 -3 -81 -41 -69 188 141 163 -10 117 -28 189 53 -128
3753 -128 -184 62 -139 -53 -241 136 74 -25 -127 -240 134 -44 -193 -118 12 39 12 -194 17 223 133 -89 69
3776F9j44m9J41O0Q7o6j18J89j66K6O8j18j39L20n9j2j43K0J19k10J74q9Q1n1
3800a0j26J12L41k90r8p3K28l10L00Q9j74l3Q1j77M3J90k76M00o4o6m9K3L6j36
3824c9J95k25K5k67K47K22k22NJ69J71n11J51J73k29K65l28L37K6R8l78O1K14
3846A60q8k1k51J99j55pK63j97m7L61k79j28J68O0N3N5n6k90J25R7m7J24pj06
3870a4O0j5J65k70qK59r9O4k31K70k35R4O2K08n5k18j91j15M30k10K61l1K1k13
3894a1M3J20k58R2o9J18P5l14O2L90k88m30L93Q5M8k15L49L6m92L26q1Qm5j13
3918a71M27J75l85o9o2j12K99j44Pj39J30J93Q1l87q0J77K9j59L08J14j92j77
3940a37k76N27K51m79k0J39L01j59k56j3L05j99j03K0J57j31K56l1P6k59N5j23
$$ plain form
3776 69 -75 -124 17 77 164 98 -20 169 3 29 97 -21 -160 160 101 89 -54 -34 85 -125 49 -40 41 -10
3800 -10 -136 -24 317 27 -71 -144 84 -226 74 163 -11 -44 37 -140 -97 93 -183 217 153 87 38 61 97 -39
3824 -39 156 -69 -44 -311 -64 158 -64 -59 110 281 -230 -79 94 -135 130 -198 139 165 263 -115 -54 160
3846 160 72 51 -200 -1 -156 -163 100 -97 -144 217 -62 -190 -22 38 91 146 90 -200 -75 22 -25 99 92 -14
3870 -14 46 31 196 -74 -82 177 78 142 -89 181 -54 40 102 310 255 37 -154 -269 161 -49 212 181 202 -11
3894 -11 32 152 -106 -14 -83 35 110 -204 -142 248 -40 -470 -77 8 56 -159 190 226 -266 60 -21 -13 -58 -171
3918 -171 256 431 46 -23 -85 -197 102 -42 -35 -174 -44 149 230 -157 -237 -60 -31 -190 118 232 40 -137
3940 -137 -413 114 365 -114 -134 5 306 147 -109 -122 183 -16 -119 -99 58 -73 183 152 228 -31 24 -99
3962i9J26m28L96L04k21m78M86J32k82J53j14j37M1L22p9rj59j54K46K36m33K19
3984F8NJ07p5nnM3l87J01K83l08J82n4K14j25k98L78R5j50k31K45L2j83o7K06
4008G1k38Q6P2K78j77m3k81L48J0j74j87J77L27j43l09K79j65L58l00K4j60j7
4030a64K60J1j44k14M49j80M4k61K98Jj62q5K13K81m21r0K42j15l17L43K76j14
4052A51j13l37M77l39K3J17J72m3l56N89l5k66j44j78L19n3J44k02K51q1O4r9
4074F1J49n42J02O01l96R4j54K51P9n18K08J85J8j35j19Q5p8J56OK9j68P2J54
4097A40K04l35j94K25J84m61j20L22J00k50j21L39r5J83m92N86l03j38K22K90
4117B86n4k53j94L15J81q47M48L5J71p1J29j21j98n1J19J72k25J49K2K73j54k52
$$ plain form
3962 -99 27 -401 -5 299 78 -400 86 218 -64 89 -25 -162 -121 201 122 113 -46 -200 46 282 -151 68
3984 68 73 180 105 100 95 138 -249 -148 135 -173 9 -45 169 44 -254 124 219 69 -162 83 115 -68 -135 71
4008 71 -167 -81 -9 269 92 49 -232 116 126 -48 -235 -58 269 126 -183 96 -69 289 -11 13 -147 -164
4030 -164 96 107 -37 -251 198 18 62 -199 99 100 -62 -147 66 347 -74 -164 78 -37 -354 -11 265 151
4052 151 38 -299 178 -161 -138 -21 151 108 -248 341 306 40 -104 -282 37 -16 128 -74 177 96 160 61
4074 61 210 -332 -230 371 -25 69 -85 166 245 -273 -65 120 138 3 -116 -31 -109 47 53 82 -86 -14 140
4097 140 344 9 -185 40 224 -237 -357 -35 65 -185 -306 33 -62 121 -371 215 -88 -226 -4 286
4117 286 232 -21 -215 100 281 -566 -118 -83 88 17 146 25 -173 -224 -105 67 -158 -9 13 286 132 -120
4139a20j9M05k98j7L75l37j31L6J40p7k12K32N3j62M0K27r0lj22jJ07O9k19N4
4163g0L16l01j21J68J36l21J76N8M4j86P9P5R2l22Q2L62j10k32j58L34J51l91
4185a39j61L89j95J38k05O3NJ84M2j12q5NJ64j19J98j61R9J01j76k27K84n3j87
4208a48K24k36n8J16K13Q2j04k31K7K58J4k40J19j3mJ21j90J35k55R5J16k9k83
4231b71L56P0M1k58l2K99k80p8n4L73J1n1k74m0J55r0J28n5O4J1n3J45k22K19
4255A14j88J56r9J64k97M30k34l6J55j36l8j7J40l88M20L8p2m02K54J48o6p0l7
4278f1J0J64Lr0k74N00l0k11J20J08j70j31R8j47J72j2j12L18k44m8K68J29o90
4301c30J97J35K99k08j63K51j20j81K05j4l30L18P9Q5m16L13j09K0J06j78q7L0
$$ plain form
4139 -120 -139 266 -32 -49 326 -11 -142 -106 34 -43 -255 -23 30 -132 -92 135 45 42 -80 -81 26 95 -124 -70
4163 -70 246 -55 -176 -8 128 -193 -17 41 85 -101 -22 53 145 -177 -95 267 157 -75 -233 101 252 -139
4185 -139 -300 89 -106 32 -173 -110 -105 79 121 9 -76 -71 93 -26 172 11 110 211 35 -192 92 39 -148
4208 -148 76 -160 -218 -102 111 193 89 -142 -115 143 157 -83 36 23 19 140 -50 85 -170 -75 41 12 -271
4231 -271 85 155 196 -62 -94 205 -75 -153 -207 166 177 126 -148 -188 -33 -123 5 -50 14 25 -28 117 -105 114
4255 114 -74 82 -17 147 -150 280 46 10 165 29 -9 -26 114 -274 146 184 112 -290 -36 112 46 -24 -61
4278 -61 -51 113 116 26 -248 252 222 11 131 239 69 -62 36 -111 61 49 -63 255 11 -37 231 360 -330
4301 -330 -133 2 301 93 -70 181 61 -120 85 71 -259 59 138 223 -193 120 11 31 137 -41 -128 -98
4323i8K0K07l91J46R4lJ47j04J79l25J87k04K67k8P1j78q5K36j54j6J18p7Q5p5
4347A9r1k4j00K38Q8p7Q4k55N9J82o6p5j6l0j4q3r2K52P2j91J19k8M24l87J55
4372A63q6j88o8K31r3O2l71M38J25j30k22J21Q5n0j56Q0L0o1N9J11k1n1O2J87
4396B57q7k85P2l9J18p8q0K13k63K65o0M0L0j31m7K90j67j46K36r8j18Q6k41J98
4420c5J09q6m4j7K44j32N2m87L21J40O6N9j28j95J52R7l24L04J01j91K4M2PQ3
4444A62m39M75j96k35J83J64K1k93L39j06j3P6k90l9L79j12l09M39k37N9j62L0
4466a04N4K17k36N8L8L1M4j56R3k43K15L47m46J36j53K58j93j63J23K25n0k58
4488a63N9L73m63J95J3q7R7J16j74K58m64K45K80l73J35j42K15l1k44L91J05n39
$$ plain form
4323 -98 -78 129 -262 -116 -22 -25 122 18 197 -128 59 -145 122 94 165 -13 -98 138 -16 -32 86 9 94 19
4347 19 -72 -96 -196 42 130 53 137 -118 -59 123 57 -18 -34 -64 -78 -161 -253 -1 71 -120 -1 -29 395 8 163
4372 163 77 -111 -179 52 -41 21 -350 88 213 83 -139 -18 67 17 -139 -59 -29 -90 -31 80 59 8 70 257
4396 257 170 -115 -43 -82 36 -42 -122 91 -172 93 33 73 103 -28 -75 215 48 -98 138 40 -78 8 -233 -35
4420 -35 74 -12 -56 -73 171 39 91 -396 -75 65 131 190 62 -133 19 116 -208 96 197 6 30 72 79 162
4444 162 -277 198 2 -233 -50 114 135 -158 181 75 62 138 -152 -191 188 76 -233 206 -31 28 -134 -104
4466 -104 -50 167 -69 -11 27 58 102 -54 39 -204 11 358 -88 48 -105 153 -40 -203 -80 145 95 -163
4488 -163 -104 269 -194 1 14 -73 24 140 -34 224 -240 5 285 -88 47 -95 120 89 -155 236 341 -198
4510a98K70n9nl82J09L14L0p2kk7J30j45j92K49K12j78M4j89K73m09J60K84k77
4533f0O9j4L34l2k68k79O30l88o8L71Mm60L6K04k22J32J27j22Jl79K90J68j13
4556c9k23J13K94k6j06k47M73j33j88K40l34L40k47r9L15q9j31r6K43J56j92q7
4578f3J79j53o1K7O2j41kK89l17L0l1K34N9j76o8L32j92j85%J34k3j46K72n6J69
4603A73k51j23K25J71m13K47q7j67oL58R3l56R1L2J79k37o9K15K55m71j49M31
4625A41j76p9K7J56k16J6K38o7j3k18K70m7K71k66k5k0j93kL83j11l1j70L90J43
4649D01o97L01M5l12J62J3L07k09r2J89J77o0m86J11L4m8J31P4J65l13J95j61
4671g3R6j16R7K01k59M9OL14k79j49R0J65l9J64j59j97J31O6j95L23j64l22pL63
$$ plain form
4510 -198 72 13 8 -374 -265 49 79 7 5 -22 108 -37 -229 20 232 54 98 -91 182 -227 -67 217 -60
4533 -60 9 -5 329 297 29 -250 380 -8 -76 295 299 -161 -125 79 -143 -11 116 -6 -5 -384 -94 74 -39
4556 -39 -262 -149 145 119 13 -234 239 106 -82 158 -176 164 -83 -182 133 44 -87 -183 60 216 24 -63
4578 -63 116 -37 -98 -71 -9 -150 -152 137 -180 -150 -181 53 112 -64 -132 200 8 -177 -177 -43 -66 -212 60 4 173
4603 173 -78 -201 24 195 -218 29 -58 -225 -231 127 220 -136 -45 -13 166 -71 -140 75 330 -141 -290 141
4625 141 -35 -114 -87 69 -147 -131 107 40 27 -191 79 32 303 37 12 -8 -201 -203 180 69 38 -132 258 401
4649 401 -296 5 50 -262 -100 -87 220 11 -81 108 285 225 -261 -150 -116 -164 -33 41 206 -107 88 -73
4671 -73 23 -93 4 205 -54 -5 1 315 36 -113 -23 142 103 267 108 -89 42 108 -87 236 72 -250 -257 106
4695A06J2r8J10j25k57L26q1M6K76l06Q5j71J53l5mj10j18P6J56j14Q9j22Q9K15
4719A98j65j79L56Pl84K47J65J1j17j55J16J47k12O9j03n1k2L57j74j79r8J96
4741C0j12K95k07j79J01R2j50J6K45l6M9J6k64r6J33K29K35m18P6j14p1J86j19
4764f3L70l76J22P5k72M23k83p5J57J23k30K04r8J6k46L43l45%P4J73k89J91J31
4787A25m57L28m36L30P3J9J08j60N5J00j38K48Q1l56j03k25M00J07j26Q1q7%K65
4810B32j75J6k20o9O6N4Q4k34K17J21J7j01j8K72m52K72k37L06q8j33J08J1J47
4833A96l24l2K65k63o9L23j64m0J61j49N8J79q4j35jJ81j41Jj72K02q3P2j59r9
4857b77M63j54N6j94k23L07j09n1M40j47j30k19J89r7M7K91l56P8L8K61l20Q4
$$ plain form
4695 106 118 20 130 5 -252 74 -7 39 315 9 94 -77 76 41 37 -73 -191 -115 41 -73 16 -106 -17 198
4719 198 33 -146 210 217 -167 80 245 256 139 -16 100 247 35 104 1 -50 -72 285 111 -68 -166 30
4741 30 -82 213 6 -173 -72 20 -130 -114 131 95 144 160 -104 -200 -67 162 397 -21 55 -59 -130 56 -63
4764 -63 307 -69 53 128 -144 279 -4 -79 78 201 -29 175 77 93 -153 190 -155 -155 -81 92 -197 -6 125
4787 125 -332 -4 -440 -110 -37 -18 90 -70 -15 85 -53 195 276 -80 -183 -408 -8 99 -27 54 -33 -33 232
4810 232 57 73 -147 -216 -150 -96 -12 -246 -29 92 109 8 -10 262 -190 82 -155 151 63 -70 38 49 196
4833 196 -128 -160 105 -158 -227 96 -68 -108 53 -96 -38 141 57 -78 -79 102 -39 -38 -210 -8 -91 -19 -178 -277
4857 -277 186 32 88 -106 -329 -22 -131 -182 258 111 -19 -238 -49 -146 -99 192 -164 -86 -48 213 -107 -23
4879b3PK9k53K75L8j4o0J91J6j95J7k86N17m91J90l3M73m03r8J69j01q1L03k41
4903e4Q7k1l5R7j82O1J8q4J10j26J5J88j68K16jJ05l11J49k67oL31j20J49k34
4927h3J6J71k67j54K07J36j50k8J72N6k90J51j49K45n7j3l7l21J24L46L8j47J77
4950A43j15J55m54L43M7n9P1j32K08k23k90J89K10J8j30q5R8J82l54J47j19J37
4972a3j47J92n3n4j83J03L3l35L86J02r6K79j34j06O8j41K85k84J79R3q4j6j37
4995f3N8K08o5j53k11L44k8K5l05J35K70l88L16l6j01j05K40q1j68j81K31J80
5017A22j9k31j43K98R3j90k00L48Q1p6j14k28J44m1K32j09l1J09J0m6o4J06J88
5040B39l16J62l13k5M46j11q0o0j04K17j55J19j48J70K67l84J60j10j7k8N7j78
$$ plain form
4879 -23 -16 13 -240 35 73 59 -1 190 206 11 28 -258 259 -232 -42 -75 398 -5 -103 66 -35 -116 187 -54
4903 -54 33 12 -23 74 -108 -47 -29 -113 -3 -129 -114 74 -94 122 121 226 -85 64 -203 -209 122 2 151 -83
4927 -83 -67 104 -163 -317 -110 26 -124 -152 20 76 -214 -63 -212 33 -24 -37 -74 -395 -271 75 113 -34 143
4950 143 28 183 -271 72 119 60 131 -1 207 -16 -306 -117 93 111 -19 -104 -6 176 -178 -31 -150 -13
4972 -13 -160 32 -21 -75 -258 -155 -122 -457 -71 31 -65 214 80 -26 42 -99 186 -98 81 174 90 74 -63
4995 -63 -5 203 138 -15 -226 118 90 115 -190 -55 215 -173 143 107 6 -99 141 60 -108 -289 -58 122
5017 122 103 -128 -271 27 120 -70 -270 78 159 83 -31 -259 -115 -156 76 -33 -64 45 55 9 -55 51 239
5040 239 -77 85 -228 -253 193 82 2 -58 -162 55 -100 19 -129 41 308 -76 84 -26 -43 -71 -14 -192
5062a92J80KN5j46L18j89M0l26K99m1j21L01j85L9j37K30J3j17j03o3L38k26n7
5085h8k3n2r3J56j62J86J51K16k77J31mj6r9j1q4P0M5l11K09Q1k22L62M7m71J25
5110a34%L25R0k90J5n4j27J24k4J35q0l39L20J19j9J03n7%l74M24K5r0k37K23
5134G8o1m8n5j3J41r1J19L88k96Lk27J07M6Lj85L85j17k34Pj39k2J22L74j50k42
5159a07Q7J43j89J22k52J49J4K33k38K30n8j15j03n5J92L1o9o0j02R5K03k99Q
5182a40Q8m1J86j51J28J5Rm2J61q2r6k9j70L66m5J15k09q8J4p9J15k0n7Q0K22
5207B50l60O3K1k98K85L7N5j46J19j92j6J31J65j41J0n5K24r4J06j67k20K15J6
5230HO6j39p3N5J01P7j38j26K25j21J23l3j31L2lN2k1j31o5K00p4O7K69k10j51
$$ plain form
5062 -192 -12 -10 45 -101 217 28 68 -258 41 0 -121 180 -5 34 -103 127 140 23 -80 -143 195 -31 -88
5085 -88 -111 -163 -256 -100 -262 -76 75 291 14 145 141 125 26 15 -69 1 46 -265 -56 25 -197 165 212 -259 -134
5110 -134 -134 191 281 -9 6 -48 -175 -51 -75 60 -20 -359 -39 80 61 164 107 107 -267 157 182 92 -145 78
5134 78 17 -31 -86 -99 42 -49 70 458 162 165 -62 45 91 94 -91 294 177 -57 -50 -189 -211 -89 285 135 -107
5159 -107 -20 123 -66 56 -196 -47 -33 200 -38 192 134 19 -84 -139 53 84 15 -45 -147 -52 151 -148 -140
5182 -140 -52 -93 93 -58 70 85 94 52 213 131 35 6 -164 202 157 272 63 -25 -11 -90 25 5 -52 28 250
5207 250 -110 -47 -26 -324 -39 -2 53 -93 26 -166 -182 -51 114 -27 -17 -72 152 58 164 -3 -223 -8 8
5230 8 74 -65 -138 -83 18 95 -43 -169 56 -65 58 25 -106 -74 -77 -25 -46 -177 -242 -42 -116 -49 220 10 -141
5255a41j06R1j52K22K18q0J15l46K30j16J02j00Q6j22k80M57m8k11%J19K2N8r1
5278g3K64k85L5l2o6K71l2n5l9L03l27J85k43J49l2o7L9J87k14k10L07J5j91k46
5302c57J15M8J34l3K31k96M83l64R9j30K2%l5m0J02J8k57J41J2O6J37r7M4j56
5326a13j4L19l10n7J61j74J2M18j56j34J36m7j15O6k17J86PmL0P5O1j73P1K48
5350B76l19K68k25J45k31N8L9l7j31J41P8R2p6j67L09l16O3K17q7R6Mj91o2j14
5374a70K55j52J67L2j39q9r1K12k11j6K28l8k87L64j5j56o7L01k59J24K30l46
5396a23J27j1QJ99l88L45k49MJ55k55J35N3O5j09J48j07K03l03K2K21pq0j87J63
5420B9L7J29l32K0L25l21K23j60j06L79j96q1k36K14K19k19R9K9j9j47q5l4J20
$$ plain form
5255 -141 -247 -156 -308 -86 132 52 167 -179 51 -65 37 -63 23 -99 -379 78 30 -181 -181 -62 -40 18 -73
5278 -73 191 -94 -59 -91 -157 114 82 27 -12 291 -36 149 -94 55 23 -44 -5 182 -32 -242 65 80 -111 -357
5302 -357 -242 -194 -60 -93 138 -158 325 -39 60 -70 -48 -48 -83 -123 -21 -3 -260 -119 -107 -41 96 -1 43 -113
5326 -113 -127 192 -118 -175 -14 -188 -176 242 86 -48 88 41 -74 -8 -225 -39 -32 -36 -6 69 130 -43 28 276
5350 276 -43 225 0 145 -86 -28 11 -26 -157 -16 62 154 78 -89 220 -96 -33 184 97 193 197 6 -56 -170
5374 -170 85 -67 100 132 -7 -96 -187 25 -186 -202 26 -12 -299 65 50 -106 -173 128 -131 -7 223 -123
5396 -123 4 -7 1 200 -188 157 -92 -88 67 -188 -53 0 65 -44 104 -3 200 -103 -81 140 133 53 -134 29
5420 29 66 195 -137 -117 208 -113 110 -50 -156 223 27 -54 -290 -76 143 -76 23 52 33 -114 -199 -233 -113
5443a13o1K90j98K58k32k5R3O2k2K9k13J16K75m47L99j63o0J53j83Q4J38m44J81
5466h3P8k04M9K13r9M5J31k25k6L31l80J36k17K01MK74m50K30k75Q7J07J86N0
5489A63k37P1NO3N7m3j38K25k61L0K3R8J19o2j68L4J75j42k19M27l81J19J02J90
5513B50r6m01K21j26l5N4Q0nM4O4K13k85Q7o0L9O7j55K88l78R8O6m1j35L46l54
5538a54J10r0L14j65K03j24k04j0K63k21J36R7k30J17r4J42L3m6p9j18J96n6o5
5561d5J8P7O0ON2n2j76n4J22N5k43K70J06j26J08Qj33ok5PJ88j43j85J67k28J53
5587a9K00q2rk29j3k5K12P3m23J65N4K13k39J61p7K89l59L29o8o6l5Q1j91Q7j68
5612a39K38k16Q8j82NN0K19J83k97k5k60K61K64j78j12J62Kk35K52k3j68K34j69
$$ plain form
5443 -113 -174 116 -82 176 -56 -81 12 74 52 81 -132 -16 259 -188 211 48 -12 141 -42 42 180 -264 -83
5466 -83 -5 -209 -160 53 -46 -1 130 -95 -121 210 -170 -34 -251 -50 -46 228 -222 8 -267 -180 -73 113 163
5489 163 -74 -3 2 65 122 79 -59 166 -95 -65 -42 56 175 113 -55 -21 154 12 -207 220 -161 -42 60 250
5513 250 154 -247 -26 -152 -187 -133 -53 -58 -14 50 263 -22 65 5 44 111 -44 244 -134 -36 30 -11 -146 200 -154
5538 -154 -44 -134 180 15 218 94 -110 -120 143 -78 58 155 -75 42 -52 90 123 77 -2 -120 76 20 -45
5561 -45 -27 50 110 116 168 116 -60 -114 8 63 -180 90 196 70 178 186 53 47 22 29 217 74 -111 56 -172 -19
5587 -19 181 99 90 -139 -152 -177 35 108 -315 -150 -96 117 -122 39 -38 251 -108 221 153 87 52 133 -58 29 -139
5612 -139 99 -117 -29 -211 -206 -156 63 246 -51 -76 -336 -75 189 11 -101 61 63 -172 80 57 -111 123 -46
5635d6M6O8o8j03O7k3J69j65P8j68J75j82K14j59j4L72l74j16L90j34k50QR9J12
5659dj90K85o9K9L6n5J02k0j57J55j33lJ05qj32j72J49K19j59O3J18k14Q6J23
5683A54j84K13j81r3L2K91o2l8j62J2k1J57k85L92l80K43N0l31K14J0k02r9K66
5706dJ24k24K00j04Q1l32K19L5J2q0J13N8l35J05m5J24r0M9L36l33r9R0m1Q3K62
5731B04k28l29L96O9j71J65ml59L01J8P2k1j02n4J24k11l7L82M9m02L13J03j06
5754A72j92M6K1j02J20j07J58k8n6m5j59K16O5j55J05m0J04j53j27M37l98K60
5776A42j77n1K54j29K9j85Q4k4L22k62j0q0M3P2M2p8J57p0n9jp4K68k52P8k3o7
5802e1P7Q4J41k48J54q1m0J3k10NK61r1J57j18K1M5Qj65O1J26q9n2j69K52l12
$$ plain form
5635 -46 0 68 0 -103 -36 -59 110 -55 23 -145 30 -152 62 -97 -111 261 -113 -229 161 27 -223 -215 -116 -4
5659 -4 -194 91 22 51 87 32 134 114 -43 112 -21 -24 81 73 -59 -231 -82 137 -22 41 159 -55 31 154
5683 154 -30 183 2 -91 -59 232 170 132 -30 -18 -39 118 -167 225 -155 88 138 -193 21 31 -171 -270 -4
5706 -4 120 -104 96 -8 73 -259 -40 -5 7 -73 40 98 -237 -132 -177 -53 -143 -94 242 -91 -190 -100 -141 -58 204
5731 204 -24 -353 43 112 -59 106 102 -257 44 62 134 113 11 -43 81 -130 -167 215 264 -138 175 278 172
5754 172 -20 26 47 -55 65 -42 116 88 32 -13 -172 44 109 -46 59 19 123 -30 -157 280 -118 142
5776 142 -35 -86 168 39 68 -117 -33 -57 265 3 -7 -87 -44 28 70 -8 149 79 20 19 -55 213 -39 39 16 -51
5802 -51 26 110 251 3 157 76 36 49 -161 -156 105 14 171 53 74 119 127 -38 23 149 60 8 -161 91 -221
5827b21K83k28K67J6j49M6O2j27k38K22K83p1k61K65jj08j10NP8k34Q0K74J3k07
5851f1n8R7L9N1k01J96P1q7r1MK24l22N3J46k03N2J38J94l03M6OL85j92k84J60
5876F0J57j66j20k04L67k56R8J23Q9K84m16p2j6j1J44l21Q4K17j50K9M2J5K38
5899B15k37j19J81j59J09J05k67J75r4J14J90j99j90J43L4jJ73k87J29O7N0j06
5921B6J17k18J91k97Q4K17l55K7L11j38J95n7j26j48K52j16K29j32K39l30J03
5942G4k6k77L00k9O0j40O5k37mJ34L7l9r7L69j61J49k2P0k12q3m6N1J11pJ00j45
5968ej78N1K71Kn7q9J24p6P2rk01J23j67L8J41J00L0Q5k58J01k17J17L1K8J73
5993B30k62r9j04K03J71m97J96M36k87K47j87Q1k57J03J00k87J27r3J48P3k14
$$ plain form
5827 -221 62 -166 101 117 -32 14 76 -51 -289 -67 216 145 -116 149 148 40 -70 -65 13 -221 -141 133 146 -61
5851 -61 -119 -22 17 68 -133 63 134 47 -44 -40 184 -138 -85 61 -142 -90 48 242 -61 -15 -9 376 184 -100 60
5876 60 217 51 -69 -273 94 -162 -64 59 148 432 16 -56 -72 -83 61 -260 -176 41 -109 -80 -38 -23 215
5899 215 -22 -141 40 -119 -10 95 -172 3 -91 23 213 14 -176 -33 1 0 173 -114 15 82 132 26
5921 26 143 -75 116 -181 -97 120 -235 -208 103 -35 160 103 -23 -171 81 -35 194 62 301 -29 74
5942 74 48 -229 71 42 102 -38 27 -210 -214 -80 -43 -82 -179 190 29 178 156 226 14 -69 -115 -64 47 40 140 -5
5968 -5 -183 -132 139 141 84 -5 119 43 115 106 -95 28 -139 -101 40 140 170 255 -3 98 -119 -2 29 57 230
5993 230 -32 -131 -235 -32 139 -358 -162 274 -13 234 47 128 -129 -26 74 -213 -86 -179 -31 42 -172
6014a72M9j04J12J32p0O7j8Q0k55K37J26j7k40j83J99P5Nj23L0o9J76j06K5j24
6038a68J05K03j28k05Q0M0K70m86K57j9q1K38o8k61K62n9R1k99M3K81k33R0R4
6061D7J34r4l32M15j72K9L6k08j44L49n3m2m5K32j49N6J23k29Q6k8O4j55J82j82
6085h0J46j34L2K11k63P5j32L73j55L1j97%R3R5q8O1j34k39J7K18j3O6N1k8p4
6110f8n0L68k83J77j84Q3J61k11k05K13j99K56j56J78k3j16l2n6J0J10K02j44
6132C1N6j02O0P3mk52K85k55J77J00K6j05J1M1Lr1j0r2L0P1k86lJ11J16q1J75
6158H5k31K09J05m40M37k74K0J36rl02J74k1J17L8J26k09j45J42J07j14q2P2j18
6181a77Q6L42l03J63j01k43L49j45K12n1k32m0K19j46J7j23O7l2j38N36k69J28
$$ plain form
6014 -172 -123 -227 -115 17 -53 14 -4 76 -179 58 184 167 -73 -256 -57 18 23 -100 -70 -139 37 -69 -44 -168
6038 -168 -63 140 12 -193 -113 -73 197 -289 -32 -51 -132 106 38 -223 39 -20 71 -228 -185 96 -137 -47 47
6061 47 181 87 -245 170 -2 27 63 -145 -289 60 7 -35 -80 152 3 59 182 -47 39 11 75 -80 102 -80
6085 -80 66 -68 -36 175 -88 -13 -145 228 73 104 -93 -93 0 95 7 68 -66 -305 -288 -70 -83 -17 34 6 -68
6110 -68 -118 250 -33 144 -40 43 204 -7 -212 1 -198 58 -98 80 57 -59 -91 -147 -137 -27 175 31
6132 31 87 -15 45 118 114 -138 147 -108 69 169 195 90 101 142 145 54 44 -48 -18 53 -233 -236 -125 -9 -90 85
6158 85 -146 63 168 -272 165 -109 -89 47 38 -264 -90 -111 6 44 170 -39 -184 -42 65 -49 -131 -59 -177
6181 -177 -91 251 -52 111 10 -233 116 -29 183 132 -100 -140 79 -67 -50 -173 -106 -138 -276 260 -9 119
6203A19j43J01q5J44N5j48p5K1K6o7l9j6%K6K61k16Pj09r0K91l9J28m2L0k35l7
6229a32L11j49l2r4p4P5J84j23r3Q9k6N8J78k35K6K4J12L3j87J62j67L84j86l1
6253A07k77K33O4l1L8j20J88k62J68k29m0J53J2J72l10J25l5jp8J66k7j84J43
6276b5P4j0R6j30M2J33p6j17j14L65l17j40J67K01k20L12j45j9K18l69K15r4k53
6299b06K46rj60J54N8l25N07l19P1P1j53J11k7k89L64J66m22m8Q9N8J98o7m43
6322c75J09M79r3K8k62P3Q7n0P3j15K02n9J44j11k14R9J7k03j9L00j01r6K53o0
6346A06n2Kn1J32j31j81J41p7O2P7r4R8M9o6J47k64Q2k79JL89M0k54J04o9J20
6371C2k04K81k69J9J99k77J83N5K9j0L1r5J01m6M8J19l59J47J8l25O40j45m14
$$ plain form
6203 119 -24 77 -8 136 191 43 -32 -11 15 -52 -91 -107 -107 -81 180 -36 -29 -138 -228 63 24 152 110 140 -95 -132
6229 -132 179 30 -2 -96 -170 -95 89 -34 -127 -38 -64 -6 172 -63 -37 -13 99 132 -55 107 -60 324 138 107
6253 107 -170 63 127 96 134 14 202 -60 108 -121 -161 -8 4 176 -134 -9 -44 -45 -123 43 16 -168 -25
6276 -25 49 39 135 5 47 180 104 -13 -127 238 -79 -219 -52 149 -71 241 96 77 295 -74 141 47 -206
6299 -206 40 31 -129 25 83 -242 265 -54 17 88 -65 46 19 -270 94 260 -162 -210 -121 -63 135 68 -375
6322 -375 -266 213 120 148 -114 -41 46 -4 69 -46 156 97 241 130 -84 15 32 -171 -190 110 9 -87 166 106
6346 106 54 56 5 137 6 -175 -34 -111 -49 28 -66 32 81 15 162 -102 -20 -299 -298 91 131 -123 -19 -88 32
6371 32 -172 109 -160 -141 58 -219 -36 19 48 38 69 -26 75 29 77 196 -163 -16 2 -323 317 172 -242
6394b42N12l81L26j76J68k92J3J59j37p6L28q3k68J89j09J67J16j71Q2L4k04J71
6416A26j61j54K77O9j03j95J67o7k2qL28k19l5L4J26j41l7r5Q8m0qj41K40L0n6
6441C%Q1J94l44j05J51M1J53k2j22j43J47J92j29Po4j01j19M54l11M3k4K01j42
6465D1j51O0J35N6R2k0j74M7l85L59K0k02R2rK6j72L26l0r2O5q9K11j27J16j98
6490cj00P0R0K71l72R6q2J97j45l2j55K46O0L1l13K13j87L2L7K3M02j28k92k02
6514b43J02K01r4J21j55k4L58l81M13k61j30NJ43J86l82J56k47K79K35j20k29
6535f7J3K3J61l22M3J30J07Q9k11J7j57K28o3L9O9ml70K54P6J78N7j55j78j22
6559a65J34K78k21Q4k42p8L8M84m00K39k84J40q7L73k98m6m1j54K16l1j92j46
$$ plain form
6394 -242 270 -111 215 39 207 -85 -72 87 -50 -126 202 119 -149 40 -69 98 214 43 125 159 -45 126
6416 126 -35 -189 88 157 54 -141 26 -41 -63 -71 257 38 3 37 163 22 -15 -110 -22 -62 -70 -211 29 59 3
6441 3 3 84 278 -66 -171 -20 21 174 152 30 -113 34 226 97 104 40 -61 -180 274 -37 6 -18 183 41
6465 41 -110 -50 85 141 233 213 39 86 -299 60 80 -122 -30 -39 -13 -185 141 111 19 84 -5 206 79 195 -3
6490 -3 -103 -33 57 328 -44 52 -30 167 22 -10 -165 81 141 172 -141 72 -115 -83 -46 -23 379 251 -41 -243
6514 -243 -141 60 -34 87 -68 -92 266 -115 298 37 -93 -88 55 241 -141 15 -232 47 282 162 -67
6535 -67 -54 -31 130 -192 -149 -19 88 177 -34 -17 -174 54 -9 30 99 95 -275 -21 55 233 290 135 -43 -165
6559 -165 -31 247 26 110 -132 -210 -172 312 -88 151 -133 7 -80 293 -5 -51 -92 -246 -30 -61 -253 -399
6581c99N13j62J00k51J01J41N1j30Mj03l2K9Q3k3L21k96p2M42l79k29J73j99K95
6604b2J45P0l19J6o9K92N2n4l01K85L4l9q2j39L17L1k93M1l9P5N1l42K35K17l54
6629a92L29R0m01k1q1J91L43j28k31j2L47l3k30J32j93oJ23J95k67n1j73P8K02
6652A1j25J97j88Q5n6L29j91j6J01k40o4J9n3L33k8k12M1K44l14Jj25K53On9J32
6677H1k21J28N5q0J64j40r0O8K20k75l7K54j60j46M38k22Q7j72L0p6j21O0J46
6700ij82L19l4j46O7m4k8j30L63k22Q1j49K45j77J7J89j31n7K56j48J38m5j20
6723E3p6K7J51l25l5L04p6j02J97k17Q6o8J16r9QK20k40K89p5l6j38K7nK02m07
6748b19L58j17k38L83l58K13j34L09n9q2J66M6k03k00Q8j3PJ27J04j71k23K53
$$ plain form
6581 -399 114 -48 52 -199 -98 43 94 -36 -32 -135 -167 -138 -55 -78 243 -53 -125 317 -62 -291 -118 -317 -22
6604 -22 123 193 -126 -110 -179 113 165 111 -190 95 129 90 8 -131 186 217 -76 -35 -74 1 52 -290 -55 162 -192
6629 -192 137 227 -174 -195 -276 -85 258 130 -101 -113 234 201 -29 103 -90 -96 27 222 -45 -96 -269 -191 11
6652 11 -114 83 -105 -20 -76 253 62 46 147 -93 -157 -138 -191 142 114 -98 -57 187 -127 -126 -251 2 8 -51 81
6677 81 -140 -12 43 -37 127 -13 -103 -35 185 -90 -127 127 -33 -179 259 37 124 -48 -18 -94 -215 -155 -9
6700 -9 -191 128 94 -52 15 -29 -57 -187 176 -46 35 -114 131 -46 -29 160 29 -28 228 80 218 173 53
6723 53 -23 4 155 -170 -205 99 23 -79 118 -99 -13 -81 35 -64 -56 164 -76 213 138 102 -36 -9 -14 188 -219
6748 -219 139 22 -216 167 -191 22 -112 197 138 56 222 268 65 -135 -47 -60 -53 74 178 7 -216 37
6770C7qJ0J78l36J49k18M41j81j70n2K8k1O2P8j49R5Q4k43j7l6J66P2n0M8j7L2
6796a8O2J09o9k01J78Jj89K41j15ll94L67N5j38J73mK31l03pk31M55q3k26N2K7
6821c0J09Q5l35K42J16mj91J14J6k18R8NK1J10k53P8K15m8k55L92l01p4P0r6j21
6846b55J63J71j20rL8j32K10R3q5J6j27J44k11Q9n8K25K55n19J03L8O9K70m70
6869a02R8J28r9l42M23l07K49r8j51J73L2m6k24K73M9M3j19j16Q0Q4r1R8q7j69
6893b21K67j25RJ28o7m9j40L21j8j91jp4L64j28j22J70l43K77Q3p4J12q1k10L17
6917B04l85J78K61o1k44J57l30J22K2J4K53k80K6M1J21k87J23k18L47l27J55J23
6939A5p8n9K7o4L21k03J06J07l84L00l3j20L5m9M1O8R4Q4n7P5k36J20j95K26l24
$$ plain form
6770 37 29 39 217 -119 30 -188 253 72 -98 -150 -122 -143 -81 -3 -152 -57 27 -216 -233 -269 -103 -31 -81 -33 -50 -18
6796 -18 44 153 84 -117 61 62 -127 114 -1 -4 -398 -31 24 -114 59 55 286 -17 -24 -255 200 117 -109 -57 -30
6821 -30 79 164 -171 71 187 183 -8 106 122 -96 2 7 28 138 -115 -37 178 130 -125 267 -34 -108 -38 -134 -255
6846 -255 -92 79 -41 -50 -12 -144 66 159 74 90 -37 107 -104 -15 -73 152 407 -112 -9 29 98 368 -102
6869 -102 -4 124 25 -317 106 -201 48 -50 -201 -28 4 -42 -266 7 56 99 -20 -136 -56 28 -63 35 -52 -221
6893 -221 46 -79 -70 58 -9 -58 -198 123 105 -86 -87 -161 203 75 -47 123 -220 57 140 66 178 97 -113 204
6917 204 -181 -3 258 197 -47 110 -220 -98 -76 -62 191 -89 -63 -22 99 -188 -65 -283 64 -263 -108 15
6939 15 -63 -122 -95 -159 162 -41 65 172 -212 88 55 -65 -30 -79 -38 30 124 208 151 226 -10 110 -85 141 -183
6964a83J61O2j68L46j45o5j14J85j67J17k19L87m57K06q5M61l32k63L74L5j71
6985c5p9J26J7M6j0j21K40k76nK36j69J56l7j46K4j4n1O3O9M3L5p8p5j77J96J67
7011A45j72q8r0P8J39j46L16r5k63N5J07Q7j37n4m5K50k14n1K03j96K97J06j35
7034I7o4p5m7J62m2n2J11mj0j28L67j04j2q5j18K38j98L03m20L36k09O6l25L58
7058A45j53j90n7q9N52l83K72k56K35k44M07k18K6L03m01k46J45L6QK13k29QJ26
7081A0k9R2J65j84n6K18N0l3j53J7j68J34L0O8j90j17J60N5o5M04j77p1k64N4
7105e0L3l5M38n78L27k32J6k0P5J42k04J69M0k90K62j97J41l41M88j57L1J43k66
7128f5j0K12k2rL%j57j13K96j41m0J42k65K66mk75J74MJ09j5j21m80O51k21K81
$$ plain form
6964 -183 -22 40 -128 218 73 8 -106 79 -88 29 -190 197 -260 -54 -139 322 -10 -273 101 136 -35
6985 -35 -114 12 29 75 65 -56 184 -92 -97 139 -30 126 89 -57 -33 -47 -98 -35 34 77 112 34 -41 -218 -22 145
7011 145 -27 -115 -205 -127 12 -134 182 87 -176 -121 -14 73 -64 -118 -163 87 -127 -178 25 -171 126 232 97
7034 97 33 -42 -89 73 31 -21 90 86 76 -52 315 211 199 114 -4 234 36 339 -81 255 46 112 -213 145
7058 145 -8 -198 -255 -344 208 -175 97 -159 76 -168 239 21 47 350 -51 -297 -152 -116 -108 105 -124 -116 10
7081 10 -19 73 238 54 -2 216 266 233 80 97 -71 63 93 161 -29 -146 14 69 4 408 231 160 -104 -50
7105 -50 -17 -52 386 -192 135 -97 -81 -101 -26 116 -88 81 121 -169 93 -104 37 -304 184 27 58 201 -65
7128 -65 -75 137 115 106 109 109 -48 -161 135 -6 -46 96 -169 97 93 -182 -8 -4 105 90 -31 -511 140 -81 200
7153B00l27J65m3J20J0j88l0j56M64n23K14K98m5j6k74Q7J42P2j13l00M07k87
7175a23J11M0j5j85K40m4N6mK0q3r0J17O6om8j33J20r5k15K79J36k99K20M9l00
7200a86n5L55N6l89L19j23j90L94q4k68J18n7K1O9j07p2N8P1j3P8r3K32j96J75
7224A13j47j96L14o8K0J22m6j20k18M76m03K50q9K1J49k18R6J12Nj35p2Q7rp5
7248c1J18l21L89k24QK33q0k61J73O0j3k08K58R7j23q9K0K31j50J68l54l0N4Q8
7272A3j77J2J94j23n0J29r8N2J72j50j09J07j58O5J76J94l84J83L4K41l56k18
7294b51K10J64k14k58M40j19j05K75j16J85j60L2J29l9l98J67J71k88L04n1K8
7315A06j42K9o2J04O4r8L6o5k2r1K89l6j48j83L24k08J17n3m6J76r4j93M6J65
$$ plain form
7153 200 -127 38 -5 115 125 -63 -93 -249 215 -308 -94 204 159 143 -131 -44 98 170 57 -243 164 -123
7175 -123 -12 28 13 -172 68 24 80 76 96 13 -77 40 106 100 52 -81 39 -56 -271 8 144 -155 65 114 -186
7200 -186 -241 114 170 -219 100 -23 -213 181 97 -171 -53 -110 -89 -20 -127 -199 -141 -70 -83 -5 -98 134 -62 113
7224 113 -34 -230 84 16 36 158 112 -8 -226 250 -153 97 8 29 178 -40 56 168 173 38 -34 53 44 -31
7248 -31 87 -234 155 -69 -61 172 92 -169 4 64 51 -157 101 198 75 -14 6 237 87 255 -99 -129 -75 13
7272 13 -164 -152 42 -81 -131 -2 -100 -48 124 -26 -135 -28 -186 -121 55 249 -135 48 82 323 -33 -251
7294 -251 -41 123 -91 -349 91 -28 -133 142 26 211 51 83 212 173 -225 -58 113 -175 129 78 106
7315 106 -36 -7 -69 35 99 1 37 -28 -50 -141 148 112 -36 -219 105 -103 14 -39 -85 91 -3 -196 -150 15
7339A5q7L74q3l03L66l94N3J57n6OO8j79Q7q7o5L16j94j84K28Qo7q0J06j0q8K85
7365A92l83j0L13kJ06j12P4j81K7j71K28N5k51J60j06N0O1n1m95M85oJ3N6M8K0
7390A20j06j55J27J05j99NL5J31OL6j23J44m7j84J10j22j0N2M3Q3R8O4j96Q8Q0
7415A85j19l77M07qj34j06K99k03L00k87J69p2M9j21n9L7J9j40Q9P8oL3N0p7K0
7440B6j09j98J06K66j13J49k21J8J12k58K32k25K38j2r5K9k5L8J19p7j5l3J95
7463A47k08M4N1r3j2J64L3j88j40J62mj31L37r6Q9j77m5O2j45O3K89l67P3Q1K6
7488A5k8j81L06j40k69M00j18J40j48o1J03O1qk00J59nm5n1m2K10l00J96J94r8
7512I0k48J39j11R3p6o9K71m4q4j81J83M8r5jj50N58j96q4K63j11k80k9L5l2o2
$$ plain form
7339 15 -72 302 219 -84 282 -112 -59 98 42 48 116 -63 24 -63 -128 188 -6 -190 38 46 -21 -101 5 -5 -93 192
7365 192 -191 -201 112 110 216 104 178 -3 24 -147 81 136 -115 45 -61 -11 50 -1 -496 -11 -17 -4 52 100 120
7390 120 14 -141 -14 91 -108 -103 -68 63 69 105 -18 126 79 -105 5 -117 -127 -75 -32 51 149 213 17 105 185
7415 185 66 -311 96 88 -46 -152 147 -56 244 -43 126 54 103 -18 -77 -40 -21 -161 -72 6 0 33 83 6 26
7440 26 -83 -281 -175 91 -22 127 -94 -76 36 -222 10 -215 23 11 -84 -55 -80 -42 77 0 -15 -48 147
7463 147 -61 -17 34 -59 -71 93 126 -62 -202 -40 -44 -175 162 66 155 -22 -67 -5 -150 -87 202 -165 -92 -11 15
7488 15 -13 -194 112 -28 -297 103 -15 125 -23 -84 19 80 72 -128 31 26 -19 -70 -112 98 -202 -6 188 90
7512 90 -158 -19 -130 -37 -113 -182 89 45 -39 -220 -37 11 -84 -85 -235 323 127 43 306 195 -85 -114 -79 -111 -173
7537a73L6J48m9Oj7J44j33K6J34j61L72l75K04l26j54L54l3P2l67M11j6q0L4J74
7561B31k77J9J9j88J25J9j16J91j41J99N3j94KN4k12K05P0J12k19K15J27k97J01
7584I8n2j29J39l32L33k74R1J57j69L14k13N5n6J63j02n9K52l9L5l44J44L05k21
7607I6l4j48J88j62L9N4n2K15l64K05Pk4Q3Qm2J07m36K84j72R7L7L57n53J07R5
7632hJ1j71J41j57K74J39l44L2J10p9j0J12O8k30J38R4j99O4M0J16p4J76j99r0
7656d6J44n9Rj26J09j45K39m4P7k22K53k22O6J40j60j30K35j97J63n4J56l08J63
7679D1n1k30K19o8M04Q5m60k1J18m1M9j74K31k32L23j24m7J31j52J5J21n6o8Q0
7703I3o7N4k66K98p5l3Oo9J17j80K88l39K18J40k65J29j49L2n2L03l05K48m6j73
$$ plain form
7537 -173 -137 11 -38 -32 -49 95 -38 -12 122 -39 333 -42 162 -164 -318 36 3 75 -292 119 103 23 57 231
7561 231 -46 -27 -8 -196 -71 -52 -168 23 -118 81 134 -60 -58 -4 -216 -11 59 171 -48 167 294 -3 98
7584 98 46 -83 56 -276 57 -217 -126 31 -138 176 -37 18 -38 125 23 -36 216 177 212 -132 12 317 96
7607 96 62 -86 102 -60 -21 33 -19 196 -168 37 44 20 103 111 69 176 -260 24 -148 -51 -14 343 -210 -103 -8
7632 -8 3 -168 -27 -184 90 229 -115 -83 27 -52 -62 50 118 -112 26 120 -79 -15 25 141 67 243 44 -46
7656 -46 98 39 48 -78 31 -114 125 81 158 -64 189 -33 33 173 13 -117 118 -79 84 30 186 -122 41
7679 41 -10 -240 -21 -89 315 400 -60 -81 37 -4 45 -129 102 -130 193 69 22 153 1 16 137 81 13 93
7703 93 26 80 -186 112 37 4 10 -59 58 -122 166 -173 45 185 -80 49 -100 -68 -120 183 -122 126 80 -93
7727i3m8J56j26J82K5n9J58N9j13k21K53l11P7l9K50Kk07R0p1L1P2P8j00J2o7
7752a0j88Q2L67k79J09j31K29k66o3L06k23K13m06L35j5j04L01j83J04j57LJ54
7774A78l11Q1K07J3l53J80m9pJ44q1K8l36K97q8P8k25Q8L05m2k65J27l9M4j1J40
7799A03j95J86j59J38j04o1K3k05J74M17k15k75K59j62L3J5K30o2J11j35j15k74
7821b73L12k23J09m3K39q1l2O5kr9nL5j04J18j1k1j41K79j01p8j63M07m14M44
7845B17m36K69j56o7j01M68p3j43q0K35M2q4k15J08kJ61j84O2q8r5J91J20k15
7868f6k44J74O2j06J10K1M01l14p2J7J01n4pK18l93N37l62j07L8QN6l64L73J1
7892C8q3%k13L36j73R8r9L01l23M51l62k39K40j85J34P4r2J64m0j90L03j60J71
$$ plain form
7727 -93 -141 15 -111 71 96 37 195 254 141 -80 173 -138 -61 -100 150 152 -55 35 -36 -5 67 145 45 57 -10
7752 -10 -198 -116 251 -28 81 -50 179 -87 -150 156 -67 146 -260 75 60 -44 257 74 178 21 24 178
7774 178 -133 -52 155 168 -185 -5 -54 -61 83 2 30 -306 -9 -97 -19 -244 -156 149 107 -158 -31 -70 -26 -37 103
7799 103 -92 94 -65 73 -31 -92 -69 -274 -100 317 102 -173 86 -76 -43 -28 202 140 251 116 1 -273
7821 -273 39 -184 -75 -118 121 40 8 73 71 -28 -33 2 -102 16 5 -16 -157 122 21 -57 -220 187 -227 217
7845 217 -219 50 -106 -173 -274 194 121 -22 -102 133 175 91 -124 -16 -18 143 -41 21 -67 -162 29 149 -66
7868 -66 -310 -136 -74 -180 -70 -49 352 38 -34 -17 84 30 23 241 -152 385 23 -84 -46 -38 18 -346 27 38
7892 38 -45 -45 -258 78 -95 3 -96 205 -118 333 -29 -268 -28 -213 -79 -5 -97 67 27 -163 140 -20 151
7915A51r1j31J16j52M2R0J2q0P3K20k34M00m85k8Q7j29K22j64RK08K60m86J69
7938G9J28j3k59J70l42L3J59J25k02NK68m14K96J31j59k9J86k49J66n0K4j74Q4
7961c7K28k63o5L12k45k28L21p7j8j25J46K22l31j59K13O0J26j51m6J77N7j4k05
7984a02M02k80k24L70l32K13rj38O0J7k02L47l6J4j86L06j95k88K03J27K07k80
8006fJ06j78J07K4P7k30M7L3m8K34l02K30k0k42L14n3k76L17R0j90n8J3j16K51
8030A24k50QK51Pj8j48L30l64J76j60L3R0K1j97n0o3J42J04l4J46j75L4L92k83
8054A16j14k15K56J64j23Kj64J88o3J13j13l6J7J82p9k58L07j74p8j9J55k8J42
8077A78r9R5j30L5m2M6n6K50l50K3r9J31J44l65p8K27rQ4j24N5J10O7N7p7Pj04
$$ plain form
7915 151 60 -71 45 -107 -65 25 37 -43 30 250 16 416 -69 -97 -10 -139 83 -81 -72 136 396 -90 79
7938 79 207 194 -65 105 -237 -204 -45 80 -122 -117 151 -263 33 164 5 -24 162 -87 79 29 53 -121 -37
7961 -37 191 -72 -137 175 -70 -298 23 -54 -72 -197 -51 171 -160 -319 -106 -46 80 -71 -117 60 117 103 -102
7984 -102 300 20 -204 166 -166 47 38 -100 -40 -23 -225 122 86 100 -86 220 25 -263 -60 67 274 -6
8006 -6 100 -78 29 53 130 -100 -53 -20 -68 166 -136 94 74 -168 146 93 -183 134 224 34 -24 -11 -127 124
8030 124 -126 -118 133 140 122 -26 304 -60 116 -44 -11 79 100 -97 -147 -210 -68 36 2 148 -27 7 399 116
8054 116 2 -213 43 207 84 86 -78 110 47 160 47 11 28 210 131 -127 180 6 -72 -91 64 36 178
8077 178 79 174 44 79 37 83 27 277 -73 -50 -149 -18 126 -239 -317 -90 -99 -15 -139 -84 26 93 150 73 80 -24
8103b4O9j44Ol9J88n0K5J22l8p2j33N7K5P5q6o7J63L2q5O2k86J74K20k59j6J72
8129I1L7K4l51K43j66R8j7j8J09k15M75n74K23R3m0J39j88L29k35J10k27J9k58
8152b99M34j24k01K98o1k11N0K00P2l78J89j68L48l6m7K0j04j64K77k05K50l23
8174a83J6K36J62j95l80M95k78L44k90K27j42j16N5Q9M6lQ
$$ plain form
8103 -24 45 -99 -93 -132 56 6 31 153 115 43 -90 -33 -8 67 -19 -86 77 109 24 86 -200 -26 194 -65 -81 91
8129 91 128 152 -199 44 -122 -24 -41 -59 50 -165 310 -264 -41 52 12 151 -37 292 57 167 -60 -41 -299
8152 -299 135 11 -190 108 47 -164 -114 86 158 -220 -31 -199 149 113 66 86 -18 -182 95 -110 140 -183
8174 -183 -167 69 231 36 -344 151 -127 217 -73 154 12 -104 -49 40 86 83 91
8191I1
$$ Imaginary data points
##PAGE= N=2
##DATA TABLE= (X++(I..I)), XYDATA
0@%%%%%%%%%%%%%%Qj6J6j6J6k4L2l2M0m8N6o4P2q8J04j19J35j52J71j94K18k46
36a31K78l10L46l86M29m77N29n87O50p19P93q74R62j060J171j290J420j567J734
55I11j918K127k369K648k978L376l862M470n264O348p916J0407j4991K6211j07274
70i0074j63808J41667J41520M4123k0749J4772k5862o9614n2355J2922K8273M8163
82H978N7322K481q8206n2086N8783O2571m8040o1575L7610O6946k2718n4785J1307
95b1412M5296L46k1542q199j5660k0260K9808N3287j0965n1911J1309N2275k1540
108B0832p5968p46P4694K6167m2423j1499L3378p91l8502j0413J6983Q57K507
121d924K9948R726l4186j4175L1355J060n1605j0318O2572L1819m6479k7649M0804
$$ plain form
0 0 0 0 0 0 0 0 0 0 0 0 0 0 0 0 8 -8 8 -8 8 -16 16 -16 24 -24 32 -32 40 -48 56 -63 72 -80 91 -103 115 -131
36 -131 147 -163 183 -203 226 -251 278 -309 341 -378 415 -459 503 -557 614 -676 744 -823 911
55 911 -1007 1120 -1249 1399 -1579 1797 -2065 2405 -2859 3489 -4427 5980 -9011 17200 -90074
70 -90074 -253882 -112215 29305 73428 52679 67451 41589 -28025 -80380 -67458 -39185 8978
82 8978 66300 68781 -19425 -71511 -12728 49843 1803 -59772 -22162 44784 22066 -32719 -21412
95 -21412 23884 24230 2688 -5511 -21171 -41431 -11623 41664 30699 -21212 -9903 42372 20832
108 20832 -55136 -55882 18812 44979 2556 -8943 24435 23644 -14858 -25271 -8288 -7431 -4924
121 -4924 25024 34750 564 -13611 17744 18804 -32801 -43119 19453 51272 4793 -22856 17948
134A7948K2787m4432l5357K5184K9454l030j109R722j1599j5075J7089R786l9360
147a7992k5584N0141N4122l1007n7478J6043N0963j1454n2930p276L7934K4208
159B9690k100r985j8081j1703K2453K3367l1812m6075K8915P3227M28p2089k3952
172c7717N3744K9957m2196l7549K1480L8941J0341j3133k2070j8319J1989L3529
184B8997l366m6894r188N7740L5878m5589n1598K1028M5391o807l6321m648K5047
197I670J7519M17j3479k3867o734K8276K1369k6816l1510K5658M6251j2804n0745
210a6795o439L8726J3316k6267j4036J7790J5819l411r817r258n467R455J4490
223A8106o685j9142P306K7611j473l2547r473K6963J3007k1443j3525J8480J7100
$$ plain form
134 17948 40735 -3697 -39054 -13870 15584 12554 11445 21167 9568 -5507 11582 21368 -17992
147 -17992 -43576 6565 60687 29680 -27798 -11755 39208 27754 -25176 -32452 5482 29690
159 29690 27590 17605 -476 -12179 10274 33641 1829 -44246 -15331 57896 58324 -13765 -37717
172 -37717 16027 45984 3788 -33761 -12281 26660 37001 23868 1798 -16521 -4532 28997
184 28997 25631 -21263 -30451 27289 63167 17578 -34020 -12992 32399 25592 -10729 -15377 9670
197 9670 27189 27606 14127 -9740 -16474 11802 33171 6355 -25155 503 46754 33950 -16795
210 -16795 -23234 15492 28808 2541 -11495 6295 22114 18703 8886 -372 -5839 3616 18106
223 18106 11421 -7721 -415 27196 25723 -6824 -16297 10666 23673 2230 -11295 7185 24285
236B4285r820j5842j744O583N466K025o138r723N478K0620J411k8026j4754K5556
250E377K3725j7782k9352Q232L1719N473k6177j9152J0610K3029O399j8743j9939
263a6581P771K9912P559l1483k5799K1496L6944n466l8950j1021L2438K4738j8291
276A3267l1735j857K6858J8060j3083k6606l758K5531J9934j6389l1535K85L2795
289A1767J6263k4123k7624R000L0439O879k4475k0762J0778K6241N542k2980j9976
302b3031J2801K7390J606k7950j6440K0372K5975p551k8448o070K3121J6558j3891
315D442k1726J842K0635Q916j4927j6497N527J8597M150j6250j1738R630J5601
328H202k046j5544n676J2389J0552o826j3142k42J2484O282q660j1192K678J2684
$$ plain form
236 24285 14465 -1377 -3121 3462 8928 10953 4815 -4908 570 21190 22601 -5425 -20179 5377
250 5377 29102 11320 -18032 -9800 21919 27392 1215 -17937 -7327 15702 22101 3358 -16581
263 -16581 -8810 21102 28661 -2822 -28621 -7125 29819 24353 -14597 -25618 6820 31558 13267
276 13267 -18468 -20325 6533 24593 11510 -15096 -18854 6677 26611 10222 -21313 -21028 11767
289 11767 28030 3907 -23717 -14717 15722 22601 -1874 -22636 -11858 14383 19925 -3055 -23031
302 -23031 -10230 17160 18766 -9184 -25624 -5252 20723 13172 -15276 -21346 1775 18333 4442
315 4442 -17284 -15442 5193 14109 -818 -17315 -11788 6809 10959 -5291 -17029 -7399 8202
328 8202 6156 -9388 -15064 -2675 7877 1051 -12091 -12333 151 6433 -2227 -13419 -10741 1943
342A943M038j1705j0006O891J4100n8j5413p875J2668J4662n800j8261l483J7078
356a221J2607j1473j9505K321K0859Q842j7146j8696Q556K3501L619k2249j5780
369b5765J4565K3460k592k4504j0199J8502J9932p788k3334n430K0143J6655j0283
382C362k3021k746K1018J5606j2842k3529Q28K4007J2186j7656k0936N876K3277
395E430O859j8852j7205Q760K2474M575j9997j6494J1011K3610Q94k3891j2514
408b5340J8244K1465p966k4542l245K0947J2172j2733j6635K486J6862P711j0783
421a357j4988J631J6329P692j3700j4240Q476J8843o85j8845p381J4394J1285
434G454p301j1810J366R976N271m198r888l459Q723J0730n188j5251J027J9291
$$ plain form
342 1943 5981 -5724 -15730 -8839 5261 5203 -10210 -18085 -5417 9245 3445 -14816 -18299 -1221
356 -1221 11386 -87 -19592 -17271 3588 12430 -4716 -23412 -14856 8645 12264 -9985 -25765
369 -25765 -11200 12260 9668 -14836 -25035 -6533 13399 5611 -17723 -23153 -3010 13645 3362
382 3362 -19659 -22405 -1387 14219 1377 -22152 -21324 2683 14869 -2787 -23723 -17847 5430
395 5430 12289 -6563 -23768 -15008 7466 12041 -7956 -24450 -13439 10171 11065 -12826 -25340
408 -25340 -7096 14369 6403 -18139 -21384 -437 11735 -998 -17633 -15147 1715 9426 -1357
421 -1357 -16345 -14714 1615 9307 -4393 -18633 -10157 8686 8001 -10844 -18225 -3831 7454
434 7454 153 -11657 -10291 -315 4956 758 -9130 -12589 -3866 6864 1676 -13575 -12548 6743
448F743O250j9337j3887J3763J7541p007j6393J531J4844N330r079j0485j271
461a1457Q878J0022k815j5071k468J8982J1227j8729k0421J1041K4382k820k1545
474a0794k464J8252Q560j0390j2154j762O165J0258L957j0768j1415J1113J9367
487A7925p395k7917l482K8158J3307j9800j5028J2353J6412n195j3968o620L482
500g768J1062J0580n120j7608k8K2590N659k7997j7291K3977K6452j2293k4057
513a1842N986J9681j708j6557n180N700N904P574M015j1026j0862J0823J4532
526A7040j4062k3421R819K9768J523k3535m661J7173L013j5940o123P899M822
539C315L455P185l082j5170j106J7125o32k4257l434L0510J5045k3642j7683J6149
$$ plain form
448 6743 12993 -6344 -20231 -6468 11073 4066 -12327 -10796 4048 9378 299 -10186 -11457
461 -11457 -2579 7443 4628 -10443 -12911 6071 17298 -1431 -21852 -10811 13571 10751 -10794
474 -10794 -13258 4994 13554 3164 -8990 -10752 -4587 5671 9628 -1140 -12555 -1442 17925
487 17925 10530 -17387 -20869 7289 20596 796 -14232 -1879 14533 9338 -4630 -11250 -7768
500 -7768 3294 13874 8754 -8854 -8882 13708 19367 -8630 -25921 -1944 24508 12215 -11842
513 -11842 -5856 13825 12117 -4440 -9620 -3920 1984 9558 13573 2547 -8315 2508 17040
526 17040 2978 -20443 -10624 19144 20667 -2868 -7529 9644 12657 -3283 -9406 -1507 3315
539 3315 6770 13955 10873 -4297 -5403 11722 11090 -13167 -16601 13909 28954 5312 -12371 3778
553C778J4001j6237j6239R819J4574J325l22j01r191o885J0398O126j7229j0255
567a6438K4568K3362j7974k6913R620K1709j0441k2481N919K1234L013o969Q02
580I011l085j1426J794J2935n478j6960J1089L0100k875l3359p808K4797O488
593A5223k2652o902K0657J2851o986n893k354q898j962J2940L145j6805m31K8552
607B0485J0679l1205k2404K0599J9965j6812j7564J6570K1228n905j3591j114
619I31k084o927O226J1490o941j0425J6063J9091j7176l0189O058K6086k910k0411
633a1118N081K2888J320j6663m970J814n965R52J3779K317j3485K782K1297l610
647A6419l1143q431K7602J2202k0181q513K1195J2016j6057j4861L751L282k527
$$ plain form
553 3778 17779 1542 -14697 -4878 9696 11021 10699 10598 1407 -5478 4920 11046 -6183 -16438
567 -16438 8130 31492 13518 -13395 -3775 17934 7493 -14988 -9069 12165 15178 8209 9011
580 9011 5926 -5500 -3706 9229 3751 -13209 -2120 27980 25105 -8254 -16062 8735 15223
593 15223 -7429 -14331 6326 19177 12191 6298 3944 -4954 -6916 6024 9169 -7636 -8067 20485
607 20485 31164 -41 -22445 -1846 18119 1307 -16257 313 21541 15636 2045 931
619 931 -1153 -8080 -1854 9636 2695 -7730 8333 27424 10248 -19941 -13883 12203 9293 -11118
633 -11118 -6037 16851 18171 1508 -3462 -1648 -7613 -6661 7118 9435 -4050 -1268 20029 16419
647 16419 -14724 -23155 4447 16649 -3532 -12045 9150 21166 5109 -9752 -6001 -2719 -5246
660e246O516P319o784m585J2896N047k2851j6275J9130K1557j1932j7289J3172
673F75J8129j0376j9739O89Q739o05N66Q244n36r609M811J0872j1515k2143O930
688a4868K7132J484k1579j561K0703K120k0955q917J0262P498j108K996J365p165
702b593q72R952l094k0221j574K4542J1094j9531j1896J6264J1645j6143j5934
715a8361Q423J2736l86k499K314k507m861M697L652j1874q640J4795J7110r356
729E243j7918N540J5941m768j7426o55J3556N547m021j414j312l790K515N295
743B333o731j0889P820J9093j299k0252l861J7055N245j6861q564J3120J0985
756G194l953p092k19M84N59K611k361p487J750J3899M321j4413r286J1034J0346
$$ plain form
660 -5246 1270 8589 1805 -2780 10116 15163 -7688 -23963 -4833 16724 4792 -12497 675
673 675 18804 8428 -11311 -10622 -1883 -2488 -1922 6322 5786 -3823 988 11860 345 -21798 -14868
688 -14868 12264 13748 -7831 -9392 11311 13431 -7524 -16441 -6179 1319 211 3207 4572 -2593
702 -2593 -3465 6487 3393 -16828 -18402 6140 17234 -2297 -14193 2071 13716 -2427 -18361
715 -18361 -9938 2798 2412 -87 2227 -280 -5141 -444 3208 -8666 -17306 -2511 14599 5243
729 5243 -12675 -7135 8806 4038 -13388 -14043 -487 5060 1039 -375 -1687 -5477 -2962 2333
743 2333 -4398 -15287 -7467 11626 10327 -9925 -13786 3269 8514 -8347 -16911 -3791 7194
756 7194 3241 -3851 -4070 -3586 -3027 -416 -2777 -10264 -8514 5385 9706 -4707 -13993 -2959 7387
771G387r583j1559O217J2491q4p737k862J502R84K471K58n785k808R471Q896q434
787H25j3564M337J3743r78j3771k239J2579O891o876q209M98M824L395j635n562
802e742j994P366P792n077j2709P40J2994L393j1537o665R295R515m644r114p10
817g097N663L618j886l996j933L414O405l05q845m402Q283P700n564r224K279
832e890R998J496p788n314L953O291Q42m936m850K547P740J809q325o305N939
847b793R717k488j0329j564R639N781p236q083K738Q392J866n960n176K417O771
862C692K030o090n851L505P756N09p978l722O296O606k953p727j183O418M615
877E923k846o335r56O059M366l391p107p6P907M086o383o855K676Q841J069p852
$$ plain form
771 7387 -2196 -13755 -7538 4953 4869 -2868 -5730 -4228 -3244 -773 -515 -6300 -9108 363 9259 825
787 825 -12739 -8402 5341 4363 -9408 -11647 932 7823 947 -7262 -6764 -1940 1455 -180 -5742
802 -5742 -7736 -370 7422 2345 -10364 -9624 3370 6763 -4774 -11439 -2144 7371 2727 -6387 -7097
817 -7097 -1434 2184 298 -3698 -5631 -2217 4188 3883 -4962 -9364 -1081 6619 1055 -8169 -5890
832 -5890 4108 5604 -2184 -7498 -3545 2746 3588 -1348 -6198 -3651 4089 5898 -2427 -8732 -2793
847 -2793 6924 4436 -5893 -7457 2182 7963 727 -7356 -4618 3774 5640 -320 -5496 -3079 3692
862 3692 5722 -368 -6219 -2714 5042 5551 -2427 -6149 147 6753 3800 -3927 -5110 1308 5923
877 5923 3077 -3258 -4214 1845 6211 2820 -4287 -4363 3544 7630 1247 -5608 -2932 5909 6978 -874
893h74m984N253P249r23p972k793O392O005k844p758r80P223M942n185p167J371
909c045P689K480o196n517L461O955K75o333l689M016N903l45o197l310M379O144
925F670j397o557k635N859N438l181o962m21P231L619m906o358J442P141K278
940G261n300n922K692P191J054p024m476N046P138j633p974k065O886M600m158
955C316o430Q61O121K623m026m651P97N267K600m690n179K224O444J432o348m238
971c877M293N648j639n473j562M460L610j528m206k372L722M599j158o809j381
986c673O873M765n117p663K568P784O27p190l222N251M977j436m938k354K802
1001E4M200j81n424k568N200N820k850q366J9P559K507o368l924M207N138j179
$$ plain form
893 -874 -5858 -605 6644 5721 -2251 -5044 1348 7353 4509 -3249 -4229 2994 7936 2751 -4416 -3045
909 -3045 4644 7124 928 -4589 -1128 5827 6102 -231 -3920 96 5999 5654 -543 -3853 526 6670
925 6670 5273 -1284 -3919 1940 7378 4197 -2765 -3186 4045 7664 2758 -3600 -2158 4983 7261
940 7261 1961 -3961 -1269 5922 6976 -48 -4524 522 7660 6027 -1947 -4012 2874 7474 3316
955 3316 -3114 -2253 3868 6491 2465 -2186 -1389 3878 6478 1788 -3391 -1167 5277 6709 361 -3877
971 -3877 416 6064 4425 -1048 -2610 1850 5460 3932 -274 -2646 1076 5675 4517 -2292 -3673
986 -3673 3200 7965 2848 -4815 -2247 5537 6164 -1026 -4248 1003 5980 4544 -394 -2748 54
1001 54 4254 4073 -1351 -3919 1281 7101 4251 -4115 -4096 3463 5970 -398 -4322 -115 5023 3844
1017C844l921j907O19K535K086j812m602R99P062J618p834n635O245O838l559
1032B576p174J773O895J444n149l490Q01K243K639m20m580j298O560M252o794
1047B78q303L969R564j239q968o1Q287K473o161m368J918K494L83R05r04k901
1063b634K187N375j859r076j437R156L994p258m016O424M824m920n517J168K559
1078a030K28J823M26k839j377N130K037q580n556P836Q805n222q258M340Q290
1093F053l057q755q75N641J845j174R81l55j931J656K459m499o972M257J0108
1108E382q22r246M4Q731N4r492k958O719L312k322N60J613k794j491L338k84p143
1125f799j069J0518N354q616o468O862N831p524p718M902P414p78k352J098n13
$$ plain form
1017 3844 -77 -1984 -1365 1170 3256 1444 -3158 -2159 4903 6521 -1313 -6948 -703 6135 2576
1032 2576 -4598 -2825 4070 5514 365 -3125 -2324 -81 2558 2138 -2442 -3740 2820 7072 278
1047 278 -8025 -4056 5508 4269 -4699 -4760 3527 6000 -161 -4529 -2611 -117 266 1171 267 -2634
1063 -2634 -447 4928 3069 -6007 -7444 1712 5706 -1552 -5568 856 5680 760 -4757 -3589 -1030
1078 -1030 -802 1021 1447 -1392 -2769 2361 4398 -4182 -9738 -1902 6903 1681 -6577 -2237 6053
1093 6053 2996 -5759 -6634 -993 852 -322 659 304 -1627 29 2488 -2011 -8983 -4726 5382
1108 5382 4560 -4686 -4642 4089 4143 -5349 -8307 -1588 1724 -598 -38 1575 -1219 -2710 628 344 -6799
1125 -6799 -7868 2650 8004 -612 -7080 -218 5613 -1911 -9629 -4727 2687 1909 -443 655 142
1140A42l116J361K118n007l749P838Q898n419r954L086Q551l977j0026K252R797
1155B795J392n057L92K058l492k287K868M48m615K150R375O59j0620l045Q166
1170A187K246q856l206Q935N553m362l187K159j398l273J828K842l458j203P866
1185C673M477q646p937O349O940o588p065O794R283k968o787O08K363l034j741
1200d279L726R73k727L575N624m328r634J507Q379j112p931K182R989K04p698
1215a550k189L860r23k715K434K985k398l5N713m43r393l122Q426M194p084l573
1231e813Q374N640o624o731K706L177j877m23K756R7j056K974J180o656n033N695
1247a614P062m482n915M999P594l909p880J00N136m40k416K490K076j905o2K468
$$ plain form
1140 142 -2974 -1613 505 -4502 -8251 -413 8485 3066 -6888 -3802 4749 772 -9254 -7002 2795
1155 2795 4187 -870 -478 1580 -1912 -4199 -1331 -883 -5498 -3348 6027 6686 -3934 -6979 1187
1170 1187 3433 -5423 -8629 306 5859 1497 -1690 469 -929 -4202 -2374 468 -2990 -4193 3673
1185 3673 8150 -496 -8433 -2084 4856 -1732 -8797 -2003 7280 4312 -2475 -1867 496 -2538 -4279
1200 -4279 -553 420 -2307 1268 6892 2564 -7070 -5563 2816 1704 -6227 -4045 5944 6148 -1550
1215 -1550 -3739 121 -802 -3517 -1083 1902 -496 -531 5182 4739 -4654 -7776 650 4844 -2240 -5813
1231 -5813 2561 8201 1577 -5154 -2448 729 -1148 -1571 1185 1282 226 3200 4380 -2276 -7309 -1614
1247 -1614 5448 966 -4949 50 7644 3735 -4145 -4045 1091 651 -1765 725 2801 896 834 3302
1263C302k284o319J401P809P33o587o64P054R52o849l456M071L017j767m63K031
1279A981l48j283J749n07m948j046O753L208n401l909N953L902n569n639L140
1294a964N332r89k954J076K068j469m42L09k028k063L606M322k517m459J912M761
1310D501k018n839J8N642J179k914o90J908l08j152Q01j054k256J398M876k44
1326C848n155q35M922J391n199l320M826L902k136l012N92J360J30q76o21j148
1342a331J005L354N70m095j944L611K508l267l946K471M583n04l740J23J680K21
1358A299n16r31l06r2J830J850k005l237J430L567p14l940p95M516J482k783k200
1375a545J007J829K12j559r79K54J852J577j436l017K92L300J051l879j760L394
$$ plain form
1263 3302 1018 -5301 -3900 3909 4642 -1945 -2609 4445 5397 -1452 -4908 -837 2180 413 -50 1981
1279 1981 1633 350 2099 1592 -3356 -4402 2351 5559 158 -3751 2202 6104 535 -5104 -1964
1294 -1964 3368 2379 -575 501 2569 1100 658 967 -1061 -3124 482 4804 2287 -2172 -260 4501
1310 4501 2483 -3356 -3338 2304 3483 569 -121 1787 1479 327 1128 74 -2182 -784 4092 3848
1326 3848 -1307 -2142 2780 4171 -1028 -4348 478 4380 2244 -768 -176 1184 1314 438 -183 -1331
1342 -1331 -326 3028 3598 -497 -2441 1170 3678 411 -3535 -1064 3519 3015 -725 -602 1078 1299
1358 1299 783 -148 -454 -546 1284 3134 1129 -2108 -678 2889 2175 -1765 -2560 1956 3438 655 -1545
1375 -1545 -538 1291 1503 -56 -1035 -781 1071 2648 1212 -1805 -1513 1787 2838 -1041 -2801 593
1391E93K671j982l181O75K228Q92j699j104J96J107J135n47k021m25K448J309
1407B295k089k322J323K621j17k440j116J717J813q86j606m26J405J238l09j896
1423g95j017J726K154j148k584k1K644J145k563j814J528K278k10k334q31J353
1439d89J834o16j521j123J598J886p23k272m20K086J388j680j710L63K311K61
1455A173j383j205M81J479J50q80j423O39J741J41j388j459J024K187j46k089
1471i58j151K038J408r22k035j13J623J317j260j833M79J806Q89j621j590O56
1487a267K206m4j801j338J666J741p29j690l09J612P75q12j290o9J468R72q09
1504B82j714MJ360J030j019j667N57J651K85j416j034J177J177k11r58j128O98
$$ plain form
1391 593 3264 1282 -1899 -1224 1004 1896 197 -907 -711 396 1531 984 -1037 -1462 986 2295
1407 2295 206 -2116 -793 1828 1711 -729 -1845 -128 1685 799 -807 -1233 172 1410 1101 -795
1423 -795 -1812 -86 2068 920 -1664 -1685 959 2104 -459 -2273 -745 1533 1323 -1011 -1842 -489
1439 -489 1345 729 -792 -1915 -317 1569 846 -1426 -1846 240 1628 -52 -1762 -1399 912 1173
1455 1173 -210 -1415 -934 545 695 -185 -1608 -969 772 913 -475 -1934 -910 1277 1131 -958
1471 -958 -2109 -71 1337 415 -1620 -1733 -110 1207 -53 -1886 -1407 399 1288 -333 -1923 -1267
1487 -1267 939 895 -906 -2244 -578 1163 434 -1256 -1565 47 822 10 -1280 -1349 119 1091 282
1504 282 -1432 -1428 -68 962 -57 -1724 -1167 484 769 -647 -1681 -504 673 462 -496 -1624 -926
1521i26J603j32j472j091J519J551n84k166k10K305O54j644j167O12J892N7j405
1538f04p32N79J390j30j075q36O64J625N3j939n77J217J522j018j542L30J729
1555F56mp92n88M4N26O08j53j278o86J839J249j407k224J306K003k90k161r2J628
1574A84R78r18r56K36M45P8J07j057n20J353J359o12k251K46K275L12k140p56
1592a637K008J172r92j679N77P59p7l46R9k39k02J226N68j744r46J514J159j201
1610A9j393J054J723n07j311l34R87r0j08K11l59l10Q64J120j621j808Q74K511
1628A522m92k387N79K369L36k591m20Q20Q21p81K31J86M9L6Q66k03k134l62K156
1647F01O91j576q63K196J069k122j315Q92R36p14r1R42Q3n57N03M28j460j470
$$ plain form
1521 -926 677 545 -927 -2018 -499 1052 468 -1698 -1908 397 1051 -593 -1760 -1148 744 801 -604
1538 -604 -1336 -757 633 503 -572 -1408 -744 881 934 -1005 -1582 -365 1157 139 -1403 -1073 656
1555 656 652 -140 -728 -684 -158 450 297 -981 -1667 172 1421 14 -2210 -904 1099 809 -1352 -1444 184
1574 184 1162 244 -712 -476 -31 47 154 -903 -1423 -70 1289 677 -1574 -1328 947 1259 -881 -1637
1592 -1637 371 1543 551 -1128 -551 208 131 -215 -116 -355 -557 669 1237 -507 -1453 61 1220 19
1610 19 -1374 -320 1403 896 -415 -749 238 148 40 251 -108 -418 446 1566 -55 -1863 -989 1522
1628 1522 1030 -1357 -778 1591 1927 -664 -1084 -264 557 -224 7 193 242 278 1144 941 -1193 -1555 601
1647 601 1292 -284 -1147 1049 2118 -4 -1319 -427 509 -205 -296 646 729 172 675 1103 -357 -1827
1665a827J483K160j202j918J307K154j080k488j77K042K62j028L20P59l63l81
1681B3Q39r31j239O59J848L37k060K4J892P2k418p91J780J222j162l64J440l17
1699H54j153M13P10j650n33K037J567j746j523J238J459j699j792R75K217q47
1715E27o86R87J76j337JN55m89q61Q81K186r35j885N56J881j115k144P42K420
1733A460k27j346k1J316p87r94K26N81m89j22J827J46j896m47J412j0j784l65
1751a520K127J164j432q49J216j0j229k80P44j8k61Q33J106j295j585J091J089
1768H91j271j162J159K191p97j654K22Q53m31q54N76O87n06L80Q19p03j402L68
1786f34R61K19j503P2K413J5j536o15R91l80p86M81R55k45o42R02L22j543o19
$$ plain form
1665 -1827 -344 1816 614 -1304 3 2157 1077 -1411 -1588 454 716 -312 8 767 404 23
1681 23 862 -69 -1308 -649 1199 1536 -524 -500 1392 1464 -954 -1745 35 1257 95 -269 1171 854
1699 854 -299 114 824 -826 -1359 678 2245 499 -1024 214 1673 -26 -1818 -843 1374 527
1715 527 -159 828 1004 -333 -332 223 -266 -1127 -246 1940 1005 -880 -324 1557 442 -1702 -960 1460
1733 1460 1233 -113 -134 1182 395 -599 -373 208 -281 -403 1424 1570 -326 -773 639 629 -1155 -1520
1751 -1520 607 1771 339 -510 706 696 -533 -813 -69 -87 -348 485 1591 296 -1289 -198 891
1768 891 -380 -1542 -383 1808 1011 -643 -421 432 1 -853 -277 410 -96 284 1103 400 -1002 -634
1786 -634 327 546 -957 -885 1528 1543 7 -608 383 3 -783 -302 653 408 -234 668 990 -553 -1172
1805a172J086Q62j196n72J483R55j298j006N07O05n20l24P67K10m95L81L68q37
1823a96r31O14J510o95r51M20J648r40j401M19P75j03q20N12O42k77m09L14K37
1842C68j095m9J073K40j077K94P57J50r71p45J321J82r66J77M81j31j02J00N7
1861F4n46j03O06N99r19k34P34O33j017r95Q22Q52l39o54M26L71K0k94j96r6O9
1882a97k8P31m06n03K08Q23n50p35K1Q98K29o80k14L01L10l44Nm8j30J79L07N01
1904F78j021j38M77M78o24n11O82L77j82k81m3J77J40k23j35J52l96O12j58j66
1924a05k21M33l7r6k77K97K20r2k17j31K58O1k20j23o4J97K07j1k7j48m3K08O2
1947A31m53L45Q9J5k18k03K65J25k25l4R9n9L78l03l8j34J05K02k11J08j20M73
$$ plain form
1805 -1172 -86 776 -420 -992 491 1446 148 -858 -351 254 -266 -590 177 387 -108 273 641 -196
1823 -196 -1127 -513 997 302 -649 -229 1419 479 -922 -503 272 169 -651 -139 503 226 -183 131 368
1842 368 -727 -776 297 537 -540 -246 511 661 -310 -1055 266 448 -518 -341 140 9 -93 7 64
1861 64 -482 -585 21 620 -299 -533 201 834 -183 -1178 -356 496 157 -497 -71 300 320 26 -170 -266 -197
1882 -197 -225 506 100 -403 -195 628 78 -657 -636 262 491 -189 -403 -102 208 -136 -131 -179 -309 -130 177 678
1904 678 -343 -481 -4 474 -150 -661 21 398 216 -65 -108 69 209 -14 -149 3 -393 219 61 -105
1924 -105 -326 107 70 -26 -303 -6 214 122 -95 -226 32 93 -127 -250 -314 -117 90 79 52 -96 -139 69 131
1947 131 -322 23 112 127 -91 -294 -29 96 -129 -163 -64 -123 255 -48 -86 -220 -115 87 -124 -16 -136 337
1969C37l35P8l55Q4N26l12l38R0L31K57m31j22j49L38K44j94j62R2O7J69n5j33
1991B7j76J92K15n31J84J23J47l5k29n9r5K24L32k56k35j17J66J97k79K3L39k
2013A55j08n03K53J12K32J58l59L8k2J78M5k84m2P8O6k41K47k2P9R8j72j76J32
2036e8J46j72J78N6k08k00L46q4k60K18L5q6k5J42N1L0n0l6l35J52M53m34K84
2059A43K9m55L69k25J61kK59k50j01K84J14n02K54OJ22o7l3l30J25K59l0k44l8
2082a52K23j05J58k40j68P3L02N6M8r4k18J79j31j53J03r3J91J21p5r2n4R8j1
2105c4j00Q6k9OR5k99K39qK70j40q3J67k61q5J36J2L9N6M7j36l2L94J5l56j30
2130a31k27M61l7L1J13j39r1mJ84k16K29m76J26Q9m5L93l70J85j31o2p8l8P3J03
$$ plain form
1969 337 2 80 -275 -191 335 23 -315 -225 106 363 -68 -190 -339 -1 243 49 -113 -21 46 215 160 27
1991 27 -149 43 258 -273 -89 34 181 146 -83 -142 -237 -13 319 63 -172 -289 -123 74 -205 -182 157 155
2013 155 47 -456 -203 -91 141 299 -60 -22 -44 134 179 -105 -147 -69 -3 -244 3 -19 60 158 -14 -190 -58
2036 -58 88 -84 94 150 -58 -258 88 4 -256 -38 -3 -89 -114 28 79 109 59 23 -312 -160 293 -141 143
2059 143 172 -283 86 -139 22 20 279 29 -72 212 326 -176 78 84 206 139 106 -224 -99 160 130 -114 -152
2082 -152 71 -34 124 -116 -284 -211 91 147 195 101 -117 62 -69 -222 -119 -212 -21 100 25 -67 -121 -23 -34
2105 -34 -134 -48 -77 -71 24 -275 -36 -44 226 86 3 170 -91 -176 -40 -28 11 67 114 -22 -54 340 355 -1 -131
2130 -131 -358 103 66 97 210 71 -20 -24 160 -56 173 -303 -177 -88 -133 260 -110 75 -56 -118 -196 -234 -161 -58
2154e8J04j73J17o7L26j82k44j0J68p9J94j77o6J91J62j78l42K18k60M04j67L08
2176A89j9m7q1q2k47K16K03L8j31M7j33p3Q1j24K27j68J55p4Lk2p9J3L26k68R1
2201D1p9R5K07j26j13j82J95L36k61k12kP5J03j42j24K07k9j99K10J6l12M57m17
2224b56L73k23L4J00M2k08J42J03j03J81k91K35k86j96N47r1q3k9L07l23k36J11
2246a50K38k6j06O4K4j16Jo7K48J8l35J70p1O8J98k44Q7Op6J89l40K00RK56p5
2271A70m13OK90K90m74OM04l57L25k73L43l02k96K48L10l14k84L25J16M4l15r1
2293b42J44o9j65N59j75J85n33L60j77J43p5P8j29j45K97K27N2m65o1J80N5J29
2315A73l30J94L67l20j97P2k51J56P1J48j61j12L75l3Q8m07J55J17l41J08M9L46
$$ plain form
2154 -58 46 -127 -10 -77 249 67 -177 -187 -19 -98 96 -81 -147 44 206 28 -314 -96 -356 48 -119 189
2176 189 170 123 42 -40 -287 -71 132 170 39 86 -47 -120 -39 -163 64 -104 51 -23 -20 -42 -121 -108 218 -50 41
2201 41 -38 57 264 138 25 -157 38 374 113 -99 -101 -26 77 -65 -189 18 -11 -210 0 16 -296 161 -256
2224 -256 117 -106 -72 28 70 -138 4 107 4 185 -106 129 -157 -353 194 103 20 -9 298 -25 -261 -150
2246 -150 88 62 -44 20 44 -72 -71 -138 110 128 -207 -37 -108 -40 158 -86 1 7 -69 120 -220 -20 -11 245 170
2271 170 -243 -237 53 343 -131 -125 279 -78 247 -26 317 15 -281 -33 277 -37 -321 4 120 164 -151 -242
2293 -242 -98 -167 -332 227 52 237 -296 64 -113 30 -45 33 -96 -241 56 283 335 -130 -191 -11 44 173
2315 173 -157 37 404 84 -113 -41 -292 -136 -65 83 -78 -190 185 152 240 -167 -12 105 -236 -128 -79 267
2337B67k46J08j09j86r3J15N93l68o8l2J57%k63r1L47j69k62K84L0o0j8qK44r3
2361G9k1p6L32l64LJ24J06k94p1L90N7k49j07J24J42n02J05L08j49LK3N22l66
2384A19k99J88l4Mj31K7L37l30j56K33L7P3k47K86nl34L10Q3O3j07k79K75k9m18
2408c34K29L94R3o68K12L68k01j45j95L24K11l44j39K35j52P6Ko5k30J02L06L76
2430D55m82m16M93j27O1j3O3j59J57p4K96q1l33J53R1k89j07L03M65j99m36K47
2452F8J47L7k58o8Q7N3m6L58l78J56p3nr4j88Q1L28J5k14k52L97l10J6J66j08
2476h5Q2O5r3M4j07j44J12J32jj26J43J86k94J52j46K20l79j00L62Rn6mo6n1L09
2501A64j70j32j35J0M29k9J7k81Q7J76l2j27n10N98oK0l09K00k6q2M88k25o3J35
$$ plain form
2337 267 21 129 20 -166 -259 -144 449 81 13 -19 138 138 -125 -216 131 -38 -300 -16 14 -46 -64 -72 172 79
2361 79 58 -18 314 -50 -47 77 183 -111 -182 208 265 16 -91 33 175 -327 -222 86 -63 -60 -37 485 119
2384 119 -180 8 -26 -22 -153 -126 211 -119 -275 -42 -5 68 -179 107 102 -232 78 161 224 117 -162 113 84 -334
2408 -334 -105 289 382 -286 -74 294 93 -52 -247 77 288 -56 -195 40 -112 -36 -34 -99 -329 -227 79 455
2430 455 -27 -443 50 -77 -16 -29 34 -125 32 -42 254 173 -160 -7 84 -205 -312 -9 456 257 -179 68
2452 68 215 252 -6 -74 13 66 20 378 0 156 83 78 -16 -204 -123 205 220 6 -246 151 -159 -143 23 -85
2476 -85 -3 62 -31 13 -94 -238 -126 6 5 -121 22 208 -86 66 -80 140 -239 -339 23 32 -24 -28 -94 -145 164
2501 164 -6 -138 -273 -263 166 137 154 -127 -40 136 104 -23 -533 65 59 79 -230 -30 -56 -138 350 125 62 197
2525A97k02J63k30q3K96n0Q7j80j51M03j05mJ75m99K04J00k01J50l47L89j23J50
2547A39j38J66o2j39M4k1J51J9j15q1N8K40j59k16J85P2j69J40p2k98K98j61L96
2570B77k80j09l7L79j36Rr8q4K43j24P6R3l92K12J53l35J84K06j10k83R9N4R3
2593I0j3j29R7P5L06o35M66l16J80j67O9j67J87J20j05J30j33L0j37kk20J95K59
2616A80k64nk57J96P7L1L54k72P1J4j08k7r1l48L46J63j33j83K44j27J91Q1j72
2639c9r3K33J87j62j30p4Q7J78k14J00j51L16j75m52K78L93j74j28l65L20m4K28
2661A19Mk19o9L49l4j04k01K30M0j02q7O1J85l39M7J04J66l0J79l45r2K7N4L99
2685C42l64j37K38J3J65k87j49L19Q0j80O1j36J85q3j85K85j83J19l43J56J36
$$ plain form
2525 197 -5 158 -72 -155 141 91 178 -2 -153 250 145 141 316 -183 21 121 -80 70 -277 112 -11 139
2547 139 1 167 105 -34 10 -11 140 159 44 -37 21 261 102 -114 71 143 -26 114 42 -256 42 -119 277
2570 277 -3 -112 -149 230 94 103 5 -79 164 40 116 209 -183 29 182 -153 31 237 127 -156 -57 -3 90
2593 90 77 -52 45 120 426 -209 257 -59 121 -46 23 -144 43 163 58 188 55 85 -52 -54 -274 -79 180
2616 180 -84 -89 -346 -150 -73 -42 312 40 111 125 17 -10 -101 -449 -103 60 -73 -256 -12 -139 52 133 -39
2639 -39 -132 101 288 126 -4 -78 9 187 -27 73 -78 238 63 -389 -111 282 108 -20 -385 -65 -109 119
2661 119 123 -96 -165 184 150 46 -155 75 115 13 -74 -13 172 -167 -120 -16 150 120 299 -46 -138 -111 -57 342
2685 342 -22 -159 79 92 257 -30 -179 140 220 40 101 -35 150 67 -118 167 -16 103 -240 -84 52
2706E2j37M50k52j27j10K12Q3Jk57K91P0m00Q8R4j2j10J7J56j3k20J65k89J79
2729f9O0O2N5J19n15M36n2j12r3K03m4p3j1Mq3M2Q3K91k54k06j7J31K07m25K41
2754b0L04l34M9r9J44k67N8J41J14L5l7P6j6m12N9P8K66L8j79O4J21o6k21L07
2778B03P8m13J0K40Mj11j49L84k14m1j25L83j41l01J83K33j61j12j96L94k74J85
2800E9N5p0M6l32J74j32j53K1M30N7j16r6L28j62k70k71J88L27m65M25J84J61
2822C88k75m2J68k89k13J42M23o0m45J77K62k71j73K87K44k89j95K54k53N2P6
2843c2J75q2l59J8L81K9k88j75L51Jm98K17L45J29l09pJ50O0k48MK37j02l51O08
2867B54j42Qr2RJ18l40L8K07N5j95p3M31o9m90n5M02kk77L09M3J02o22J52M57
$$ plain form
2706 52 -85 365 113 -14 -124 88 171 172 -85 206 276 -124 -36 58 46 -64 -47 109 96 -124 41 -248 -69
2729 -69 -9 53 108 227 -288 148 96 -16 -109 94 50 -23 -34 -30 -113 -71 12 303 49 -157 -174 -43 164 -261 -20
2754 -20 284 -50 -1 -100 44 -223 -165 -24 90 125 88 164 148 -264 -205 -127 139 177 -2 62 183 117 -104 203
2778 203 281 -132 -122 118 122 11 -138 246 32 -9 -134 249 108 -193 -10 223 62 -50 -246 148 -126 59
2800 59 114 44 90 -242 -68 -200 -353 -332 98 155 39 -57 271 109 -161 -432 -244 83 -382 43 227 388
2822 388 113 71 239 -50 -263 -121 302 242 -203 -26 236 -35 -208 79 323 34 -161 93 -160 -108 -32
2843 -32 143 61 -298 -280 101 130 -158 -333 18 19 -479 -262 83 212 -97 -104 46 106 -142 -138 99 -3 -354 254
2867 254 112 120 28 37 155 -185 -147 60 115 -80 -153 278 209 -281 -336 66 64 -213 96 139 241 -381 -229 228
2891B28l4p04M25L05j62J69n28L69j80j01J12L25m57J61M2J96m47R0M44k48R9
2912A04k35M34o1k79%J42J31l81J65J53n0k15Q8J7K7l98J30L54O6k00K36P5m18
2935a15k67L74m2lLO8K7j11K35M3k20l02j26N28L0j78j80N61l06k54J42J44k23
2958a72J08q2L77n3l8l13M64l08l18N95p9r4j34L34k22k66j7J75k12K80j76K78
2980A27%j22J07k20J3j16K79K81l80j24L60j60P0k86Q2J52N5j41J44J59j12l19
3002a51J2K86k46L12k59J66k87L20N1k68MJ10pj2P1m5K80m03r6J32L91m82k14
3025c35M63J43k28j6K5j12j36J79R5j36r9Q4j29J6J39J25o4r7K23k06l5r8J67
3048c2O0l8j54M0L25Q7j54l29K15J80m51K07J00N7j56j26K16K29n61L77j54J27
$$ plain form
2891 228 194 -510 -85 220 58 227 -301 68 -112 -213 -101 224 -233 -72 -30 166 -281 -191 253 5 104
2912 104 -131 303 242 -37 -37 105 236 -145 20 173 123 -92 -4 13 40 -358 -228 126 192 -8 228 303 -115
2935 -115 -382 -8 -50 -53 -50 18 45 -66 169 212 -8 -310 -436 92 122 -56 -236 325 19 -235 -93 51 -172
2958 -172 -64 -146 231 178 140 -173 291 -17 -335 260 181 87 -47 287 65 -201 -218 -43 -255 25 -151 127
2980 127 127 5 112 -108 -95 -211 68 349 -31 -155 205 45 115 -171 -89 63 118 -23 121 280 168 -151
3002 -151 -139 147 -99 213 -46 120 -167 153 204 -64 -60 50 43 31 102 57 337 -66 -162 -30 361 -121 -335
3025 -335 128 271 43 27 52 -60 -196 -17 78 -58 -157 -73 -202 -186 -47 78 14 -83 140 -66 -101 -199 -32
3048 -32 28 -10 -164 -124 201 288 134 -195 20 200 -251 -44 56 113 -43 -169 47 276 -285 92 -62 65
3070F5O7KNj4j39J66j31m8O3o3K30k58O6j32L77j64KJ49j74o9j56J14J45qk44
3095a49J78j39J27p6j21j09J85K41k43L55k26O8o8r2J22J21j62J52Lm13L87k46
3117a05j57K22Q5P2j31J46k22k76K68o6R3j16O2J10n5O5j28K33n0m5k34J78j4
3140f5J08n8J52j78J28l6N9L9k45m6k64N23k5J18l83J73M7n4J25r2m4K65k04j36
3164i3J38N9l71L40l26L65J1m8p8OkJ25j71p7q0K20m2Q7j30j09J50J34l5Jj65
3189i1J01l6N4k2L8l5j28N6J49j43Mm1p2K96k0k54M00m13K22N0j65J25j30r8Q9
3214f4K18j20j3k65J05K38nl92K33P3n5L6j6R8K6N4l27R5J73m3k42J89L0j24R9
3239Ar3J76q3m1J61n9j72K28K07k32k08L53k92P7n5k11J55J0J03J18k12K77l11
$$ plain form
3070 65 132 134 139 125 -14 152 21 -27 36 -27 203 -55 11 -121 256 92 94 243 69 0 -156 -42 103 95 -149
3095 -149 29 -110 17 -59 -180 -289 -104 137 -106 249 23 91 23 -69 53 174 12 164 167 -246 141 -105
3117 -105 -262 -40 45 117 -14 132 -90 -366 -98 -164 -71 -187 -125 -15 -70 -5 -133 100 50 5 -229 -51 -65
3140 -65 43 -15 137 -41 87 51 110 149 -96 -142 -406 117 92 210 -173 0 47 -7 118 26 -18 247 43 -93
3164 -93 45 104 -267 73 -253 112 123 75 -3 3 1 126 -45 -122 -202 18 -24 63 -67 -176 -26 108 73 74 -91
3189 -91 10 -26 28 6 44 9 -119 -63 86 -57 -53 -94 -166 130 110 -144 256 -157 65 115 -50 75 -55 -153 -64
3214 -64 154 34 21 -244 -139 99 94 -298 -65 8 -47 -11 -27 71 97 151 -176 -81 92 49 -193 -4 26 -98 1
3239 1 -92 84 1 -40 121 62 -110 118 325 93 -115 238 -54 23 -32 -243 -88 -78 25 143 -69 208 -103
3262a03L49l17k52N66q8J04k19j36Q8pj06j6K9K32k52K46K5k04J01j11K21m26
3284b76L05J59q8j19j11p6K65j59J01o8J08j01n9J9j42M5O7J67K40l50K65j99
3306gk5J35k92M09k41j01K67j96l8L0J34m1k03K56nJ1l41L31J77l44k3J02J98
3329A93k09j40J80K23n03J43N06m38K16m82M05K3m6q6N0M79o23j09K60kp1J43
3351A12ok27j47J26K11j49J94J84L8k76k30L28J50l07Pj08J98l6P0j77K90m29
3373a84J49O6PN4J18j73j25l2J32J48n54M37j84L43j64l8l5K9l12P1L47J88l66
3396g8K8K62j00k97j39O46k92j06KK21Q7j67j47J43k55K75j29R2k95J43J98J11
3418B03m09K26n7l3K4k76K17L54j64m29L77Q9m38K07q9M80k62k20K97k08RO4J63
$$ plain form
3262 -103 246 -71 -323 243 155 259 40 -96 -8 -15 -121 -137 -108 124 -128 118 143 -61 40 -71 150 -276
3284 -276 29 188 100 -19 -130 -206 59 -100 1 -67 41 -60 -119 -100 -242 -197 -130 37 277 -73 192 -7
3306 -7 -32 103 -189 220 -21 -122 145 -51 -89 -59 75 34 -169 87 82 93 -248 83 260 -84 -107 -5 193
3329 193 -16 -156 24 247 -256 -113 393 -45 171 -311 94 117 71 -15 35 514 -109 -218 42 40 -31 112
3351 112 106 -121 -268 -142 69 -80 114 298 336 60 -170 158 308 1 8 -100 98 62 132 -45 245 -184
3373 -184 -35 31 38 92 210 37 -88 -120 12 160 -394 43 -141 202 38 0 -35 -6 -318 -247 100 288 -78
3396 -78 -50 212 112 -185 -324 322 30 -76 -74 147 234 67 -80 63 -192 83 -46 46 -249 -106 92 203
3418 203 -206 20 -37 -70 -46 -322 -105 249 85 -344 33 122 -316 -109 -198 282 20 -200 97 -111 -102 -38 125
3441A25k02Lp9M97l23k36K18Mm1k36L82q1q8M0J31m0j47j26J40K29j73p1L04Q2
3465C12l78n29N75K17j51j27m3K61l25l1O5J05k01K81O1p1l95N79k54O0k06K14
3487A9L60r6l69K43m0m86M57j67J52j7j06K42r1j43R1M5m4l05N8O20m00j46P2
3510e1P9j99K72k09K67l24p6J68M3l4L2K71N7m30J14J85j94j37K01Q1k6l96J33
3533a73J25m1k4O9N21k85o51L19O8j5k1n9L31n20K22L92m13J90P1P3k72L8m5L01
3557B01R6j98l00K14pj11j2mM62l61k0n2m8RM9J09L32m23j40J55J06l76L29N6
3581F6j6j38J25j02Q0k3J26n48K68J19L56m26K45j11L4rk43J22J18l5J20l6p3
3604A9K15n18K23j38J03m12O17O3l71K54Q9J33k43j64Q6K14k4j76J44P0j71k5
$$ plain form
3441 125 -77 -74 -153 344 21 -215 3 7 -34 -270 112 31 -57 -17 114 74 -73 -199 -59 170 -3 -74 230 312
3465 312 -66 -595 -20 197 46 -81 -124 137 -188 -219 -154 -49 -250 31 92 21 -374 205 -49 11 -195 19
3487 19 379 283 -86 157 117 -369 88 -79 73 56 -50 192 101 -42 49 94 50 -255 -197 423 23 -123 -51
3510 -51 28 -171 101 -108 159 -165 -241 -73 -30 -64 -32 239 296 -134 -20 165 -29 -166 35 116 90 -306 -173
3533 -173 -48 -89 -113 -44 477 192 -459 -140 -72 -87 -108 -167 164 -356 -134 258 -155 35 106 179 -93 -55 -100 201
3557 201 297 99 -201 13 6 -105 -117 -121 341 -20 -40 -92 -140 -131 -82 27 359 -64 -204 -49 57 -319 10 66
3581 66 50 -88 37 -65 15 -8 118 -430 -162 -43 313 -113 132 21 55 46 -197 -75 43 8 128 92 19
3604 19 234 -284 -61 -199 -96 -508 109 172 -199 55 144 277 34 -130 -44 170 146 -30 114 184 13 -12
3626a2M3j19l3L51l2n75q5L92r7L52m39L31n1R9j56J16K6j31j13n1N2J21k22J34
3650i9M17l76J07J86k1k99k69N04k6l96K38N3J73k18J20k30N9J87M4J01k26k32
3672b03L42j60n2K3o3K23k3k56O7J18J51K2mj85l3J82j89k2r2L46j4l9k70N4K71
3697A94l17K64m8m6j91L7n1Q8L2k95K41o1K32q8j61J98r2J23j06o2L8j60L17k21
3721a35J74n6o2P6K97j89N0o6P2j34k07j37J34M99l18Q4p8j03J17j64Q7L9J48
3744A28j37k46K42j27J81l3j70J74l8k16K83R0j41O0k24M38l50J99L3n1k1j65
3766i1P7M1q9m1J8J84l3J3j3m09L01J69n6j23P5m8j64K62j76L05k81J42j7k14
3790a68J43NJ15K40l18N2k00r6J79l6J53m3Qj31L17L6l36p1L21k64J01r3J73J16
$$ plain form
3626 -12 31 -88 -121 230 198 -377 -462 -70 -167 185 -254 77 26 125 -31 85 111 -20 -133 -184 -132 -11 -233 -99
3650 -99 318 -58 49 235 214 -85 -354 150 124 -272 -34 19 192 -26 94 -136 -77 110 154 255 29 -203
3672 -203 139 -21 -73 -50 -113 110 87 -169 -102 16 167 189 185 0 -33 149 -40 -62 -154 192 178 139 -131 -77 194
3697 194 -123 141 93 47 -144 -107 -158 -70 -38 -333 -92 -153 79 -9 -170 28 -64 59 -47 -109 -71 -231 86 -135
3721 -135 39 -17 -79 -3 294 105 155 89 161 27 -180 -317 -183 316 -2 82 4 -99 18 -146 -59 -20 128
3744 128 -9 -255 -13 -140 41 8 -162 12 -26 -242 41 131 -10 50 -174 264 -86 113 146 95 74 -91
3766 -91 -14 27 -62 -103 -85 99 66 79 66 -343 -42 127 71 -52 23 -25 -189 73 -103 202 -79 63 46 -168
3790 -168 -25 -20 95 335 17 69 -131 -227 -48 -84 69 26 34 -97 220 256 -80 -151 170 -94 7 -86 87 203
3814B03j56NQ0j59j0k23L27Q8j25O4q4k7m9K97j95j08Q7j89K51Jl93N44j36j77
3838h4J9J64l1Mj37J38j3q3M8j91K93o7j14J95k73k03N26j62j87k9J69K67k81
3861c2n7J18O4j88LK0l1L07m08M22j47j34oOL4r8J94k9J66l00KK14m7k96J07R5
3887b1M7k22Q9K37j07k56M21o9L6l77PK52N2j70J84K26n95J5L76Jj88j31L05m5
3911F7k64J31J38j95k5L16L1j26j53j96J76J22j01J40j42J42J14k1j8k98j29M83
3933A92k52p0k7L59j85k34L6K39k07j81R8L71l2k71J25N5k4M1j84R7m3M1J07K82
3957C33k10k74J5K16rj2kmj17n1J12m5pj67K63p5J66q2L77n00j1P6NJ07m0J4K6
3984A04M7l05j17L67k94J55J97j4k8k38J91O4l49k7j5M65k05Ll2k8Q2R2j6j73
$$ plain form
3814 203 47 52 132 -27 -37 -260 67 155 30 94 10 -17 -66 231 36 -72 15 -174 77 78 -315 229 93 -84
3838 -84 -65 99 68 72 -65 73 60 -23 25 -166 127 60 -54 141 -132 -335 191 29 -158 -187 -18 249 -32
3861 -32 -89 29 93 -95 -92 -72 -103 204 -204 218 71 -63 -69 -63 -29 -127 67 38 204 -96 -94 120 73 -223 -116 -21
3887 -21 26 -196 -107 130 23 -233 188 119 155 -222 -215 37 89 -81 103 329 -266 -251 125 126 -62 -193 112 67
3911 67 -197 -66 72 -123 -148 168 199 73 -80 -276 -100 22 -79 61 -81 61 175 154 136 -162 -291 192
3933 192 -60 -130 -157 202 17 -217 -181 58 -149 -330 -232 139 107 -164 -39 16 -8 33 -151 -54 -97 -56 51 333
3957 333 123 -151 -136 80 71 59 57 53 -64 -115 -3 -48 -55 -222 41 -34 132 50 427 -73 -84 -8 -3 104 64 78 104
3984 104 151 -154 -271 96 -198 -43 154 140 112 -126 65 129 -220 -247 -262 203 -2 1 -31 -59 23 115 99 -74
4008g4N5l5K54j43k33J75K54l13r2K1J74J15p2j25J81j46k01K33j18Q8MK92l3
4031B61l68k17K34K10m38K06K81j5k05m13O07K18l71j79K69J70m34L06m5j61J36
4052E2j1Mm8k69K96K44l34J25K60r3l13l5L3N92l20l06K11K26k45k71M36j59k14
4075a39rN30m42j38m8J44Q4j83J91K59J07n21K41K07k78J4M7ll05K75J60j41P7
4098A29k39K01J25k07k59L29L70k34m83L73j81r2J24J70J46l92J54J09k85rk88
4119d39M50j14J10j8L33l51N2j55L48k89j17L28k13J68k63K26k16J22j65M83j5
4140B65k96l58O63J51l86j84Kk5L2K50J60q9l18J64KJ28k81M0R0j10R6J36J65
4163B97n31L23j23N5p1P1j4LK15j89k47L13r0R7j23N5j35J37L42j71k62l8K37
$$ plain form
4008 -74 -19 -54 200 57 -176 -1 253 -60 -152 -131 43 158 86 -39 142 -4 -205 28 -90 -2 2 294 261
4031 261 -107 -324 -90 120 -318 -112 169 154 -51 -464 143 361 -10 -189 80 250 -184 122 77 -84 52
4052 52 41 45 -3 -272 24 268 -66 59 319 226 -87 -122 -89 503 183 -123 88 314 69 -202 234 75 -139
4075 -139 -148 382 -60 -198 -246 -102 -18 -201 -10 249 356 -165 76 283 5 19 66 63 -242 33 193 52 129
4098 129 -110 91 216 9 -250 79 449 215 -268 105 -76 -168 -44 126 272 -120 34 143 -142 -151 -439
4119 -439 11 -103 7 -11 322 -29 23 -132 216 -73 -190 138 -75 93 -170 56 -160 -38 -203 280 265
4140 265 -31 -389 274 425 39 -145 -143 -168 -136 114 274 185 -133 31 33 161 -120 -80 10 -100 -4 132 297
4163 297 -234 89 -34 21 -50 21 7 10 225 36 -211 102 12 109 -14 41 -94 43 385 214 -48 -86 151
4186A51j64O2j16J44K12k33N0k8o9L6L7j8j48K5J03L4j10l31M64l9pq5J02l77
4210c05K95Q3o7j1k10J46K90j51j89J62j01L96m51O2O3K40j20j97qj36J55L7O5
4233D8j06p3L06j26j80M9K11j49O5o2o3J25m88M49J55j19K90m98J59j43J93j45
4255a02J03K38m55J62n7Q5j21K63j6J7k73J79j44L68k08j49k9oJ82K37l08R3k59
4278b00L49j55k05M1J04L51n38N31l11j21K2K24r0Q5j05o5lQ3J33N9j91O9j14
4301d7K88L3j74r0J13m33L90l6l11K28j74K87r0K2p0J64n3j41J36k16N13j30m18
4324b09J64k11J62L08j49qj60J32m3K06n08K89J52k02K01j37oJ36k26K39p4p1
4346a5m6p0L80k66J76j64L65l74p5K04k22L7l03K97K13j13K34l16K60m78K53o6
$$ plain form
4186 151 -13 49 -67 77 289 56 106 78 9 45 82 64 -84 -59 44 78 -32 -363 101 62 55 -30 72 -305
4210 -305 -10 73 6 -5 -215 -69 221 70 -119 43 -58 338 -113 -51 12 252 132 -65 -73 -209 -54 -17 48
4233 48 -58 -131 175 49 -131 -82 129 -20 45 -17 -80 45 -443 6 161 42 332 -166 -7 -150 43 -102
4255 -102 1 239 -216 -54 -111 -26 -147 116 100 117 -156 23 -121 247 39 -110 -139 -145 37 274 -34 59 -200
4278 -200 149 -6 -211 -170 -66 285 -253 278 -33 -154 -132 92 2 87 -18 -83 -86 -3 130 189 -2 67 -47
4301 -47 241 274 100 10 123 -310 80 44 -267 -39 -213 74 -16 6 -64 100 47 -94 42 -174 339 209 -209
4324 -209 -45 -256 -94 214 65 57 -103 29 -14 192 -316 -27 125 -77 124 -13 -19 117 -109 130 56 -15
4346 -15 -61 -131 249 -17 159 -5 360 -14 -89 115 -107 -70 -373 -76 137 24 258 -58 202 -276 -23 -89
4368h9j18J91j10J28N3n9J14n3k88j45L18N8J81k51JL06j07q3l98L31Q3J41l34
4391a30J73n4K00LP9l56k32P54o10o9N2K98J83j55J72l86J12j65J77j6m13L89
4413FK12j28q5k65J25M34m5j20J07j23j8k49J9K58M3O0j76p7J19j01l9j3P4R6
4437A14J8P8j85J69r3n4l37L85j90K71p9j84J17Oj02j06K79j57j11J76J49j56
4459Hn3j35J64J04j58J84j44k18L03k97L64k42Q1O5q7K24j13J64k79l58N31Q3
4481A91j88J2P3O6J42k45K5P1j92K43l10O8j0K14j00P3k62J1L69j40k2j07J58
4504A40K90o19K27O0l2j54J82K4j14k70L92J23J8l24P4J28j67j79Q2K81j10r6
4526d4R0L64l77q3K30k77O5J98j27R0n59M64J73l16J10j20K56k62m8J92o8J25
$$ plain form
4368 -89 -207 -16 -126 2 55 -4 110 57 -231 -376 -58 0 181 -70 -69 237 130 47 -351 -20 63 204 -130
4391 -130 43 -11 189 192 271 -85 -317 437 -173 -242 -190 108 291 136 308 -78 34 -131 46 30 -383 6
4413 6 218 90 5 -260 -135 299 254 134 241 118 100 -149 -130 128 171 231 55 -22 97 -4 -43 -56 18 114
4437 114 132 210 25 194 101 47 -290 95 -95 176 97 -87 30 36 -66 -172 107 -50 -161 15 164 8
4459 8 -45 -180 -16 88 -70 114 -30 -248 55 -242 122 -120 -39 26 -61 163 50 214 -65 -423 108 191
4481 191 3 15 88 154 296 51 76 147 -45 198 -112 -44 -54 160 60 133 -129 -118 251 111 89 -18 140
4504 140 430 -189 38 98 66 -88 94 118 4 -266 126 249 267 -57 17 145 -22 -201 -119 162 52 -44
4526 -44 46 410 33 -50 180 -97 -32 166 39 129 -430 34 207 -109 1 -119 137 -125 -173 19 -49 76
4548G6K22j77J01k84M7J14o2m4L0j49J10l5k51K17J46k81J68r3J03l0j17K26m1
4571dK20J4k75p1r8L47p3P0m4j96J33K08l31K23m4o9k21L56Q1J92l63j46J83k84
4595a92J95K64O2m81j05M69nn04K61J07Pj8kl8k67l7L95j51Q4j01J22K81k71q0
4619ej09L07l09MJ75K2M9k64J19K8J55r6J19l23O4j04J03L26m82J86J89mk62O8
4643d4lp4J28Nj4l4O6j46Q5p0O2J64J17m20P0J09j36M0j2N8K07l27K29r1l90M14
4669go3J27l04L68q2k1k62p6L03j57n9k9L54j87M9p4Q2J94j36j16K68j47j74M6
4693a03O0Q6j20J1ON7p0J42j50K63j85k53M62j82P1p4j05Q8j6j64L1J72j26L54
4717B55p5k79M7L94j73k9k37K41K22n85R6K17j30J03n9K54m74L02N9p8k51j54
$$ plain form
4548 76 298 121 222 -62 -15 99 37 -7 23 -126 -16 -51 -302 -85 61 -220 -52 -145 -42 -72 -189 37 -4
4571 -4 216 230 -45 -116 -214 133 60 130 86 -110 23 231 -100 123 79 10 -211 145 226 418 55 -91 92 -192
4595 -192 3 267 329 -152 -257 212 207 -297 -36 71 78 60 58 20 -247 -284 111 -40 44 -57 65 346 75 -5
4619 -5 -114 193 -116 -112 63 85 134 -130 -11 17 172 76 195 -128 -64 -168 -65 261 -221 -35 154 150 -112 -44
4643 -44 -47 -121 7 12 -2 -36 30 -116 -31 -101 -39 125 242 -178 -108 1 -135 -95 -107 -49 158 -169 60 -31 -421 -7
4669 -7 -70 57 -247 121 39 18 -244 -320 -17 -174 -233 -262 92 -95 -46 -120 -38 156 20 -96 172 25 -149 -103
4693 -103 -43 43 -77 -66 -60 -3 -73 69 -81 182 -3 -256 206 24 95 21 -84 4 -12 -176 -145 27 -99 255
4717 255 180 -99 -52 342 169 140 -97 144 366 -219 -123 94 -36 67 8 262 -212 90 149 71 -180 -334
4739c34L53n5L80l17J29k31n4j1N3J11j27J40J86l64PqJ84J49l66L49m12L21k87
4762b04J4N8n5j4J06O4l7L1m3M99n07j7J6J71k6o3j04P9J00k32J13P5Qj19P7K39
4788B29j76j92J06K49l66J02K02j60j05J15J17o8p7N6mk1j47J50k70N17l27R0
4810B0L6M9J60k36N1j9l7K13j81P2o8K28l22m9J90j61K56l72M93k81j05J14Q8
4833A39k51R1K1k11K72J91j66j25j04K10nk60J22j6RJ99j22J48Lj94J26o0N3k35
4857a65K62k31J16J02j13j26L95k07J99k86p9J25J89k84J28k2K22j29q6J74n8
4878A26j21K11l5l28nK41J00m07L01KL4j71j10K43l8L36o15K07p8J81J43k69J22
4901G0o3r4R9J51k77r2J27J67k24K09j1j41J79Q0k75J01R2j35K47l49K00L5J26
$$ plain form
4739 -334 19 -36 344 27 156 -75 -129 -140 -87 24 -103 37 223 -141 -134 -142 42 191 -175 174 -238 83 -204
4762 -204 -190 -132 -187 -201 -95 -31 -68 -37 -80 419 -88 -105 -89 82 56 -7 -111 -32 68 -164 -51 24 32 -87 -10 229
4788 229 53 -139 -33 216 -150 -48 154 -6 -111 4 121 53 -24 32 28 7 -140 10 -260 257 -70 20
4810 20 56 105 265 29 80 61 24 237 56 128 60 288 -34 -83 107 -54 202 -170 323 42 -63 51 139
4833 139 -112 -21 0 -211 61 252 86 -39 -143 67 62 -198 -76 -92 -83 116 -6 142 145 -49 77 17 70 -165
4857 -165 97 -134 -18 84 -29 -155 240 33 232 -54 -133 -8 181 -103 25 3 225 96 10 184 126
4878 126 5 216 181 -147 -152 89 189 -218 83 85 119 -52 -162 81 43 379 -236 -29 -107 74 217 -52 70
4901 70 7 -87 12 163 -114 -206 -79 88 -136 73 62 -79 100 180 -95 6 98 -37 210 -139 61 96 222
4924B22j35k05k6J73o3o8p4j00M76k89J59o7J28Pl64J49Q5j02L18j31J14m37J76
4947e4j89J60J29K58l35K11j16j56J16k30L65L3K4j02j40J80j27j67J44K4R7j92
4969f7k12M04j58l0qqJ71o7j12J92j28Q6k04R8MJ29j8k90J12J84l9R7j43j5J71
4994A49k14Q8L0k1k47L33j68J49k71J19J3j37P1N9M1J64q4r0j92K1L01j61k6j25
5018a98L23k5P9l02Jj14Q3K27Lj59J0K8K32k00q6K12M3k19k56M2J48k0K12k86
5042b22J51P3N3k9O8N6j67N1J17M7k45L51k62L8k54K79J24j57l63M14JM1j24o7
5066b6Kj88j06J98K70m9j97K25p9j23K29q9p7K10j44pJ09j4p5J41k01r3j32K46
5090C0K3k06N6L9r4L75k53r9N3R5J24N6n0p3N5l15K20j89L8O0J44l11L49j06k29
$$ plain form
4924 222 87 -118 -144 29 -34 -102 -176 -276 200 -89 70 3 131 138 -226 -77 8 -94 224 93 207 -230 -54
4947 -54 -243 -83 46 304 -31 180 64 -92 24 -206 159 192 216 114 -26 154 27 -140 4 28 125 -67
4969 -67 -279 125 -33 -63 -71 -79 92 25 -87 105 -23 63 -141 -43 -39 90 72 -218 -106 78 39 136 -7 -22 149
4994 149 -65 23 53 32 -215 118 -50 99 -172 -53 -40 -177 -106 -47 -6 158 74 -16 -208 -187 114 -47 -73 -198
5018 -198 125 100 179 -123 -122 -236 -153 74 77 -82 -72 -44 188 -12 -98 114 157 -62 -318 -276 -128 -148 64 -222
5042 -222 -71 2 55 26 94 150 -17 34 151 198 -47 304 42 80 -174 105 229 72 -291 123 124 165 41 -26
5066 -26 -24 -212 -318 -120 150 101 -96 129 50 -73 156 67 -10 200 56 49 158 144 69 210 9 -84 -216 30
5090 30 53 -153 -97 -58 -152 223 -30 -129 -76 19 143 199 149 76 131 -184 36 -153 -115 -55 89 -222 127 21 -208
5115b08J05M19l69J51j09K5K57j95j88P7o1J50j45J94k26L34j85r6r9J58L1J8
5137C8K7P3p6l8K17j17k9l49L21j38L47j13K77k62k75J23M3q2j27j33K81J29l95
5160b58L82j04k02K89K6n1j85p6K71j17J78j67o5j8J92o7k0j5K49j67m6j4j06
5183i1J57l3J88k43Q7L1m3N7j29m6L17j83l6p0J74j90K3J20jj7k68J24K84m85
5207b73M60n2j59O8m7j20K17Jj99K16j30K61k48J09k82n8M58j90m1n4k0J07N8
5230H2M9j5j8p5R6l11L72k47K5N5R0l04K50j8J2K48k37k40J81j63m2M16l10o4
5254a68m8L48l48R2N9J16K2o5P6k5n7J51j86k82M02Q6l07Q6O8q3j7J75J21j07
5278A09J06j68K03j42k7j65J58K9O6o3j94MK64j93k07L86J03k98J97m34K99J31
$$ plain form
5115 -208 -103 316 -53 98 -11 14 271 76 -112 -35 -96 54 -91 103 -123 211 26 -70 -169 -11 20 38
5137 38 65 138 62 24 241 124 95 -254 67 -71 276 163 440 178 -97 26 69 -13 -140 -273 8 137 -258
5160 -258 124 20 -182 107 133 82 -103 -179 92 -25 153 -14 -79 -97 95 28 8 -7 242 75 29 15 -91
5183 -91 66 33 221 -22 65 96 53 110 -19 -65 252 69 33 -37 137 -53 -30 90 89 72 -196 -72 212 -273
5207 -273 187 135 -24 44 -3 -123 94 95 -104 112 -18 243 -5 104 -178 -236 222 32 -9 -63 -83 24 82
5230 82 131 116 98 23 119 -192 180 -67 -42 13 103 -201 49 31 43 291 54 -186 -5 -168 -210 206 -104 -168
5254 -168 -216 132 -216 -124 -65 51 73 8 84 59 2 153 -33 -315 87 173 -134 -48 20 -63 -80 95 216 109
5278 109 215 47 250 108 81 -84 74 103 169 106 -88 -84 180 -13 -220 166 269 -29 168 -266 33 164
5300A64j22m4m8J53K26m04r6M9L09p2J92m31l2q0L27N8j00j18K37J7l73K06J02
5323A20j97R7K74m46J58k24K58R8q7J29k62J14J34j20j27n8J93Q7k38O7K40m6
5345A64k78J29k01M14l82L9K31J55j39l3j15l1J29J9k81K03q2J28L7q9o4j43M18
5368B28j36N8j62k23j7R6r6O02o29K60J28n4N8k44J12j5J94m25M77k72O5N5P7
5391A37K8k33J31k54K23Q3o9L8j23l6L29j82o3K25m24L73j93oj36L24k52M51m58
5414h7J07J04M0l60Q6J19j49R6J7k08J85k56K07K20p2L0J01j15m4J03k77K38J35
5437B20k90J59K8j92P8J27J09m25K81j30R5M5Q8m60M0J53K36m3j55J89j84m7J19
5460D1j17P7MR0l1n0K4L78m98rN1J98k80j4K82k38J07KJ18m9M0J9p8nj95M9j37
$$ plain form
5300 164 42 -2 -50 103 329 -75 -171 -122 187 115 307 -124 -156 -236 91 149 49 -69 168 185 -188 18 120
5323 120 -77 20 294 -152 6 -218 40 138 51 180 -82 32 166 46 -81 -139 54 141 -97 -30 210 164
5345 164 -114 15 -186 228 -154 -115 116 271 132 99 -16 -47 82 101 -180 23 -59 69 106 17 -47 -190 228
5368 228 92 150 -12 -235 -252 -156 -252 350 -279 -19 109 55 113 -131 -19 -34 160 -265 212 -60 5 60 137
5391 137 165 -68 63 -191 32 115 46 84 -39 -75 254 72 9 234 -190 183 -10 -16 -152 172 -80 371 -87
5414 -87 20 124 164 -196 -110 9 -140 -44 -27 -235 -50 -306 -99 121 49 79 180 65 21 124 -153 85 220
5437 220 -70 89 117 -75 3 130 239 -186 95 -35 60 105 193 -267 -227 -74 162 119 -36 153 -31 -78 41
5460 41 -76 1 5 95 64 14 38 416 -82 -91 -40 158 -122 -136 146 -92 15 17 135 86 126 145 67 62 -133 -84 -221
5487b21K88m5j99K84L3l05l0J11J33j39QR2l0J81m0m3m8k13J51J77l00R8j9K8
5511d8N1j60M23k81J09j20P3J08j26J07l7o0k92K64Ok17L52k43J01L82n56J36
5533b8q9J53j8J50k35J39K44k96j43J50q5O9pnP4j08J23jK6k51R2L2j7J05k12
5558a38J05J21k02J67J19m85R8J99m2K92k30N0j80L30l05J32l87M41j85J56j14
5579e8oJ28J30j42O0l5j8k27M15l89LN8Q8L7k07K42Jj81pJ64j40J25j16ML27j07
5605A49l26K91r0J39k01O8N0p6P4L2J24j97j63J02J20j84M4o6K05K1q1j54K90
5628A71L6j03j46K05j08k84O4K94l42J37Q2J15l15J19K30k14Q6L3k23N5M6J3K82
5651B33k46j25Q5L9J8j14L18m5j36j74J49p4K31l68k0K41M1k1k9N5j19R0J59p3
$$ plain form
5487 -221 67 22 -177 107 140 -165 -195 -84 49 -90 -82 10 -20 161 121 78 30 -183 -32 145 -155 -57 -76 -48
5511 -48 3 -157 266 -15 94 -26 47 155 29 136 99 39 -253 11 17 -200 152 -91 10 392 -164 -28
5533 -28 -117 36 18 168 -67 72 316 20 -123 27 -58 11 4 -1 73 -35 88 87 113 -138 -46 -14 -31 74 -138
5558 -138 -33 88 -114 53 172 -313 -215 -16 -58 234 4 54 -126 204 -101 31 -356 85 -100 56 -58
5579 -58 -64 64 194 52 112 77 59 -168 247 -142 -139 -81 7 44 -163 79 80 -101 -108 56 -84 41 -75 -71 256 149
5605 149 -177 114 24 163 -38 30 80 4 78 110 234 37 -126 -24 96 -88 -44 -110 95 116 35 -119 171
5628 171 207 104 -42 163 55 -229 -165 129 -213 -76 6 121 -194 -75 155 -59 27 60 -163 -108 -62 -49 233
5651 233 -13 -138 -53 -14 4 -110 208 163 27 -147 2 -72 159 -209 -229 12 53 32 3 58 -61 29 188 115
$$ [...]
8191C5
##END NTUPLES=NMR FID
##END=
