##TITLE=1H_SA_Slon.3
 CDCl3, 108 sc, 
 28.7.2020
##JCAMPDX= 6.0         $$ Bruker NMR JCAMP-DX V2.0
##DATA TYPE= NMR FID
##DATA CLASS= NTUPLES
##ORIGIN= UXNMR, Bruker Analytische Messtechnik GmbH
##OWNER= root
$$ XWIN-NMR		Version 3.5
$$ Tue Jul 28 12:28:42 2020 Russian Standard Time (UT+4h)  she@DPX200
##.OBSERVE FREQUENCY= 200.1315
##.OBSERVE NUCLEUS= ^1H
##.DELAY= (6, 6)
##.ACQUISITION MODE= SIMULTANEOUS
##.ACQUISITION SCHEME= undefined
##.AVERAGES= 108
##.DIGITISER RES= 18
##SPECTROMETER/DATA SYSTEM= spect
##.PULSE SEQUENCE= zg30
##.SOLVENT NAME= CDCl3
##.SHIFT REFERENCE= (INTERNAL, CDCl3, 0, 15.7039)
##AUDIT TRAIL= $$ (NUMBER, WHEN, WHO, WHERE, WHAT)
$$ ##TITLE= Audit trail, XWIN-NMR		Version 3.5
$$ ##JCAMPDX= 5.01
$$ ##ORIGIN= Bruker BioSpin GmbH
$$ ##OWNER= she
$$ F:/spectra/data/she/nmr/H-F/1/audita.txt
$$ ##AUDIT TRAIL=  $$ (NUMBER, WHEN, WHO, WHERE, WHAT)
(   1,<2020-07-28 12:27:30.71 +0400>,<she>,<DPX200>,
      <continue with go, POWCHK disabled, PULCHK disabled
       configuration hash MD5:
       00 E9 B6 7A A2 85 ED C7 34 08 36 98 17 FE 4E 26
       data hash MD5: 16K
       04 5D A9 5F 08 18 29 71 4E 06 A2 E7 B5 83 DA 38>)
$$ ##END=
$$ 
$$ hash MD5
$$ 2C 5C 35 97 5B D5 5F 81 0B FE 05 FF 1C F5 27 BF
##$RELAX= 
##$RELAX= 
##$RELAX= 
##$RELAX= 
##$RELAX= 
##$RELAX= 
$$ Bruker specific parameters
$$ --------------------------
##$DU= <F:/spectra>
##$EXPNO= 1
##$NAME= <H-F>
##$PROCNO= 1
##$TYPE= <nmr>
##$USER= <she>
##$AMP= (0..31)
100 100 100 100 100 100 100 100 100 100 100 100 100 100 100 100 100 100 
100 100 100 100 100 100 100 100 100 100 100 100 100 100 
##$AQSEQ= 0
##$AQ_mod= 1
##$AUNM= <au_zg>
##$AUTOPOS= <>
##$BF1= 200.13
##$BF2= 200.13
##$BF3= 200.13
##$BF4= 200.13
##$BF5= 200.13
##$BF6= 200.13
##$BF7= 200.13
##$BF8= 200.13
##$BYTORDA= 1
##$CFDGTYP= 0
##$CFRGTYP= 5
##$CHEMSTR= <none>
##$CNST= (0..31)
1 1 145 1 1 1 1 1 1 1 1 1 1 1 1 1 1 1 1 1 1 1 1 1 1 1 1 1 1 1 1 1 
##$CPDPRG= <>
##$CPDPRG1= <>
##$CPDPRG2= <>
##$CPDPRG3= <>
##$CPDPRG4= <mlev>
##$CPDPRG5= <mlev>
##$CPDPRG6= <mlev>
##$CPDPRG7= <mlev>
##$CPDPRG8= <mlev>
##$CPDPRGB= <>
##$CPDPRGT= <>
##$D= (0..31)
0 1.2 0 0 0 0 0 0 0 0.06 0 0.03 0 0 0 0 0.0002 0 0 0 0 0 0 0 0 0 0 0 0 
0 0 0 
##$DATE= 1595924504
##$DBL= (0..7)
120 120 120 120 120 120 120 120 
##$DBP= (0..7)
150 150 150 150 150 150 150 150 
##$DBP07= 0
##$DBPNAM0= <>
##$DBPNAM1= <>
##$DBPNAM2= <>
##$DBPNAM3= <>
##$DBPNAM4= <>
##$DBPNAM5= <>
##$DBPNAM6= <>
##$DBPNAM7= <>
##$DBPOAL= (0..7)
0.5 0.5 0.5 0.5 0.5 0.5 0.5 0.5 
##$DBPOFFS= (0..7)
0 0 0 0 0 0 0 0 
##$DE= 6
##$DECBNUC= <off>
##$DECIM= 24
##$DECNUC= <off>
##$DECSTAT= 4
##$DIGMOD= 1
##$DIGTYP= 9
##$DL= (0..7)
0 120 120 120 120 120 120 120 
##$DP= (0..7)
150 150 150 150 150 150 150 150 
##$DP07= 0
##$DPNAME0= <>
##$DPNAME1= <>
##$DPNAME2= <>
##$DPNAME3= <>
##$DPNAME4= <>
##$DPNAME5= <>
##$DPNAME6= <>
##$DPNAME7= <>
##$DPOAL= (0..7)
0.5 0.5 0.5 0.5 0.5 0.5 0.5 0.5 
##$DPOFFS= (0..7)
0 0 0 0 0 0 0 0 
##$DQDMODE= 0
##$DR= 18
##$DS= 0
##$DSLIST= <SSSSSSSSSSSSSSS>
$$ [...]
##$SUBNAM2= <"">
##$SUBNAM3= <"">
##$SUBNAM4= <"">
##$SUBNAM5= <"">
##$SUBNAM6= <"">
##$SUBNAM7= <"">
##$SUBNAM8= <"">
##$SUBNAM9= <"">
##$SW= 24.9337058887773
##$SWIBOX= (0..15)
0 0 2 0 0 0 0 0 0 0 0 0 0 0 0 0 
##$SW_h= 4990.01996007984
##$TD= 16384
##$TD0= 1
##$TE= 0
##$TE2= 300
##$TE3= 300
##$TEG= 300
##$TL= (0..7)
0 120 120 120 120 120 120 120 
##$TP= (0..7)
150 150 150 150 150 150 150 150 
##$TP07= 0
##$TPNAME0= <>
##$TPNAME1= <>
##$TPNAME2= <>
##$TPNAME3= <>
##$TPNAME4= <>
##$TPNAME5= <>
##$TPNAME6= <>
##$TPNAME7= <>
##$TPOAL= (0..7)
0.5 0.5 0.5 0.5 0.5 0.5 0.5 0.5 
##$TPOFFS= (0..7)
0 0 0 0 0 0 0 0 
##$TUNHIN= 0
##$TUNHOUT= 0
##$TUNXOUT= 0
##$USERA1= <user>
##$USERA2= <user>
##$USERA3= <user>
##$USERA4= <user>
##$USERA5= <user>
##$V9= 5
##$VALIST= <valist>
##$VCLIST= <CCCCCCCCCCCCCCC>
##$VD= 0
##$VDLIST= <DDDDDDDDDDDDDDD>
##$VPLIST= <PPPPPPPPPPPPPPP>
##$VTLIST= <TTTTTTTTTTTTTTT>
##$WBST= 1024
##$WBSW= 4
##$XGAIN= (0..3)
0 0 0 0 
##$XL= 0
##$YL= 0
##$YMAX_a= 906402
##$YMIN_a= -590597
##$ZGOPTNS= <>
##$ZL1= 120
##$ZL2= 120
##$ZL3= 120
##$ZL4= 120
##$ABSF1= 10
##$ABSF2= 0
##$ABSG= 5
##$ABSL= 3
##$ALPHA= 0
##$AQORDER= 0
##$ASSFAC= 0
##$ASSFACI= 0
##$ASSFACX= 0
##$ASSWID= 0
##$AUNMP= <proc_1d>
##$AZFE= 0.1
##$AZFW= 0.1
##$BCFW= 1
##$BC_mod= 2
##$BYTORDP= 1
##$COROFFS= 0
##$CY= 11.3945322036743
##$DATMOD= 1
##$DC= 2
##$DFILT= <>
##$DTYPP= 0
##$F1P= 16.9975609425685
##$F2P= -3.02152046262296
##$FCOR= 0.5
##$FTSIZE= 0
##$FT_mod= 4
##$GAMMA= 1
##$GB= 0.15
##$INTBC= 1
##$INTSCL= 1
##$ISEN= 128
##$LB= 0.24
##$LEV0= 0
##$LPBIN= 0
##$MAXI= 10000
##$MC2= 0
##$MEAN= 0
##$ME_mod= 0
##$MI= 1.114404
##$NCOEF= 0
##$NC_proc= 0
##$NLEV= 6
##$NOISF1= 3.799351
##$NOISF2= 2.8
##$NSP= 1
##$NTH_PI= 0
##$NZP= 0
##$OFFSET= 15.70392
##$PC= 1
##$PHC0= -9814.052
##$PHC1= 40.00091
##$PH_mod= 1
##$PKNL= yes
##$PPARMOD= 0
##$PSCAL= 0
##$PSIGN= 0
##$REVERSE= no
##$SF= 200.130013532006
##$SI= 16384
##$SIGF1= 3
##$SIGF2= 2
##$SINO= 400
##$SIOLD= 16384
##$SREGLST= <1H.CDCl3>
##$SSB= 0
##$STSI= 0
##$STSR= 0
##$SW_p= 3612.71676300578
##$SYMM= 0
##$S_DEV= 0
##$TDeff= 0
##$TDoff= 0
##$TI= <>
##$TILT= no
##$TM1= 0
##$TM2= 0
##$TOPLEV= 0
##$USERP1= <user>
##$USERP2= <user>
##$USERP3= <user>
##$USERP4= <user>
##$USERP5= <user>
##$WDW= 1
##$XDIM= 8192
##$YMAX_p= 0
##$YMIN_p= 0
$$ End of Bruker specific parameters
$$ ---------------------------------
##NTUPLES= NMR FID
##VAR_NAME=  TIME,          FID/REAL,        FID/IMAG
##SYMBOL=    X,             R,               I
##VAR_TYPE=  INDEPENDENT,   DEPENDENT,       DEPENDENT
##VAR_FORM=  AFFN,          ASDF,            ASDF
##VAR_DIM=   8192,          8192,            8192
##UNITS=     SECONDS,       ARBITRARY UNITS, ARBITRARY UNITS
##FACTOR=    0.0002004,     1,               1
##FIRST=     0,             0,               0
##LAST=      1.6414764,     0,               0
##MIN=       0,             -590597,         0
##MAX=       1.6414764,     906402,          0
$$ Real data points
##PAGE= N=1
##DATA TABLE= (X++(R..R)), XYDATA
$$ [...]
3159d834K833L027l940k058P991k528n556N612K019n333N25N346k641l484O054
3174C033q18m867L619K112n076K474M233m923j975O407o10n712M712L565o862
3189f88q3O403l474l081M346R60m764L182K019l880O40M536m602k877Q088j139
3205E586p650M825M511o679n08N902k806l979M618J17l928J128L835o651K168
3220D89N874n129k141M296Q81p901M175N117n180k660O601k734l869K665J105
3235A589k940J614J978m981R2N250l659l935O942o33p006K951N124m622l158N413
3251A9L57o408M626J802m547J681L643n108P64M364k411m889M960J593n596J782
3267c368M236l892k575N532j328l408L364R21m642J946L093l557j678O030j428
$$ y = [-4834, -2001, 1026, -2914, -4972, 3019, 491, -5065, 547, 2566, -2767, -2242, 3104, 463, -3021, 3033, 2215, -2652, 967, 3079, -1997, 477, 4710, -213, -2188, 4219, 3609, -2103, 2609, 6174, -688, -771, 5632, 2158, -923, 3423, 4383, -381, 2801, 4820, 940, 1580, 6116, 1514, -1363, 6725, 5586, -2064, 2761, 7272, 593, 85, 5987, 3181, -798, 3820, 3937, 9, 1137, 4972, -1679, 489, 6363, 1234, -907, 3389, 4270, -3631, 544, 5661, 481, -2179, 4422, 1688, -2181, 484, 1589, -1351, 263, 2241, -2740, -2648, 2602, -1057, -4992, 1950, 1317, -5689, -2738, 2386, -2236, -5394, 19, 376, -6032, -1406, 396, -4151, -2470, 1173, -3935, -3171, 1193, -1218, -6107, -1147, 446, -5150, -3368, 868, -3024, -5599, -67, -1395, -4803, -1439, -518, -5160, -3214, -121, -3678, -5356, 674, -754]
3282g54n737O726J715o861J741N936n135l236O590N6m984L436L155m709O99L317
3298A955m017j880O594k479l405L664L487n160n63O254k697m348N219M04m260
3313a232K863L221l737n59M592m729j848O008p93n011M706L235p231N43N774l882
3329A920k555L626K474m617J418L794m159l93M150l992k493N588j352n611M732
3344B530K576m846j581O107k389m024M209J309m501J843J084k752p33N140l497
3359D75l212M891J04o353L955L735n101j477M882n11n516L595K937n511K101K380
3375A374n416P64M245j691m206N141L53n532Q10O270n157k570N861j720m075M306
3391a243K523n342O87L449l293r81N056k422l932M698J420n629J696M896l554
$$ y = [-754, -6491, 235, 1950, -4911, -3170, 2766, -2369, -5605, 985, 1041, -3943, -507, 2648, -2061, -1362, 1955, -2062, -3942, 2652, 173, -3232, 432, 3919, -1241, -1804, 4450, 1753, -2595, 2624, 3028, -1232, 1631, 4852, 1115, 556, 5148, 419, -1429, 4579, 3786, -1225, 3481, 6716, -515, 28, 5802, 1920, -635, 2991, 5465, 848, 2266, 6060, 1901, 1508, 5658, 1666, -827, 4761, 3409, -2202, 2530, 5106, 260, -1321, 4786, 2397, -1627, 2582, 3891, -610, 1233, 2317, -435, -1168, 3972, 475, -2737, 2154, 2258, -4095, -140, 3595, -1506, -2983, 1899, 1388, -4128, -533, 2404, -3107, -1006, 1374, -4042, -3278, 967, -724, -4930, 211, 564, -4968, -4158, 2112, -3045, -5615, 246, -1474, -5549, -1243, 1280, -4062, -3375, 74, -3219, -4200, 856, -1566, -5498, -800, 620, -5009, -3313, 1583, -1971]
3406a971m172O590j34m568K536K767m013P11K328k571j169L937p37n059O321N35
3422A331n255K829M852m029m369P326p11n148K568M334m662n10M236l407j23M016
3438C278j388l224L850J727m128n99P315n380l339M729R51m044J150L870l773
3453I95j956N876l024k375M825j49m728K479K865n274N66O040l068m692L709J355
3469C444l170J595K393l425q42K473P9m411M806J054n485L428L347n623k182O266
3485C747k082n078M375K167m635O56K308j526j244K885k069j485J086K661n173
3500c407J329M485m644j506M224n89n299M233J723l342k79M281l860j740L794
3515e97j222k169L242J227n680L64N511l886j669O267j594m921L218J690l800
$$ y = [-1971, -6143, 447, 313, -4255, -1719, 1048, -2965, -2254, 74, -2497, -3666, 271, -466, -5525, 796, 1331, -3924, -1095, 3757, -272, -4641, 2685, 1974, -3174, -606, 3728, -934, -1444, 2792, -615, -738, 3278, 1890, -1334, 2516, 4243, 115, -484, 6831, 1451, -1888, 2841, 3792, -252, 898, 4768, 995, -961, 4915, 1891, -484, 4341, 4192, -536, 1943, 4808, -466, 100, 6140, 3072, -1620, 2089, 3444, 274, 1869, 4262, 837, -5, 2468, 2547, -1864, 2942, 3996, -1489, 1939, 5286, -337, -2519, 3747, 1665, -3413, 962, 3129, -1506, -850, 1458, -68, -1312, 1573, -496, -1981, -895, 1766, -3407, -2078, 2407, -2237, -3743, 481, -108, -5407, -1174, 549, -2793, -3072, 1209, -2651, -4391, -597, -1819, -3988, -746, 481, -5199, -4835, 676, -3210, -4879, 1388, -206, -5127, -1909, -219, -4019]
3530d019J581K111q48l199L788q29k788M371m87l689J466L141k891j482M703P80
3546A709n468J542M553l637o32M080k636j580J598J529m220L186L248n386J38
3561a976N684k928k746N003M54n833K118M649m206r97M111j233l711M821N0m329
3577a069K271J723m103J145N434k948k878L845J30l313M82M257k769j460L599
3592D346j379l943M044j25k148J967L201n955R4M856k247l206L361Q03n014J181
3608a64L972k453j223J855n2l427K345Q21k824K219J649m107j051N473k188k856
3624b011K537J327m414N73L427j862k095L903j592l107K708J267l886J352K901
3639A028l600j805M572l38n229M901J677n571J072M512k690k871L981J06m328
$$ y = [-4019, -2438, -327, -1175, -4374, -586, -1415, -4203, 168, -319, -4008, -2542, 599, -2292, -3774, 929, 1709, -3759, -2217, 2336, -1301, -1933, 2147, -489, -2069, -471, 1058, -3162, 24, 3272, -2114, -1976, 3708, 780, -1966, 3037, 3491, -2342, -224, 4425, 219, -778, 3333, 2100, -1611, 3210, 3260, -1069, 1202, 2925, -1178, -33, 5401, 2453, -425, 3420, 3550, 237, 719, 4976, 2207, 747, 4346, 2967, -976, 3068, 2943, 795, 2762, 5963, 8, 102, 4958, 2711, -495, 2866, 3669, -1345, -164, 3808, 1355, 132, 1987, 1935, -1492, 853, 1674, -1150, 1069, 2718, -1389, -2440, 3033, 845, -2011, 526, 1853, -2561, -1988, 1439, -423, -2518, 1385, -207, -3314, -606, 661, -3225, -1873, 1028, -2572, -4377, 195, -143, -5372, -471, 1206, -4365, -3293, 1219, -1471, -4342, -361, -255, -4583]
3654d583K521K266l071l60L728m241p48N540j369l819J814K366m321J656L627
3669A006j450l747L898M99k971K292K835m610j53L842k189k311M847q31l237K702
3685D22J867l163k489O865k766k214K452J114l338J773K444k602j125M116k645
3700G11k852N275p33l366K551J191k333j098L894j775j703K979J636l953K056
3715B480J332k722q16M431k246m158M423R64l793P90L015j974k107L951K32m364
3731e62J911J776l205K228Q97k416j141L838k706k791L922J466m667K347J814
3746B711l237j244L246M51m622K515J307k976N33L464m446L99L064j411l003K627
3762f22J808l539p51M617k554k605M769K59m664K206J53l147J852L109l097j367
$$ y = [-4583, -2062, 204, -2867, -3227, 501, -3740, -4488, 1052, -317, -4136, -2322, 44, -4277, -2621, 1006, -444, -4191, -293, 206, -2765, -473, 2362, -2248, -2401, 1441, -748, -3059, 1788, 957, -2280, 422, 2289, -874, -3363, 3502, 736, -1478, 974, 2088, -1250, 523, 2967, 365, -760, 3356, 711, -2141, 3134, 2401, -965, 1586, 2777, 444, -654, 3240, 1465, -238, 2741, 4377, 424, 2480, 3812, 1090, 274, 4705, 2459, -1699, 2724, 3688, -105, 685, 3700, 1726, -381, 3570, 3802, -562, 1349, 3125, -80, 2148, 3045, 629, -512, 3326, 620, -2171, 1751, 3217, -1450, 897, 2711, -526, -1770, 1476, 1927, -2695, -180, 1127, -1849, -1316, 2148, -2298, -1899, 1165, -246, -3249, -622, 1186, -2353, -3104, 1513, -1041, -3646, 1123, 1382, -3282, -1076, -923, -4070, -2218, 891, -2206, -3573]
3778c573L401k28m425L461K211m120l64M230k150k516K472J467k091M7L074m247
3794c351NL879k332k005M108nl890K156L480n394K66N194k060l481L094J288k738
3811a786Q39K445k127M57K013o90k955L454k75l043K538K414k758k499L550r7
3827A480k469L023Q26l129M67K399k290o98L498j084k446L917j77m175K951K073
3843D166l718j092L595l70l719K758K119j889j789K579j856q15L769k355j753
3858c70K172J684m484J272L358k137k076L466q52l690K825K647m713L71K433k880
3874i74l75L910j904k478L102Q68l993QM924l870l174M447O74m789K636N56j576
3891b008J286J432j935j143L349j626l884L855J572m211L22M087l227k524M065
$$ y = [-3573, -172, -400, -4825, -1364, 847, -3273, -3637, 593, -1557, -4073, -1601, -134, -2225, -2178, 896, -3351, -3346, 533, -1799, -3804, 304, 299, -3591, -1435, 2045, -3349, -3083, 2111, 51, -3430, -336, 952, -1786, -947, 1498, -629, -172, 1841, 1151, -1804, 1650, 1375, -1668, 870, 3284, 526, -1973, 1577, 1480, -989, 2034, 2860, -269, 198, 2597, 307, -391, 3107, 2023, -423, 3494, 3317, -858, 2093, 4166, 448, -644, 2951, 2581, -1138, 1620, 3739, 1850, 61, 2640, 784, -31, 3738, 1383, -370, 1802, 3486, -998, 274, 3632, 1495, -581, 2885, 2033, -1657, 1168, 3815, -898, -527, 1906, -974, -1349, 2561, 657, -1821, 1281, 2149, -1844, -1836, 3088, -782, -3956, 491, 1165, -3624, -988, -432, -2008, -722, 710, -1225, -2368, 981, -645, -4529, -674, 898, -3313, -2991, 1096, -2131, -4655, -590]
3906e90L73m475L300J413l223j87L362j191k599L594p67k135K550J634l724k76
3922b941L671j855l210M218J199l855J044L175k930o99K859j627k502M678J02
3937A327m557K402K287l929O18M003k439k959M919m64l065J509K532j234j659
3952g09K462p35j570J423R48k168L44L243l178m29M251j513k188K625J47l135
3968a82Q09J600L8k274L180j115l324M714j52l305J887K740m392J67K306m8l563
3985i14J680K211l567R72K357j952j631L602j228k316K256J846m510K205K249
4000C260k473j959L834j240l539K700J631k754j199L984k292j731L620p32l318
4015b208J443K594k366m35L172l989j147M218p01l591O55L131k736l51L916k424
$$ y = [-590, -217, -4692, -1392, 21, -3202, -3389, -27, -1218, -3817, -223, -990, -3125, -575, 1059, -2665, -2941, 730, -1125, -4335, -117, 1082, -2773, -1729, 1446, -1484, -2183, 676, -951, -3453, 1225, 1327, -3230, -828, 1459, -2470, -1852, 2151, -288, -3247, 1672, 1208, -1857, -348, 2184, 950, -709, 1753, 1018, -552, 871, 1819, -349, -5, 3238, 60, -369, 3882, 2369, 181, 2806, 2953, -182, 627, 2227, 2265, -9, 3171, 2056, -1268, 3446, 3294, -11, 1876, 4616, 224, 391, 2697, 2649, -914, 766, 2977, -590, 382, 2739, 787, -844, 2758, 1530, -786, 1470, 3316, -1194, 1011, 3260, 787, -1172, 2662, 1422, -2117, 583, 2214, -540, -1739, 2245, -47, -1778, 1842, 1110, -2208, -765, 1829, -537, -972, 2200, -1789, -2936, 1282, 581, -3010, -2355, 776, -1960, -2311, 1605, -819]
4031h19k153J889K33k963K768P91k980m2L976k449j526K762P57l769M81K613k095
4048b526n74M246n38l666L278j862j261J964K869l708O58J606j238k532L702J135
4064A553l099p39K551r25k614M270M04k224J431K84j489l65M294l357j77K171
4080A969j675k180L033K221k975o97K547j994j048L863j458k896K345J236j342
4095I49j26K584k100j949M087k339j211L051J166k951q36L047k307j361L171j306
4111A569k694K502J382l371J514K821l707j54K531M13l883M302j4l664j75K769
4127B141j064k540K945K45l059J631K046m143Q25K674j680j987K106L54m467M017
4143D4J784l283q83L197j425k319L002M23k637J229J970l202N82J517j211k276
$$ y = [-819, -2972, -1083, -850, -3813, -1045, -254, -3234, -3276, 700, -1749, -3275, -513, 244, -3525, -3044, -431, -2526, -3100, 1146, 608, -3058, 220, -1642, -2903, -939, 1930, -1778, -1120, 486, -752, -3284, 418, 1553, -1546, -2285, 266, -659, -3273, 997, 1401, -823, 608, 892, -597, -962, 3332, -25, -202, 1969, 294, -1886, 1147, 3368, 393, -304, 2243, 249, -799, 3064, 1606, -1290, 1055, 2291, 949, 823, 3407, 1307, -642, 3445, 1106, -105, 2946, 4112, 1161, 325, 3372, 1065, -296, 2875, 1569, -1125, 1377, 2759, -612, 902, 3723, 16, -138, 2393, 2806, -1077, 3225, 3211, -453, -628, 2141, 1077, -1463, 1482, 1727, -1332, 299, 2345, -1798, -973, 1701, 21, -1966, 140, 494, -3973, 44, 1828, -1455, -2338, 859, -566, -2885, 117, 540, -2097, -868, 1102, -2100, -1518, -1, -1212, -3488]
4159c488L915j74l005L00K404k214k04K375j311k600L229L91j901N78K598l103
4175b210l43L967k680j292J131K411m062J067J938k423O50J386R64k343J216R87
4191C64l081J886J724r44r50K365j473k596L170J684k779j61K481k444j135L423
4207A534m66n86P74J655k777q40M104l216n27K544r58k025L121J841m251N94K338
4224B859j042k412K986p8k661K048J493k717J99J961j978n7K281q2m188L576K01
4241B389k632N44L118j980k719L405O29m025J973K492k931O4J953r39k052L217
4257B506r27k856K344J413l777J418K809j697l785L042J134k916J158N71k266
4272a829P39K439j441k005K180k78l270K064J222k382j09L791j747k164J753J553
$$ y = [-3488, 427, 253, -2752, -2452, -48, -2262, -2466, -91, -1402, -4002, -773, -382, -2283, -1705, 893, -2210, -2553, 1414, -1266, -2558, -1427, 984, -3078, -2011, -73, -2496, -1846, -460, 504, -1839, -623, 364, -2717, -831, 893, -51, -1001, 1364, -109, -2705, 465, 2149, -630, -791, 1690, -754, -1889, 1534, 1068, 482, 1256, 2911, 134, -706, 3398, 182, -345, 2199, 1241, -784, 2337, 4178, -73, 521, 2859, 1817, -595, 2391, 2313, -348, 1700, 3193, 476, 675, 2636, 658, 601, 2882, 2800, -1388, 2188, 2389, -243, 301, 3419, 1439, -1280, 2125, 2754, -1271, 702, 3194, 263, 327, 2280, 1341, -711, 2506, 1579, -1277, 1067, 2480, -1297, 121, 2930, 1233, -2552, 490, 1624, -1292, -134, 437, -1829, -1090, 1349, -92, -2097, 83, -195, -3465, -1401, -179, -2561, -2670, 1121, -626, -2790, -1037, 516]
4288E16k917J625J266l384l23L225j452k194L421j03k075J580J627l630N11K988
4304F81p64k990J603J270k089N93K672l004k37K256n84k212K858J027l590P58
4320a752L042l278L18L499j809k150K531J447k601K40K031k374J78J696j518l05
4336h05J600R26k589J830J262j021k865L723l70k988K810K35k740J511J406j061
4352H64j331L172p13j827J412J202k197l57L739l442n64L516k011k241K670J220
4368C112m261J917K225k073q62L211j365l102K286J785l126j07K247o54l332M392
4384B293K62l494J318R14k556J067J885j589j426K881n61l590K562J657l502N46
4400a333K728j970k763M408P84l519q3L163k764M89J772j006k079J492k19k611
$$ y = [516, -2401, -776, 490, -2894, -3217, 8, -1444, -3638, -217, -320, -2395, -815, 812, -2818, -2307, 681, -83, -3073, -1470, -200, -2289, -1696, 976, -2028, -2265, -9, -593, -2805, 53, 1080, -2510, -1752, 1290, -1988, -1670, 1829, 20, -2130, 401, 1848, -753, -513, 1518, -856, -678, 1018, -500, -805, 795, 1721, -868, 962, 2224, 1203, -1662, 2061, 1691, -1297, 1513, 1748, -992, 519, 1925, 864, -467, 2705, 1992, 165, 1577, 2779, 582, 225, 3964, 522, -42, 3474, 1463, -778, 1892, 3112, -1149, 768, 2993, 920, 58, 3269, 1904, -1198, 1088, 2873, -253, -360, 1887, 1233, -2099, 2293, 2555, -939, 379, 1293, -1263, -196, 1689, 100, -1326, 1555, 994, -2596, -34, 1623, -1879, -1333, 1395, -575, -3338, 1070, 1854, -1665, -1748, 1415, -1349, -860, 912, -94, -2173, -681, -900, -3511]
4416c511L126J130j220j315K670j757k317K071J550l102N48K370k414j647L949
4431A31o32j572L680k400j956J472K589j801j376K087j154k386K695J404j680
4446h99j48K129k385p42K909n24k578J882J146k100P17K600l306o48L292o74l281
4463b610K895J971l129J970N75j434n02K805j162k487K645J117l573J573K270
4478B924j638j898L156l96k536J620K036l217O2K220k187J4K702j190j693P09
4494F88J545k971O62L336k280j792K318K98k333J631K293k731j377K753j995j131
4510a086J675J048l070K721O43k219N0J857j564j269K141J64j303o62K210j997
4526f61k032M309j284k241K394L70k495L09J900k522P83K425j559k092K868K04
$$ y = [-3511, -385, 745, -475, -1790, 880, -877, -3194, -1123, 427, -2675, -2127, 243, -2171, -3818, 131, -501, -2073, 1607, -793, -2749, -1277, 1312, -489, -1865, 222, -932, -3318, -623, 781, -899, -1047, 1082, -1303, -2045, 864, 340, -2238, -356, 790, -1310, -593, 2007, -1299, -1947, 1345, 671, -2610, 285, 2256, -873, 1097, 1672, 238, -264, 2541, 1379, -1108, 1537, 2654, -919, 654, 2924, 1286, -612, 2544, 2148, -388, 1232, 3268, 51, 113, 2333, 146, 160, 2862, 1672, -21, 688, 2233, -738, -76, 3260, 980, -812, 1506, 1804, -529, 1102, 3395, 664, -713, 2040, 45, -1086, 589, 1637, -1433, 1288, 1931, -288, -238, 1619, 55, -1214, 927, 1091, -212, -874, 1336, -661, -2693, 1616, 332, -1909, 485, 855, -1640, -1331, 569, -1953, -1170, 1255, -304, -2396, 472, 676]
4542F76k689J516P39j508l47J991j428j422J643j69o89m16K002j874K01K892l064
4559a946j583K061J958k573L65K191j789j661K821R44l068O55K634l899P0L152
4575C32j003j065K988n81k933J418J765k195Q34K405k150j599K447n91j845L593
4591A820M75k737p06L456l220n95M839k377j988J530J867k076j309L301k792o14
4607a126K395J79j661J655M88k041J483Q43j744j131K952l39j990J091J727k391
4623C90O7K147j196j886K281N18j848O55J721l712R13J608p00k625M458o75l400
4640a284R75K714k147j579L339j574j431K183L31k775K588L55j874j592K057j65
4656A21k275K883K85l334J383K085k399k22J681n74j971L145P32k983R66O33j679
$$ y = [676, -2013, -497, 242, -1266, -1613, 378, -1050, -2472, -829, -998, -1687, -2103, -101, -1975, -1774, 1118, -1946, -3529, -1468, 490, -2083, -1718, 473, -1316, -2977, -156, 788, -2280, -1625, 1009, -2890, -2820, 332, -671, -1736, 1252, 671, -2262, -844, 921, -1274, -440, 1965, -185, -1784, 663, 72, -1773, 1820, 2295, -442, -1148, 2308, -912, -1507, 3332, 955, -1033, 497, 2364, 288, -1021, 2280, -512, -1126, 1269, 1448, -213, 1442, 1930, -111, 1372, 2215, 471, -660, 2292, 1953, -37, 1054, 2781, 390, 457, 2604, 1408, -478, 1803, 2321, 473, 1128, 2849, -863, 50, 1658, 958, -1667, 2791, 2116, -1284, -309, 2405, 258, -1321, 2018, 444, -987, 1196, 1527, -1248, 1340, 1695, -179, -1771, 286, 121, -2154, 729, 1014, -2320, -937, 1148, -1251, -1473, 208, -366, -2337, 808, 1540, -1443, -477, 156, -1523]
4673a523j767L563m99j925J410K71j648k53L233k490k08J173J61j061L09K091
4689H37k956J936J76q25j431J997j126q69K598r43k248J667K744k239j388J867
4705b03J225l897L101P26k531K80K563j260j598L121p3k404J306Q39j964L35K034
4722A600j405j025J674l67p12J50J748j740Q80J161k195j106K867j1k463K186
4738A242J416l114L96J479L91k558K334N58j970M66J740j576r64K275k186p49
4754h20L538m76k449J543R53k756M55J817j882j61J528M67k758M60K571k340J45
4771a65K246j702k641L607j70l162J509K840k480q46J928m48q24j06J382l280
4787b312J601J769p26r35J024l51j942K021J102k576N45K011k044r79K104p24
$$ y = [-1523, -3290, 273, -226, -2151, -741, -470, -2118, -2371, 862, -1628, -1836, -663, -502, -1563, -1254, 837, -2119, -183, -7, -832, -2263, -266, -1392, -2261, 337, -606, -2854, -1187, 1557, -682, -2070, -203, 1022, -2875, 226, 952, -1579, -1299, 1264, 4, -1594, 1527, 1454, -950, 356, 1195, -769, -434, 1600, 195, -830, 844, 477, -235, -85, 1663, -77, 803, 1964, -231, -1337, 1530, 1519, -944, 1242, 2658, -456, -60, 1419, 1810, -748, 1586, 2144, 174, 640, 2380, 804, -160, 2115, -71, -820, 2718, 2242, -207, 1336, 2289, -467, -12, 1805, -77, -238, 1290, 1757, -1001, -541, 2030, -310, -165, 2081, 379, -2262, 1345, 1175, -1987, -478, 2362, -118, -964, 964, 516, -308, -414, 968, -2312, -711, 1058, 332, -603, 421, 70, -1872, 149, 1251, -1325, -780, 1231, -813, -1792, 312, -412]
4803d12j890N48J262k058J453K024k597L75J633j088j961J905J669k480Q04J793
4819I80l257kL062j780j361J610R28j651Q16M75j078j114K355J012l731L028J947
4836B239k390l90J017q16j226J793J74k899K640J842l330o26L363n23j977L305
4852B196r17j833J594J297k516n31J851J137l379K727L67j695k07K477k245j251
4868i28K802j518p8J334O87k753J020O78l82p26K653r91k270K362j99k281N28
4885f2K87M64k06J215q71r49J259Q09m083K618N96j589J58K463q11k397K717k47
4903A371j453M00J072j569j164K270K85k957K908o76j918M13J665j276p88K376
4919I59k131q62K367N35k676P0K425k127j95J283L36k161J736J135l450J984R69
$$ y = [-412, -2302, -1754, -492, -2550, -1097, 927, -1670, -1295, 338, -750, -2711, -806, 863, -1617, -813, 980, -2277, -2279, 783, -997, -2358, -748, 180, -1471, -655, -180, -1258, -2372, -17, 995, -2736, 292, 2239, -151, -541, 476, -340, -1566, 227, 401, -2498, 142, 1984, -1346, -1972, 1391, 868, -1109, 2196, 1279, -554, 1040, 2337, -179, -710, 1141, 2278, -1101, 1626, 1993, 298, 91, 2568, 323, -928, 1874, 356, 278, 1612, 2299, -454, 566, 1244, 862, 136, 2789, 1798, -472, 1890, 1691, -590, -62, 225, 689, 483, 1698, 827, -122, 1137, 1946, -2137, 481, 1077, -512, -354, 2109, 1298, -1099, 1618, 1371, -82, 318, 1390, -179, -1343, 927, 1212, -1745, 1163, 487, -1431, -1018, 647, -629, -1417, 959, -1172, -2034, 333, 868, -1808, -1738, 687, -1440, -1635, -352, -16, -2177, -441, 694, -2756, -772, 197]
4936A97p48j882K786j182j664K311K24o11r62J813j468l50J191o59j053J357R41
4953B41j496P77J393k017r76K337r88k30k55K614l099J80K602j224k53O91l47
4970e0j073K530j583j002K79K254k228k33J832L11j957M40J830j753Q47Q40n76
4987G08l11O35o7j164J763K27j643n12K942j417j496K218N47l084J631J716k022
5004F71p97J779j316n53N70O13p89J251O23k403Q78O51L33k650K132P98k796M48
5022e57K047o79o51J827j530q80P93K39r50M14P50r89p79K616j559j191O34K188
5040A743k517K87J713k102N58Q37J08j694J859j369j031J125J859j891j458K606
5056F33r86j060J14J184j556K47P22m0j656K471k1j985J372o05j137O84J960r83
$$ y = [197, -551, -2433, 353, -829, -2493, -182, 42, -569, -1531, 282, -1186, -1536, -345, -1004, -2057, -700, 241, -1255, -478, 915, -1102, -2078, 259, -729, -959, -1214, 1400, -1699, -1519, 1083, -141, -394, 297, -50, -1123, 1407, -176, -1178, -899, 1355, -873, -1106, 726, 1037, -920, -480, 1350, -403, 444, 1284, 708, 397, 1032, 965, -199, 1564, 1791, 148, -364, 2578, 1161, -335, 1883, 2430, -654, 977, 2693, 671, -126, 1653, 337, -216, 354, 967, 178, 1429, 2052, -351, 527, 1178, 1511, -1139, 993, 1791, -1005, -557, 1490, 811, 160, 1987, 457, -423, 370, 609, -341, 73, 823, -166, -945, 1671, 112, -1079, -445, 1743, -774, -487, 1226, -876, -318, 519, 627, -1067, 792, -577, -1608, -483, 1376, -515, -1973, 633, -353, -1413, -1299, -115, -1671, -1424, -702, -742, -2398, 73, 52, -1933, -561, -1166, -2303, -1619, 341, -642]
5074f42j816K496K82k643J776J90j583J2K220j148j434J871N00j837R51J139p42
5091d08j168J050N17j735J725O88j052M17R31k368P46J365r19n7J243k64k397
5108a686K504m0j100K52N28k75j671J837J176k290J482J386k371k49J082O35j531
5125c31J427j12o33J56J104r52k01J403k369r90K748J679l207Q41J940k215p42
5142d54K005m14j429J480J74j697l02K054j358J852j534M18j406J058R69k342
5158i26M49J582j254K00L61j66j201J204Q45j006Q3P64r85K40R12o15k399J905
5176gR57k271J36J610j163j697K770j05r64k20R71k138L03K548j863n91J159J78
5194c87j660J165J593k737J04K255j409j112J753Q14j383R87L07j911N01J605
$$ y = [-642, -2458, 38, 320, -2323, -547, -357, -1940, -1928, 292, -856, -2290, -419, 81, -1756, -805, 334, -408, -1576, -526, -9, -1744, -19, 669, -383, 34, 965, -1403, -657, 708, -211, -268, 975, 711, -1686, 818, 778, -322, -70, 458, 183, -1488, 349, 1525, -765, 717, 2103, -268, -517, 565, 1200, -331, 1096, 984, 351, 507, 1611, 659, 458, 1861, -508, -1498, 1250, 2929, -278, 563, 2503, 288, -454, 1551, 1137, -292, 1188, 1362, -335, -637, 1417, 59, 1911, 377, 795, -611, 447, 1416, -926, -477, 1105, -149, 51, 412, 246, -955, 249, 1094, 88, 171, 935, -50, 190, 1102, 487, -1912, -7, 950, -1321, -1185, 425, -738, -2435, 335, 230, -734, -954, 17, -2121, -1818, 730, -1133, -1724, -565, -387, -2047, -882, 711, -2026, -1922, 333, -1076, -2188, -435, 379, -1004, -17, 290, -1621, -1120, 485]
5210D85j742j140K953k02j625J115J301k423o0K376j087j464J722j012j03j21
5226a027J904k200K62J970j856O10J946j311k059J309J730k073M37J829l91j443
5242c63J403k16j498Q4K386j105m23J869j000k207K111p36M0k3J653j234j02Q43
5260A482r75l26R22J34q43n01J791r61j125J931k09j964J744k41j576J093R02
5277A278r23J36J071j244q13J116K197l619J129K05l25q20J394l38q91J539n05
5294E87r72M12J090j884j023J679O50j777Q51J984k939N04K228j494o75J499j391
5311f71j176K082o12q33K0J198j42k892K974r08j033J101J335k921M93K388j483
5328a080j115K326J99k457J793R21k121k50J427m8j095J966j42j838J248N16j256
$$ y = [485, -1257, -2397, 556, 354, -1271, -156, 1145, -1278, -1338, 1038, -49, -1513, 209, -803, -906, -1027, 877, -1323, -1061, 909, -947, -337, 1609, 298, -1761, -452, 1278, -795, -358, 1471, 1080, -363, 1040, 824, -674, -590, 1796, 691, 268, 2137, 1137, -1070, 1041, 305, 345, 322, 1975, 741, 639, 1482, 507, 181, 1103, 1237, 394, -107, 1684, 723, -402, 1529, 1320, -644, 1100, 859, -717, 376, 1278, 355, 491, 1562, 318, -495, 621, 2818, -801, 328, 533, 208, -612, 782, 444, -447, 1092, 587, -385, 27, 1117, -767, -1790, -111, 539, -1238, -387, 1597, -1342, -838, 1390, -104, -779, 720, -671, -1847, 235, -377, -1210, -1190, 8, -134, -3026, -52, -960, -1993, -892, 443, -2478, -1985, 403, -1080, -2195, 131, 330, -2127, -334, 587, -1534, -1784, -357, -405, -1500, 466, 324, -1514, -266, 250, -1006]
5345a006j012L067j712m78M89J152k553K444j41n49q09J589m47j584J568P36j477
5362g23K48K053k015J124k55K63j315P15N14j328J331J732l025Q57K739j713k043
5379h41L4J788n82J24J181j968J03J942n69j449K36J768j605R54L70q81o37J781
5397A749R31m267K170L27j525M90J938q23j256J176L64k368J556N84j332M57J449
5414A620j627l60J414o24r87N08J260j723Q04M20m47k226K452L5j150J040L84
5431G93j803P9J760j912P58O51n44j329J149J150q92j012J743j378r12J287J001
5448E89j429N05O06k313J240J778j831k3k89J247j380O59P14j203J08J735l31
5465C82j533O67j8j510J190J160r26r5J161j280k57J728K41r47k8P0N85j141R02
$$ y = [-1006, -2018, 1049, -663, -1141, -652, 500, -2053, 391, 250, -299, -1108, 481, 34, -1550, 18, 754, -723, -475, 1578, -437, 687, 432, 695, -620, 95, 609, -719, 612, 2344, -681, 176, 2915, 1202, -841, -807, 981, 399, 523, 1704, -264, -161, 1781, 1212, -237, -1, 1767, 162, 1116, 1486, 605, -32, 1749, 2680, -1587, 583, 910, -615, -125, 1813, 990, -266, 910, 1274, -1094, 462, 1046, -286, 171, 1620, -7, -367, 1047, 423, -564, -56, 1204, -519, 285, 705, 258, -1968, 484, 519, -631, 409, 793, -1010, -931, 829, -1083, -325, 326, -218, -1547, -398, 752, -140, -1152, 591, -787, -1699, -412, 589, -840, -335, 271, -2042, -802, 976, -855, -878, -1167, 80, -1300, -641, 73, -1130, -1022, 713, 382, -1151, -484, -502, -2012, -822, 338, -588, -683, 478, -802, -1059, 669, 910, -37, -65, 5, 590, -551, 351]
5484C51j32j268J781m28j053R43O24r62n18K355k000n98R38J428k267O63J027
5501H84j184K79J119l60j425J065J172k414J202J158j264k41O69j74l39NP58j081
5519a71J94J219j284K62O02j054oJ241o34q1L90Q09j109M15M66o62j71J94R5j52
5539E63J17L44j272m56J612k20j310J226J083k713L39J866j344m3J502n69k134
5556a409J824J252p60j035L61k19j711J538L08j375L41J257j053q05K521j656
5572f21l87J402j382p01Q08J335j558L54J417j954K65J241k09r43k78P16o67L17
5590h45J099o78j816J462N11k67q54J421m97r74K209k116n6J655r01k53M74K78
5608a48j44m30J508m58j414J920j043j456O41K278j833o34J395j65j3l87R49m71
$$ y = [351, 219, -1049, 732, 304, -749, 194, 818, -144, -662, 1693, -307, -905, 33, 1461, -806, -143, 884, -300, -21, 1098, 738, -687, 378, 1550, -864, 338, 1496, 232, -9, 660, 486, 147, 152, 910, -171, 23, 1242, -42, 220, 822, -232, -238, 1003, 369, 288, 678, 1487, 378, 793, 1259, 597, 426, 620, 715, 563, 680, 1024, -248, -704, 908, 688, -622, 604, 1687, -1026, -687, 1179, -165, -208, 1294, 725, -1409, 415, 1667, 907, -128, 233, 14, -1697, -159, 149, -1226, -885, 372, -681, -1486, 1035, -621, -1008, 394, -988, -1689, -881, 454, -1104, -750, 667, -1287, -1022, 219, 10, -933, -1211, -495, -1162, -845, 254, -424, -2240, -778, -267, -534, -1388, 33, -464, -1438, 771, -1345, -1401, 254, -647, -900, -426, -148, -292, -722, 786, 328, -1086, 834, -209, -1665, -1024, 1254, -579, -1213, 182, 17, 4, -383, 566, 95]
5626I5k15J81k23q55K202L20j243K33j98M89o65K493l350J92Q33r77P30R03L01
5645A246j329J77J279k62j315J830o93j019m63R08j088K19J744p43p62K325j035
5662A019r31J062m24j807J275Q26j461P53O54o67j493R93R42m83j217J854R6q36
5680A55O6J080k637J484J220j381n3M17q44j486K213r80j014J781L32j088j29
5697h64J655m56j601Q00P08j667J103R2j150J173K87q91j18J10P07j19q77K369
5715A261k244O7J680j453n70J549r25j38R54m39p75L3J356j154L27J055K43j614
5733g87L23Q89r53p19J882j357k0R07O58k070P94J881j507q11J988m73j112M19
5751f8M09m00M07P95j365j037K175M80k042J386L33j280J006P06j462j154K632
$$ y = [95, -120, 61, -162, -1017, 1185, 1505, 262, 495, 297, 786, 121, 2614, -736, -544, 289, -688, 42, 945, 1246, -83, 94, 1373, 1111, -204, 1626, 933, -86, -549, 359, -729, -510, 1234, 491, -271, 2054, 1019, 88, 1150, 726, -1081, 194, 1020, -441, 312, 966, 299, -1194, -201, 741, 258, -959, 895, 991, 155, 221, 1301, -1336, 148, 1368, -13, -66, 351, -493, -1979, 234, -746, -1760, 21, 353, -735, -864, 791, 335, -1266, -466, 242, -1425, -322, -230, -1380, -207, 80, -811, -929, -819, -112, -231, -1108, 1261, -983, -916, 764, -689, -1259, 290, -635, -773, 181, -258, -1033, -1000, 356, -798, -471, 584, 827, -787, -464, 425, -528, -1247, 635, -722, -742, 165, 823, -1247, -453, 1428, -79, -890, 1098, 625, -487, -68, 341, -59, 348, 1143, -222, -1259, 916, 1396, -646, 740, 1073, -207, 799, 1505, 43, -1111, 1521]
5768A521q53j597J128J460j713O19K359l793j9J401Q66q27n74Q36m68n56J540
5785A330j205K31L28r82Q66p40J512j501K06J323j098o72J759L88j661K78R71
5802A333j670k68J134o1j515K261p00k096K134K58j490M48j28J25r13R09Q62o40
5820a7n46L32K0l9N7p24O7J248M78j202O90O64j412M9R38q81j516J887j49j539
5840a595P61J244j128p91K111j104o32N29J083j502K87J236p64j111O86k8P00
5857a8Q91p19j856J038J218n82o01P08L44j120J176o20L6j08J347j575n04P18
5875b27J50j404J543Q15q95j23m11R74N50j37L89k240J215J140j327j8Q25j551
5893g32R0J077O37j805J929Q08k106M73N99j725k52J696q55o61J168K16j450J068
$$ y = [1521, 668, -929, 199, 1659, -54, 565, 2924, -869, -888, 513, 1379, 552, -22, 814, 346, -210, 1330, 125, 356, 684, -298, 568, -172, 1340, -161, 45, 1368, 270, -402, 1357, 1745, 84, 362, 1333, -337, -605, 529, 468, -1047, 1214, 514, -1582, 552, 810, -680, -232, -360, -235, -1148, -239, 623, -17, -563, -231, -211, -250, -193, -917, -850, 398, 876, -326, 364, 1028, -384, -335, 603, -278, -1794, 93, -56, -1595, -834, 410, -718, -1509, 602, -502, -1134, -605, 478, -1024, -737, 499, -265, -1376, -690, -718, -18, 873, 154, -1702, -664, 554, -28, -629, 79, 423, -697, 479, -141, -105, -213, 1134, -441, -945, -227, -77, -1481, 62, 877, -18, -141, -552, 422, 972, 835, 1224, -1016, 199, 1339, 12, -6, 819, -732, -642, 435, 1072, -733, 1196, 2004, -102, 371, 970, -755, -1007, 689, -166, -827, 341, 557, -893, 175]
5911A75N9m86M44R45r56J76l5Q62j988J725J08k52p59K31k55n02P15m47M13j074
5931i01K272p01M12J45p83j182m82J496l27o16Q62K05j213J625j156j42r61K120
5949F73j292k66J845j672j149K391r0j535k60J589l89r04J266K32j152P43n93
5966e63j159J373m28J20p43M50M70n85J244L9Pj071J155O24j949J294j892J302
5984c12L96o66O02q13P74n22m82J130P84j865R48l81K90m84J152j410O60P52k10
6003C43j227J121k2k49j43L84k90o34K379q89o23k59P33j842J085N54n49J97l7
6022C2O96l17l98J77l52J175o83M91p31Q32N62j767J145R31j610j154K138p46
6040D21M64O99N45k108O24m52K91p17J872p29r49O16N77k427J171N26J43p46J757
$$ y = [175, 234, -252, 192, 1137, 181, 357, 322, 1184, -804, 921, 1029, 777, 18, 249, -6, -508, 207, -240, 173, -901, 1371, 670, 1082, 1227, 444, -738, -1220, 276, -51, -667, 195, 400, -813, 812, -344, -486, -1447, 673, -619, -885, 960, -712, -1861, 530, 440, -1095, -1355, 234, -155, -1059, 207, 439, -713, 30, -563, -1722, -349, -777, -657, -1400, -950, -480, -1065, 179, 218, 225, -846, 309, 933, -1016, 278, -1614, -312, 84, -582, 20, -793, -19, -541, -1023, 107, 891, -974, -26, -407, -117, -601, 551, -859, -199, 553, 343, -884, 237, 215, -34, -177, 207, -83, -717, 1662, 773, 150, -109, 624, -1218, -133, 421, -128, 69, 32, 728, 411, 13, 190, -162, 1013, 330, 821, 90, 922, 1484, -283, 862, 1793, 183, -971, 1167, 421, 885, 1584, 2129, 21, 645, 193, 484, -233, 1639, 910, -39, 577, 1154, -1273, -102, 424, 567, -179, 1578]
6059A578j115p04K28M21j228R92j34r94J52K034j185j113K069j394j448J255J328
6076G42j099k6L55K87j245K16Q11j538J699m0m61k47Q66L12j983J247J98k125
6094b031J817l90j20l01P88k22m8J67Q5j63n79J385j258l5N87o0l81J158L1o13
6114a83n22k54Q54j48J48m7o46O97r2L49k9l27J5j335K318j450K93O58n50j104
6134a355J159N30j40K26j026M10j34J55Q78j340R05j12L06m20R31J042k478J59
6152c04J393k150K61J176J324j266P85M45j170o88J202n28l21J199n70j255J994
6169A527K3j387k65Q84j155M64J242j471k91R07k69j341J165J238q91l32N48m14
6187A82P89M4j045J27K36q5j271J508N98j256J54M4Q74j925R82L32o00m43J476
$$ y = [1578, 463, -241, -13, 408, -820, 172, 38, -956, -804, 1230, 45, -1068, 1001, -393, -1841, -586, 742, -357, -383, -28, 259, -986, -770, 41, -1497, 202, 162, -299, -546, 320, 632, -1351, -104, 94, -2031, -214, -604, -724, -1025, -237, -459, -507, -340, -255, -418, -997, 388, -870, -905, -318, -378, -759, 399, 430, -183, -705, -959, -105, -253, -105, -152, -798, -101, -193, 156, 127, -200, -185, -1520, 798, -652, -359, 299, -251, -1355, -196, 334, 194, 420, -606, -196, -330, -175, 703, -637, 268, 156, 462, 42, 973, 2015, -463, -304, 1089, -1061, -800, 376, 1700, 434, 1219, 1664, 494, -194, 1008, 480, 159, 1358, 788, -467, 1527, 1550, 163, -102, 782, -373, 91, 1333, -138, -429, 478, 209, -1132, 33, 1271, 380, 48, 596, 182, 971, 1015, -30, 97, 333, 248, -1023, 485, 1083, -173, -19, 25, 899, -1026, -44, 288, -312, -755, 721]
6206G21j386P82J16k0o16N14j8L7j395J613j005l3J426p79j397J81K393j641p82
6225a289J627p27r33J471p77o92O90J569o65j429L27J606j129J031r66q51K65
6242h72K159k257j02K16Q0l91J756J83j948Q55N96Jl69r58O50j088J456J271q86
6261C52k62J035j097n87J540m45j105L88Q64j369L96J250m08k364J670J889q79
6278H68j235J888j587M58n51n65J123J069j257q57P39J420j914J078K55n02m10
6295B0N53O29j653J119N1q84j104K258n1r21L12L93j500J619j52L59j607N92m54
6314d21Q27N02q28mP0R51j822N87J353j908M83L76K10o88M59J07o46p91O98L83
6334a02o85J318q32n49J281l85j497Q17P46L93o63L11r58N92Q8K48n31M85L04
$$ y = [721, -665, 117, 233, 213, -403, 111, 93, 130, -1265, 348, -657, -690, 736, -43, -1440, -1259, 1134, -507, -1289, 338, -389, -1322, 149, -628, -1320, -630, 939, 274, -1155, -828, 778, -351, 680, -286, -1137, -872, 1287, -970, -1072, -856, -776, -1167, 589, 772, -1176, -321, 275, 276, -93, -1051, -401, -1489, -33, 1238, 352, 90, 1125, 28, -559, 981, 536, -569, -181, 683, -686, -290, 960, 552, -1812, -142, 1747, 868, -367, 1521, -66, 392, -159, -724, 399, 1468, 211, -646, 93, 1513, -401, 677, 932, 430, 20, 573, 1202, -451, 668, 719, -165, -1269, 989, 938, 17, 329, 722, -778, 841, 689, 1048, -559, 33, -421, 406, 908, 80, 76, 146, 1097, -725, -138, 1215, -693, -210, 166, 376, -312, 147, 254, -392, -1183, -485, -102, -787, 531, -301, -850, 431, 46, -1451, -634, 112, 505, -158, 153, -805, -213, -125, 123, -408, 77, 381]
6353C81r36r05J492O62k262J361j47p39J388j07N71j374J2O38r45R28M1l85l63
6372f89Q00n58MJ364q34j006J5J687j229M57J147j316p24M39J170j397P72P0L16
6391D88q8j21o83m19J411O5j414J747p44M79k96l66O06l76k46M02m09m33L6L66
6411Eq4P57j72j708J047L26k54O66M9N50p53k22n77l25R41Q31p50r0k49M10r70
6432e72P36P18o00n95J029j101l49P12J438j767J109j98L3K72j401P05o52Q60
6450C77L80j101N70o76m27P24R16p91N83K58J87k292O50J079j206J608K67k092
6468i86L26R27p77K32O56r4k499N16K519k321K77O8O1O37n73Q73R9n27P35K68
6488D17j312J134q44L86j183N76P68M96O49j828n92L39J668n57K91r8m59j88J115
$$ y = [381, -555, -1460, 32, 694, -1568, -207, -354, -1093, 295, 188, 759, -615, -603, 35, -910, 18, 59, -326, -689, 111, -447, -443, 921, 87, -919, -904, 783, -446, 11, 1158, -158, -882, -443, 727, -670, 102, 172, 488, 400, 279, -404, -823, 588, 653, -761, 986, 242, 721, 425, 59, 665, 289, 43, 445, 36, -397, -361, 5, -79, 678, 506, -1202, -155, 171, -83, 583, 632, 1182, 429, 207, -370, -695, 246, 1077, 327, 237, -12, 398, -572, 164, 882, 282, -313, 716, -385, -734, -22, 1416, -351, 758, 560, 593, 865, -536, 169, -483, 377, 757, -344, 226, -450, -877, -153, 763, -28, 555, 813, 1000, -1292, -642, 437, -769, 839, 1106, -986, -660, 267, -510, -278, 378, 284, -2215, -1699, 820, -1501, -1224, -1156, -1095, -458, -1031, -158, -59, -586, 149, 417, -895, 239, -605, -219, -1402, -826, -58, 438, 1087, -741, -1333, -994, 674, 117, 408, 310, -149, -337, 778]
6507G78j082j79J123j05n76n99K13O27K4R7k03m1n8J264k810J057k67p89J634
6526A08k35J410k173J974o90m75m04J762j426k66R01o6j40o5o44j9O03O45o36
6545A64p3J272q09K85J42j00p09l52J288q60o99J491n78j086Q89N62q41j08J554
6564A432k09j420M08j453J918L67m69n32L86j442J102K06P23o36o70L95N77j176
6582d93l7J800j218r53J317J62j81r1m38l62m3K06k37p22J574l79m63O72r79N20
6602c45j60L42o87L52M64L32j7l21m2R02q78O81q30J278j518M75l97m51M52K35
6622a33m53l3m02P41N42j602J206K99J110j129l30L00k59j33J220p26r02J207
6640E23l05j72q50J136m50p34O16K19m5j059K065j045Q21p54j055J909j283Q32
$$ y = [778, -304, -483, 640, 535, -41, -640, -427, 200, 224, 321, 118, 77, 19, 1283, -1527, -470, -737, -1526, 108, -127, 1283, -890, 1084, 394, -81, -485, 1277, -149, -415, 486, 420, 280, 215, -429, -448, 155, 800, 164, 91, 1363, 554, 839, 981, 881, 172, -180, 1108, 248, -451, 1040, 462, -624, 265, 827, -14, -122, 1432, 1223, -197, 211, -1242, 676, 1043, 574, 42, 428, -1014, 88, 294, 1017, 381, -289, 106, 683, -493, -530, 1270, 52, -901, 416, 578, 397, 306, -132, -494, -537, -331, -568, -1290, 284, -95, -558, 114, -865, -345, -505, -163, -850, -498, -34, 298, 281, -40, -82, 820, -58, 623, -207, 1071, -447, 28, -369, -820, -368, -133, -586, -619, -1021, -280, 262, -1340, -134, 165, 1275, 146, -184, 116, -143, -276, 944, 218, -684, 523, 218, 46, -804, 332, -118, -852, -236, -17, -62, -1121, 944, -101, 720, -34, -1089, 820, -463, 369]
6658C69r5L44n92j360N22J260j359K41J475n91l70J42J207j449o5J300j064Q34
6676G49o55R28N03k083J313l31l59l2K81L02J04J22j246M37Q27p12N8J7n87J01
6696b63M14j11j59l50L75o50j52J196R53j191o07J369k151Q28K18P26j0m97j02
6715a64l02J001j276L96r59J281J50M39j10j491l77R74O77r3l29k44K26q86R34
6734a53l17R60j370J039j189J069j63m76L9j27q7q64J751l83r39K040L90j802
6752e82N48K65P27k073K92J469j199M86L85l0q27j75L48n00J339K08j549L2R72
6771A36k62M32R14j540j239J629J5o92P29J096j846P69Q21l51j667N95J463j331
6789c29Q83K18p55l51J68J341j963J179L42J47j382L15J164j016J213N1q68o28
$$ y = [369, 274, 618, 26, -1334, -812, 448, -911, -670, 805, 214, -156, -14, 1193, -256, -321, 979, -85, 749, 94, 1022, 1525, -558, 755, 424, 65, 33, 314, 616, 720, 842, -404, 33, 860, 148, 206, 223, -364, -263, 151, 40, -119, -469, -94, -744, -896, 300, 1253, 62, -545, 824, -1327, -499, -281, 445, 435, -62, -164, -466, 535, -741, -345, -1304, -23, 127, 566, 456, -1035, -1412, -438, 239, 146, -183, -427, -201, -1087, -153, -470, 490, -880, 159, -1030, 39, -124, -600, -561, -688, -775, -1639, 112, -271, -1210, 830, 1220, -582, -34, 231, 958, -1115, -823, 646, -553, -67, 318, 288, -539, -714, -366, -866, 473, 681, -868, -836, 136, -126, 306, 1220, -320, -1559, 70, 85, -607, 122, 1218, -628, 141, 962, 611, -1056, -461, 1002, -329, 554, 772, 17, -334, -166, 1175, -788, 391, 733, 880, -502, -187, 977, -39, 1174, 1225, 357, -271]
6807b71J368q55M22k17L3L8L84m67k68K32m38L88q0l10J79m89L16m94k06J285
6827E50J41r97l00J771r89q31L50K28m44P5O23n62J032l60m60j486J039K15m28
6846h33O0N42J088j513P11j97j231R93l38J44O99kr55p1J199m37l51J108qp43
6866a35l02M44P3j971L254j295L27j431J928j399M9R64n46j362J790J34o40K51
6884A33k43q93Q03j67n72N16J131o82j16R17j729P78q79J386M90l28M51q90l19
6903b13N84o62q64M64J118m04K77N13r88k302R93R09N5P33j0j053k10Q28O15m30
6923d7n10K91n16O68J441j143j25J161o33o32K93O09l01k91M90n11l95O13p9k56
6943A27n63J660j433l41J583O06j446l09R42j435J088j93k103J864J57j273P63
$$ y = [-271, 1097, 242, 664, 447, 480, 518, 902, 435, 167, 399, -39, 349, 269, -41, 138, -351, -35, -529, -735, 550, 691, -306, -606, 1165, 176, -655, -305, -77, -521, -446, 177, -385, 647, 287, -173, -1659, -620, -405, -833, -773, -231, 857, -656, 55, -142, -1373, -380, -718, -574, 125, 123, -832, -903, 296, -141, -492, 616, 608, -135, -437, 7, 80, -1891, 1363, 68, 395, -1036, 892, -507, -458, 506, -40, -1402, 388, 522, -118, 133, -110, -1003, -200, -367, -939, -423, 708, 26, -90, 827, -902, -124, -1003, 383, 873, 545, 996, 106, -213, 371, -291, -1155, -691, 427, 23, 300, 813, -175, -2477, -1484, -575, -520, 213, 203, -850, -1060, -232, 383, -47, -557, -266, -782, -114, 1327, 184, 59, 1220, 587, -45, 248, 857, 556, 265, 755, 244, -151, 462, 383, 127, -436, 1224, -209, -550, 1033, 1639, 193, -116, 826, -609, 479, 286, -1817, 47, 204, -1069, -306]
6960c06p7P23j379J236P7l5%O40m12q32R88n93J70R67j293n24M3N2J48L44J02
6981C9j270J335K7N25j722Q26N34m72l01M24o10J203j243N20j70l83J492l28j157
7000g31K51R76m95O26m39q5j073J792p15j07q4j85n1o10Q42j436J381m84L18l93
7020g02Q21m8r29J337J619k075q60P89Q03n05k42N90p87J022j71k9r09P75q18
7039c19k88J960l78m19M97j280O42o53O15N46r52o3N00n14K66m88J31m38O37o12
7059f10j90Q6K344j034r48Q35M4p58P44N34q03L63o87J569j034r3P5j61L26k47
7079C55j208N12O08q6J93J15p76L41l39R02j331Q75K54k10j087r7J600r91J187
7098H17k33j779O01J474n06p29N67k10p66Q09O80m05j175R83l3o43m35L97j88
$$ y = [-306, -383, 340, -1039, 197, 274, 239, 239, 879, 467, -365, 623, 30, 200, 1167, -126, -650, -607, -555, -407, -63, 39, -1231, 104, 131, 656, -1066, -240, 294, -178, -479, -55, -665, 538, -705, -185, -355, -738, 754, 426, -731, -480, 496, 1, 627, 188, 103, -970, 822, 107, 0, -84, -269, -320, -930, -88, -1524, -143, -627, -309, -702, 119, 71, -858, 479, 2098, 23, -837, -48, 755, 250, 8, 598, -189, 833, 662, 633, -276, 499, -319, -607, 1353, 975, 556, 1053, -227, 415, -238, 377, 923, -29, -92, 408, -106, 160, -328, -197, -635, 2, -610, -800, -714, 1630, 596, -352, 483, 527, -231, 513, 1047, 244, 607, -80, 1489, 455, 362, 437, 276, 602, 355, -853, -341, 267, 181, 374, 489, -287, 54, -285, 617, -714, 161, 415, 205, -882, -979, 621, -370, 817, 584, -1195, -594, 880, 374, -355, 212, 2, -764, 45, 725, 320, -855, 128, 95, -548, -983, -586, -774]
7117g74P8J393n37m99j28J15j03M06M95k658J389J629n80k66J25k42l89O41J360
7136A455j504k0n89k84J268m10K71q36N05N5K01j630K346j439O23O24r40%J023
7155G19qq63Q7n6R49l57n60K79n41O80m81k60J417q31p53J47J234l52j038O69
7175H1o90J027m18J11J29L66m68L68n64M48n86m08J276J93n74j78J80J242j773
7194b38J172n90k58O73J88j132R28l48l14j952K872m59q86R83r40M52L07K14M31
7213A103j162J09L99o48M59l58n1J94O49J46m29k58n31J98R67m86l05j006J830
7232H20k58j281Q23o0r45J122l25j30j47M0mm15J011l41j025J155K43j270Q16
7251a71m66L81J30j26M59m66L92j64j91l98K139r20Qo58l80Q0j95j95L05J89k20
$$ y = [-774, -696, 697, 160, -339, -467, -352, -455, -49, 446, -2212, -823, 806, 226, -40, 85, -157, -546, 95, 1455, -49, -69, -658, -942, 326, -84, 187, -649, -144, -89, 112, -1518, 828, -611, 12, 636, -304, -304, 719, 711, -152, -65, -121, 828, 471, -89, 190, -351, 329, -152, -412, 1005, 174, -579, -432, 802, 450, -588, 81, -609, 418, 0, 111, 240, 606, 138, 506, -58, 390, -196, -604, 672, 865, 291, 113, 293, 1535, -238, 934, 344, 86, 759, 947, -185, 743, 395, 81, -1871, 1001, 542, -344, 639, -301, 151, 458, 672, 1103, -59, 50, 449, -199, 260, -98, -149, 45, 694, 840, 411, 153, -378, -180, 787, 301, -4, -1010, 820, 562, -719, 104, 44, -901, 221, -104, -234, -381, -341, -345, -760, 251, -90, -1115, 40, 283, -987, -171, -637, -256, -126, -252, 207, -259, 133, -31, -222, -620, 1519, 599, 607, -51, -431, -351, -546, -741, -436, -247, -467]
7272d67p9o86J141p64P94j105N08M06n6p80J065P01l02m40k9m0M8J033n85O1K63
7293F87j009M52J37j788J252L44p30O09j1P62J96p67l92MJ085o04jj101J104M41
7313F70j309J62J065j237J434j200M75o69k88J137J78j282J908j366J10P30k48
7330B70q86O26J02r60J269J042j468K9N28n44P98K99r21m72M66k22j13m9J278
7349A072l48j068Q42J73r06R84n35m4k5k16o64J88Q64j35j011L49K2K44O11J000
7369A397j349j137N95l8o41J343N20k98r01J063j97r97N26m71k99R00n11J77m45
7388g63Q60n00k65J80J082j558O87%n34L89P08j186M05J51J062k35j489J346j233
7407h93J020j072J264j42n05J410q18p20M11M17m33k56r4M61p04Q33m77j53P74
$$ y = [-467, -546, -1232, -91, -855, -61, -1166, -658, -252, -308, -1088, -23, 678, 376, -64, -93, -133, -85, 948, 363, 424, 687, -322, 130, 267, -1521, -269, 75, -655, -46, -57, 705, 901, 134, -258, -254, 831, 227, 226, -875, 229, 670, -639, -477, 588, -649, 785, -415, 60, -609, -897, 240, 418, -864, 1044, -322, -212, 518, 270, -616, 10, 112, -848, 421, 1463, -5, 24, 552, 8, 806, 1105, 184, -288, 178, -44, -157, -206, 1072, 724, -344, 498, 671, -235, 749, 214, 170, 145, -71, -735, -547, 317, 182, -829, -480, -458, -214, 397, 1397, 48, -1089, -494, -532, -1173, 170, 690, 392, -509, 554, 357, -640, -114, -585, -884, 16, -495, -318, -763, 97, -403, -668, -488, 594, -964, -277, -277, -811, -422, 286, -900, -495, -344, 718, 483, -1006, 340, -893, 127, -945, 319, 177, -328, 1082, 264, -456, -45, 372, -61, -317, -411, 50, -654, 179, -298, -451, 323]
7426C23q56J053p52O14p61M55Q15j295O51n12k95J070j00l69n58M52J99l07P42
7445E69l21q39q8J612m1m19j84M70j206k48J704p45j733J841j694J143L18J41
7463B80r02M38N51k12j95O80J107k737J596r58J190j288J263o21l98J407m96j137
7481d32l83Q17k87L55J146o75r59L68l86J020q36M0L39m63l30J175l80q2n72N22
7501cl24K16j707J558k10k49R53J31l42n34M30o49n9M29M89Q74j880J596j09j62
7521D48j037J2L22M54m9n96k23K60O29j230K73J921j358o14R45K94o45K46M14
7540D66j355P0R23J63j56N25mq91O76j63j098J202q28N32q6j81O89p82Q97O21
7560A220r89k18P4k33R9O29K1m68J92K8j651J523L11J62j110J477J007k106O35
$$ y = [323, -533, 520, -232, 382, -379, 76, 891, -404, 247, -265, -560, 510, 410, 41, -517, -65, 134, -173, 569, 248, -591, -679, 933, 892, 473, 289, 759, -447, -695, 1009, 264, -1469, 372, -1322, -179, 139, 280, -622, -184, 367, 155, -40, 640, 1747, -990, 606, -352, 838, -450, 813, 192, -206, 1201, 705, -432, -815, 2, -285, 70, 1216, 541, -418, -50, -436, 584, -252, -212, 127, -336, -666, 509, 129, 47, -525, -3, -327, -111, -1818, -260, -470, -719, 234, 365, 23, -511, -81, -730, -789, -360, 129, 1003, -877, 719, 610, 448, -589, -577, -255, 199, 150, -446, -669, -409, 220, -1010, -737, 1184, -174, -788, 157, 451, -194, 52, 466, -889, -819, 104, 267, 111, 636, 632, -259, 417, 254, -844, 358, -470, 62, -24, -205, 484, -298, 599, 1220, 231, 13, 87, -146, -47, 582, 603, 135, 327, 355, -1296, 227, 538, 700, -410, 1067, 2074, -32, 603]
7579F03p15M87m97n27J486j332M80J004j128K6K73j74n46O38J032j652j352K421
7597E27k93j49R20j073O6l4j58J23L65j25l14O02j05O9p75N44j88q30J187K26
7617E85j137Q76M14r48M01j15L04n42n76Q00o26L27J360r79k12m6M61q94m24O38
7637c33n71o07J210j19P61l73l24M9m52J597m85l49J98k71r70J785n11j354P10
7656d09P13j367J277j09Q90j159o04O60Q12j110j72J36J16R34k03l15O13j09q52
7675b58L09P18j179l14R18K29J04m47j24o43P25M05l42L82M98l42j014R11l76
7694A60m57l28M41L88q10J486q63m98K34j8P67P6O36j026j45N30o93Q01K54K63
7714A198j419q41J493n31M98n4n15k80J087j041k01J000q75R97J15m69Q6P8n64
$$ y = [603, -112, 375, -122, -649, 837, -495, -15, 989, -139, -113, 160, -14, -560, 78, 1110, -542, -1894, 527, 234, 85, 1005, -68, -2, -36, -194, -71, 294, 169, -145, 457, 352, 421, -354, 190, 2, -828, 359, 585, -552, 324, 738, -210, 191, 76, 380, -162, -738, 62, -564, -237, 1123, 144, -68, -114, 347, -547, -971, -333, -904, -1511, -301, -420, 341, -32, -356, -307, -759, 838, 353, 4, 202, -69, -1039, 746, 235, -1119, -409, 304, -1063, 214, 105, 995, -164, -768, -108, 704, -406, -578, -442, -326, 608, 405, 90, 703, 594, -258, 51, 769, -410, -724, 194, 423, 527, 80, -44, -687, 38, 443, 101, 483, 981, 639, -375, 536, 160, -297, -625, -184, 204, -606, 880, 17, -481, -247, -265, 502, 578, 1214, 188, 43, 573, -120, 681, 935, 1198, -221, -1062, 431, -100, 398, 344, -171, -451, 636, -405, -606, 394, -481, 516, 631, 162, 248, 326, -238]
7733b38l52J408j555J10L89J283k033J191j28m09K11r72J445K29k89N4j239R91
7751I6j91j502J520j36O28m93j25R4m17J727j196M89R4q05o81Q26L23j317J859
7770G93k69j442J183j18j256Q72J6J55r40N01P73k135J289R99j7o25l16J049p16
7789b04O53k55l96K85j19K56j73L63j08j889K535o87j105J902n3l14q33N56M56
7808H70r30O74N6q05J32L49j95p67P77j775P77N54P76O9k43j027Q16n4J123N19
7828A696k223J173O47j865L35N95R51r27K10j111M20N8J04l23n0J303p23o4k71
7847f5K69j71N88k8j536Q98k75J093j010J769j244q28K61J07J358j647j43O3Q84
7866C43K85j141j44M15J257j455L50J140n17j402J35J076j613J077N47r72j36
$$ y = [-238, -590, 818, -737, -627, -238, 1045, -988, 203, 75, -334, -123, -1095, 350, 579, 290, 344, -895, 96, -95, -1597, -77, -213, 415, -78, -203, -109, -526, 1201, 5, 494, 588, -217, -898, -72, 251, -1066, 793, 524, -918, 265, 147, -1109, -237, -221, -66, -1006, -505, 268, -1867, -578, 421, 404, -221, -537, 512, -204, 449, 194, -202, 83, -36, 220, 47, 410, 302, -1587, 948, 261, -844, 1058, 1005, 691, -142, 414, 870, -60, 614, 670, -135, -3, 346, 151, -616, 161, -1614, -837, -283, 493, 562, 319, -708, 108, 54, 1177, 1696, -527, 646, 1293, -572, -237, 358, 1309, 382, 592, -519, -99, -41, 63, -260, -310, 993, 270, 206, -65, 204, 33, 621, 593, -943, -45, -320, 773, -237, 1532, 288, -540, -279, -172, 1186, -461, -604, -541, 343, 628, -513, -657, -242, 1015, -440, -90, 1050, 533, -869, -734, 342, -1271, -194, 353, -619, -755]
7883g55N72J22K65k29L18j122Q60P23j363M3K22j116P58O56p47O18r74J54N99
7902c96N85m99O86j726J793j44j282J784m8j504K7O86k15l56Q82N17j898P82O47
7921C21P70j251L64k19l83J290j345m05N32J94q50J503j75l00n58J292p12R01
7939I69o47R26l09j794K29Q91p62J53J12K96l20P88o46k53J478j377N16o17J127
7958G60j371J069J746k284L96K26m90j10J2P23k24n0N34N21k182J171L26q50N68
7977D91p77K24K53M9L17L87j54j963O84J296o60J18j13n51M56k05o7l39J274l67
7997C53k22j128J582o01m01J8m09L85O0J190J33p31j610K525m04K1o52n97J211
8016G23j260K21N10r31K244j637p15J481k52o67M71l21p01M82JL84K51l79K29
$$ y = [-755, -183, -61, 204, -25, 293, -829, 31, 754, -609, -566, -344, -1460, -702, -46, -793, -175, -1149, -995, -396, 189, -310, 376, -1350, 443, 299, -983, 801, 753, -751, -724, -38, -253, -609, 273, 790, -1108, -326, 321, 1091, -160, 204, -15, -398, 892, -453, -858, -326, -132, -982, 521, 346, 46, -512, 780, 68, 969, 322, 1248, 939, -855, -626, 265, -497, -344, -232, 64, -256, 532, -114, -367, 1111, -266, 250, -367, 760, -611, 458, 2204, -80, 316, 542, 52, -58, -46, 677, 453, 403, 937, 1458, -724, 447, 773, -77, 491, -286, -62, 191, 240, 557, 944, 790, -1173, -489, 807, 147, 265, 152, -399, 57, -148, -215, -554, 720, 353, 131, -997, 585, -16, -417, -399, -808, -423, -363, 827, 960, 229, -1381, 1144, 740, 761, 109, -488, 723, -537, -316, 194, -737, 1507, -130, -845, 636, 384, -283, 188, -133, -834, -352, -351, 33, 284, -95, 134]
8035A34J19J33k61j050R11m52J422j272Q40p10k83J072r14L27O19J45l92l2PP0
8055D33n13M56k13Q28j758P66l54o92J178N91j506Q02Q73j038m43J78J213q78
8073g7N08J02P19j074P2p9l77L53p66R21j93Q73r75j24L39q2Q09n13j171m3R72
8094A94J823j731P76o37m36l08K61N07q02J152j293P42Q44j745J143j029J274
8111G35p67o36N48J23l40L04j09m87L75J91O57R6j142L84q57Q66M36j105J62j08
8131f74O5Q55N22j044O36k95m9K52q8J67M58j028j04l75P06Q3L01l75l34J351
8151A030J11k235J337k63J50J50K8l37q26O16q0L77M61j105J353r39N69j300p9
8170i82M18N67p32J005l26l56l99L64n1j41J015p47o87J295l90N7M43j49L67p44
$$ y = [134, 253, 386, 125, -925, -14, -466, 956, -316, 524, -186, -469, 603, -311, 16, 635, 780, 388, 356, 363, 433, -80, 376, 163, 991, -767, -1, -355, -1047, 131, 722, -784, 18, 891, -147, -590, -412, 801, -77, 431, 533, 1252, 178, 250, 171, -206, 147, -619, 302, 109, 982, 7, -117, 222, 140, 949, 436, -735, -778, 194, 2017, 286, 1062, 425, -11, -319, -58, 449, -353, 799, -494, 248, 1092, -653, 490, -539, 735, -32, -668, -120, 3, -337, -33, -142, -629, -254, -63, 594, 690, -452, -68, -925, -59, 377, -728, -566, -674, -609, 246, 768, -276, 360, 65, 16, 268, 180, 347, 805, -223, -327, -702, 4, 87, 388, 13, -321, 1030, 1141, -1094, 243, -20, 130, 280, 308, -29, -855, -239, -319, 58, 519, -586, 767, -172, 397, -903, -982, -564, 3, -729, 276, -50, -406, -805, -441, -492, -633, 382, -365, -1052, 243, -147, -90, 353, 204, 571, -173]
8190a73k03
$$ y = [-173, -376]
8191c76
$$ Imaginary data points
##PAGE= N=2
##DATA TABLE= (X++(I..I)), XYDATA
0@%%%%%%%%%jJ09k16K16k16K17l25M32m34N42o50P58r21J031j191J405j618J836
27I74k075K360k675L010l393L816m260M753n300N899o558P279q080Q950r898J0954
43E756j2136J3446j4903J6546j8417K0570k3055K5955k9416L3646l8931M5742
55B4803n4932O8063q8496J24970k09846P72281K69559j464430J86343Q65364m5157
66D48522q01870K05806O54377o4010p03019p1019N27370K22100m33561j45715
76a61019L57009P6657m28357j3411L91348K3521k80459N4079J21378j17903m5287
87b2444J30236l1146q3047N9152K4433p0107J1496k960l0195P9638K3592j59486
99g0838J4994K05786q6115k49082J29161K66293j18088k46910P1141K09375k3150
$$ y = [0, 0, 0, 0, 0, 0, 0, 0, 0, 0, -1, 108, -108, 108, -108, 109, -216, 216, -218, 324, -326, 432, -489, 542, -649, 756, -862, 974, -1101, 1259, -1416, 1594, -1799, 2017, -2243, 2510, -2790, 3109, -3449, 3830, -4250, 4700, -5198, 5756, -6380, 7066, -7837, 8709, -9708, 10862, -12193, 13762, -15654, 17992, -20939, 24803, -30129, 37934, -50562, 74408, -135438, 636843, 906402, -558028, -371685, 493679, 448522, -353348, -147542, 506835, 442825, -260194, -331213, 196157, 418257, -15304, -161019, 195990, 272647, -155710, -169121, 222227, 245748, -34711, 19368, 140746, 22843, -22444, 107792, 76646, -6401, 52751, 77184, 7077, 18573, 15613, -14582, 65056, 88648, -70838, -55844, 149942, 63827, -185255, -56094, 210199, 92111, -154799, -83658, 125717, 102567]
110A02567k20462n2403K62423J31854l35276k06300L85056K12293m34941j76478
120c31667M67153J23248m74531r5198M14429O9445l20879n0789K45842O3614k10440
131i9773j14317J96795J78765j89210k02669J92223J60513k27711r6468K68472
141F6620M8546k52163q590J79054n4484j01270J01967O5469p4446n0928L286L7541
153c9398O9370l4630q1847R0388P6018j72713o9248K38036O1845k33062k5851
164a21092K09073n803j80723L46J55586N9702j13153j30265Q8318J84868j03775
175D3082k18531J63387K54120k09078k51963K27856K08763k28347j42486K20215
185F7018J05155j76392r7650J10289J04059n5245j17379M1611J46925o2639j85258
$$ y = [102567, -117895, -170298, 92125, 223979, -111297, -317597, 67459, 279752, -155189, -331667, 135486, 258734, -215797, -310995, 103434, 172879, -148000, -198789, 47053, 110667, -99773, -214090, -17295, 161470, -27740, -230409, -38186, 122327, -105384, -201852, 66620, 115166, -136997, -145587, 33467, -21017, -122287, -20320, 45149, -29297, -80225, -76939, -39398, 29972, -4658, -86505, 3883, 79901, -92812, -162060, 75976, 137821, -95241, -121092, 87981, 82178, -98545, -98199, 57387, 117089, 3936, -126329, -38011, 146857, 43082, -175449, -12062, 242058, 32980, -218983, 8873, 217636, -10711, -153197, 67018, 172173, -4219, -101869, 8420, 112479, 57234, -60145, -18534, 128391, 65752, -119506]
196a19506R2208J99932j18417j62841J52771J04477j80814n2191J73677K1101
206A10397j24554N102O8699j2779l5391j8047K9676P9843l7018j44087M5784J55003
218A22628q3380j41967J39438J17850j73819j08796J46797P9777r5331n1450M9607
229A354M8718k4542j00167O95J65167J7855k10210q369K13082m5453k09478R6005
241e5343J96046j20452j65341J00802J08514p3409p1797L9794O7272o487r6502
252g6903k9261J28222L1471j54732k028J77780m2328j82854P7316J50979j01597
263b3935r9128J16514O0562j04729m1014N8805L7974p215m3836j9458P8361J5518
275B8419j29079J332J70126j5570j72289M8455J46451q3588j12749R6979R0439
$$ y = [-119506, -27298, 172634, 54217, -108624, 44147, 148624, -32190, -84381, 89296, 110397, -14157, -9055, 59644, 46865, 11474, -6573, 23103, 102946, 65928, -78159, -32375, 122628, 39248, -102719, 36719, 154569, -19250, -128046, 18751, 98528, 3197, -48253, 1354, 50072, 25530, -74637, -73942, 91225, 109080, -101130, -109499, 103583, 58130, -151348, -55343, 140703, 20251, -145090, -44288, 64226, -9183, -80980, -41186, 26086, 19599, -76903, -106164, 22058, 53529, -101203, -103231, 74549, 32221, -150633, -73317, 77662, -23935, -123063, -6549, 54013, -50716, -91730, -32925, 5049, -2166, -46002, -65460, 12901, 28419, -100660, -99328, 70798, 55228, -117061, -68606, 77845, -5743, -118492, -21513, 68926]
286F8926o4684o2856J8018M7047K7217n4282m6143R7090O3877j44927o1479J73096
298F0900L8511j69987J1754J60675m4710j37876N1519J01523k8789n5821N263
309g038L7807K4830m8188n2774Q7856P6564j21096p0848J45113L8054j56298J2442
321c3576J55507m3540j31925N0586Q9720m0670m7796K0291K9917J3150m5071n3735
333c7142P3291Q2120j03401p7550J29399M5964j55525j3182J57397j0429j30306
344c9364K1561Q3453k2312n0824r80L6250L6286l9280q4575N2815J03498q1670
356A4858r9842J14747P4321j44229m9104J38337J6240j10722O261P0755j4387
367A7235m6354n182K1264M0048j7427p8423L1974R3181o6174r9464J00763Q2440
$$ y = [68926, 4242, -58614, -40596, 6451, 33668, -20614, -66757, 30333, 94210, -50717, -112196, 60900, 99411, -70576, -58822, 101853, 57143, -80733, -29214, 72309, 43520, -12301, -7038, 30769, 55599, 7411, -45363, 42493, 119057, -2039, -72887, 72226, 110280, -46018, -33576, 121931, 78391, -53534, -2948, 86772, 46102, -1694, 18597, 48514, 61664, 16593, -37142, 36149, 118269, 14868, -62682, 66717, 112681, -42844, -56026, 101371, 90942, -39364, -17803, 65650, 43338, -7486, -8466, 27784, 64070, 24790, -59785, -6970, 96528, 14858, -84984, 29763, 104084, -40145, -89249, 49088, 65328, -45394, -39133, 31622, 17235, -29119, -34301, -13037, 27011, 9584, -68839, -36865, 56316, -9858, -109322, -8559, 73881]
379G3881j23769n3071J28247J4032j13565P139P9691j0366m4325n454J7161L4679
391D280j3029p1766L0389J01131n7105j11000Q3780R7972j10024o2585J23201
402A5244L5933j12759j5084P5578Q860l3104j2637J0907L9856n080p8470J7553
414e3203J14190l1851j21021O1179J02921r2906p2475J13677N1661r7567k5753
425e1148O4049Q397k7049n404Q998L5789j06p3883K877J08537j2911j12202M8004
438f052R9570q3884q2212J01448O2834q4225k9709N7044P519k7880j0727P100
450A0826M1684J1434p5315j8154J01761O58j13236L4631J15499o6564j01249P7478
462A9453O8136p2581l8213N5044J8198k5506k3837p316M2406K7915p0985k8898
$$ y = [73881, -49888, -102959, 25288, 39320, -74245, -67106, 12585, 2219, -42106, -47560, -30399, 4280, -8749, -80515, -50126, 51005, -6100, -117100, -33320, 64652, -45372, -107957, 15244, 51177, -61582, -76666, -1088, 7772, -25332, -37969, -27062, 12794, 7714, -70756, -53203, 60987, 29136, -91885, -30706, 72215, -20691, -93166, 20511, 72172, -25395, -51148, 12901, 21298, -5751, -11155, -2157, 33632, 33526, -40357, -37480, 71057, 58146, -54056, -6052, 93518, 9634, -72578, 28870, 91704, 7479, -22230, 34814, 42333, 14453, 3726, 10826, 52510, 63944, -11371, -29525, 72236, 72894, -40342, -5711, 109788, 43224, -58025, 19453, 87589, 15008, -23205, 31839, 50037, 24531, 694, -6622, 35784, 63699, -7286, -36184]
474c6184R7074Q807j20170J7343J22009m4995r9240O0883O6510o8580m3290M7669
486G836K5332j7309k3056j6456K9452L0989n8515l4201Q9653J9663j14151j498
498f2261J11944k8121r6927N3303P0411n8779m7336L8251K6666r850j7209j9018
510c8926K2530L6557n2604m2996Q6676L6545j09222j8697J08057j4534r6345L8552
522d4407P9166m4546n5357K8571K8389k748j4579j8799K3406M0547m8114n2855
534h1326P8465N2209r7560k6328J05466k543r7860K6186Q0265l3045m9898K7963
546a8006K5156m452j4179k1096K1197M8835l4478n8626O1641N4130q7878l1768
558e9524J06780J4432r5067Q286P3270k5839m6010K6381L0103j9j5431l3970J0658
$$ y = [-36184, 60890, 69697, -50473, -33130, 88879, 43884, -55356, 5527, 72037, 3457, -39833, 7836, 33168, 15859, -7197, -23653, 5799, 36788, -21727, -55928, 33725, 53388, -60763, -62261, 49683, 21562, -75365, -22062, 48349, -10430, -57766, -19515, 7151, -2699, -19908, -38926, -16396, 20161, -32443, -75439, 11237, 47782, -61440, -80137, 27920, 13386, -82959, -44407, 34759, -9787, -65144, -36573, -8184, -10932, -25511, -44310, -20904, 19643, -28471, -81326, -2861, 49348, -48212, -74540, 30926, 28383, -69477, -43291, 36974, 3929, -45969, -18006, 7150, 2698, -11481, -32577, -11380, 37455, 2977, -55649, 5992, 60122, -27756, -59524, 47256, 61688, -33379, -25093, 48177, 22338, -23672, 2709, 32812, 32793, 17362, -16608, -5950]
571e950N7518k2381o2631N5470O1439q7363n3164R9128L5727q7162l900P0315
583E7046j8917n0242J5508L2749Q726j2788l7876N038N4901j9412o7224N1129
595A8638P1042p9176o5407Q5662M1181q5040q792P1450j1005n4177Q308K8843
607B1527O502q236l0587N37M8687j4617o9288L9120P4537o1882o6768P2383M2068
620E3983p8992j6757O6288j959m6595M579J4805L682J255k5186o873N2516n882
633A4864p4423J7677P7433m2091p0746O5986N0788p1325l3205N6647J0395l5013
645c3013K800J2637O165M93l1532j2979N9851J4814p6254N218P9208l6464p6965
658h6021O2119O6390o1726m2661N3047J4954l6747l5K1593J3843J357l6323j9293
$$ y = [-5950, 51568, 29187, -33444, 22026, 83465, -3898, -57062, 42066, 77793, -9369, -13269, 57046, 38129, -12113, 3395, 36144, 44870, 32082, -5794, -756, 54145, 34733, -32491, 18638, 89680, 10504, -54903, 30759, 71940, -13100, -21892, 49558, 38553, -15624, -7316, 21527, 28029, 19793, -10794, -10257, 38430, 23813, -45475, -6355, 68182, 6300, -60468, 11915, 53983, -25009, -41766, 24522, 22563, -24032, -19453, -4648, -966, 289, -24897, -31770, 20746, 14864, -59559, -41882, 35551, -6540, -77286, -11300, 39488, -31837, -65042, -8395, 2000, -33013, -30213, -17576, -11411, -10918, -42450, -55429, 4422, 19236, -57018, -51800, 27408, -9056, -86021, -23902, 42488, -19238, -61899, -8852, 6102, -30645, -30680, -9087, 4756, 6113, -30210, -49503]
671d9503N7129J9836o9368N737P9532l2162q1500M8923O8365n3960l9104N4631
683H556J6131m0371m068J9992J2564P688k3953k3613M4593K2770o3363k590P7288
696E1624j5496p7256L5609O3157m6535l9740M7503J8419l1161p517J1323O297
708A6227J4620j6206k6363L9795L0270o4743k0534P8410J105p7242K2239O7870
720F5448l6766n1329L4991K7941k1174j0262L045N845J3501k0221l1547M3948
732B3420L9605o4488l3173P2426Q474p8815J8974P5934l5283n9738K9270L0795
744B7401k3929q267Q206N050Q439k0911l6814L7019M3724n0688l6007O4245Q687
757B6155p5710Q625P1743k1384n2410K5491K3523k2426p033R348J578J6058r525
$$ y = [-49503, 7626, 27462, -41906, -36169, 43363, 11201, -70299, -21376, 46989, -6971, -46075, 8556, 24687, -15684, -19752, 240, 12804, 20492, -3461, -27074, 17519, 40289, -23074, -25664, 51624, 36128, -41128, -5519, 57638, 11103, -28637, 18866, 37285, 6124, -1393, 9930, 16227, 30847, 14641, -11722, 28073, 58343, -6400, -26934, 51476, 52581, -24661, -2422, 65448, 28682, -22647, 12344, 40285, 19111, 8849, 11894, 17739, 31240, 11019, -20528, 23420, 63025, -1463, -34636, 37790, 46264, -32551, -13577, 62357, 27074, -32664, -3394, 27401, 3472, -4795, 3411, 8461, 16900, -4011, -40825, -3806, 39918, -10770, -46777, 17468, 26155, -49555, -40930, 30813, 9429, -42981, -17490, 6033, -16393, -23426, -14078, -12500, 3558, -5967]
770e967m0071K2551M8890l9202m4516N9040K6648p1241r052O5630o311n0064J6018
783b7647K6448j2653r972l049J638K6285m970m3479K2166N3572m1787n1107O2850
796a705L8858p1138j6781O9249j254n7793J5685L8250j2280j7468j529L776K0263
809F133n50l4598J7102M8591l8237m7664N4576M0915o1604j3052O3530p016n3391
822b5265J8125L3481j1756o755M293r178J0773Q620l1684L485N1847j7610n4296
835b5920L3662M1717m6678k1662N2538Q552m1938K311K2685p590j385l28q077
848G887K1727R519m6423p050O0405p695o1523L0965N2364n1133m4433N3791K5011
861D3412m1780o059K6361m137j5300p223J809K6051Q572m4874o327N0987j2814
$$ y = [-5967, -46038, -23487, 25403, -13799, -58315, 725, 27373, -43868, -52920, 12710, 6399, -43665, -27647, -1199, -13852, -23824, -26873, -25235, 1050, -3920, -47399, -25233, 28339, -13448, -64555, -1705, 37153, -33985, -50766, 18483, 17229, -40564, -24879, 13371, 1091, -16377, -17906, -14130, 6133, 5583, -29015, -11913, 36678, -1559, -49223, 5353, 46268, -15336, -28388, 35142, 28126, -25265, -7140, 26341, 14585, 7830, 12123, 2945, 13718, 22338, -9346, -5861, 45986, 28376, -25920, 7742, 49459, 2781, -18881, 33657, 42209, 271, 2582, 25267, 17677, 16292, 15964, 7887, 29614, 39133, -7290, -14340, 46065, 38370, -23153, 7812, 60176, 9043, -35390, 18401, 43412, 1632, -4427, 21934, 17797, 2497, -4726, -2917, 23134, 31706, -13168, -19495, 31492, 18678]
874A8678n8271L5038N6600m9543m4809M8793K0276m6367P22L2251n455j6789j942
887a0818o038J1951J9031k9337j5559M2632j646n5774J8749N4145l1428l8652
899d2744L5704J6973l6407l704K3775k514m102L73j8389J1464K6915k9568k4345
912d6569N1259J1459o1527M248O0314k3115m5386L3637L1842l3024j6082K1971
924a0973O268l762l180q812J4284J9845l5256j9261N1948J5905n9603N535N7734
937C0672k6719m7138L6956L5622l1466j4254K2414k066j0093O491k728Q333K0357
950B6381k4376k6105L7917J8895m4396J550N0888j7456m5709K4850L0914k4452
962H901o961J7254n216l027N897j4644L680L2893j7077l6818L2911K7461m6414
$$ y = [18678, -39593, -4555, 52045, 2502, -42307, 6486, 26762, -19605, -18883, 13368, 7913, -8876, -10818, -16856, -4905, 14126, -15211, -30770, 11862, 10216, -45558, -26809, 27336, -4092, -42744, -7040, 9933, -26474, -30178, -6403, -8917, -13019, -12646, -31035, -19571, 7344, -22224, -46569, 4690, 16149, -45378, -41130, 19184, -3931, -49317, -15680, 16162, -16862, -32944, -10973, -4705, -8467, -11647, -20459, -6175, 13670, -21586, -40847, 11101, 27006, -32597, -27062, 30672, 3953, -43185, -6229, 29393, -2073, -16327, 6087, 4021, -6072, 419, -2309, 6024, 26381, 2005, -24100, 13817, 32712, -11684, -10134, 40754, 23298, -22411, 2439, 33353, 8901, 1940, 19194, 13978, 10951, 16848, 2204, 5884, 38777, 21700, -15118, 17793, 45254, -1160]
975a160j5204N5905k37m9106J3042L2082j8760j8547J3522O590L78m34j9511L662
989B222L1392j8418l6597L6939L1078n2223k0630N5918J026n0559J4942L7430
1001C2520k3856k3165J7610N102m863L110j1799k063K2782j4412l3489L2378L2107
1014C1962m2284k2998M4298J797m6875J5257L6377j8052j9186R864k318l613J2918
1027b853q381q444K5315q333m0436K0188M3163l0791k8284L9297Q213m4661M095
1040c1912L6838o595j8282O608l108n79J1642j2525n770L0702l798m4112J6299
1053b4592M5283k9997l1929M2310J8215m6077j274L7873o780k1211J2082M186
1065a911l550Q173r237j0002K7843R93l7564J4886M2231k5112l6707L8131J8963
$$ y = [-1160, -16364, 39541, 39304, -9802, 3240, 35322, 16562, -1985, 11537, 18127, 18505, 18071, -1440, 2222, 33614, 15196, -21401, 15538, 46616, -5607, -26237, 29681, 30707, -19852, -4910, 32520, 8664, -14501, 3109, 8211, 3348, 6458, -5341, -7404, 15378, 966, -32523, -145, 31962, -10322, -33320, 10978, 12775, -34100, -18843, 17534, -518, -19704, -9840, -12158, -15771, -2853, -11234, -19678, 5637, -2696, -43132, -22944, 20219, -10572, -38856, 441, 8654, -36007, -31912, 4926, -1669, -19951, -13343, -16451, -17030, -5388, -17913, -23683, 7019, 3221, -40891, -24592, 20691, -9306, -41235, 1075, 19290, -26787, -28061, 9812, 3032, -18179, -6097, -1911, -5461, 2712, -6525, -16527, 11316, 12309, -25255, -10369, 31862, 6750, -29957, 8174, 27137]
1078B7137l9188p22L4566o462k2242J0877L252k923J3387p438j5463K2961P358
1091B5100l8006P026M5731j6691m0136K8398K3083l5706n418L2714p46j9629M566
1104A0286n67l257J6243q333j6527K2257J1141m0219L01M8268j3500m3016K4850
1117G927K7663l4526j3573L4283J429k0937L317j13k872J1824m735j7143K0301
1130A2845J0950l7310n733M5571r263m1084K1226K7902l2007j5837K8468L814
1142I542j8091L816J748p512J2152k785j9667J7751J8183l4470j1416M0810l013
1155G048m1086J8478L0542k6497j9005K6007K507j6452O623J673o759J3357k328
1168e892k3519J6347K4399l0296j5237M1976K109m3617J1543L4801k1117k2546
$$ y = [27137, -12051, -12773, 21793, 15331, -6911, 3966, 7218, 4295, 17682, 10244, -5219, 17742, 25100, -12906, -5880, 39851, 23160, -16976, 11422, 34505, -1201, -6619, 26095, 25349, 5720, 10286, 9719, 6462, 22705, 14372, -2155, 20102, 31243, -8976, -8675, 39593, 26093, -16923, 7927, 35590, 1064, -12509, 21774, 23203, 2266, 5583, 5470, 2598, 14422, 9687, -7456, 12845, 23795, -13515, -19248, 26323, 17060, -24024, -2798, 25104, -6903, -22740, 5728, 9542, -8549, -4733, -2985, -10497, 1655, -1130, -20797, -3046, 15137, -19333, -30749, 10061, 7048, -34038, -15560, 14982, -11515, -30520, -4513, -2006, -18458, -11835, -10162, -16921, -3564, -5892, -29411, -13064, 11335, -18961, -34198, 7778, 9887, -33730, -22187, 12614, -8503, -31049]
1180c1049K4532R000j7397J875M411m142J3378k355k2237J4621K5683k7267j7703
1193b8650M0209O173m2674Q074L7031j7351k2303K3057P927j7816L378M627m692
1206c010J1040L016k2625Q727K6672k2922k0137L8093J1077m1229L090L5139j3245
1219A3686k1160K0202Q951j4431M62L173p022J1186O394k2328N370K7526k0593
1232A1416k7936L4258J6087l6496j828L4111j1377k3657J5986R363j1582L036
1244A1381K408j0001J0919O221k6135L030L3380j6793l1134K6993J8682l7791
1256h840n796L5768n579k7815J2607J1437j3436J38L960q030J0813N680k5289
1269a4382J30L1448j2849k9628K6716K0255l6458j1050L5044k562k5559J1300
$$ y = [-31049, -6517, 2483, -14914, -13039, -8628, -12770, 608, -1747, -23984, -9363, 16320, -10947, -28650, 11559, 17732, -24942, -16868, 20163, 2812, -19491, 3566, 11493, -6323, -2945, 1682, -3010, 8030, 11046, -11579, -2852, 23820, 898, -19239, 18854, 29931, -11298, -8208, 26931, 13686, -7474, 12728, 21679, 7248, 7710, 10883, 3861, 15047, 21441, -887, 4483, 32009, 11416, -16520, 17738, 33825, -2671, -4499, 29612, 18235, -5422, 10564, 19927, 8345, 11381, 13789, 3788, 14707, 20928, -5207, -2177, 31203, 14410, -16724, 10269, 28951, -8840, -14636, 21132, 15553, -12262, 345, 11782, -1654, -1516, 2444, -5586, 5227, 10907, -14382, -14252, 17196, 4347, -25281, 1435, 21690, -14768, -25818, 9226, 6664, -18895, -7595]
1281g595J1784j4249j607N445r077J0278R161k1159o927K8950p348l0225K3189
1294i380K4731l2846j3941L1030N19k2728J1957J1270j2340p68L017j1161J0685
1307i955J6500k1605r697K7716k761l4297J9038L2256k5427j9238K7868K569k2413
1320a9446Q776J3770o224J09K903j3331Q631J7551j9232q024L0272j343l7757
1333b3345J4647L4127k2934j9247K8991N470k5243L580J6176o578K51M831r359
1346A367M351J3961j7005j0599L0065K113l4346J1410K9320k0714k0287K5927
1358A5563P936k1789K974J4285j0963j022P746j1091K783J7537j4865j7283K4309
1371A6120Q027l1465M600L1623j5258k4115J7953J1850j9209J649J1683p876m69
$$ y = [-7595, 4189, -10060, -11667, -6222, -15299, -5021, 4140, -17019, -23946, 5004, -2344, -32569, -9380, 15351, -17495, -31436, -406, 113, -22615, -10658, 612, -11728, -12496, -9479, -20640, -9955, 6545, -15060, -24757, 2959, 198, -34099, -15061, 17195, -8232, -27470, 398, 2967, -19446, -10670, 3100, -3124, -3015, -112, -13443, -4812, 12739, -6493, -14517, 15755, 14412, -23345, -8698, 25429, 2495, -16752, 12239, 17709, -7534, -3954, 12222, 5644, 5895, 10726, 1367, 5718, 19679, 2674, -7925, 22140, 24253, -10093, 1317, 30637, 9923, -10364, 15563, 23499, 1710, 4684, 18969, 8006, 6984, 14730, 3639, 6422, 23959, 9094, -8189, 16120, 24147, -7318, -2718, 28905, 13647, -10468, 7485, 19335, 126, 1775, 13458, 5582, 5113]
1384E113L452j2771K369K1917j3786k0887K4055J0110l5129R29L6813j2457k8472
1397a8744J8127J1754k0829j311J6454n894m085L941j1860r12K1852r432k0618
1410b1557K1637J2679l5150k784L5193q062k6093J5608J2953k1645k898J7421
1422b698m593k200Q517j3229n407J9184n979j9211J9783J6057k7489r438L1361
1435D658n241k4149J5505J4366j6460m041J1426o244p23J0510r057o057K1050
1448E543k991k5735J6933K3339k6145j1461L1658k98k8625J0200J8947j2182m653
1461e470J1691m850m240Q367q907l004K2220j862k5404J2058K1355k5265r271
1474a2582L3398Q31l0127P406J9150j3954m296J5032l334o191O129n758p313J8792
$$ y = [5113, 8565, -4206, -1837, 20080, 6294, -14593, 9462, 19572, -15557, -14628, 22185, 9728, -18744, -617, 11137, -9692, -11003, 5451, -443, -4528, -587, -12447, -13359, 8493, -939, -21557, 80, 12759, -22391, -25175, 10018, 1956, -24137, -8529, 4424, -17221, -20119, -2698, -7291, -9491, -974, -14203, -19610, -426, -6405, -25616, -5833, 10224, -17265, -26703, 4658, -583, -24732, -9227, 5139, -11321, -15362, -3936, -10180, -10903, -393, -9450, -15507, 5543, 2552, -23183, -6250, 17089, -9056, -20517, 11141, 10843, -17782, -7582, 11365, -817, -5470, 6221, 1371, -2869, 5498, -3409, -6413, 15807, 13945, -11459, 599, 21954, -3311, -12582, 20816, 21647, -8480, -1074, 18076, 4122, -174, 14858, 11524, 5333, 11462, 5704, -1609, 17183]
1488A7183L184k4790R303J8644k0006j4667K9882N243k6064N554J5776j3718n001
1501E23J2599m444l609J1542q713j3561J8680N458k4863N527K5292j7114k1597
1514a4280K3818Q827k4090J535J7921j0457p860Q149l061l553R898p873j0224
1527a1250J7776L792k7734N423K7163j5270k0204K3328R264k7784j167K1205o087
1540a545r727R792l170r178Q505j458j0313J7408P012k6072k877K6230j1715j6734
1554b3842K0951J1724k6042l219J8767o490o009J2709k302r656Q676k590j1762
1567a9085J5626J4062k5099o050K4947n894k2299J9492J5641j9608p427J6733
1579A039l856o414J0431j804p094J0822l058j4520J5081J3751k1156o870K7438
$$ y = [17183, 20367, -4423, 4880, 23524, 3518, -11149, 18733, 23976, -2088, 3466, 19242, 5524, 523, 13122, 8678, 5069, 16611, 7898, -5663, 13017, 18475, -6388, -861, 24431, 7317, -14280, 9538, 18365, -5725, -4190, 13731, 3274, -4586, 3563, 502, -3051, 6847, -1026, -11250, 6526, 10318, -17416, -11993, 15170, -100, -20304, 3024, 12288, -15496, -16663, 4542, -1545, -11272, -1480, -4650, -13828, -5323, -6781, -17094, 314, 7326, -18746, -21623, 4607, -7108, -23842, -2891, 8833, -17209, -20428, -1661, -8151, -14160, -1451, -3753, -13409, -4733, -7323, -19085, -3459, 10603, -14496, -20546, 4401, -1493, -23792, -4300, 11341, -8267, -15694, 1039, -2817, -9231, 1200, -604, -7698, 3124, 66, -14454, 627, 14378, -6778, -13648, 13790]
1592A3790m512k5915J7404J7574j9401q338J9396k253r167P226R61o349R130J86
1606I732j4370J0404J4161j8919q370K6474l786k2928J3160J6159j7958p670J9366
1619A5455q99j1934O877O16r941J0139M106j5557Q500J5342j9747j1895K3542
1632A4604K474k2825Q880J9229j8517j0782J5020J590r200P411j343r657Q424
1645E308K468j4564P754J8006j8838j5292K2469L914k3587P600K1311j5034j5329
1658a3814J4521J782j0375O437L655j0694P366K438j5428M987J8661j4457j5719
1671b0640K2117M254k4516M254K1975j3419j2278J4476J864j2367O944L168r233
1684a3401P494N300j5487J832J8518r851j6955K0207Q668k3712J860J9374r251
$$ y = [13790, 9278, -16637, 767, 18341, -1060, -9398, 9998, 7745, -1422, 5804, 6765, 416, 9546, 9732, -4638, 5766, 19927, 1008, -7362, 19112, 15326, -7602, 5558, 21717, 3759, -3911, 15455, 14556, 2622, 9499, 10115, 174, 10313, 14419, -1138, 7362, 22704, 2957, -8938, 14604, 17078, -5747, 3133, 22362, 3845, -6937, 8083, 9673, 473, 7884, 6541, -3116, 5308, 7776, -6788, 966, 18972, 134, -15158, 7311, 11225, -12362, -4762, 16549, 1515, -13814, 707, 2489, -7886, -1449, 2206, -8488, -1122, 1316, -14112, -9125, 9536, -4921, -20640, 1477, 5731, -18785, -14531, 7444, -5975, -18253, -3777, -1913, -14280, -7336, -4168, -13401, -5907, -607, -16094, -14262, 4256, -5595, -22550, -2343, 6325, -17387, -15527, 3847, -5404]
1697e404j0183J3155L014j1366N036K807r104P626R003j5447j678K0295q882j7947
1711a9075J8911J2714k1475l357J9971n891j2723J0551Q447r924L846J108r163
1724f060Q112Q536j3179j004K0553j0180j9844J6803J5757k0341l423K0737o066
1737A0401j6531J0756Q717r651L275L820j0185M920R062j1992l316J9884o367
1750A2793j9546J2985J4220j8416n107J9433l887j5915J0376O837j1604M424M484
1763A1077j1480L713J1284j2844p548J9867k096k0899J1271J5220j8086q886J8857
1776I450o03j5060P753O157r753J751L604r018K742J1630j1400q556J7040R25
1790F662k2837Q599J8844j5742j1240J6992J224j4337N726O987q830J602M476
$$ y = [-5404, -15587, -2432, 582, -10784, -5748, -2941, -12045, -4419, 4584, -10863, -12541, 7754, -1128, -19075, -164, 12550, -8925, -12282, 7689, 1798, -10925, -374, 8073, -1851, 1995, 3103, -6060, 2052, 10588, -2591, -3595, 16958, 6778, -13066, 3737, 19494, -847, -4270, 16467, 10401, -6130, 4626, 13343, 3692, 6967, 10787, 602, 5522, 14584, 2592, -724, 19160, 12793, -6753, 6232, 20452, 2036, -3071, 16362, 12475, -3440, 6936, 13773, 2169, 6593, 11077, -403, 3310, 14594, 1750, -5798, 14069, 11973, -8926, 2345, 17565, -521, -9407, 9450, 8847, -6213, 1540, 7697, -2056, -305, 3299, -5719, -2977, 8653, -2747, -11303, 5737, 6662, -16175, -7576, 11268, -4474, -15714, 1278, 2502, -11835, -6109, 878, -7952, -6350, -1874]
1803a874q984J978J0994p866j0773J7277J656k1197O820J8834j2884j1361J6192
1816a188J642j6560N830R325q251K234M311q782j121J4129p705r339J7022K818
1830D365k1223M140J9456j0463j1003J6967J445j3852K691Q374m882J751P674
1843E440r743k806J3827o702j0642J4822Q869k0761J601J9354q846j2972J3293
1856D734P479j3334O71R222o114q13P497p118l294J2957n393j2397J4611R306
1870A8014j9474O13J7256o915j5875J4195Q606j3800NQ650n791j592O971o577
1884D286l050J2281m332j3649J1670J0498j7293l807J8070l623j6062R699R765
1897A4453j3439j078Q635o531j197P439o665n854J3605k431j5417J0274J0830
$$ y = [-1874, -10858, -8880, 2114, -5752, -16525, 752, 2408, -18789, -11969, 6865, -6019, -17380, -1188, 454, -16106, -10276, -951, -9202, -6968, -2657, -11439, -12560, 1569, -6136, -15475, 1547, 4365, -16858, -12718, 6738, -3725, -14728, 2239, 3684, -10168, -7477, 897, -3985, -2234, 5440, -4303, -7109, 6718, 16, -10626, 4196, 13065, -7696, -6095, 13259, 4413, -8559, 4734, 12213, -1121, -450, 8772, 2658, 1845, 9342, 2224, -1070, 11887, 6494, -5903, 8708, 18014, -1460, -847, 16409, 9494, -6381, 7814, 16420, 2620, 2625, 11275, 5484, 3892, 10863, 4286, 1236, 13517, 9185, -4464, 7206, 17704, 411, -3396, 14674, 11051, -5011, 4688, 14453, 1014, -64, 8571, 2040, 843, 8282, 1617, -4237, 9368, 6937, -8480, 1794, 12624]
1910A2624j7399o799J8804r46j6228P686R841j3650j794R942n221k159Q128p247
1924d418p653J1809p5j4230Q915J4416j7028q690J7028O50j4908P449J0182j1342
1938g895m381Q671m883r61Q125n478o684J0526J26j3991P552J5911j3766j0264
1952a7392J6040L557j7690P335J1455r549k868Q068k959m423R065k613p284R933
1966F75L986j5764M111J5885j1348r733J4971L149j3786L166J1433q324k158Q220
1980D483l541k860P454l111p776J0495N242j4216J374J5561r986j1682J6525N726
1994A3688j4892J283J0508o483n086Q984r39k735N045j703j0354R758P012j3936
2008A50J280J5404j0566j2336J3761P831j3586M6J1021q527n029P789Kn790P385
$$ y = [12624, -4775, -11574, 7230, 6284, -9944, -2258, 7583, -6067, -7861, 2081, -3140, -5299, 2829, -4418, -12071, -262, -337, -14567, -5652, 8764, -8264, -16954, 74, 724, -14184, -6735, 3447, -7895, -12276, -3605, -8488, -9449, -1324, -6802, -13486, -2960, -2834, -16825, -9273, 6638, -7128, -17392, -1352, 2205, -15485, -8150, 3305, -6244, -9112, -1044, -4003, -8426, 639, -1974, -9258, 675, 4661, -11103, -6992, 8893, -2455, -12188, 2783, 5932, -7854, -4688, 6745, -1579, -3737, 4483, 942, -1918, 5536, 2425, -5351, 5144, 10386, -3830, -2456, 13105, 3119, -8563, 7962, 13688, -1204, 79, 10587, 4104, -982, 8002, 7063, 4328, 9373, 7670, -2684, 7074, 14086, 150, 1430, 16834, 6268, -6068, 7693, 15524, 1938, 1984, 13005, 4478, -551, 7238, 7240, 1450, 8835]
2023H835k234j0236Q154P844j2534j757J5043o877j4564J1011Q316j3214R5R675
2037G557o373o721Q153k77n451O371J046j1894N731Q494j1988k921J3689l838
2051A578j4736R374R410j1927k927J0073m812n843O463J367n702O985j684j0280
2065a2661P421Q599j1382l883J4654l696j3671Q828J0783j1869m929J0600k965
2078d171n972P571L59n738M409J291r588M378J2512j0214n926J3052k779j3335
2092a4151Q433J2217j0750l437R338k969p684R458K610p188N414L619j3334L868
2106d556J3429p207p921J4422k24j5424M630J3004p349l357P531j121q732O109
2120C234J649m552O836L691j1679J173J2492q780p211J2539M933j6775M136J2295
$$ y = [8835, 6601, -3635, 4519, 12363, -171, -1928, 13115, 6238, -8326, 2685, 11001, -2213, -2118, 7557, 1184, -5537, 2616, 2339, -3112, 3259, 4305, -7589, -1858, 6636, -5352, -8273, 5416, 1578, -13158, -3784, 5626, -6301, -9228, 845, -3967, -9810, -3347, -1980, -7682, -697, -2381, -12661, -5240, 3359, -8023, -11906, 2748, -948, -14619, -5791, 4992, -6877, -11806, -1206, -4171, -10143, -2572, -2213, -7951, -3542, -2251, -11839, -7461, 5051, -5163, -11089, 1963, -816, -14151, -5718, 6499, -4251, -7688, 1650, -1319, -9003, 455, 3065, -4123, 1291, 4910, -8424, -4556, 8873, 1666, -6255, 8167, 7943, -7481, -2851, 10153, 2804, -553, 6978, 5857, -2875, 3234, 4883, 331, 7167, 10858, -821, 352, 12844, 4064, -3147, 9392, 14325, -2450, 1686, 13981]
2134A3981q446n867R632M23p835L999J652n684N439L588j0311J522J1581p811
2148E863r849J0330O154j4381J775J3196p648q698J0107k66q714N340K594p544
2162a741J969O762r799p97J2993o867j0923J0228N809j4018K80J3400n975q172
2176f851O334J593q030N561K431p270K747N314r362k306J3615k976j2808Q950
2190c058O383j2820l176J3622k613q620O341J097o699L625L455o535K575P821
2204A398j0898k557J2649j738j2760R365R502j2073l849J1480k373q438P528L419
2218F55p449K413L159n960J450Q669p377l166J0385q62j2705O598J1781j0282
2232b691l823J2070k283j0768P579M910p613K409O406q893N76R246n267m437J1143
$$ y = [13981, 5535, -332, 9300, 9723, 1888, 5887, 7539, 1855, 7294, 10882, 571, 2093, 13674, 5863, -3986, 6344, 12498, -1883, -108, 13088, 5440, -3258, 6849, 6583, -2131, 3209, 5803, -1741, 228, 6990, -2809, -3606, 9387, 2520, -8403, 1825, 7634, -6384, -6104, 7296, 1321, -6851, -517, 1076, -6954, -1393, 1038, -6232, -3485, 1829, -7533, -9839, 3776, 800, -12008, -3058, 3325, -9495, -12671, 951, -1662, -10282, -3941, -2844, -9543, -5918, -2463, -8998, -6423, 1398, -9500, -12057, 592, -1146, -13906, -4541, 4961, -7112, -10961, 519, -1854, -10292, -2764, 655, -6794, -4381, -1222, -7182, -5732, 2937, -4440, -7606, 2779, 1917, -10788, -4190, 7591, -2691, -6514, 5556, 3273, -7495, 84, 4994, -2619, -210, 6196, -2697, -2121, 7125, 1858, -2579, 8564]
2247H564Q30j4300M476J0784r255l624J3210o96j0473K980M997n830K659O068
2261A0390q361q24R169o620m969J1849J500j3004L352J0436r007q035J2686K251
2275A0813r562J831M744p029J895O135o301n31P287o650o669Q785M506j1873K495
2290a24J0301r300o966R910J984r051L168O039q006j11N368o665j062R129l541
2305A073r156Q570M571j2479J377J0597n659q426R036K28q018K780N906m918J15
2320d403M631p036j997Q970l072q524Q998N219j2980%J2040m978o831Q010K752
2335G99q640P00N504m731J649L821l188l885Q377l765q301R721P132j1468j868
2350h143J1467n918q403Q612N925p106N12M779n516l46P524l876k356P517j393
$$ y = [8564, 9394, -4906, -430, 10354, 1099, -2525, 10685, 9989, -484, 2496, 7493, 1663, 4322, 10390, 2029, 1205, 10374, 3754, -1215, 10634, 12134, -870, 2482, 12918, 3911, -4124, 8562, 10813, 1251, 3082, 7826, 797, 2692, 8827, 2526, 1995, 9282, 2632, -4037, 4748, 9254, -2619, -124, 10177, 877, -6089, 3821, 5805, -3246, -78, 5961, -2045, -2156, 3212, -3453, -4515, 4614, 1073, -8083, 487, 5058, -7421, -6044, 4553, -1106, -9532, -496, -268, -8286, -5506, 400, -4518, -4403, 228, -6808, -8805, 165, -2907, -11431, -2433, 2786, -10194, -10194, 1846, -3132, -9963, -1953, 799, -7841, -7141, -1637, -6368, -4719, -898, -4086, -7971, 406, -3359, -11660, -1939, 5193, -6275, -8143, 3324, -2594, -10997, -2385, 3540, -3566, -3054, 1725, -3791, -4137, 3387, -489, -2845, 4672, 3279]
2365C279r896O105P986q803k885J2239l819j1105P061P584q115K882M825n403
2379A935k086N725k517l431J0529j946j1028N216Q854q482m012J2230r16j2022
2393a951M332O421n561M2M889k934l798M899l223l660R291J038j1637L414R408
2408A0970r027n615J3254j302r992L350O208p987j023P165l745k692M914j115
2422C363n855O279J950j0918L032R518p604p225J0960J74j0621L819Q045p066
2436b149k716N594m547l902Q852j950p281O771K913j1046J327J1386n793p841
2450a0382R374J880j0498K285P891m631k032N307l375l007N382Q5p813P915K200
2465E81r099K19J1351o890p518R743N230j2087J158Q513m207k500M981j494l693
$$ y = [3279, -6617, -512, 7474, -1329, -4214, 8025, 4206, -6899, 162, 7746, -369, 2513, 7338, 1935, -151, 5574, 3057, -374, 10155, 8209, -2819, 2397, 11251, 2769, -1243, 10987, 10071, -1951, 2381, 8802, 3241, 3283, 8172, 5238, 1440, 6339, 3116, -544, 8747, 9785, -1852, 1562, 10970, 1943, -3672, 9582, 8280, -1712, 1638, 7846, -141, -1164, 6001, 2256, -436, 4478, 3363, -2492, 3787, 5737, -5181, -2149, 7369, -235, -7460, 3500, 3674, -6947, -3128, 4917, -2149, -4865, 729, -3818, -7720, 1132, -818, -8099, -1328, 1585, -9461, -8134, 3252, -2541, -10382, -1008, 872, -9626, -7341, 550, -4081, -6113, -806, -4181, -7188, -1806, -1721, -9534, -1619, 581, -8518, -8299, 3052, -3838, -11356, -1613, 3617, -8470, -7312, 1201, -3006, -5506, -525, -2019, -5712]
2480e712M597k96o000P258M808r789r9J1105n393p378P123N750r235M39P501m433
2496B46l519P316j803n088P125j87p557M755O649q866j427J1461l375r206O404
2511B928N411p195k48P822l965m690O548r46m860O231R01p889L408O517q618j790
2527d35J1328j564j1754O033N470q266r41R485l465n957M639j34m842N652P99
2542F048p391L383N548q170l523J0817m5j1118M961O623r299r07Q430k808m197
2557a648L441j101m618M079M125r033K355P670p619o052R802J560j0744L223Q090
2572C530p014l306Q124k280n392M119M94n245N179L752q826L57Q454p468m292
2587i814Q640K860j1664K987P885n583m467P778L16o078L788P81m952N262K477
$$ y = [-5712, -1115, -1411, -7411, -153, 4655, -5134, -5233, 5872, 479, -6899, 224, 5974, -3261, -2822, 4679, 246, -3273, 4043, 2240, -2848, 4277, 4090, -3467, 1288, 7937, -929, -2356, 9105, 5730, -3476, 2928, 8339, 1144, 896, 8718, 4753, 63, 6611, 5665, 805, 7036, 7937, 48, 3456, 9973, 1355, -435, 10893, 9329, -2425, 3608, 9078, 812, -129, 9356, 5891, -66, 4573, 4439, -403, 5249, 6048, -1343, 2040, 7588, -582, -4105, 6712, 6667, -4451, 510, 7133, -2166, -3073, 5357, 2549, -1648, 1793, 692, -3926, 153, 4278, -4755, -2400, 5270, -2349, -8401, 1401, 2961, -7783, -4560, 3530, -3484, -6790, 1334, -946, -6338, -2219, -1725, -6970, -1791, 1961, -6865, -6508, 1946, -5522, -9814, -1174, 1686, -9978, -6991, 894, -4689, -9156, -1378, -1062, -7140, -3352, -2571, -7523, -2261, 216]
2602B16o970j14Q517m180o941J0395J722r770R36Q752m466m857Q836O90p173M270
2618a37J825n180K319N789o507k591Q721l879n819P854N589j0331n6P828l288
2633B137m361Q035p93n812M253K099o339K676N722n347l401Q754k489o429N309
2648D014O315j0184k07Q874m467n436N993K288o890L970K246o099J419O664n541
2663B959l544R646l702q269N648N576q557j006Q906l684o322O806J158o341J940
2678A214K076l163q68O242o345m107J0149j882r116N014O678r727q23P496j547
2693A291n988M210P86o562K945M372n179R84M646m871m592P383J201r310N416
2708c268N954q411l906R569k138o181P528J131p383L137L336o326R11P601n175
$$ y = [216, -6754, -6868, 1649, -2531, -9472, 923, 2645, -7125, -6189, 2563, -1903, -6760, 2076, 2766, -4407, -137, 1688, -3492, -1173, 4616, -1891, -4482, 4239, 360, -5459, 2395, 7984, -2347, -2403, 5425, 2137, -2224, 5811, 5018, -794, 3459, 5558, -781, 1895, 7617, 2270, -1131, 7623, 5134, -1295, 4014, 10329, 145, -62, 8812, 4345, -1091, 4902, 7190, 300, 4270, 6516, 417, 1836, 8500, 2959, -585, 9061, 5359, -2910, 2738, 8314, -243, -1249, 7657, 3973, -2349, 4457, 5615, -726, 1214, 3290, 127, -741, 5501, -844, -4951, 5198, 3316, -5800, -786, 5892, -3835, -4658, 2838, 1291, -4697, -487, 299, -6263, -3318, 1054, -4125, -3141, 1505, -3366, -7958, -575, 626, -8684, -3268, 2686, -5725, -9631, -62, -2200, -8381, -853, 278, -7105, -3968, -632, -6958, -6047, 1554, -3621]
2723c621n938Q102K135r129K805P954p732k930Q052m85p586M683M518n572Q27
2738c917N939o054q81P355l235o751R343K631j0803L056P500n537l784P979P39
2753C580p063L014M068m914J225M780m566j511P241l145n702Q099L040q745K64
2768c35P897m686n234Q105J978p468L401K110m892o42P952m326k727O786m213
2783C706n785P080M915r027L0Q158n269o524P396K181p044L613L155o003k65N076
2799E393k540l796O753j839p255M589N589p366p26R011m345p896P076J155p166
2814c363K965N211n191k264N338l849l612Q125j635p256K916N523p102k075Q959
2829B690j129q849N661K853o967J255O176m634k908O189k356n315P526R8q446
$$ y = [-3621, -9559, -1457, 678, -8451, -5646, 2308, -5424, -8354, -302, -787, -8373, -3690, 828, -4744, -3917, 2022, -4032, -4913, 2442, -793, -7544, 1799, 4430, -6373, -3317, 4183, -1354, -5138, 2841, 3580, -3483, -469, 3599, -1315, -90, 4690, 124, -1387, 5854, 2709, -2993, 5106, 8146, -599, -335, 7562, 2876, -2358, 5747, 7725, 257, 3658, 5768, 876, 234, 8186, 3860, 1133, 7919, 3706, -2079, 5001, 9916, 889, 919, 9077, 3808, -2716, 4680, 6861, -183, 3430, 6585, 582, 317, 5393, 2853, -943, 5810, 3971, -3284, 1305, 6894, -472, -1198, 7813, 3468, -4428, 2648, 3803, -3363, -398, 4813, -378, -2642, 2696, -1153, -4765, 3360, 1725, -5531, -2615, 2908, -4194, -6269, 2690, 1561, -7288, -1627, 1226, -5741, -4486, 1690, -2944, -5852, 337, -2019, -7334, 192, 290, -8156]
2844h156L784O994p793k500Q880j979p270O049K118o585J140N046l248k154N403
2859b71k118m026P490R6q710M241P144p528k499P899r1q224N312M044o153K82
2875c112N774m718j859O462j438m174O516J747r069J453P001m637l087R133p75
2890E217q065K703M698m879J160M743j581n928N434k04m143N983L546r081P61
2905C64O428m789l826P512L180r309K698M903n831m09P250m004l486M244k031
2920B894m240N783K619o507p1O112n154o033Q990K313q314K480L521m218j890
2935a715O077j606m762N906j010n574L192M437o554j529Q086m019o081N913K566
2950C327p904J196M946l286k108M786k792l641M948J333o345L912L207n014k429
$$ y = [-8156, -4372, 2622, -5171, -7671, 1209, -770, -8040, -1991, 127, -6458, -5318, -272, -3520, -5674, -271, -2389, -6415, 1075, 1171, -7539, -3298, 3846, -3682, -6181, 1718, 1627, -6597, -1285, 2759, -3394, -3112, 2662, -2056, -3915, 2547, 1109, -3065, 3451, 5198, -3871, -2418, 4583, -54, -3141, 5992, 5217, -2848, -145, 4553, -326, 834, 5577, 3996, -1932, 3502, 3298, -845, 5138, 8684, -397, 364, 6792, 2003, -1823, 5689, 8869, -440, 2258, 7161, 1330, 921, 8171, 4167, 681, 4925, 2894, -1346, 4437, 7056, 549, 478, 6590, 1436, -4597, 4393, 6706, -1608, 872, 4393, 175, -1715, 4362, 2756, -2006, 3900, 2890, -2684, 508, 4945, -1609, -3138, 4948, 929, -5152, 761, 3327, -4577, -3381, 1565, -1721, -3829, 957, -1835, -5476, -528, 805, -5540, -1628, 1579, -3435, -5864]
2965e864P020l191n638O516L202r611K145N068k036l027M439j157m244M385J432
2980e61p044M987L870o078k300P082j143o638P492L129p602q69P241l396k997
2995d827M683n70m164L695J881n273K527O400o400l387Q072j464o195M082N754
3010D814n581j678O786k392m915N194J284n010K737K740n072Q65O309n022l429
3025b370P674L73o969L571M207n461k547Q232l194l673M620J402o147L301L133
3040F152n576R65N396m455m212P116N99o493K593M704o203j822M759M68m338M546
3056D199m39n264K815M461o275J224M453m230m976O737K911p914K458M982n715
3071e73k952N922j607m156N019K51n843K423M373o074K34O410m332n387N584K936
$$ y = [-5864, 1156, -2035, -7673, -1157, 2045, -7566, -5421, -353, -2389, -5416, -977, -2134, -6378, -1993, -561, -7605, -2618, 1252, -4826, -7126, -44, -1187, -7825, -333, 2796, -4806, -5675, 1566, -1830, -4827, -144, -714, -4878, -1183, 698, -4575, -2048, 4352, -2048, -5435, 2637, 1173, -5022, -940, 4814, -767, -2445, 4341, 1949, -2966, 2228, 3512, -1498, 1239, 3979, -1093, -228, 6081, 1059, -2370, 5304, 5677, -1292, 2279, 6486, 1025, -1522, 6710, 3516, -157, 4463, 5865, -282, 3019, 6152, 576, 1541, 6937, 2482, -1730, 5386, 5985, -508, 2085, 6789, 586, -1236, 3523, 3991, -347, 4199, 3760, -1504, 1311, 5772, -503, 721, 5174, 944, -4032, 2705, 5616, -2298, 160, 5142, -573, -3525, 2397, 790, -3366, 1653, 1904, -3939, -1516, 2857, -3217, -2983, 3427, -905, -6292, -708, 2228]
3087B228q524K711N996m666l967O350j090n148M431J891n087N16M877n915o55
3102f052P451l154o466O038K934n319k109P352k869m003N597l6l518O17L826m883
3118d594R92N235n562j526P171k764n009M877N109p661M94O155m116m119O131
3133H13K039n451K545J191l275R30M225m084q74O518j998o874M946N068o093j448
3149a822O080k551m980N654K091m450K140L336n695J48N323k999k708N463J110
3164F140o991K012N439n932o28O651k034o093M604J763m815K557K898l535j268
3179G68N080m411k718O285q45n500J695N789o469j234N677o10n691M694J437o047
3195b100J951K903l915j37N722l356n951O337J063o613K661P036o327m836O743
$$ y = [2228, -6296, -3585, 2411, -2255, -6222, 128, -962, -6110, -1679, 212, -4875, -4359, 518, -5397, -6052, 1399, -1755, -8221, -2183, 751, -4568, -6677, 675, -2194, -6197, -600, -636, -4154, -3537, 289, -4594, -3602, 1633, -3929, -5455, 1716, -1048, -6057, -1180, 3929, -3732, -3238, 2917, -1199, -5318, 813, 2852, -2599, -54, 1137, -2138, -1208, 3017, -1067, -1941, 4577, 2579, -4295, 651, 5719, -374, -1822, 4258, 1707, -3273, 2381, 4472, 22, 2162, 5498, -197, -49, 5274, 2275, -433, 5030, 6140, -851, 1161, 6600, 668, 40, 6691, 4657, -1436, 3168, 4931, 116, 2673, 5571, 2036, 768, 5848, 1437, -1281, 5004, 4159, -1341, 354, 6143, -326, -1560, 4117, 3507, -2184, 2510, 3947, -2100, -149, 2754, -1161, -1298, 4424, 1068, -4883, 1454, 2517, -4096, -1435, 5601, -726, -5562, 1181]
3210A181p03n172M139L049n245M33K976l545j023M212j820m286M493L362r244
3225g193K302O613l375l759N041k0n897L130M831o674K040K733l383j619M360
3240h70j93m456M083J572m882q01P439k791m206M302M86m216K633K623l633J233
3256a677L115k082m091N892q37m589M405L213o412K17O399k770l944M530K186
3271C555o041K326L614l328K9M050l248l161O295p05n506M013M385o403m45P067
3287F497m443l286M310K823o155K285M182n028r32M419j355l480M004J047n237
3302c49K802M200n502j654O266j158o247M668J375m296N71M563m295k96M298l980
3318I66k300L997K373n888K228K586m051l390P062q62o093M110K642n357O85L022
$$ y = [1181, 478, -4694, -555, 2494, -2751, -2318, 658, -2887, -3910, 302, -1518, -5804, -1311, 2051, -7193, -4891, 1722, -1653, -5412, -371, -391, -6288, -3158, 1673, -5001, -2961, -228, -3611, -5230, -870, -1063, -5519, -1436, 136, -4746, -5547, 1892, -899, -5105, -803, -317, -4533, -1900, 723, -2910, -1677, 1438, -644, -4735, 1157, 320, -4269, 136, 3349, -3063, -2846, 3553, 783, -3161, 1369, 3555, -2486, -160, 3454, 126, 155, 4205, 957, -2204, 4091, 3386, -2120, 1893, 6278, -125, -570, 6497, 2054, -1232, 3078, 5901, -254, 2031, 6213, 1185, 253, 4672, 3317, -163, 3841, 4888, -349, 2453, 6653, 1151, -503, 5763, 4605, -1642, 3026, 4401, 105, 676, 5239, 944, 648, 4946, 966, -1334, 2663, 5036, -852, 1376, 3962, -89, -3479, 3583, 2721, -3372, 738, 3380, -1977, -1292, 1730]
3334A730k397j502L301j396l414L631J340n254K348M458m957l109O621m99p089
3349f188M732K851l914j676N161l184j758L925k295l697K839L829n563J006N969
3364B037n485k645N731j43n439K961L182l520j210M715k249k840N490j297m465
3379e177K425K558l622P28M457k893m458O329O64m237J051M733m187Q9K817j321
3395d4k662L675P21m662L234L104m664J47N742l173m511N376J369n369K796L162
3411D241m035j338M728l10m115M046N59l909R04M850m379k24L624k220m092M893
3427C223K130n927J932M351l771j706L655j462l081M434q33l734J528M088m984
3442a57r70O195l301l592L886J984n183J021L437k656k421M672k193j854L667
$$ y = [1730, -667, -2169, 1132, -264, -3678, -47, 1293, -3961, -1613, 2845, -2112, -5221, 1400, 901, -6188, -1456, 1395, -2519, -4195, 966, -2218, -3976, -51, -2346, -6043, -3204, 625, -4938, -3932, 2037, -3448, -6093, -362, -505, -5944, -2983, 199, -3321, -4531, 184, -2065, -4905, 585, -712, -5177, -2752, -194, -3816, -3088, 1369, -1524, -5982, 347, 1011, -3226, -2175, 2558, -1629, -1540, 1277, -44, -2706, 969, 1690, -2972, 262, 3366, -1298, -1151, 4591, 1418, -3093, 2283, 3652, -1717, 1079, 4241, 206, -1132, 3596, 3286, -829, 3217, 3776, -133, 771, 5621, 1242, 1018, 4642, 2422, -1670, 3223, 5353, -574, 1358, 5709, 1938, 232, 3887, 2425, -656, 3778, 2945, -789, 739, 4827, -157, -1127, 5068, 1767, -1825, 2061, 4045, -1138, -117, 3320, 664, -1757, 2915, 722, -1132, 2535]
3457B535N46o051J162M203l663j491M986j078n110L724L086n180r41O405m054
3472i21k534K765q33k118K197J241k467l1L656l878j733N037j51n550L157L419
3488A256n467J21M351k138l494M602p5l537K037J327l711J261N164m507j568M264
3504a14j71n599M705L094l717j682L833j613j871K594J286l059J646J066l432
3519c034N60N612k424l541M896O26n665K950L885m337j961M788j668l440M557
3534A804J004l686K952K59j857n51L310j505k205K952J288m562J247M755m589
3549F16j116N300j870l595L123J313l276J404K699l446k013N846j681m712M939
3564C531J420n021J023L828k848k237L362m71k241K055J380l290L7L448m478o99
$$ y = [2535, 3081, -2970, -1808, 2395, -1268, -2759, 2227, 1149, -3961, -237, 2849, -2331, -3272, 3133, -921, -3455, -690, -1523, -3641, -1444, -203, -2670, -2701, 955, -2923, -4656, 381, 230, -5320, -2163, 1256, -4211, -4090, 261, -1877, -5371, -769, -844, -4381, -2344, -1017, -4728, -3467, 1697, -2810, -4378, -114, -285, -5884, -1179, 1915, -1802, -3484, 349, -1264, -3135, -541, 745, -2314, -668, 398, -3034, -2474, 3138, 714, -2827, 2069, 2695, -2970, -20, 3865, -472, -2433, 2355, 687, -2753, 1804, 2808, -878, 2074, 2333, 476, -75, 3235, 1730, -475, 2477, 3765, -797, 450, 5205, 616, -500, 4800, 2930, -665, 2458, 3771, 495, 1899, 4598, 1152, -861, 4985, 3304, -1408, 3531, 4951, -70, 953, 4781, 1933, -304, 3058, 2587, 346, 2401, 3781, 491, 528, 3976, -502, -1201]
3580a201M502j545l542K671R98l751M59M531k921k607L838J84m251K018L362m322
3596a577j99K669l073n85M163q59l885L339R05m998O67M045k153j324K720L7m152
3613d260J694K912m040K77K657j672l125O199r16m481K501L040m137j382N108
3628C75j110l699J795K414l492J620K427l169k88M530l549l270O063n65l465J761
3644a622M091l527o26K801q64l320L781Q12k473n91K684k601J825K166j597l193
3660b254M032P59m151J395M465l973j189M806j624l502L353N31k499Q75K733k575
3676A182j317K888j06k643L296J954n413J370L344k504k898N331m75l416J993
3691B586J203l737m14M370j804l001M340j594l448L788J116l028p27N242l938
$$ y = [-1201, 3301, 1756, -1786, 885, 1883, -1868, -1409, 3122, 201, -2406, 1432, 1616, -2635, -617, 2745, -1577, -1776, 893, -2180, -2765, 1398, 539, -3346, -7, 898, -4100, -3433, 612, -1541, -2865, -145, -108, -4260, -2566, 346, -3694, -3417, -760, -2432, -5557, 642, -274, -4755, -2254, 786, -3351, -4733, 375, -735, -4434, -2639, -225, -3717, -2097, 330, -2839, -3127, 1403, -2146, -5416, 647, 82, -3383, -1622, 2469, -1058, -1684, 1117, 253, -3067, 714, 1526, -947, -1538, 1146, -1455, 370, 2536, 939, -2254, 1778, 2537, -1614, -219, 4246, 273, -916, 3890, 2266, -1236, 2117, 2648, 149, 1024, 3757, 1182, -135, 2753, 2647, 4, 3300, 5254, -159, 1211, 4555, 2051, -847, 4484, 4009, 593, 2586, 3789, 52, -362, 4008, 2204, -797, 3543, 1949, -1499, 2289, 3405, 377, -350, 4892, 954]
3706I54k622M446k49k725P71J512k925N62K999m170r29L577L40m611M560N37m479
3723b452j89N722k575m738M682m57l505K450R20k284j147M130k384k415M386p84
3739f40k943K214K747m219l90L167j317k922M490q03l029%L685j558j046K495
3755f9j617k577K667m65k293L394J538m124M54L482j796k376L734K95k685n01
3771b939L181j947m11L838j878j616J219J129l628J541M097l441k290N779k215
3786D19l908M258K399m229J040K825k643j593M574j080l210M282l94l222J275
3801G93L583l445q66K926N57n028K956L031m573J556K689k181j554L067q26l610
3817i25L711P84l083P25K475j993j945M404j233k673J828J700l586j07M709l850
$$ y = [954, -1668, 2778, 2529, -196, 575, 2087, -838, -276, 2723, -1447, -2376, 1201, 1541, -3070, 1490, 2027, -2452, -2641, 3081, 506, -4232, 450, -7, -3512, -1062, -142, -2426, -3573, 557, -1827, -4242, 144, -640, -3583, -1369, 1378, -2841, -3231, -64, -1381, -4303, 187, -616, -3645, -3645, 40, -1518, -2564, -69, -1686, -4263, -1596, -2061, -4354, -960, 578, -3546, -3092, 390, -1406, -3782, -48, 247, -2438, -2939, 242, -1705, -2116, 1722, -156, -1772, -553, 576, -3052, -1511, 2586, -855, -3145, 2634, 419, -3489, 769, 3168, -1061, -21, 2804, 161, -1432, 3142, 2062, -1148, 3134, 2740, -482, 793, 4376, 931, 65, 2991, 3548, -1480, 1476, 4507, -66, 1490, 4179, 1998, 444, 3511, 2685, -925, 2786, 3570, 487, 1212, 3687, 1694, -251, 4153, 2920, 247, 2075, 3775, 189, 82, 4791, 941]
3833I41r23K406j181k373K747R40m169J656K443j630k536L239J223m057Q76L060
3849B662l031j373L279k191j867L611m94l145J600K311m310J186K709k096l143
3864d292L467N59m240K641J710k151o22K976q18l798L261J64j514J166J523k941
3880b909n86M118k247l033L089L290n949J783K569j832j326K910j480j749L481
3895A29k46k804K370R54k310j439M170j229k466L173J307l136l90M257m016j321
3911b997L952j231j702K743kk478K126L355m485j56M091j744k695K656J377k517
3927B93p04L414r98k507M015j766k280L064J158l500J528K026k859j096L963l61
3943C390m471L386K064l831r01L997k294j578L144O7m571L319R98k049Q9L073
$$ y = [941, 18, 2424, 1243, -1130, 1617, 2557, -1612, 44, 2487, 857, -1679, 1560, 2783, -1274, -398, 2662, -369, -1742, 1537, -654, -2521, 1090, 596, -2549, -949, 1362, -2948, -1762, 947, -1149, -4292, -825, -266, -4506, -1865, -155, -2306, -2928, 48, -770, -4568, -1307, -1143, -2657, -1491, 32, -2909, -3495, 623, -1624, -4657, -1568, 1722, -4227, -2444, 125, -1707, -3033, -123, -1603, -3352, 129, -117, -2921, -551, 403, -1907, -3346, 824, -405, -2871, 302, 1609, -1527, -1917, 2340, -1676, -2997, 955, -276, -1978, 765, 763, -1715, 411, 3766, -719, -875, 3216, 1472, -1223, 1433, 2810, 293, -411, 3003, 2005, -502, 3513, 1747, -533, 2531, 3689, 189, 1717, 3743, 884, -212, 3751, 3390, -1081, 2305, 4369, 538, -363, 3634, 1340, -238, 2906, 2973, -1598, 1721, 2719, 670, 759, 3832]
3959C832l888L23L589j385l971K115L006m305r8K668Q9l293K268M98k469J108
3975H7J735l348O7K918k248j162J966J189l545J656J983l060j703M720k713j138
3991b596K012J192k662Q36K120l453j110M108j796k538L427J327m082N88K477
4006a50k355r29M935k701k732K960K98j967P81K934l671n60M005k646j959K913
4022h44K214m910R31M890m244j173M551m82l630L221R39m335K211J821j862j527
4038b229L958k194r59J727J837k904j82L771k873j092J532J554l300K707Q52l800
4054a595K079K079k547k54K642n59l066L425J881l577r17K506n22j514L387N63
4070D011n263J845K752k266L71J947k930m16J979N83k871K341K523m276l27L273
$$ y = [3832, -56, 267, 3856, 2471, -1500, 615, 3621, -684, -782, 1886, 1975, -1318, 950, 1448, -1021, 87, 1822, -1526, -1459, 1459, -789, -1951, 15, 1204, -2341, -685, 1298, -1762, -3465, 1255, -1458, -2596, -584, 608, -2054, -1218, 902, -2551, -3661, 447, -1349, -3887, -460, 867, -3215, -2627, -150, -2505, -3434, 1501, -1200, -3932, -972, -674, -2641, -1860, 1074, -2597, -3157, 848, -1798, -3757, -844, 1370, -3540, -2609, 2281, -1963, -3136, 1415, 933, -2697, 524, 1463, -2872, -661, 1160, -702, -2229, 1729, -465, -1424, 303, 2140, -764, -946, 2825, -48, -1140, 392, 1946, -1354, 1353, 2205, -1595, 484, 2563, 16, -238, 2404, 1845, -1221, 2204, 4085, 508, -409, 2097, 1575, 61, 3448, 4011, -1252, 593, 3345, 1079, 1450, 3397, 467, 51, 2030, 2613, -258, 2083, 4606, 330, 3, 3276]
4086C276k021o70P49L05j731r0L003k654N58J843k606j657K862J96l939K009L735
4103C168m435l40L004j470j268K769j309k070K48K571j886q99K975j757j682K674
4119B93L0l507L00L886k809j052L361o87k872K520M66k418M37K045k909J622J475
4136A81j148l192L254J016l325J044K507k673j529L871n41k775K641J051l015
4151b633J086M57r36N68K693r17l076K484R58l682K525K266j941k457L851l09
4167I37k458P93O12j418O00L208k507o41K008Q13k757K025Q52k623M01J988j311
4184E22r71J935J126k992K536J95k888J359J634j741k34K420j593k289K269K551
$$ y = [3276, 1255, 585, 1334, 1639, -92, -182, 2821, 167, 725, 2568, -38, -1695, 1167, 1363, -2576, -567, 3168, -1267, -1607, 1397, -73, -1341, 1428, 119, -1951, -1703, 868, -1018, -1917, 1058, -699, -2381, 293, 323, -3184, -2884, 1002, -1807, -2859, 502, -185, -3057, -537, -71, -2489, -2052, -7, -2916, -1294, 181, -967, -4159, -905, 111, -3214, -2170, 337, -2336, -3865, 6, -535, -3310, -669, 382, -2633, -1547, -1090, -2026, -1458, 1235, 318, -2758, -274, 684, -2998, -473, 1793, -148, -2605, 1246, 937, -1521, -728, -116, -1534, -934, 2274, -233, -874, 1134, 1947, -810, 1215, 2067, -556, -155, 1833, 522, -449, 1486, 2612, -380, 2156, 2351, -537, 822, 2456, 715, 481, 2901, 1308, -981, 1288, 3839]
$$ [...]
8191b8
##END NTUPLES=NMR FID
##END=
