##TITLE=1H_SA_Slon.2
 CDCl3, 8 sc, 
 28.7.2020
##JCAMPDX= 6.0         $$ Bruker NMR JCAMP-DX V2.0
##DATA TYPE= NMR FID
##DATA CLASS= NTUPLES
##ORIGIN= UXNMR, Bruker Analytische Messtechnik GmbH
##OWNER= root
$$ XWIN-NMR		Version 3.5
$$ Tue Jul 28 12:18:39 2020 Russian Standard Time (UT+4h)  she@DPX200
##.OBSERVE FREQUENCY= 200.1315
##.OBSERVE NUCLEUS= ^1H
##.DELAY= (6, 6)
##.ACQUISITION MODE= SIMULTANEOUS
##.ACQUISITION SCHEME= undefined
##.AVERAGES= 8
##.DIGITISER RES= 18
##SPECTROMETER/DATA SYSTEM= spect
##.PULSE SEQUENCE= zg30
##.SOLVENT NAME= CDCl3
##.SHIFT REFERENCE= (INTERNAL, CDCl3, 0, 15.7039)
##AUDIT TRAIL= $$ (NUMBER, WHEN, WHO, WHERE, WHAT)
$$ ##TITLE= Audit trail, XWIN-NMR		Version 3.5
$$ ##JCAMPDX= 5.01
$$ ##ORIGIN= Bruker BioSpin GmbH
$$ ##OWNER= she
$$ F:/spectra/data/she/nmr/H-F/1/audita.txt
$$ ##AUDIT TRAIL=  $$ (NUMBER, WHEN, WHO, WHERE, WHAT)
(   1,<2020-07-28 12:17:16.48 +0400>,<she>,<DPX200>,
      <created by zg, POWCHK disabled, PULCHK disabled
       configuration hash MD5:
       00 E9 B6 7A A2 85 ED C7 34 08 36 98 17 FE 4E 26
       data hash MD5: 16K
       1B 5C 82 8C E4 3C 82 A2 92 3D D9 14 E1 71 49 EF>)
$$ ##END=
$$ 
$$ hash MD5
$$ 55 ED 8D AB B9 D4 5D 65 69 89 61 86 E8 76 83 AE
##$RELAX= 
##$RELAX= 
##$RELAX= 
##$RELAX= 
##$RELAX= 
##$RELAX= 
$$ Bruker specific parameters
$$ --------------------------
##$DU= <F:/spectra>
##$EXPNO= 1
##$NAME= <H-F>
##$PROCNO= 1
##$TYPE= <nmr>
##$USER= <she>
##$AMP= (0..31)
100 100 100 100 100 100 100 100 100 100 100 100 100 100 100 100 100 100 
100 100 100 100 100 100 100 100 100 100 100 100 100 100 
##$AQSEQ= 0
##$AQ_mod= 1
##$AUNM= <au_zg>
##$AUTOPOS= <>
##$BF1= 200.13
##$BF2= 200.13
##$BF3= 200.13
##$BF4= 200.13
##$BF5= 200.13
##$BF6= 200.13
##$BF7= 200.13
##$BF8= 200.13
##$BYTORDA= 1
##$CFDGTYP= 0
##$CFRGTYP= 5
##$CHEMSTR= <none>
##$CNST= (0..31)
1 1 145 1 1 1 1 1 1 1 1 1 1 1 1 1 1 1 1 1 1 1 1 1 1 1 1 1 1 1 1 1 
##$CPDPRG= <>
##$CPDPRG1= <>
##$CPDPRG2= <>
##$CPDPRG3= <>
##$CPDPRG4= <mlev>
##$CPDPRG5= <mlev>
##$CPDPRG6= <mlev>
##$CPDPRG7= <mlev>
##$CPDPRG8= <mlev>
##$CPDPRGB= <>
##$CPDPRGT= <>
##$D= (0..31)
0 1.2 0 0 0 0 0 0 0 0.06 0 0.03 0 0 0 0 0.0002 0 0 0 0 0 0 0 0 0 0 0 0 
0 0 0 
##$DATE= 1595924235
##$DBL= (0..7)
120 120 120 120 120 120 120 120 
##$DBP= (0..7)
150 150 150 150 150 150 150 150 
##$DBP07= 0
##$DBPNAM0= <>
##$DBPNAM1= <>
##$DBPNAM2= <>
##$DBPNAM3= <>
##$DBPNAM4= <>
##$DBPNAM5= <>
##$DBPNAM6= <>
##$DBPNAM7= <>
##$DBPOAL= (0..7)
0.5 0.5 0.5 0.5 0.5 0.5 0.5 0.5 
##$DBPOFFS= (0..7)
0 0 0 0 0 0 0 0 
##$DE= 6
##$DECBNUC= <off>
##$DECIM= 24
##$DECNUC= <off>
##$DECSTAT= 4
##$DIGMOD= 1
##$DIGTYP= 9
##$DL= (0..7)
0 120 120 120 120 120 120 120 
##$DP= (0..7)
150 150 150 150 150 150 150 150 
##$DP07= 0
##$DPNAME0= <>
##$DPNAME1= <>
##$DPNAME2= <>
##$DPNAME3= <>
##$DPNAME4= <>
##$DPNAME5= <>
##$DPNAME6= <>
##$DPNAME7= <>
##$DPOAL= (0..7)
0.5 0.5 0.5 0.5 0.5 0.5 0.5 0.5 
##$DPOFFS= (0..7)
0 0 0 0 0 0 0 0 
##$DQDMODE= 0
##$DR= 18
##$DS= 0
##$DSLIST= <SSSSSSSSSSSSSSS>
$$ [...]
##$SUBNAM2= <"">
##$SUBNAM3= <"">
##$SUBNAM4= <"">
##$SUBNAM5= <"">
##$SUBNAM6= <"">
##$SUBNAM7= <"">
##$SUBNAM8= <"">
##$SUBNAM9= <"">
##$SW= 24.9337058887773
##$SWIBOX= (0..15)
0 0 2 0 0 0 0 0 0 0 0 0 0 0 0 0 
##$SW_h= 4990.01996007984
##$TD= 16384
##$TD0= 1
##$TE= 0
##$TE2= 300
##$TE3= 300
##$TEG= 300
##$TL= (0..7)
0 120 120 120 120 120 120 120 
##$TP= (0..7)
150 150 150 150 150 150 150 150 
##$TP07= 0
##$TPNAME0= <>
##$TPNAME1= <>
##$TPNAME2= <>
##$TPNAME3= <>
##$TPNAME4= <>
##$TPNAME5= <>
##$TPNAME6= <>
##$TPNAME7= <>
##$TPOAL= (0..7)
0.5 0.5 0.5 0.5 0.5 0.5 0.5 0.5 
##$TPOFFS= (0..7)
0 0 0 0 0 0 0 0 
##$TUNHIN= 0
##$TUNHOUT= 0
##$TUNXOUT= 0
##$USERA1= <user>
##$USERA2= <user>
##$USERA3= <user>
##$USERA4= <user>
##$USERA5= <user>
##$V9= 5
##$VALIST= <valist>
##$VCLIST= <CCCCCCCCCCCCCCC>
##$VD= 0
##$VDLIST= <DDDDDDDDDDDDDDD>
##$VPLIST= <PPPPPPPPPPPPPPP>
##$VTLIST= <TTTTTTTTTTTTTTT>
##$WBST= 1024
##$WBSW= 4
##$XGAIN= (0..3)
0 0 0 0 
##$XL= 0
##$YL= 0
##$YMAX_a= 305051
##$YMIN_a= -138413
##$ZGOPTNS= <>
##$ZL1= 120
##$ZL2= 120
##$ZL3= 120
##$ZL4= 120
##$ABSF1= 10
##$ABSF2= 0
##$ABSG= 5
##$ABSL= 3
##$ALPHA= 0
##$AQORDER= 0
##$ASSFAC= 0
##$ASSFACI= 0
##$ASSFACX= 0
##$ASSWID= 0
##$AUNMP= <proc_1d>
##$AZFE= 0.1
##$AZFW= 0.1
##$BCFW= 1
##$BC_mod= 2
##$BYTORDP= 1
##$COROFFS= 0
##$CY= 11.3945322036743
##$DATMOD= 1
##$DC= 2
##$DFILT= <>
##$DTYPP= 0
##$F1P= 16.9975609425685
##$F2P= -3.02152046262296
##$FCOR= 0.5
##$FTSIZE= 0
##$FT_mod= 4
##$GAMMA= 1
##$GB= 0.15
##$INTBC= 1
##$INTSCL= 1
##$ISEN= 128
##$LB= 0.24
##$LEV0= 0
##$LPBIN= 0
##$MAXI= 10000
##$MC2= 0
##$MEAN= 0
##$ME_mod= 0
##$MI= 1.114404
##$NCOEF= 0
##$NC_proc= 0
##$NLEV= 6
##$NOISF1= 3.799351
##$NOISF2= 2.8
##$NSP= 1
##$NTH_PI= 0
##$NZP= 0
##$OFFSET= 15.70392
##$PC= 1
##$PHC0= -9798.448
##$PHC1= 17.00091
##$PH_mod= 1
##$PKNL= yes
##$PPARMOD= 0
##$PSCAL= 0
##$PSIGN= 0
##$REVERSE= no
##$SF= 200.130013532006
##$SI= 16384
##$SIGF1= 3
##$SIGF2= 2
##$SINO= 400
##$SIOLD= 16384
##$SREGLST= <1H.CDCl3>
##$SSB= 0
##$STSI= 0
##$STSR= 0
##$SW_p= 3612.71676300578
##$SYMM= 0
##$S_DEV= 0
##$TDeff= 0
##$TDoff= 0
##$TI= <>
##$TILT= no
##$TM1= 0
##$TM2= 0
##$TOPLEV= 0
##$USERP1= <user>
##$USERP2= <user>
##$USERP3= <user>
##$USERP4= <user>
##$USERP5= <user>
##$WDW= 1
##$XDIM= 8192
##$YMAX_p= 0
##$YMIN_p= 0
$$ End of Bruker specific parameters
$$ ---------------------------------
##NTUPLES= NMR FID
##VAR_NAME=  TIME,          FID/REAL,        FID/IMAG
##SYMBOL=    X,             R,               I
##VAR_TYPE=  INDEPENDENT,   DEPENDENT,       DEPENDENT
##VAR_FORM=  AFFN,          ASDF,            ASDF
##VAR_DIM=   8192,          8192,            8192
##UNITS=     SECONDS,       ARBITRARY UNITS, ARBITRARY UNITS
##FACTOR=    0.0002004,     1,               1
##FIRST=     0,             0,               0
##LAST=      1.6414764,     0,               0
##MIN=       0,             -138413,         0
##MAX=       1.6414764,     305051,          0
$$ Real data points
##PAGE= N=1
##DATA TABLE= (X++(R..R)), XYDATA
0@%%%%%%%%qJ6j6J6j7K5l2L8m6N5o7P6q8J04j21J41j63J88k17K48k81L18l58M01
32B12m53N09n67O34p07P86q72R65j071J188j315J455j611J786j982K202k453K744
50A450l080L477l957M547n294O275p633R652j3001J9887n9296J32659O4649k08757
64e8422p0056N4903N361p0199M5292J09816K3037r0573o0923K701L2236M9646
76b7181Q0239J4922r6405q8191M4712P2233j7297l0890M9276L4684n8773o5969
88h8640K4692O6940J9359m3088m2492Q344K8910m714j2800K5298K6850j8942k1358
101c1641R970M044j8446J349K1617k381k3775J894K8548l80m1799j2692M9638
114a4054K5298n6588m3469M0399L2296l3689j799O4722J3195o9709l6417L9224
$$ plain form
0 0 0 0 0 0 0 0 0 0 -8 8 -8 8 -9 16 -16 22 -24 31 -36 40 -48 56 -65 76 -87 101 -116 132 -149 169 -189 212
32 212 -241 268 -299 335 -372 414 -458 507 -564 624 -691 764 -847 939 -1043 1159 -1294 1450
50 1450 -1630 1847 -2110 2437 -2857 3418 -4215 5437 -7564 12323 -46973 85686 150335 -58422
64 -58422 -128478 -73575 -68214 -138413 -93121 16695 39732 -50841 -111764 -109063 -76827 -27181
76 -27181 53058 67980 -28425 -116616 -71904 329 -16968 -47858 1418 36102 -22671 -88640
88 -88640 -63948 2992 22351 -20737 -63229 -54885 -25975 -30689 -43489 -18191 8659 -10283 -31641
101 -31641 -21671 -17627 -36073 -34724 -13107 -15488 -39263 -37369 -8821 -9201 -51000 -63692 -14054
114 -14054 11244 -45344 -88813 -48414 -16118 -49807 -51606 13116 26311 -43398 -79815 -40591
126d0591L3321j264O903Q278l3294m8404R265O4019L4332k8680k9116o156l4315
139f5702m2795M0743R6972J9328p1960n2128P593J9696J8578L3671K7993j1902
151B0087m9353m2448J2068N7307M6957R521j6198m2381n2385K89O0123L8467k1075
164B0979k8959m373j0431k1808O851M6989L3966l3285o4323j2399L9237J9359
176h197n723J4889J3643l0787k7120K4605K5633j4622r597J6852k945k9523l025
189c5917L5506K1226k2421k4015J6525K2845j9005k6529J7227K7849j1281j1654
201i644K4046J3196k4411j4276J7830J3556m265k192M19j0434j8370l355K7795
214I895L1648p575l7271j6723M491n024M856L5556K1485l1596m2962k710K8522
$$ plain form
126 -40591 -7270 -8534 -1631 6647 -26647 -75051 -65786 -1767 32565 3885 -25231 -31387 -65702
139 -65702 -108497 -67754 29218 48546 -23414 -75542 -67949 -48253 -29675 3996 31989 20087
151 20087 -29266 -71714 -59646 -2339 44618 54139 37941 -4440 -56825 -56536 3587 42054 20979
164 20979 -7980 -12353 -22784 -44592 -37741 9248 43214 9929 -54394 -66793 -27556 -8197
176 -8197 -13920 969 14612 -16175 -43295 -18690 6943 -7679 -17276 -424 -3369 -32892 -35917
189 -35917 -411 20815 -1606 -25621 -9096 13749 -5256 -31785 -14558 13291 2010 -9644
201 -9644 14402 27598 3187 -11089 6741 20297 16032 13840 14259 3825 -14545 -17900 9895
214 9895 41543 33968 -3303 -20026 -15535 -20559 -15703 19853 41338 9742 -33220 -35930 -7408
227g408K5837J3172L514j1410l3900l4078J3652N6436L1094k0985k4778j3493
239b347k5198r222M3529M5874j5459m7506k1792K372M565J6606L3775J8288k9641
252A3844n1053j1843L5706K7193j424K975L729k7885k7931K0278L8229L773j6132
265I459n568p556j5144j546K0904K0493m668k3169r426J3961N202j3524J237J7931
279H586l149k0042K776J6885l787j4477K509J1762K010p756o209K3k061q875M605
294a7200K5211O919k8641j9080J2188P661m578J5054K0863j4839l4916o436K4137
307a3657K2394N642l873q183j7299k1613N921M0522K6401k0368k9214o615m781
320b4723l683K6616L4319p666m1028k3194O340J7772J9063J5345K627k0887l5490
$$ plain form
227 -7408 18429 31601 35115 23705 -10195 -44273 -30621 25815 56909 35924 11146 -2347
239 -2347 -27545 -36767 6762 52636 37177 -10329 -32121 -29749 -25184 -8578 25197 43485 13844
252 13844 -37209 -49052 -13346 13847 12423 15398 19127 -8758 -36689 -16411 21818 25591 9459
265 9459 3891 -3665 -18809 -20355 549 21042 16374 -6795 -16221 -2260 2942 -10582 -9345 8586
279 8586 5437 -14605 -11829 5056 1269 -13208 -10699 1063 3073 -4683 -10892 -10869 -12930 -21805 -17200
294 -17200 8011 14930 -13711 -32791 -20603 -12942 -17520 -2466 18397 3558 -31358 -37794 -13657
307 -13657 8737 14379 10506 2323 -14976 -36589 -30668 9854 36255 15887 -13327 -19942 -24723
320 -24723 -28406 -1790 32529 24863 -16165 -39359 -33019 -15247 3816 19161 21788 901 -34589
333c4589j2201L2043L6839L10j7228q121j3582j7191J4578L8774J3759k1504k3322
346a1435r074J444R752J6206J4659j585k5323k1763J1726K3187R35o625P475k907
360F672k3472m779K3448J3515j0649q176L006J097n114k918O803P459o725r462
374i295R153J2111j2695j4781J1027J2194p356k379J2223l123k0933o596J6409
387d041J7990J776j0173r863m357n920J096K2217K2380j3981l0890o786R849N286
401e417J2939K0525l448l2248k3433P886K3848J8496J525r308j5918k0990r661
414c5204K4763L7303K641k7572j7108n087n350J2198L2750J4647k2918k9522q380
427b6839J1188J7438J3535O907m551k2696k3984P249L1465J2800j0908o983m700
$$ plain form
333 -34589 -46790 -14747 22092 22402 5174 -2947 -16529 -33720 -19142 19632 33391 11887 -11435
346 -11435 -20509 -19065 -9313 6893 21552 19967 -5356 -27119 -15393 7794 8729 2104 9579 6672
360 6672 -16800 -21579 1869 15384 4735 -3441 -435 662 -4452 -7370 -567 6892 167 -9295
374 -9295 -142 11969 -726 -15507 -4480 7714 358 -2021 10202 7079 -13854 -20450 -4041
387 -4041 13949 15725 5552 -4311 -8668 -14588 -13492 8725 31105 17124 -13766 -20552 -10703 -5417
401 -5417 7522 28047 24599 -7649 -31082 -23196 652 19148 20673 11365 -4553 -25543 -35204
414 -35204 -10441 26862 29503 1931 -15177 -20264 -25614 -13416 19334 33981 11063 -18459 -26839
427 -26839 -15651 1787 15322 22229 17678 -5018 -29002 -21753 9712 22512 11604 4621 -79
440g9j5895n080K1895K0419n593j5683p223j59K409L606Q049R064n452j7410k431
455i563J6198K691j2284K385J1452n734j0868N296P500p118p727N716J1297K622
469A1863r033q120K078K542k406R265J7370n017k5554o654J4789Q650J772Q440
483A9985k33k0061j9072M822K1321J5621l413j5094j1683p888l931J4525K8205
496B3104M947k6825k0374K777P076J0518K0252J0014j8186k6440p065J5596K1387
509A6781R246m375j0063j4929j7106M483L0981J7562j6662k1091o807m002M10
522a5572J7488J8034n165k1370j3954K036J1864J0009M421J528q626j8911o650
535b4868J9417J6106q331q964L930l548j0386L297J3144K903q117n627K756N006
$$ plain form
440 -79 -15974 -21054 841 21260 15667 -16 -7239 -7398 -4989 -1383 6666 15730 10278 -7132 -9563
455 -9563 6635 9326 -2958 -573 10879 5145 -5723 -427 7073 -45 -7772 -2056 9241 11863
469 11863 2830 -5290 -3212 -670 -3076 6189 23559 18542 -7012 -13666 1123 9773 11545 19985
483 19985 19752 -309 -19381 -14559 6762 22383 18970 3876 -7807 -15695 -19626 -5101 23104
496 23104 28051 1226 -19148 -16371 -9295 1223 21475 31489 13303 -13137 -20202 -4606 16781
509 16781 26027 21652 11589 -3340 -20446 -15963 15018 32580 15918 -5173 -11980 -15982 -15572
522 -15572 1916 19950 14785 -6585 -20539 -18503 -6639 3370 7791 9319 693 -18218 -24868
535 -24868 -5451 10655 2324 -6640 -2710 -6258 -16644 -13347 -203 2700 -5417 -11044 -8288 -3282
549c282m06l446M059N304m598k828R863L754j4489p886J2730R502m579k424J390
564B664p232j1589n53J2295J2339l721j6679r708L037K580O021J6850N611k0594
578h679k0302N143J4645Q349Q943N115j2230k0440o162J5128K2326O585j3109
591E312j5404q003o734M864K3928J7329j4992k6528p071N010O965J3748J3789
604A2213n194k0811j3643M729J9069J5803P71o465q787j4413n659J8572K2419
617A8604k774j5490n090r56m242L823J3663O509q849j4000n502P232R645J533
631D106L9K053o125r501L816R617m549q519N851O540p120o924L905L435m672o366
647a4414K322R210J383j2461q674P537R370J687O391N401j1082j4692M905J4427
$$ plain form
549 -3282 -3688 -7134 -3075 2229 -2369 -5197 4666 8420 -6069 -13955 -1225 8277 3698 1274 2664
564 2664 -4568 -16157 -16710 -4415 7924 4203 -12476 -22184 -19147 -16567 -10546 6304 11915 -8679
578 -8679 -28981 -23838 -9193 -844 8099 13214 984 -19456 -25618 -10490 11836 18421 5312
591 5312 -10092 -18095 -24829 -19965 3963 21292 6300 -20228 -27299 -22289 -15324 -1576 12213
604 12213 7019 -13792 -27435 -22706 -3637 12166 12937 6472 -2315 -16728 -22387 -3815 18604
617 18604 15830 340 -4750 -5706 -9948 -6125 7538 14047 5198 -8802 -14304 -7072 2573 4106
631 4106 4145 6198 73 -9428 -5612 4005 -544 -9063 -3212 3328 -3792 -10716 -6811 -3376 -8048 -14414
647 -14414 -12092 -2882 -1499 -13960 -22634 -15097 -5727 -4040 2351 7752 -3330 -18022 -13117 1310
661A310N259K453L438n887j4237o003J2131J9190N321j5967j7519k920L083J535
675h813J1493J4270p460k2353q836O874R136J0140P100o751j7031j0337O746J9161
689C339J3915l614j2776p122n951l972J1186K0118O33j9659j3036K111N821P857
703a150R074M60j1367j4243n128R624J5360M191m722k880m442q822K764J6052
717D771M640j1865o010L235j274j937O527P341j598q209m628M968O456m981o310
732h874O000Q749j962j773O712l52r784j112Q612L625j677r05l917q262k955P328
748e47J2592K444j4135j6635j467O764J404L764J0059k304j7880r957R218J4097
762b583Q596P70r445j3330m719P677J5220J2828k225j3257q798j164N9Q644J6919
$$ plain form
661 1310 6569 9022 12460 6573 -7664 -13667 -1536 17654 22975 7008 -10511 -13431 -10348 -8813
675 -8813 2680 16950 9490 -12863 -21699 -14825 -5689 4451 11551 4800 -12231 -22568 -15822 3339
689 3339 17254 13640 864 -6258 -12209 -16181 -4995 15123 15756 -3903 -16939 -14828 -9007 -1150
703 -1150 7924 8384 -2983 -17226 -22354 -12730 2630 6821 2099 -781 -5223 -14045 -11281 4771
717 4771 9411 -2454 -8464 -5229 -6503 -8440 -1913 5428 3830 -4379 -9007 -4039 2417 -2564 -8874
732 -8874 -2874 5875 3913 2140 8852 8500 -1284 -2396 6216 9841 8164 7259 3342 -4920 -7875 -547
748 -547 12045 14489 354 -16281 -17748 -10984 -9580 -5816 4243 1939 -15941 -25898 -16680 -2583
762 -2583 6013 6783 -2662 -15992 -20711 -13034 2186 15014 12789 -468 -9266 -10430 -10371 -1727 15192
777A5192J445k0599j7240M633J3068R414M159k343r413j2292o318Q362J7799P662
791A3529r396j0044m280m044M375J6361Q091j2922j4492r57K761J042O441Q759
805E224l76j0667r602J353J0407L378n096o2M565l933m774O569O304m298l715
820d723M163J391l788k385j3k165K94L642N141K755p592j1876j125R821M300j010
836c170L845Q48j1105p490R100J4964O999l949j0622q798p81P002J0814J0749
850A8406j092j5141j0783K683N598N792J0207J306j7979j8250L877J6679J1131
863A2434R36n396r508r664l428Q128J6652P719j1345j3439l015J933O190J4213
877A2410P657j2405j6761l058O835O708O373M547l294r315q199J779J2587R236
$$ plain form
777 15192 16637 -3962 -21202 -16569 -3501 5913 10072 7729 -1684 -13976 -20294 -11932 5867 13529
791 13529 4133 -5911 -10191 -14235 -9860 6501 14592 1670 -12822 -13779 -11018 -9976 -3535 5224
805 5224 4848 -5819 -15421 -14068 -3661 -283 -5379 -5441 -876 -4809 -9583 -3014 3290 -1008 -4723
820 -4723 -560 831 -2957 -5342 -5355 -7520 -7226 -3584 1557 4312 -3280 -15156 -16281 -6460 -2160 -3170
836 -3170 675 1523 -9582 -17072 -7972 6992 13991 10042 -580 -9378 -10159 -3157 7657 18406
850 18406 17314 2173 -8610 -5927 -329 5463 15670 16976 -1003 -19253 -15376 1303 12434
863 12434 13370 7974 -1534 -11198 -14626 -6498 10154 17873 6528 -6911 -9926 -7993 -1803 12410
877 12410 20067 7662 -9099 -12157 -5322 1386 7759 12306 9012 -303 -8502 -6723 5864 15100
891A5100m389q983k352j389j425O704R821j294p875l280L07m16P11K493O09j574
907B768l845j748M738K850n704l714O671L289n610k199M201k307m863M771Q998
922H296J808n227o417l057J729L988M513N239k030j2448q515P355R542K002J601
937H379q47j2312j2032M358J5192Q953p37q246j0186n406K656R377J2097M330
951A5576j1612j5364k573P847P956R658M574r807j6489m792Q557J1250P401p47
965A1435q084q898m708J946J1570J1838l572j3625n845K076J259N696R896j43
979A0841j0661p351J434M334M304K453k85k833m904l622N241Q450j724o380J026
994C23K955m048k493N969J870m958j14M260R82k461k755r10J322K278J081J527
$$ plain form
891 15100 10711 1728 -624 -2013 -3438 3266 13087 11793 3918 638 945 529 1240 3733 4342 2768
907 2768 -1077 -2825 1913 4763 -941 -4655 2016 5305 -305 -2504 1697 -610 -5473 -702 8296
922 8296 10104 4877 -1540 -4597 -2868 1120 5633 10872 8842 -3606 -12121 -4766 4776 6778 8379
937 8379 7532 -4780 -16812 -12454 2738 11691 10954 2708 -7478 -12884 -10228 -851 11246 15576
951 15576 3964 -11400 -13973 -6126 1830 11488 16062 6255 -10234 -15026 -6469 4781 12182 11435
965 11435 3351 -5547 -10255 -8309 3261 15099 11527 -2098 -7943 -5867 -4608 1088 10984 10841
979 10841 180 -7171 -5737 -1403 2901 5354 5069 2236 -2668 -6290 -1049 7401 5677 -703 323
994 323 3278 -770 -3263 2706 4576 -382 -496 3764 4746 2285 -470 -1380 -58 2220 3301 4828
1010D828P48o615o605N143R574J170l245k099m783p477K954J0523O160j198p787
1025A291r091k407N874P264O043K251r289j3867k015J0909Q683L773J283p137
1039C565j2977m872R161J2255O197m208j0352q029p41L725R831R914l370j5275
1053e176p656L965M743M998P742m57j1733r205K704Q011O585J991m124n087l715
1068f414j966M097Q963J946p830m418J491n99k60O135L556n663n277J302K440
1083b497J503O28j004L94J480j394q47L552Q30m867k52N890J054l842j014k18
1099f04l000m2N216L848k163n880n899K09N850L902J106J385m707r976j144J1443
1115d56Q354O9l186n097p771k275R161J0856L981n966j0518o110K266O693O940
$$ plain form
1010 4828 5576 -1039 -7644 -2501 7073 8243 4998 2899 -1884 -9361 -6407 4116 10276 9078 1291
1025 1291 -7800 -10207 -4333 2931 8974 11225 1936 -11931 -13946 -3037 5646 9419 10702 3565
1039 3565 -9412 -14284 -5123 7132 13329 9121 -1231 -9260 -10001 -6276 3555 13469 10099 -5176
1053 -5176 -12832 -8867 -4124 874 8616 8159 -3574 -12779 -10075 -2064 4521 6512 2388 -2699 -6414
1068 -6414 -8380 -4283 4680 6626 -1204 -5622 -4131 -4730 -4990 1145 4701 -962 -6239 -4937 -2497
1083 -2497 -994 -366 -1370 -976 504 -890 -1737 1815 2645 -2222 -2474 3416 4470 628 -386 -604
1099 -604 -3604 -3646 1570 5418 3255 -2625 -8524 -8315 -2465 1437 2543 3928 -779 -10755 -11899 -456
1115 -456 7898 7967 4781 -316 -8087 -10362 -1201 9655 13636 7670 -2848 -8958 -6692 1 6941
1130F941O616l910j4852q388O080R377N635L914k640j1290q860L571J0604Q390
1144A1188J128p315q538k951J314N500R194K977r084j0248n30L382K961N908L036
1159G922o182q098j572M562N408L267j375l032j234k150o84N225N099l543m793
1174a180J803J189k667k58K275j343k822J095J378l76k314l111O61M230K489j260
1190b11K74j18n320k011Q607P516j592m458k601l584n89O452P569J319n702r663
1206d112m810M476P104L725J221l245j1095p496N658J1310M160j132m300q443
1220f979n955M648J0037P304p86q914q513o98M825N572O505J954r702j1160J72
1235a1690Q410O118K849N24o367p077n68O325P842L864l078o194k432K23K087
$$ plain form
1130 6941 13557 9647 -5205 -13593 -7513 1864 7499 11413 8773 -2517 -11377 -7806 2798 11188
1144 11188 12316 5001 -3537 -6488 -5174 326 9520 12497 3413 -6835 -7365 -3983 -1022 4886 7922
1159 7922 1740 -6358 -7930 -3368 2040 5307 3932 900 -334 -2484 -3168 2057 7156 3613 -1180
1174 -1180 623 1812 -855 -1113 1162 -181 -3003 -1908 -530 -906 -3220 -6331 -5670 -1440 1049 -211
1190 -211 63 -55 -5375 -7386 1221 8737 7145 2687 86 -3498 -4087 2365 9934 11253 5551 -4112
1206 -4112 -8922 -4446 2658 6383 7604 4359 -6736 -14232 -8574 2736 6896 5764 1464 -6979
1220 -6979 -12934 -8286 1751 9055 8269 -645 -9158 -9856 -5031 541 7046 9000 -702 -11862 -11690
1235 -11690 -3280 2838 5687 6211 -156 -7233 -7801 -1476 6366 10230 7152 958 -1474 -1251 836
1250H36N894N581l837r047j117L522J07M58K205j039m522k344J104K167J320j198
1266I0k342J318J687j690J070K076j439l634L844N370j728l887l41p70J4K446
1282B084L041j09l670o096l360M569O079P32j720k365n393m969N105R869K938
1297F735l462m904n132j885N493R230M522k070q519p845J124P578N100K350L40
1312H655p617j0557N65J0266P321j11k929p021n777O6O705P119L199m280q426
1327b822l561J874L640M473M308m324j0828l413N457L746J045R90j331m851l547
1342i144R66M492M477J3l678j900J930J622J339L899J03l989K3L766m42k502J366
1359B341J269j313n15J303L06o92l057l162J609N476O69l275j616q74j961K246
$$ plain form
1250 836 6730 12311 8474 -573 -1690 1832 1939 2397 4602 3563 -959 -3303 -2199 -32 1288 90
1266 90 -2252 -934 753 -937 133 2209 770 -2864 980 6350 4622 735 394 -376 -362 2084
1282 2084 5125 5016 1346 -4750 -8110 -3541 2538 3270 1550 -815 -6208 -11177 -6072 3797 6735
1297 6735 3273 -1631 -6763 -8648 -3155 6075 10597 8527 8 -7837 -6713 865 5965 8315 8655
1312 8655 1038 -9519 -8954 1312 8633 8522 5593 -1428 -7205 -7139 -434 6685 9884 5604 -2822
1327 -2822 -6383 -4509 -869 3604 7912 3588 -7240 -10653 -5196 -1450 -405 585 -746 -5597 -9144
1342 -9144 -8178 -3686 791 804 -2874 -4774 -2844 -1222 117 4016 4119 130 153 3919 3477 975 2341
1359 2341 3610 2297 1782 3085 3391 2699 -358 -3520 -1911 3565 4234 959 -657 -1531 -3492 -1246
1375a246O741J661l259l957k479n32L641O232K445k485o281o809J558Q052M212
1390G494j353j898m583p770j52R305P462q03m799n989m536J478O766O341K338
1405I301m769q573l498M544N912L171K091l407r805l917O019O685J897k45k518
1420B888m974k705K423N330M681J89o255m072K167L551J148K834N16n003l703
1435i85J925J727n46J083O6k974k332K92J556R13n74l526j253L460J043l136M2
1452c219K435j514o18L573K392k338k119j114O48J931L716O87j543l669l570J697
1468b625O326L139l260l002k129l902K76P152O679j996n797m695k258L219O160
1483C287L682p44m819o856k586O187P133J808r88m147p588l574O372P937J964
$$ plain form
1375 -1246 5495 7156 3897 -60 -2539 -3071 570 6802 9247 6762 481 -6328 -4770 3282 7494
1390 7494 6141 4243 -340 -8110 -8262 1043 8505 7702 2903 -3086 -7622 -6144 622 6963 9301
1405 9301 4532 -4041 -7539 -2995 2917 6088 8179 4772 -5033 -8950 -2931 3754 5651 5406 2888
1420 2888 -2086 -4791 -2368 2962 7643 7832 1577 -2495 -328 3223 4371 7205 7721 2718 -985
1435 -985 940 2667 2121 3204 3270 296 -2036 -1744 -188 725 151 -3375 -4628 -1168 -125 -3261 -3219
1452 -3219 -784 -2298 -2916 657 3049 711 -1408 -2522 -1874 57 3773 4460 2917 -752 -4322 -2625
1468 -2625 3701 6840 3580 578 -1551 -5453 -5177 1975 8654 6658 861 -3834 -6092 -2873 3287
1483 3287 6969 6225 1406 -5450 -8036 -1849 5284 7092 6104 1957 -5631 -9205 -2833 5104 7068
1498G068k491m565m783q51L988N362L863r92o880o262K131N802K744J552J48n113
1514G21n337J385M049K032M07p06l488k893K83K697L559R01l615l507J904K392
1530G84j509L03K444n16k330J160J879m73r69j20m55K28J734O86j317j748k074
1547b293M33M085L022l323l494p51r37o19M085M333j418m574l738r90L266N263
1563B350J936k211l826m456j840N268P088P83l651l045m297k164M532P964K112
1578F543m343n772l686O75N463N025J962k275o415o255K745O885L215j74j252
1593B341n043n338J601O403L632n92k946m169k863K243L802L393J248l851m794
1608d933l86L656J493M36J635j132m191m96L016K099J48m57j697o59J129M95j47
$$ plain form
1498 7068 4577 12 -4771 -5622 -1634 3728 7591 6599 -281 -6543 -4412 1390 4134 5686 5834 721
1514 721 -4616 -3231 818 2850 3257 2551 -937 -3830 -3547 -850 2709 3610 -5 -3512 -1608 784
1530 784 -725 -422 2022 1506 -824 336 2215 1742 773 653 198 426 2160 2846 1529 -219 -2293
1547 -2293 -1860 2225 5247 1924 -1570 -2321 -3258 -3877 208 4541 3123 -1451 -5189 -6179 -2913 2350
1563 2350 4286 2075 -1751 -6207 -8047 -2779 4309 5092 1441 -1604 -5901 -8065 -3533 4431 6543
1578 6543 2200 -3572 -7258 -6583 -1120 3905 5867 3592 -2823 -9078 -6333 552 3767 3593 2341
1593 2341 -2702 -8040 -6439 -36 3596 3004 58 -4111 -6974 -4731 -929 2464 3712 -139 -4933
1608 -4933 -5319 -1663 -170 266 1901 769 -3422 -3918 -902 1197 1345 888 -809 -1468 -339 156 9
1625IQ46n92j730R74K675j171k051L26N36j405J081L028k72l276j982k90K766
1642e28L639R3k202k221j689j269L603N518J13m372k511j363p37M070N896O61
1658F701n238n189j693K003N403L534m77l477m927l996K897P587L305k549l385
1673D99m061l224K852P086L594j870m547m767j780L594N426K241o50m527n684
1688e818r35N396M235l10l20k348m640j326L735M028R97j301k915k335J058J972
1704h27J536J678q23l001j181K000Q79j274Q73J045k241j247J749R25j484j270
1720b663l2J064K027q5j930p26K62q43J568L983j40l782j995P60q3K080L828K43
1738C536m464l255p72K323M269K105k087l352k250k118J905O400L520l776l885
$$ plain form
1625 9 855 263 -1467 -493 2182 1011 -1040 -714 -178 -1583 -502 2526 2254 -1022 -3004 -3294 -528
1642 -528 3111 3204 1002 -1219 -2908 -4177 -574 4944 5057 685 -1826 -3189 -3926 144 6040 6701
1658 6701 1463 -3726 -5419 -3416 1987 5521 5044 1567 -3360 -7356 -4459 3128 6433 3884 499
1673 499 -3562 -6786 -3934 3152 6746 4876 329 -4438 -6218 -2624 2802 5043 4393 -134 -5818
1688 -5818 -6753 -1357 2878 2568 2248 -100 -4740 -6066 -2331 1697 2694 1393 -1522 -3857 -2799 -827
1704 -827 709 2387 1564 -1437 -2618 -618 261 -1013 -140 905 -1336 -2583 -834 91 -1393 -2663
1720 -2663 -2695 -1631 396 311 -1619 -2345 -2083 -2926 -1358 2625 2485 -1297 -3292 -2532 -2615 -535 3293 3536
1738 3536 -928 -4183 -4955 -2632 1637 3742 1655 -1697 -3947 -6065 -4160 2240 5760 1984 -1901
1753a901k448j005K501N788K773k714m611l487J30M610M178Q71j822l731m889
1768e757p70N981N256n87k432k516l140o48M608M103P73k214l665k394J810L336
1784A744K038O20j027m177k379K368K643l40l38L46k296k582J417K357r0p07j176
1801a579j100J160R09p26l05J133m39m57K067J221k055j173P48M23k8K251P65
1818B815k426k698m52J678L082J169k325k294p91o94J078M306K734k809m150j473
1834c250J35K527L756J891k800m465k212Q8M166L966K56l434l248l221o81N355
1850a171N446p87m109k736k312N75M755M356k7k962m289k171K327M733K170j8
1866C780k020l941l273K539M744P79j549j150k547k015K074L198J672q18k007
$$ plain form
1753 -1901 -4349 -5354 -2853 2935 5708 2994 -1617 -5104 -4974 -364 3814 4685 2863 -868 -5757
1768 -5757 -6527 -546 4710 4123 1691 -825 -3965 -4613 -5 4098 4871 2657 -1008 -3402 -1592 1744
1784 1744 3782 4402 3375 -802 -3181 -813 1830 1490 1152 1498 -798 -3380 -1963 394 304 -403 -1579
1801 -1579 -2679 -1519 -610 -1336 -1641 -508 -947 -1404 663 1884 -171 -1344 -596 -173 -201 2050 2815
1818 2815 389 -2309 -2761 -1083 1999 3168 843 -1451 -2242 -2936 -1858 2448 5182 2373 -1777 -3250
1834 -3250 -3115 -588 3168 5059 2259 -2206 -4418 -4330 -164 3802 4058 624 -2624 -5845 -6526 -1171
1850 -1171 4275 3488 -621 -3357 -5669 -5094 -339 4017 3990 1028 -3261 -5432 -3105 1628 3798 3780
1866 3780 1760 -2181 -5454 -2915 1829 2608 1059 -91 -2638 -4653 -2579 619 2291 1473 -534
1881e34j626J59K005Q81N25J520p14k189P62K385l09j369N51P0p20O18Q43j080
1899A778j156k25J11J371J094j945k127q0m5J98K534K234k081l731j058J457J839
1916A68K606R55k665l562j580J152L592L451k9l838k626j218p5M334M948p70m429
1933D14l011l95J742M313L795m87m235l588j659K526N159K046j917k842l608k187
1949c934K467N014J886k776l198k892j513K749M394J506j605k712k716j3L152
1964a91K143K65m30j297k721j2L346J406r77q67r31j353L8J585L06o09o27o45
1982a571m2J486q13o10L18Q98o04J52K131m92k260n8J257J526R08P97k084k082
2000a143j25R22K121K706q93l679j593N19P0K700L707j336m628k538J158J878
$$ plain form
1881 -534 -2160 -2001 4 885 1410 2930 2216 27 789 3174 2865 1496 2047 2117 1397 2015 2858 1778
1899 1778 622 397 508 1879 2973 1028 -1099 -1179 -1224 -1026 1508 3742 1661 -2070 -3128 -1671 168
1916 168 2774 3729 1064 -2498 -4078 -2926 666 4117 4088 250 -2376 -3594 -3669 665 5613 4843 414
1933 414 -2597 -2992 -1250 3063 6858 6371 2136 -1452 -3111 -585 4574 6620 4703 1861 -1747 -3934
1949 -3934 -1467 3547 5433 2657 -541 -3433 -4946 -2197 2197 3703 2098 -614 -3330 -3343 -191
1964 -191 1952 2217 1787 490 -2231 -2243 1103 2509 1532 665 -266 -1619 -1581 4 310 -299 -926 -1571
1982 -1571 -1613 -127 -940 -1550 -1232 -334 -938 -786 1345 853 -1407 -1465 -208 1318 2226 3023 939 -1143
2000 -1143 -1268 -346 1775 4481 3588 -91 -1684 -1165 -1095 1605 5312 3976 -652 -3190 -2032 -154
2016a54L297K110j924l748k698p52K950M595J086l168l752j975n05K537M878Q92
2032C669l045m076j295J05L422M051R14k132l462k128P74M366L233o19k161j694
2048g8k499J11M307L005j557k216j627j594N45K473J467p67j040k060n57J675
2064d12J366o94N4K34j760j002K014J247j358m29Q68j45K30K38n62j250K63M8
2082a050O38J276j95k273j280J173N29R49K055m25l731j973J040K621K110N55
2098B019j607k783j257P9K289L436J294l435l574m96N86K556L904J112l584m040
2114c501m54J452L084K844N08k736l512j376J283M517K944j633l021j864j586
2129c051M55L824L075j765l159k107p63J623L039J657j335k286k065o25K353K545
$$ plain form
2016 -154 3143 5253 3329 -419 -3117 -3869 -919 3676 4762 1594 -2158 -4133 -4638 -2101 2777 3669
2032 3669 624 -3452 -4747 -4642 -1220 2831 3745 1613 -1849 -3977 -3203 1163 4396 3777 1616 -78
2048 -78 -2577 -2466 1841 4846 3289 1073 -554 -2148 -1603 870 2337 1570 530 -1530 -2087 -412
2064 -412 954 260 314 548 -1212 -2214 -200 1047 -311 -740 128 -17 213 451 -111 -1361 -1098 -1050
2082 -1050 -412 864 669 -1604 -2884 -1711 -1182 -233 1822 1397 -2334 -4307 -3267 -646 1464 2019
2098 2019 412 -2371 -3628 -3549 -1260 2176 3470 35 -3539 -4035 -3449 -893 3011 4123 539 -3501
2114 -3501 -3955 -2503 581 3425 3933 1197 -2315 -3691 -2408 2109 5053 3420 399 -1465 -3051
2129 -3051 -2596 1228 4303 2538 -621 -2728 -3491 -1868 1171 2828 1493 -793 -2858 -3483 -1130 1415
2145A415K61j081o09j053j037K271K132m75j403j99k41K0J183K38k18j29k96q13
2163c4J125P21j307r10J001K43n49Q28N70j825j434Q75J944Q26K44j262k088m87
2181a519N16J325K228Q60k860l086n2J753J953K071N24l151l498L18J831K139
2197A352K273m22k850k612q83J314M083K586k122l869j679K83O71L377K381j724
2213B159l477k271P82J250L673O40j620k352k331L9K486L651R8k389j518j230
2229b410m85J755L381N9k251j555o58Q16J505J236l58q15r81j445R39J778M37
2246I48j341J64j67r27P3J539r7j288M9O35L93K35k99r26O9Q32K31Q01P79j645
2266E8k103O32J775J047M58K59k052k003l39K413J601J191q68k793k143N18J699
$$ plain form
2145 1415 1676 595 -14 -1067 -2104 167 2299 1824 421 222 -19 1 1184 1422 1204 1075 779 -34
2163 -34 1091 1812 505 -405 596 839 290 1118 1688 -137 -1571 -696 1248 2074 2318 1056 -1032 -1519
2181 -1519 -1003 322 2550 3410 550 -2536 -2588 -835 1118 3189 3713 562 -2936 -2618 -787 1352
2197 1352 3625 3203 353 -2259 -3142 -1828 2255 4841 2719 -1150 -2829 -2546 -1875 1502 3883 2159
2213 2159 -1318 -3589 -2807 -1557 2116 2756 1136 -1216 -3547 -3508 -1022 2629 2727 338 -1180 -2410
2229 -2410 -2895 -1140 2241 2300 49 -1506 -2164 -1348 157 1393 1035 220 -761 -2206 -1267 511 948
2246 948 -393 -229 -396 -1323 -1250 289 192 -1096 -1047 -412 -19 216 -83 -1009 -940 -108 123 924 1703 58
2266 58 -2045 -1413 362 1409 1867 2126 74 -1929 -2268 145 1746 2937 2069 -724 -2867 -2349 -650
2283f50K668J855j561l941j398R57J697K600J858j899l597j799Q94K709K733P36
2299C862k505k596j378P0K575L526J96l398k304J36P1J965K619J77k373k560j37
2316b054P48K527J530j79j829j509r77N76K734N64j287j315pq35J36J958Q21j445
2334A57j349l16L30R07Q21o80m68M51l53rJ205j5j796j08J638m14J12P88q59j622
2354a580l28J408J097P20p68k472r74J117J387J377J278r50l187j209J503K019
2370D38J128R12j479l097j534J394K801J880q9k793k419p57J130K382K494K34
2386B625l572k621K97J628K139K322n65k953k252j39J937L033J663j225k734j389
2402a806k21J258K909J144j583k936r14M90R87K588P55j532k642J1L62J127J734
$$ plain form
2283 -650 2018 3873 2312 -1629 -3027 -2070 -373 2227 4085 2186 -1411 -3210 -2316 393 3126 3862
2299 3862 1357 -1239 -2617 -2547 28 3554 3750 352 -1952 -1816 -1745 220 2839 3016 643 -1917 -2054
2316 -2054 -1306 1221 2751 2572 743 -766 -1743 -1167 1567 2131 844 -471 -478 -1313 -1177 781 1602 157
2334 157 -1192 -1508 -1178 -271 550 -130 -598 -147 -500 -509 696 681 -1115 -1223 415 1 113 901 42 -1580
2354 -1580 -1908 -500 597 1317 549 -1923 -2897 -1780 -393 984 2262 1312 -1875 -3084 -1581 438
2370 438 1566 2478 999 -2098 -3632 -2238 563 2443 2354 -439 -2858 -3615 -2485 -103 2391 2625
2386 2625 -947 -3568 -3271 -1643 496 2818 2253 -700 -2952 -3091 -1154 1879 3542 2317 -417 -1806
2402 -1806 -2027 -769 2140 3284 1701 -1235 -2149 -1659 -672 1916 2671 1139 -1503 -1492 -1130 -3 1731
2419A731k70j103m20j97m82J639J099j112q56M02k72l05N87O35j146l47O12M42
2437F37k19j64j174o34J333P49L59Q2j58j754p52J471J612M57N6r30k572p34J730
2456f05K183J168k57k482k555K83J692J495J989k05k913k509N38K505J994J045
2472C366o84k957k141O29K227K505J360j932l172j132L08J545K324J172k649k613
2488a844j004J012J381K355O86k118k464p16O66J928K492o59j660j089j60K18
2504i76J894J586o09j810p94K82M4Q15J508o60j036Lm74J020J75P5o72K96Q2p8
2524F71N4J101n77j124J096R68p08j72n38p71l16O67J172N20m78j544j454J10
2542a323J885L77P81k0k217j788J298K273Q47L96p16k451j507J008K175J661J44
$$ plain form
2419 1731 1461 358 -62 -259 -741 898 1997 885 29 431 159 -146 441 1076 -70 -417 195 637
2437 637 418 254 -920 -1554 -221 528 887 969 811 -943 -1695 -224 1388 1845 1901 971 -1601 -2335 -605
2456 -605 1578 2746 2489 7 -2548 -2265 -573 922 2911 2706 -207 -2716 -2178 327 2321 3366
2472 3366 2682 -275 -2416 -1787 440 2945 4305 2373 -799 -1931 -1623 -78 2246 3418 769 -1844
2488 -1844 -2848 -1836 -455 1900 2586 468 -1996 -2712 -2046 -118 2374 1715 55 -1034 -1194 -976
2504 -976 918 2504 1895 85 -709 -427 -383 432 1940 1280 244 247 -227 793 968 1043 371 667 749 671
2524 671 725 1826 1249 125 1221 2189 1481 1309 771 0 -316 351 1523 2043 1565 21 -1433 -1323
2542 -1323 562 939 1720 1700 -517 -2305 -1007 1266 2113 2509 1793 -658 -2165 -1157 1018 2679 2823
2559B823j938k529n95J453J184J475L15k161k776l89J811J848J544K76k120k346
2575b125l0J484K044J568m56k585j150LR32J764K262j015k768j511M64P42J075
2592F98J310q70j754j007R6M90J601L09r69j191Lj26L48J045K23j498o9M99M5
2611h17m26N11m22n13M18L45J08ll51r26L02J365L82Q4j17r34j048O82J595J218
2631A453l29m43j710r79R46J861R02K57j824j969n91J659J529N84R3j845k637
2648c043l0K310J743O62k35k102k141L50J690K431R62q90k683j533Q40J309J675
2665A315J453j040k818j810R26J603J467Q28j116k220r13N19J724J695M91j795
2681C09j567P8M59N17J874N75j593j420L76N31K46J037j89j166j90J60o3R93P4
$$ plain form
2559 2823 885 -1644 -2239 -786 398 1873 2188 27 -2749 -3138 -1327 521 2065 2341 221 -2125
2575 -2125 -2155 -671 1373 2941 2485 -100 -1250 -1247 -315 1449 3711 2696 -72 -1583 -1119 -377 698
2592 698 2008 1138 -616 -1623 -1527 -1037 564 873 -96 -1287 -1284 -1410 -1062 -17 206 -1292 -1361 -862 -817
2611 -817 -1243 -732 -1154 -1667 -1249 -904 -796 -799 -1150 -2076 -1774 -409 -27 57 -60 -994 -2042 -1360 235 1453
2631 1453 1124 681 -1029 -2008 -1062 799 1701 1958 134 -1835 -2426 -767 762 1346 1439 -406 -3043
2648 -3043 -3073 -763 980 1642 1407 -695 -2836 -2486 -796 1635 2597 1707 -976 -2509 -1669 -360 1315
2665 1315 2768 1728 -1090 -2900 -1974 -371 1096 1924 808 -1412 -2325 -1806 -82 1613 2104 309
2681 309 -1258 -1180 -721 -204 1670 2245 652 -768 -392 139 385 1422 1233 67 -123 37 -26 967 1041
2700A041k64o97R63o5n93Q05l20r06j55J163M06n83j60n39r68K11J475J76r7p78
2720A15k095QJ685J208q6k0j327j627k64K428J276J65o46j682j455N18K332J234
2738A767N21o41k472j719J210K051J090O81j017k735j393J052K347Q71N21j679
2754D55j980j113J511J431J614K34j880k044l28J130J381J390K97j864j857P6
2770a547J076R05J156Q4j623r54l79Q96R75P73n97j355J82K97l11P17N88o63p25
2789e05N40L66k28L05l93k43j91R35k09j86K07q22J2P36J147l80n77l01j127k79
2809a193J844J261l90m86j353p15N50J447Q63j52p59j899j145J701J652N09n1
2826A684j005j780j376J493K203J072p79j656j784m10J653J635J207l15k307k014
$$ plain form
2700 1041 777 80 1043 978 385 1190 870 -36 -191 972 1378 795 635 96 -872 -661 814 990 893 115
2720 115 -1980 -1972 -287 921 835 815 -512 -2139 -2403 25 1301 1466 820 -862 -2317 -1799 533 1767
2738 1767 2288 1647 -825 -2544 -1334 717 1807 2488 1471 -1264 -2657 -1605 742 1613 2134 455
2754 455 -1525 -2638 -1127 304 1918 2152 272 -1772 -2100 -970 411 1801 2098 234 -1623 -1547
2770 -1547 -471 434 1590 1674 51 -903 -1282 -386 589 1362 765 -590 -408 -111 -422 295 883 220 -505
2789 -505 35 401 173 478 85 -158 -349 586 377 191 398 -424 -412 324 1471 1091 514 213 -914 -1193
2809 -1193 651 1912 1522 1036 -317 -1032 -482 965 1828 1676 917 -982 -2127 -426 1226 1735 1684
2826 1684 679 -1101 -2477 -984 1219 2291 1512 -144 -1928 -2338 -685 950 2157 1842 -465 -2479
2842b479N20J507J529P31r1k208j566L68J781J090O60q45j660j165M82J032R91
2859F77R18j008j772n31Q49M52O81Q75r88j711k4Q48L25N10J79p85n3k17K87N03
2879A5J67n36o98P04P87l45o83O88p10n40Q04J269n58p07o47k22L99J357M96m82
2899E58n43j228o36Q39K298p8n27r43r93p84J554J817N47j185j228j343lJ785
2917i3J750Q3o78j405j682N70J990J357k55P4k221j670Q98K090J085M51j299j511
2935d66j419J109J511Q75M20j179k139m09J411Q79O84N00j109j665K5O12J038
2952F78P92m4j119m37k61N00O82J73L69j185o25R04j52k07O68j37p40J23M42k26
2972A98q1n1j85K15J96M70n63J7m7r61O80J179o7n71l66k36o09R16J028L19r56
$$ plain form
2842 -2479 -1959 -452 1077 1808 1717 -491 -2057 -1689 92 1182 1842 997 -663 -1828 -1346 -314 677
2859 677 1595 587 -1185 -1716 -867 -415 266 1141 153 -1558 -1582 -734 -409 101 280 -505 -558 -775 -488 15
2879 15 182 -354 -1052 -348 439 94 -589 99 -611 -1151 -347 922 364 -343 -990 -1212 -813 544 1040 558
2899 558 15 -1213 -1849 -1010 1288 1210 683 -260 -1253 -2037 -483 1334 1881 696 -532 -1875 -1878 -93
2917 -93 1657 1740 1062 -343 -2025 -1455 535 1892 1637 1711 -510 -2180 -1282 808 1893 2344 1045 -466
2935 -466 -1885 -776 735 1610 2030 851 -1288 -1697 -286 593 1277 1777 668 -997 -972 -360 678
2952 678 1470 1426 307 -130 -391 109 791 964 1333 148 -477 427 275 68 736 599 -141 -18 424 198
2972 198 117 66 -119 96 292 762 199 216 169 -792 -112 1067 1000 429 63 -173 -782 134 1162 1481 525
2993E25r06o52l03J486J147l41n03q38j421O63J967J045n95r49j147r55N72J963
3011G58J685j045r78j420r62J364J585O44l7j258j861m17J343J651L74J5j164
3028B77j610m78J402J145Q25q2j502q57l0J235Q98L94m8j580r70K96J093L16N21
3047A245j4j119o84K08R58K07K77n70o06J11L49j30L88L14n86n37R98L54j160
3066CN0J89l68n7Q98K47o75q88k02j54J317P15n81o02m64o38N74J210R39n26j136
3087a49o22m92N87K023O53r99j241j082J10J181J693r6l33j267j637j61J504J923
3105A595k1o26j315j472m7K061J244J81r00j190j205K10J811R65J56m73j690j379
3123b095O80J752K36J50k97j419j035Q53P34J038l27m56r26j85L07P94L67L53
$$ plain form
2993 525 -381 -1033 -1336 150 1297 956 453 -385 -1806 -1143 824 1869 1274 325 -822 -1777 -1205 758
3011 758 2443 1398 420 -1000 -1962 -598 987 1631 1594 336 -1525 -1942 -599 1052 1426 1441 277
3028 277 -1333 -1811 -409 736 1561 1479 -23 -880 -910 325 1223 1617 1569 -11 -981 -685 408 724 1245
3047 1245 1231 112 -572 -364 594 801 1078 508 -98 13 362 232 620 934 348 -189 809 1163 3
3066 3 53 242 -126 -183 715 962 287 -601 -803 -957 360 1075 494 -108 -572 -1210 -636 574 1513 987 -149
3087 -149 -771 -1263 -676 1347 2000 1001 -240 -1322 -1212 -31 1662 1566 1233 -34 -1671 -1832 -328 1595
3105 1595 1574 948 -367 -1839 -1886 175 1419 1600 700 -490 -1695 -1485 326 1291 1447 974 -716 -2095
3123 -2095 -1415 337 573 723 426 -993 -2028 -1175 -441 597 270 -186 -1112 -1297 -990 -196 171 524
3141E24p04o93K43O48M2n25Q81o29j57L54k9L1Q2j49k71N28O49o90n05M26j08
3162e2r2O33J350r38p97k49j46N71J151J81o69r63n77k28R30J803l41j057r60
3181d50r37m69J509J955k65j185j115n41J13J635J052J92p68j353j200O90J993
3198H56J042j47p54j323j491R81J969N35k47o06j276r42J318J300Q38k88j085
3215F80j403k65J602Q44q2L65j102j110J09J102R7J71j18n97r58K34P08L4K68
3234E79j49o86L60M7k41l97R20n48n01M87Q61l62j217J51L75K41L98K23l59o51
3254d69k08l36R36J196k49j268m78j37j75Q19J855n15j194n57j78P5J286J344
3272A747m40r56j021p46N96J946P44j009o71j111m94P01J665R58p15j644n82p80
$$ plain form
3141 524 -180 -873 -630 18 60 -465 416 -213 -370 -16 -45 -14 68 -81 -352 176 825 135 -370 56 -52
3162 -52 -144 489 1839 901 104 -145 -291 280 1431 1612 943 -20 -597 -825 105 1908 1567 510 -450
3181 -450 -1387 -1856 -347 1608 1343 158 -957 -1498 -1385 250 1302 1494 726 -627 -1827 -1137 856
3198 856 1898 1751 997 -326 -1817 -836 1133 1668 1421 815 -461 -1403 -85 1215 2053 1765 680
3215 680 -723 -988 614 1458 1376 1741 639 -471 -362 740 837 1008 890 293 -665 -431 277 311 579
3234 579 430 -256 104 151 -90 -487 433 -115 -616 -129 732 370 -847 -696 -321 -80 318 541 182 -469
3254 -469 -677 -1013 -77 1119 870 -398 -876 -1013 -1188 -369 1486 971 -223 -780 -958 -883 403 1747
3272 1747 1307 351 -670 -1416 -820 1126 1870 861 190 -921 -1415 -714 951 1909 1194 -450 -1032 -1812
3290a812J088J681J97j22j371j418J17J467J120k5n99p08p74m54J474O49J62j15
3308E57j075q36K82J099N02L45m76q15n45Q06K11J40L59j51o51J19N99K68l23
3327D15j48K61m27j64M88p2m57J59j56Q9P66J94j098n45M13RL92J004m43j231
3347e51k37J29J87R51Q32o14j042p39k10R12J203M92j092r17n72m19P84J969K91
3366A357j122j200o06N4J038J385K80j019r58o78j95J579J110R1j125n91j026
3383a626M32J546J116o12n43j061p79L87J438N16Rk95j219m81N81R24K7L9j58
3402B41q17p92R58O04%L2j43o17j50P5M22q3L4l3m67K52N85n72n3M86K2jL49Q7
3426D19r99J22K93K10M48L59m56o22j85Q3J67J059N59j034q16j54rO02J163L93
$$ plain form
3290 -1812 -724 957 1154 1032 -339 -1757 -1640 -173 947 922 323 -385 -1159 -1613 -139 510 672 557
3308 557 -518 -1354 -1072 27 529 874 398 -417 -962 -156 55 195 554 403 -248 -129 470 738 415
3327 415 267 528 101 -63 425 353 -104 55 -101 -12 754 948 -150 -695 -282 -273 119 1123 680 -551
3347 -551 -788 -659 -472 479 1311 697 -345 -1084 -1294 -382 821 1313 221 -696 -1268 -1687 -903 1066 1357
3366 1357 235 -965 -1571 -1517 -479 906 1186 167 -791 -1469 -1664 -85 1025 1116 -9 -600 -1626
3383 -1626 -1194 352 1468 856 313 -748 -1527 -1140 298 814 823 528 -691 -1172 -591 333 360 399 241
3402 241 -576 -1368 -410 194 194 226 83 -534 -684 -609 -187 -270 -236 -269 -736 -484 101 -471 -524 -38 -16 -17 332 419
3426 419 -580 -458 -165 45 493 852 396 -226 -411 -328 -161 898 1457 423 -393 -547 -556 46 1209 1602
3446A602j252j419M9M36Q04J028J71q94j027p01L54J198J269l51j071o72o03L51
3464g28J394J172p73q11p51p13N01J410P72l83r54q64p54J371J025J55k65n51
3482B53p85p86J038Q19M35p51J41j232j0J181J21j05K8m96o40L82Q75k39k20L43
3502C52k39o15L02M62l53n0P0k56J55M20l76l89K56j48J10P45K20r08n97K91L04
3523b44rR69R6j016q94J71L76P37P82k32j028m40n53J93J451P21n80r90q04M50
3543h44K67J222P67m94r61r43p6O85J153N93q92q20r73P9J076J411m1j030l52
3562a73p48l01J256J276m16q24m55p37L0J345Q35j06n38p45p70K39J274K48j21
3581E69o1o19o30K39O83L57k43k02k84j84M93J42J74k34K65m92j39L59R5p45Q3
$$ plain form
3446 1602 350 -1069 -1020 -584 220 1248 1419 525 -502 -1203 -849 349 1618 1267 196 -476 -1079 -728
3464 -728 666 1838 1065 254 -497 -1210 -709 701 1473 1090 136 -728 -1482 -111 914 1069 804 253
3482 253 -532 -1318 -280 539 974 223 364 -868 -878 303 424 319 347 -149 -789 -407 468 229 9 352
3502 352 113 -502 -200 262 -91 -141 -71 -327 -172 248 -128 -517 -261 -409 -299 446 666 -242 -839 -548 -244
3523 -244 -253 716 812 -204 -1098 -927 -551 186 968 736 -292 -732 -1285 -1092 359 1080 500 -490 -1294 -844
3543 -844 -577 645 1412 918 -43 -986 -1062 -377 776 1369 477 -343 -1316 -1237 -161 1250 1209 179 -173
3562 -173 -921 -1222 34 1310 894 70 -385 -1122 -1092 253 1088 982 444 -301 -1071 -832 442 690 569
3581 569 508 -111 -741 -502 181 538 295 93 -191 -375 118 260 434 200 465 -27 -166 193 288 -457 -374
3602c74N91k80K92L7m54l49O5N21O1Q81o82p56l26R0O82L76O67n47j280j52L94
3623e43M17Q94L54r41r70k59J14R13Q77K22p11j047m09q3J031J240qj075j170
3642a154j65K14R61J050J53j248p55j71K01J349P38n94p69n32k76P7J641K67l95
3661E92p94k06m99L14N88Q12l54o65l61j48O16P64J6m66K15o94k73P88L87m23
3681B09J22k5n73K69P00o18o8N0KO8J84k7l15k29L68J09N42j00m65l34l62L86
3703a07L27K82K90l96p49m44P26M52N30K44j003q47j08L83O04R62J19j314q47
3722h96j3L72J229P96q7j525m05k27N72J107Q68p69q99o04l08O54J193K17l62
3741I13r90o83K68K11J296M02p53n67p19n8P13N33j00k90k74n15l87P68R78l13
$$ plain form
3602 -374 217 -63 229 266 -188 -537 -472 49 110 991 309 -447 -773 -683 -1 375 1042 495 -785 -937 -543
3623 -543 -126 768 1122 181 -789 -1048 -934 -21 856 1078 367 -680 -1089 -1172 -141 1099 1091 16 -1154
3642 -1154 -1319 -1105 -144 906 1059 -189 -944 -1115 -914 435 1173 579 -190 -722 -998 -921 720 987 592
3661 592 -202 -408 -907 -593 -5 807 453 -212 -573 -721 -105 659 675 209 424 -270 -543 245 632 209
3681 209 331 306 -267 2 702 84 16 66 68 136 320 293 -22 -251 117 226 768 668 203 -131 -493 -107
3703 -107 220 502 792 396 -353 -797 -71 381 911 1155 152 -695 -803 -420 184 1146 1265 -49 -896
3722 -896 -909 -537 692 1488 1401 -124 -529 -756 -184 923 1791 1022 123 -481 -789 -135 1058 1275 913
3741 913 -77 -760 -492 -281 1015 1417 664 97 -622 -680 33 566 466 176 -98 -613 -1000 -232 746 433
3761D33n07M2n62L11N7M28j76r5m33k00n5O81J63l14J87J7l30M81O1m44k46L10
3783a91L04m84O83m32l00j64N79L46J89K29o71o28o5P03J44L73R0q08j080P93
3803c90L83N22N67k36j145o31O8O48J177K02p61q86m52L94L31P57O78r85j153
3822i12j60K45O01J120J89p12r37l09o0Q19J100j68m68q71p7j79R68R01q1r46
3842F3o05o3q5J009P85m70p98o7k24L13O24J77p05o2J90l24k5Q66q6l37k04R5
3864F7l51J15N21j68l96K82l0k13K48k13l10J75M15j92K50q2m80n45M36K41M66
3885B36K62m02q64l96N64N00N73L73q59q42m63O20N12P01L14n55j152n00P25P36
3905H3P28j15n85j211m7O51Q75R46k46r99j134K39K93J013P29n80q23n47o6M53
$$ plain form
3761 433 -74 -32 -594 -283 -226 202 26 -69 -502 -702 -757 -76 87 -227 -40 -23 -353 128 189 -255 -501 -191
3783 -191 113 -371 312 -120 -420 -584 -5 341 530 759 88 -540 -605 98 242 615 705 -103 -1183 -390
3803 -390 -7 515 1082 846 -299 -930 -862 -214 963 1165 404 -482 -934 -540 -209 548 1226 241 -912
3822 -912 -1072 -827 -226 894 1083 371 -566 -875 -935 -116 984 816 348 -523 -600 -779 189 1090 1009 63
3842 63 -542 -605 -690 319 1104 634 -164 -231 -455 -142 482 659 -46 -108 82 -242 -267 599 513 176 -28 67
3864 67 -284 -169 352 184 -212 70 40 -173 75 -138 -448 -273 142 -50 200 118 -362 -907 -471 -230 236
3885 236 498 96 -768 -1164 -600 -100 473 846 -13 -855 -1318 -698 -186 515 829 274 -878 -1378 -653 83
3905 83 811 696 111 -1100 -1147 -496 379 1325 1079 80 -1054 -815 -522 491 1220 640 -183 -730 -796 -343
3925c43P77N18J1j121n20k32O73M22N32n46l77m00j63N41Q33K8p17q9k22k76N69
3946a02M81r4m85m2L04l61L03j06m5K12K42k79k33N67l35k40J26L84J48j29j84
3967A32l81l3K62N04j0J06j48q01m21J000K65L08j11o48j053L77P79L91P59o70
3987F07o53o08O4L00P27M70l11j045q28M71Q07M58Q08o30j020n44J08N68P21J51
4007F21n00p27m72L15M50J049L7p20n94j13j01M94P55M48q89m50k25k5N27O37
4027E17R4q73o05j87N92J77N44l11k84J70k97J34J2M45j42k25j06J80N1m6o4M5
4049a79j21L94n9j65O8m40m6L41O47r8k55m14k15j44P45L04J20k09o71m00L06
4070d91N08K40K78j25j161k68P75O60k6M79k42j012o57P61N25L77M09n49j149
$$ plain form
3925 -343 434 952 963 -158 -678 -910 -237 185 717 171 -206 -606 -769 -228 605 633 -84 -173 -395 -671 -102
3946 -102 379 285 -200 -242 62 -299 4 -102 -147 65 307 28 -205 362 27 -213 -87 297 445 316 132
3967 132 -249 -282 -20 484 474 580 432 -369 -790 210 475 783 672 24 -1029 -652 127 518 1277 607
3987 607 -46 -654 -590 -290 437 907 596 -449 -1277 -806 1 459 1267 637 -383 -927 -819 -251 470 621
4007 621 121 -606 -1078 -763 -313 736 773 53 -541 -654 -755 -261 494 942 53 -397 -622 -647 -120 517
4027 517 611 -262 -867 -1054 -462 -285 259 -52 -336 -166 -463 -329 -317 128 -14 -239 -345 -165 -114 -160 -224 -179
4049 -179 -300 94 35 -130 -62 -502 -548 -207 440 342 87 -327 -542 -686 59 363 483 274 -397 -797 -491
4070 -491 17 257 535 410 -751 -1019 -244 416 390 869 627 -385 -1042 -281 244 621 1030 481 -668
4089f68k38N35R49L78k25o47r00J24O46L03O78j5o27q71k08N74M28M48j55m33
4109G6n72r2N52O55M26l29p96m7m22K14O71J56j23o96K46j23K01M50n07L08p0
4130A78j31n06O85Kl63nK21J72k43K74k53m51K89L08J21r6k23k91m48M40L25M34
4152D39m13j83j59n62N49P79J66J60q20q37M5N53M94L44n5m25q13k90M62P60N65
4173G59R9p59j217L48N67N03M30N8q25o06P5M36O71L76l66p36n96M25M69M83N35
4194A129p67q12J3J81J89O47K98n87o66J93J14K31N92Po66j62n7k4L80N24l57
4215D00m52j88L47o4J01M08l41m2j92K85l53K09O6k76l8N38J34l38J95o38j53
4236c92O85K93O2k85j87l90j74M46N64Mj9p34k50k61R22L74J08k27n29q30R1Q67
$$ plain form
4089 -668 -906 -371 578 956 731 84 -816 -692 -46 257 935 920 293 -578 -786 -212 216 664 509 76
4109 76 -496 -588 -36 619 1045 716 -80 -127 -549 -335 336 492 369 -327 -81 -204 -3 447 -60 248 178
4130 178 47 -459 226 228 -135 -140 81 253 10 284 31 -420 -131 177 298 202 -21 -312 -760 -320 5 439
4152 439 26 -157 -316 -878 -329 450 616 776 -44 -881 -836 -283 211 555 500 75 -738 -1028 -566 194 759
4173 759 858 99 -1118 -770 -203 300 730 788 -37 -643 -568 -132 539 915 549 -187 -783 -358 111 594 1129
4194 1129 362 -450 -437 -256 -67 580 878 291 -375 -182 -68 163 755 762 96 -66 -123 -147 233 757 400
4215 400 -52 -240 107 43 144 552 211 169 -23 262 -91 118 184 -92 -130 408 542 204 399 -239 -392
4236 -392 293 586 648 363 176 -214 -388 58 622 626 607 -127 -377 -638 284 658 766 539 10 -820 -729 138
4258A38J0N8K65o38j046P91M82N82J74l44j099j47M37M17K78N14n23q62l46M96
4278c63P28J33J10m51o60m53L41N64J34N01m63q12j99N20M27N42j41n81o52K40
4298e35K57M59J49l27j81k26N9m4M59R4q9j89J06JK9O1J11o08J90L91n6l41N30
4321C00k97n93O68L46Pk58n35O8l17O44O51l59j8l31o30M03M64L99k58J17r14
4342d43m65K87J085L49j39l82r78J35o0R24L05j42l20q08k49J003O61k14N34p29
4362C54j102j26O87N93K07r2o20p76O15J22M86M94Lr14n54K67L86L99M49n09m84
4383a15o9K55j30J78M74j82n77j09K0J94K95L35m05o73K96L64k63j41J68L5k27
4404b77kJ24M7k14M3j02K63M15l46j8o0l50L02K9O41m85ll88l57K73J050r1n97
$$ plain form
4258 138 148 206 471 -167 -1213 -422 60 642 816 472 -627 -774 -337 80 358 872 349 -513 -859 -363
4278 -363 365 498 608 157 -503 -956 -615 -51 83 584 121 -691 -890 -370 57 599 458 -123 -775 -535
4298 -535 -278 181 330 3 -178 -404 -345 -389 70 164 75 -114 -8 -7 22 83 194 -414 -224 167 111 -230 300
4321 300 3 -590 78 424 431 173 -362 -294 -611 33 684 325 307 -24 -654 -251 213 612 354 471 -443
4342 -443 -908 -621 464 813 674 292 -686 -551 -611 313 618 476 156 -652 -901 102 763 549 1083 354
4362 354 -748 -874 -187 406 613 521 -99 -875 -260 -138 348 842 845 -69 -623 -356 30 429 878 369 -115
4383 -115 -184 71 -59 119 593 411 -166 -275 -255 -61 234 569 164 -509 -213 151 -112 -253 -85 -50 -277
4404 -277 -279 -155 -108 -322 -279 -381 -118 297 -49 -67 -127 -477 -175 -146 495 10 7 -381 -738 -465 585 494 -103
4427a03K26r16M59L62P27j18m90P4q39k35P50N86Q9k29k73q48LR07L32M30p56
4448A38j30j092M86O04Q09j86j50o79p10O23M15N07Q0k72p65m8K79M87J40j23
4468D13r0o85q6J53L75N91k21p1l99m77Q26j4j07R8k50P6n4n9KO60m48o5K59n3
4492C74J05k69n4J53m47O81j66l43r2J55j66j3N97R0m92J7n43P4L41M27O7k84
4514B12m31l27J90O78L19m84k09m95l86K35R53K6l3j39o39k95J90R31K53m0k0
4535D89j126m05N90O15J93m28K63n60j75K42N01N31j73j17j234L3Q40m16P76j4
4555D25Nj072r3O00J66J06K06l26n81K44mL35J89L5m86q8k6M02P6K8j96j98n6
4578c09M13n64K49O6K55j42qL86m43j13j3m3K27N15m43J97l90q3m74R20L89l63
$$ plain form
4427 -103 123 -793 -334 28 755 637 147 221 -618 -853 -103 483 572 343 70 -778 -775 132 464 894 138
4448 138 8 -1084 -598 6 815 629 479 -200 -910 -287 128 635 715 443 -322 -370 -91 396 536 413
4468 413 323 -362 -448 -295 80 671 450 379 -20 -497 329 315 208 306 56 132 78 19 21 681 233 168 427 374
4492 374 479 210 156 309 -138 543 377 34 -58 97 -69 -82 515 605 113 130 -413 -339 2 429 496 212
4514 212 -219 -546 -356 322 641 157 -52 -547 -933 -698 255 281 248 109 -530 -825 -635 296 549 509 489
4535 489 -637 -1042 -452 163 356 -72 191 -369 -544 -302 199 730 557 440 -794 -761 79 -337 439 425
4555 425 430 -642 -735 -135 31 137 343 17 -564 -320 -324 11 200 235 -251 -339 -365 37 113 141 -55 -253 -309
4578 -309 104 -460 -211 -145 110 -32 -40 346 -97 -210 -223 -266 -39 476 33 230 -160 -243 -717 203 592 229
4600B29j13K7l54J3K15P05R7n31j38n71K64P39L68m06l01o23k35O76O23pl21k20
4622A36m38m05M15Q37Mk81k6n74n03M83P73K08J7n97p75K17M69O70k16K01o82
4643f7n20K35K64L81K80o2m83m33L32J12K43L9J0n57m2J08K26J49K01j88m20J13
4665g9K76l50n0N01n63J60J74Nk87k11P28m32L40L53n92J81l69p5K50L66K53m66
4687A13K3k51r1J15N76K31o62J5j73j24M71K13M26p33m20k23P5M01N21K6l09n08
4709b88l90J07R06O43l11n83j39m35J0P60N01m86Rq26q3L20O01Q0K52m25k41m15
4731d33M08J82N71j45Lr00j84P36J36J42O0k09o43J96L39Ol0k15J58l40K15J03
4753A56j20K91J14j95j09M6j7k08J18j8l7J45J44l37P4J7k15J58L03J78l13k22
$$ plain form
4600 229 116 143 -211 -198 17 722 819 288 150 -421 -157 582 950 544 243 -380 -615 61 684 677 356 136
4622 136 -302 -707 -292 545 549 268 242 -332 -835 -352 421 629 646 49 -726 -509 -40 630 414 615 -67
4643 -67 -587 -352 -88 293 573 511 28 -405 -73 39 282 321 331 -226 -268 -160 66 215 416 228 -192 -79
4665 -79 197 -153 -203 298 -265 -105 69 74 -213 -424 304 -128 212 565 -27 154 -215 -290 -40 326 579 113
4687 113 136 -115 -206 -91 485 716 54 69 -104 -228 243 456 882 149 -271 -494 -419 -18 503 529 220 -288
4709 -288 -678 -571 335 978 667 84 -55 -490 -480 280 781 295 304 -522 -605 -285 316 396 648 223 -18 -433
4731 -433 -25 157 728 583 586 -314 -498 238 374 516 576 367 -276 -80 259 265 235 20 178 -162 53 156
4753 156 36 327 441 246 137 183 166 -42 76 58 21 166 310 -27 47 64 -151 7 310 488 175 -47
4775d7k97K3J40N15J17n21l04r0O5M74M44j31m48j09j98J72K84P47m80n16k14
4796c74j79M84K96M63l64j66n77M3K81N87m4m51M2o15l27P60N25J44m98n7m30
4817d57j65N36M51J81k68m25j1o37Q25N5K02L6k72o32L24K30L66K54j04n57m80
4838e48O95p5nPLj29J59M3k65j08N68k70k1K3J7J6l58M15m72L80J45K75m38k56
4862a99K10m33O24K69K06n68l33J08j2L25M35j07p47K90o00L47L02L85l90m00
4882b88j34q6J81N98N57o25k78m88J24K61P62J40n21l96l55J88K26N35L35n46
4902A90m09k3l34P14J16q5K54o25n61L32M41J57J55j24o45M3j69M23M10l97K39
4923A02m84k05L43L24j11J35j40l37j66M07M19m86J18Nj87o9r3M50j00j8M0j55
$$ plain form
4775 -47 -344 -321 -181 334 451 -70 -374 -464 -399 75 519 388 -60 -169 -367 -195 89 836 356 -160 -374
4796 -374 -553 -69 227 690 326 160 -417 -374 -93 494 450 -1 41 -574 -901 -141 384 528 30 -27 -457
4817 -457 -622 -86 365 546 278 -147 -158 -795 30 85 287 323 51 -581 -257 -27 339 593 489 -68 -548
4838 -548 147 72 67 74 77 -52 107 150 -115 -223 345 75 54 77 94 110 -248 167 -305 75 220 495 57 -199
4862 -199 11 -422 202 471 677 109 -224 -116 -128 197 632 525 -222 68 -532 -185 117 502 112 -288
4882 -288 -422 -508 -327 271 828 203 -75 -563 -439 -178 584 724 203 -193 -548 -360 -134 401 736 190
4902 190 -219 -242 -576 138 254 169 423 -202 -763 -431 10 167 322 198 -447 -404 -573 -150 260 -137 102
4923 102 -382 -587 -244 80 -31 104 -36 -373 -539 -132 287 -199 -81 -76 -263 -332 -425 25 -75 -93 -53 -208
4945b08L60j64q2P4k97J09J14M02j38n25p2J76o6M16K33r9p45K42J37kL62N53
4967G80m74m07k80N7o0R75O2o40o6k87M7L39M45J04n91l19j99l7N07M29j00l83
4989i8o2n41N30K94K20l03J25j59l63J14P95J41j49m89k03j70J61R4L88K5k41
5010A09k51k45M76L64k8l03J29k41l09M09K08j41J54n9l09K35J40n76K81r3J21
5031G1j02K88m04o2LN5j95M02J81j42k71k42J70M46k59L54n2o58L14j11j52Q84
5053E18j47o68j88J91j9K21N87l44j00k84n57L87O89J92j76k35k30l89L18M32
5073A98M12j47m89o10J60L25O37J81l71l86l80j25M55N07L33o22j51j80n4K52
5093e5K96j39j15m9l75K44j56O25j97r7R1n75J76L17J73J44J3k69m38M49np1J09
$$ plain form
4945 -208 152 -12 -94 -20 -317 -208 -94 308 170 -355 -427 -251 -317 99 332 233 -512 -270 -133 -135 227 780
4967 780 306 -101 -381 -324 -384 591 653 13 -53 -340 -293 46 491 595 4 -315 -514 -551 -44 385 285 -98
4989 -98 -160 -701 -171 123 343 40 165 6 -357 -243 552 693 544 55 -148 -318 -157 -63 325 350 109
5010 109 -142 -387 89 453 425 122 251 10 -299 110 318 177 331 272 -37 198 338 -238 43 -50 71
5031 71 -31 257 -147 -209 -206 -151 -346 56 237 95 -176 -418 -248 198 -61 293 241 -417 -103 -214 -366 518
5053 518 371 -297 -485 -294 -313 -92 495 151 51 -233 -790 -403 286 478 302 67 -163 -552 -234 198
5073 198 610 463 -26 -636 -476 -151 486 667 296 -90 -470 -595 -140 367 700 78 -73 -253 -307 -55
5093 -55 241 102 -13 -62 -437 -193 -349 276 79 -18 73 -502 -326 -9 164 308 321 52 -386 63 58 -13 96
5116I6L57n14K67M1q7j0j17K19q6J76j07pm17P3K33n7R9M33n63j73K2M55l32M26
5140D27j77m15J27j00J27K52L39l42l59l47L65N7M39p5k58k99k51L08J57L80K40
5161E95l01p19j34PN38M22k24j5n81l59L73N65J38K9l18n66L96j51K90N01q6l67
5183C3j67k92O0P16k09n1l0j91j23K94J52l8k26J18k60r8K76R8n2j74N4L7R6j98
5207a75J12K56k05j99J92j5K99k17n35L14K65j2L3j74m8k31L00J68oL60m01k58
5229a77j18j59M65K80P2k1m55j27K03K82J10j20r4o14Q8J95L72M34l15l09j08
5250a16k40J48M20O06k30n35k38M6J93J46M76n38k10r3k39M05M39K2j19j83k47
5271h7k21M04L17r4j38J4j55j13J40L24l16q4q2q2M4K28o4Q4l04K79J8l26L20
$$ plain form
5116 96 453 -61 206 247 160 150 33 252 166 342 235 228 -189 -116 117 60 159 592 29 -144 -122 333 1 427
5140 427 250 -165 -38 -138 -11 241 580 238 -121 -468 -103 -46 393 318 60 -239 -490 -182 -25 355 595
5161 595 294 -425 -559 -552 -14 408 184 169 -412 -771 -398 167 305 334 16 -550 -154 -305 -15 486 400 33
5183 33 -134 -426 -366 350 141 90 60 -131 -254 40 192 154 -72 46 -214 -312 -36 62 10 -164 -110 -73 23 -175
5207 -175 -63 193 -12 -211 -19 -34 265 48 -487 -173 92 80 113 -61 -109 -340 -40 128 122 482 81 -177
5229 -177 -295 -454 11 291 363 342 -113 -240 -37 245 355 235 141 -473 -385 -190 182 616 301 -8 -116
5250 -116 -356 -208 212 818 588 53 -185 -139 54 200 676 138 -72 -165 -404 1 440 462 343 160 -87
5271 -87 -308 96 413 319 181 195 40 -73 67 391 75 -9 -91 -173 -129 99 35 119 -185 94 112 -214 106
5294A06j66L54J5m59j6N8J54q1k01Q2L57l05K36o2m46J19J13J62M2J78k41k12
5316b13k73O94j63M77k49l95j44j39M16J09J34k2m57k66M33M8M43m8Jn14j56L83
5338I9k57L12nk4k35l79K26K74K51J95L6p90L5j90J96L45L51n69j49J85p5n2K65
5361D5M46m66l19K67l78L21M11N9o41K60m07r0N02K19J42J0r7n06K27J39J56l01
5383aK59j47q1j46L18k42l7j67L40j26O0P8n5k43J95K04pl05l0K12j8m13Q36l60
5407A24p4k06k05J57R9L27J88l34m24O8K57K82l43M24j51n91q4K36J04N78p4m91
5429a33j40j67L79R1K04m0k84j53J06j87K64M94K37r36k71O4L72J98L46m10J9
5450E3ok53j44L10J70Q8j35l81N3q8L4K46J03k66J48k18P7N21l53j56M8l4K9M9
$$ plain form
5294 106 -60 294 309 -150 -166 -108 46 -35 -236 -154 203 -102 134 72 -374 -255 -142 20 62 240 -1 -213
5316 -213 -486 208 45 522 273 -122 -266 -405 11 120 254 232 -225 -491 -58 -10 433 385 386 -128 -284 99
5338 99 -158 154 149 125 -110 -489 -263 11 262 457 493 -297 -262 -452 -256 89 440 -129 -278 -93 -168 -220 45
5361 45 491 25 -294 -27 -405 -84 327 386 -255 5 -402 -492 10 229 371 381 284 -222 5 144 300 -1
5383 -1 258 111 30 -116 202 -40 -77 -244 96 -30 30 108 53 -190 5 209 202 -103 -133 79 61 -352 484 124
5407 124 50 -156 -361 -204 -105 222 410 76 -348 -280 -23 259 -84 340 189 -402 -486 -250 -146 432 358 -133
5429 -133 -273 -440 -61 30 234 194 -90 -243 -137 -324 -60 434 671 -265 -536 -472 -100 98 444 34 53
5450 53 47 -206 -350 -40 130 218 83 -298 -245 -333 -299 -53 50 -216 -68 -286 -209 312 -41 -197 -149 -183 -154 -105
5474a05L3K23k59N15k46j13j85J82m03K75L41l84J55J27j38k49L76j31K77k14
5494G7k59R4k15L04L67k12J17k45k62K92k33L56J08j33Q2m07k39K51L31L35j89
5515C20j84n58j89P84L8J06r0n46l8L49J20P3L17l27j46l47L18j71N25M7j33l95
5537a27j56j73L58K54M09m87k61L2n4J56J41J53j12k19j2J46k98N35n9k60p0J40
5559C6j47J63J12k64J06L8j78J17L9R2J04l69J97m10L03J52j90k45L49j30L01
5580A76J33l09q6k76O16J54j71Q1k84j69j70K25M59j90m0l66q5J42J66rK38j05
5602A30m74j36L71K02j8K80L8o77j01p7Q6O30K25n06r3l29J64L53K21J81n04l1
5624f5j81Q5J02M11k55p3n9k85J72K5K28J84l83m2p1J76L5J29m0k55J63J51j43
$$ plain form
5474 -105 -72 151 -108 407 161 48 -137 45 -358 -83 258 -126 29 156 18 -231 145 14 291 77
5494 77 -182 -88 -303 1 368 156 273 28 -234 58 -175 181 289 156 238 -169 -408 -157 174 509 320
5515 320 136 -422 -611 173 211 317 227 -319 -357 -8 112 185 502 175 29 -318 0 -171 354 401 268 -127
5537 -127 -283 -456 -98 156 565 78 -183 -151 -205 -49 92 245 133 -86 -98 48 -250 285 226 -34 -104 36
5559 36 -111 52 164 -100 6 44 -134 -17 22 114 218 -151 46 -364 -61 91 -99 -344 5 -125 176
5580 176 309 0 -86 -362 254 408 237 318 34 -135 -305 -80 379 189 149 -217 -302 -160 6 -3 235 130
5602 130 -344 -480 -109 93 75 355 393 -284 -385 -462 -376 254 479 -27 -120 -449 -285 68 289 470 -34 -65
5624 -65 -246 -161 -59 352 97 24 -35 -320 -148 -123 105 289 -94 -136 -207 -31 4 133 93 -162 1 152 9
5647IJ3L43l43r9J47K74n11J32N3k40M59k33N8k90O04o21l1M07j10M76m38J05
5669A64n81K79Q0J60k39L30l96M6p2N04l08M05m33l39J19J44K53Q3K42m21k46
5690b26j22K97K33J67R6j36o42r7L63K44J49l8k94m0K8J7M7M35k35m14M0q9j36
5713c53K90J61R3j30k46N6o6P1N37m67j30r8M88l50K85K43j21m94J11N19j06l55
5735f2L47n15Q8K01M1Q0k15M14o65L55K05l75P3j86pj18L89kJ9j19oJ6l17O47
5759B88o2J24l82k0L2N3K11J24l60L79l66l75O37P1R1r8r6o06M7J85K74K12l26
5782C7m9M9m93L67K0N12m90k6k94J90Q8N2M71j67l43j15j04K36K95J30k48l68
5804b50j2qK92M0J80O4l55r5k9Q7K70l40K73l2j56k67M72L20m05L2j12J7j8p1
$$ plain form
5647 9 22 365 22 -77 70 344 -167 -35 18 -222 237 4 62 -228 376 -245 -276 131 21 497 59 164
5669 164 -417 -138 -58 102 -137 193 -203 -157 -229 275 -33 372 -61 -400 -281 -137 116 199 441 20 -226
5690 -226 -348 -51 182 349 445 309 -333 -430 -67 177 326 288 -6 -46 -18 -1 46 481 246 -168 -128 -217 -353
5713 -353 -63 98 191 61 -185 -129 -195 -124 413 -54 -184 -282 206 -144 141 384 263 -231 -120 399 293 -62
5735 -62 285 -230 -142 59 100 180 -35 379 -286 69 274 -101 -28 -214 -221 -339 50 48 67 -52 -58 -42 -359 288
5759 288 226 350 -32 -52 -20 33 244 368 8 387 21 -354 283 354 445 347 251 -355 -308 -123 151 363 37
5782 37 -12 37 -456 -89 -69 443 -47 -73 -367 -177 -89 -37 434 267 -76 -191 -295 -59 236 366 118 -250
5804 -250 -262 -270 22 62 242 306 -49 -144 -173 -86 184 -156 117 85 -71 -338 134 454 49 81 -31 -14 -32 -103
5828a03K8J45j26P6n5j95J83M8N0j70K72q4J3J02m07J58J77p6k35L6K20Qj60K84
5852A89K8Q5l67J13l69J66K16j74J0L57l63m52N58L51j41k03R5k34k86K69M21
5873B69j99K23l30r4j73O25l79M29j77j48r9q7J03K7O4J46r3j68m53L47K81P1
5895A85m7R7k96n56O62J97j26J26P1o32L76j50L47j74J41l60N7k7k05M15P2m94
5917c21K18l0L0J85k1Q1j25j16KQ7J08k47M8L03j75l2K1Q1J74k92o3N7J57r2k9
5942Ij64k59L61K66o2Jm35k31K8L14N73k41J1k93k1j79J08J31J34M6Qm07M6L57
5966A01K00j12j15j27l04K67K6L6L20l70j22k68Q5M16j86K25q0km03M10J74j88
5988a7J1j45k6J7R8J82K88n90K67n4k71L7L86k44K10k0J3l48L42j65L72l37k5
$$ plain form
5828 -103 -75 70 -56 20 -35 -230 -47 1 51 -119 153 69 82 184 -223 -65 112 36 -199 -163 57 65 -95 189
5852 189 217 302 -65 48 -321 -155 61 -113 -103 254 -109 -561 -3 348 207 4 99 -135 -421 -152 269
5873 269 70 293 -37 -131 -304 321 -58 371 194 46 -53 -140 -37 -10 54 200 107 -61 -514 -167 114 185
5895 185 138 235 -61 -617 45 242 116 242 313 -319 57 -93 254 80 221 -139 -82 -109 -314 101 173 -321
5917 -321 -103 -133 -103 82 61 142 17 -99 -97 -10 98 -149 -101 202 27 -5 16 97 271 -21 -84 -27 130 38 9
5942 9 -155 -414 -53 213 151 152 -283 -514 -486 -172 401 160 171 -122 -143 -322 -214 -83 51 97 105 -302 -256 101
5966 101 301 189 74 -53 -357 -90 -64 -28 292 -78 -200 -468 -383 33 -153 72 -8 -10 -413 -3 171 -17
5988 -17 -6 -151 -177 -160 -62 120 408 -182 85 31 -240 -203 183 -61 149 129 142 -206 136 -29 343 6 -19
6011a9K67l80n9J44J48oj01K53k2o3l88J84M20k69Qk04N1J92j89k52K81L50k11
6034A35k0k10%QK34L78l44j0n1k90l7L79j56Qk29M23m88k94N10L70l44n3j0j17
6058b08J81K13J94m8m66m0Q3p9K02K53k75K66m29l53M62k0M16p2j28m69O3J39
6080a15J59l79O22Q8l78k60L06j14lK77j13j32m4N7J67k44L51k59j51K99j33k38
6102b37K59Qk19P1R1K38m9q8l33J31j29M73l73O3k9j69M79k45K62j33j56O9l25
6125c41M33J57o8l92j24K97j53L54J33k20p9M1k12O6M05j30J17m3n26j4O55j60
6147A96m1L6j62k01k42Q4O44k67l0k0j25JL09l57L23K05l06l4j57R0J9J29Q1k54
6171g9O0k37L66J41o7O3m59R1q6L27l28K19J87j77L2o6m9J89k56j84J94k09J54
$$ plain form
6011 -19 248 -132 -191 -47 101 95 -6 247 225 162 -226 -42 378 109 117 -87 -36 156 -33 -285 -4 346 135
6034 135 115 -95 -95 -87 147 525 181 171 120 -170 -207 172 16 24 -205 218 -270 -564 -54 316 -28 -81 -91 -208
6058 -208 -27 186 380 332 -134 -174 -91 -170 32 285 10 276 -153 -506 -44 -64 352 280 152 -317 -254 -115
6080 -115 44 -335 287 375 -3 -263 43 -71 -74 203 90 -42 -86 -29 138 -106 245 -14 -165 134 1 -237
6102 -237 22 30 -189 -118 -27 211 162 74 -259 -128 -257 216 -157 -94 -123 -292 187 -58 204 71 -85 -16 -341
6125 -341 92 249 181 -211 -335 -38 -191 163 296 76 -3 38 -174 -108 297 167 284 241 -285 -299 356 196
6147 196 155 191 29 -172 -414 -330 314 47 17 -3 -128 -127 182 -175 148 353 47 13 -144 -54 -35 94 175 -79
6171 -79 -19 -256 110 251 184 247 -212 -121 -207 120 -208 11 198 21 53 -13 -62 127 -129 -313 -119 -328 -174
6194a74L1L48l49L78j22n7j4l06L42k94K06J58k33k8j62K25nN1J92m6j72J3k19
6217b37J7J17K99J70j55l37r0R2J70J32k7k1k71O6j51O3J48K15j20j9l13J83M21
6240C52k71J45j14m7l53KL34K11J77m70R8n69M28L13J55j70j74j98j13L32j90
6261a22M79k30k04k02J85L30p1l28N1M26p92N16J07j59N8J25j74n0J28J23L40
6282E36l98R8m06R4j16J23J03J20L7L6l13R6J18l00J19K33j13K52j16k00k7J06
6304H2k25L6J86Pj29K12k01q8J82J05K92m80j7j88K33R2j6J48m19m1j18J27K97
6327G7J72j28j8k6p0jJ05j30J74j0k06l11K71J23K1j54K96l04j2K44o1J09r3J24
6351A92m24J75L18n04M0J21L74K7m98K48L2n8r1L8j88K87j74Q9k11K77j89RN1
$$ plain form
6194 -174 -143 205 -144 234 112 55 41 -265 77 -217 -11 147 -86 -114 -276 -51 -56 -5 187 141 -31 -18 -237
6217 -237 -220 -103 196 366 211 -126 -216 -124 46 178 151 130 -141 -75 -226 -163 -15 200 80 61 -252 -69 352
6240 352 81 226 112 65 -288 -286 48 259 436 -34 64 -505 -77 236 391 221 47 -151 -264 68 -122
6261 -122 357 127 -77 -279 -94 236 165 -163 -112 314 -478 38 145 -14 44 169 -5 -55 73 196 536
6282 536 138 236 -170 -76 -192 -69 34 154 191 227 -86 10 128 -172 -53 180 67 319 203 3 -24 82
6304 82 -143 -107 79 86 -43 169 -32 -120 62 167 459 -21 -38 -226 7 99 83 231 -188 -229 -347 -220 77
6327 77 249 121 103 77 7 6 111 -19 155 145 -61 -372 -101 22 43 -111 185 -119 -131 113 52 161 68 192
6351 192 -232 -57 261 -243 -203 -82 292 319 -179 69 101 43 -48 -10 -198 89 -85 4 -207 70 -119 -110 -59
6374e9K4j9L0J77J65k17P1J8ll45J91N7J05K1K8j85k0J41k41L02p0k79l91N11
6398A2k39N84k28m54N55k58l89M34K9L46j64k90oK51k57O48m18o1J9m48K63j77
6420b48M32k4p5J00k72n7l1K47J34l87J4R5k15K53Q9j5j17l6J06j89J40O0K20
6443B24q0n16K67o7K06K43m72r5p9J35L99k53R6l2j28P5K0J69ol35J74k07L27
6466F5J89q1q6r1Qj04k07J76K5P8L3k36K09j48J70m0l82K94J56k54J66K95l76
6489a41J50j78k1J00K71M4k71M8P2l04J80M91k73j10j12j42J94j30K85k71n8K42
6511F6j43j0p8N63k37k62K98l85J54K99O7j32j34q8m01K84L04J0j13p1L7k47K31
6534A2l4J30P4l23p7K98M79n30K01j19j86J16r5j68M44j10j97N1K6k14M71l76
$$ plain form
6374 -59 -35 -54 -24 153 318 101 172 190 187 -158 33 90 195 216 244 59 39 180 -61 241 171 -108 -499 12
6398 12 -227 357 129 -325 230 -28 -417 17 46 392 228 -62 -68 183 -74 574 156 95 114 -334 -71 -248
6420 -248 184 160 85 185 -87 -144 -175 72 206 -181 -167 -72 -287 -34 55 40 -77 -113 -7 -196 -56 4 224
6443 224 144 -372 -105 -172 34 277 -195 -290 -369 -234 165 -88 8 -24 -152 -77 -57 112 106 -229 -55 -262 65
6466 65 254 173 87 -4 4 -100 -307 -131 -106 -28 5 -231 -22 -170 0 -40 -422 -128 28 -226 -60 235 -141
6489 -141 9 -169 -190 -90 181 225 -46 2 74 -230 -50 441 168 58 -54 -196 -2 -132 153 -118 -176 66
6511 66 -77 -87 -165 398 161 -101 197 -188 -34 265 332 200 66 -22 -423 -139 165 175 62 -9 28 -219 12
6534 12 -22 108 182 -141 -218 80 559 29 230 111 -75 41 -54 -222 222 112 -85 -34 -8 -222 249 -127
6556a27j00Q2R8j93L17n5j44J43j1J88l35K57J45l02j04K73j71R3P9k79K99k48
6578i5M9J0J08r7k1J41j74N9J31K99j75l86j40J96J17J6O15n32l96l4J08K48L70
6601D17j10J3n00mo4J14K78J60j05j65j38R8j28L53m07o5L09j46K6J9K52k81K39
6624A65k82j58K57Q7j77R1J93l49pm2L95j20J24j54L01m75K59j87M17n22K93j82
6646g3K06j97M0J01m1k77K30M14l64K75k82j45N0K06L82o3m77j21J09J62q2O2
6668A15N18p10K06l46K71j4M6J10l95K43j19L41k28K32m2k33J49r0n1K13K8l24
6690h0o0Pj48M11Q2k0k35M5k3p6J26J99K13n20J0j50M3L7R9LJ19k61j00Q8K01
6715A0J00M2j99M4j13j05J32j10R9m2J97k47L9Q3l2r2K5K7R7J05q0K46l02L6l3
$$ plain form
6556 -127 -227 -145 -47 -240 77 22 -122 21 10 198 -137 120 265 -37 -141 132 -39 54 133 -146 153 -95
6578 -95 -46 -36 72 -25 -46 95 -79 -20 111 410 235 -151 -291 -95 22 38 653 121 -275 -309 -201 47 417
6601 417 307 320 -180 -184 -248 -134 144 304 199 34 -104 -6 -134 219 -188 -253 56 -90 -64 -45 207 -74 165
6624 165 -117 -275 -18 69 -108 -17 176 -173 -180 -222 173 53 177 23 324 -151 108 -79 338 -184 109 -73
6646 -73 133 -64 -24 77 36 -241 -11 403 39 314 32 -113 -63 143 525 462 -15 -136 -27 135 53 115
6668 115 633 -77 129 -217 54 40 86 196 -199 44 -75 266 38 270 228 -5 144 54 3 216 244 -80
6690 -80 -140 -133 -281 130 212 192 -43 2 -21 -97 29 228 441 -79 -69 -219 -176 -139 -40 -37 82 -179 -279 -191 10
6715 10 110 152 -47 -3 -116 -221 -89 -199 -100 -142 55 -192 -153 -70 -102 -194 -169 -142 -45 60 -20 226 -76 -40 -73
6740g3L7J28l54J55k48J74K00Q9m66L76l34J67O1n9K98q6l44J3M8J62J39K41j74
6763A50k8j85K87K3j71J32k00j51J52ll9K85j65Q6j68l21n3O21j67k00K64k25
6785g6m9l06M48K75j45j44M0j24k14M14K69k38Kj0j63r1L65j14K0j9j10O6j92
6808i6L32q8K53n85L51l40M28k76K46j57M2N2j86L9j30J84o4l8o8q0K46k17J21
6831c1J17J19Ol43J17J47J76k05j6j2j71N8J6p4r5L15j35K29l03j05k53K19J4
6854b10N28k96k4j21J95l32L41J90l92q6K06j38j54M80j7j72j34Q1j29PM15jl90
6877a53k06L97m06K83K89l81J93K7J52j66k66L17L17m81O6m2M07j36J81m94j80
6898b82L60j84j57P4J12k9o9L1J7J35J33k22M3L00n16L92qn5j15J2J56Q7k03n4
$$ plain form
6740 -73 -36 92 -262 -107 -355 -181 19 108 -358 18 -316 -149 -88 -147 151 65 -279 -266 -218 -56 83 324 150
6763 150 122 -63 224 247 76 208 8 -143 9 6 -33 252 87 173 5 -316 -369 252 85 -115 149 -76
6785 -76 -125 -431 17 292 147 3 43 -81 -295 119 388 150 152 142 -21 -112 253 139 159 140 30 96 -96
6808 -96 236 148 401 -184 167 -173 255 -21 225 68 110 162 -24 15 -115 69 5 -33 -101 -181 65 -152 -31
6831 -31 86 205 211 -132 -15 132 308 103 87 75 -96 -38 -22 -96 -191 124 -11 218 -85 -190 -443 -224 -210
6854 -210 318 22 -2 -123 72 -260 81 271 -121 -207 -1 -139 -293 187 170 -2 -136 -55 -184 -177 238 237 -153
6877 -153 -359 38 -368 -85 204 -177 16 43 195 29 -237 80 397 -84 -18 -60 347 211 392 -102 -282
6898 -282 78 -106 -263 -189 -77 -106 -175 -144 -127 8 141 -81 -38 262 -254 138 130 75 -40 -28 128 215 12 -42
6922d2k96N16j90K34q9K19J04p82J62j08L16J57l00L08l19%J43j69L34j09l16
6943b27K80J09j81k8J72O8l15K23k03J85Jr2J36r2k88J51j47K11J31L6k25J59
6965F4k6k6qK63j16o3j86k12L54j16R8N7j35J36K7l69L47k61QK72k27O5L6K00
6989A82L4j91r0N4k19K68P9m04K27L5l0j08JM51k98N4L6Q2l38J79j34L14k50J36
7013G0j68K03N8q9k06K21j98K86m05K69m4j8K6J64J30J18P4p23P0J25K75P9Q6
7036D03k57k12K19k48M17Q7n18R9m2J73p1K8K31j63n20J13J34j4O4M04J2m15j73
7059b49K1J77k4L79K0k86l7j19j03K99R7j14j52J11j99j2N30j96j77K74j02r2
7081D6j1Q1J68l23l1l7Pj07K49k00L9P3K60q8k66K21m6L42k32r1J6L5q2j42m4
$$ plain form
6922 -42 -338 178 -12 222 133 352 456 -326 -164 -272 44 201 -99 209 -110 -110 33 -136 198 89 -227
6943 -227 53 162 -19 -47 125 193 -122 101 -102 83 84 -8 128 36 -252 -101 -248 -37 94 130 -95 64
6965 64 38 12 4 267 151 88 -98 -310 44 -72 26 83 -52 84 111 -258 89 -172 -164 108 -119 -54 -18 182
6989 182 216 25 -65 -11 -230 38 117 -287 -60 -25 -55 -163 -162 289 -9 45 81 163 -175 4 -130 184 -66 70
7013 70 -98 105 163 74 -132 89 -109 177 -228 41 -3 -21 5 169 299 417 491 -232 -162 -37 238 317 403
7036 403 146 -66 153 -95 322 409 -109 -10 -52 121 50 78 309 146 -374 -261 -127 -141 -77 327 339 -76 -249
7059 -249 -228 -51 -75 304 324 38 1 -118 -221 78 175 61 -91 20 -179 -191 339 143 -34 240 138 46
7081 46 35 116 284 -39 -70 -107 -100 -207 42 -158 -119 -46 214 126 -140 81 35 377 145 54 70 105 23 -119 -163
7106a63K05o7J60k43J27Q8m60O85j61j84k18J11j40K09Ln1P6j7L2j02K75l13K28
7129H0j04J67l47Q9M0J92R9j87n5R0k02r7J97M00o05K22J34j99j41J43L74n35
7151b45J40k62N50l32L10L3o9j9k90L5J10J18j50L5L35k76j87K79j30r4J51k10
7173a68R6K12l35J99q6J93j67r1J42L57m14J14j54K76j58Q6P0j60k46J15O24k51
7195B54P0l90j95L51j51n0J40K58k92k87J46J25J25k18J92l50L49j53p5J92K02
7216B43o4k45j47L32N3J41L5m20j43J96k6J2J05J21l56N43o50J45M7J64mk56K75
7239A01j19nJ4qM2P9o7k91O9LJ19J9m0K12R1k78j71P4J27M32m67N9m6L16K9l73
7265g9J45k07l7K09J94l76o5M15m3k59qM3J49k95K71J23j66N2rk00o1K67j16O
$$ plain form
7106 -163 42 -25 135 -108 19 107 -353 332 171 -13 -231 -120 -260 -51 -48 -99 -23 -40 -8 -110 165 -148 80
7129 80 -24 143 -204 -115 -75 117 216 29 -26 64 -138 -235 -38 362 -243 -21 113 -86 -227 -84 290 -245
7151 -245 -105 -367 183 -149 161 194 125 106 -184 -149 -39 79 -71 -36 299 23 -164 115 -15 -109 42 -168
7173 -168 -72 140 -195 4 -82 111 -56 -147 -5 352 -62 52 -102 174 16 102 172 12 -234 -119 505 254
7195 254 324 -66 -261 90 -61 -111 29 287 -5 -292 -146 -21 104 -114 78 -272 77 -76 -151 41 243
7216 243 179 -66 -213 119 172 313 348 -72 -215 -19 -45 -33 72 193 -163 380 -270 -125 -78 86 82 -174 101
7239 101 -18 -23 -9 -17 25 104 37 -254 -185 -182 -63 -44 -84 128 219 -59 -230 -156 -29 403 -64 -5 -51 265 294 -79
7265 -79 66 -141 -178 31 225 -151 -216 199 156 -103 -111 -68 81 -214 57 180 14 66 57 -143 -204 63 -53 -47
7289d7l1J61n5k37K8K77j71R4j10J71J01q2K78m71N3K2j38J76l0P7J84k65or2
7313a13L77j08J33k51J20j16k07K70m5l0K2O5k00j23n1K51K00j67Q5q0J37m11
7335b42L08p3l06L8L00k6l4j38J81k86L82p8m53M53J38k36j5M0n3J30k05L04k42
7358a13J30K91o56L28K67k43K59l7k65J41k0q1L6J97k28j1j54J49k50R3M1J6K20
7381A10j59P1Rr6k43J83K16o2j23Oj50m7K07p2L3M40l97J30m2J85K10j35l53O7
7405a2k26J56K64j84K63k45j09j14K19P3LK62k00j79j19J71j33QK11o2o6J97k30
7428e2Q1J78j29k5k00o6L49j39R7K51n55L24m6p9K60j12l17k52M96J01k37J64
7450I2j45L14j84Q4k11r5L61k84J33l38K21J2K56p7k32k97M85K3m9j4j44L4k9
$$ plain form
7289 -47 -78 83 28 -209 -181 96 -75 19 -91 80 181 99 377 -94 -41 -19 -157 19 -11 66 250 -15 -21 -113
7313 -113 264 156 289 38 158 42 -165 105 60 30 52 117 -83 -206 -257 -6 194 27 112 32 169 -242
7335 -242 66 -7 -313 -275 25 -1 -35 -173 8 -278 104 26 -427 26 164 -72 -87 -47 -100 30 -175 129 -113
7358 -113 17 308 -348 -20 247 4 263 226 -39 102 82 1 37 234 6 -5 -159 -10 -260 -167 -126 -110 110
7381 110 -49 22 31 -65 -308 -125 91 29 -94 -88 -238 -285 -78 -150 -117 323 -74 56 14 199 409 274 -79 -12
7405 -12 -238 -82 182 -2 261 16 -93 -207 12 85 88 350 150 -29 -148 23 -110 -102 109 47 -19 178 -52
7428 -52 29 207 78 53 -147 -213 136 -3 94 345 -210 114 68 -11 249 137 -180 -432 64 165 -72 92
7450 92 -53 261 77 161 -50 -145 216 -68 65 -273 -52 -40 216 139 -93 -390 95 118 69 55 -89 -55 -84
7473h4M06l48k3M57m44k8p1L22K1j56p1j03k96L64k82L35Lo7K04o32O14p5r1O9
7497B4o8j9n5J27J14O0j12k2k71J94L29k32p6N1j67P3q9J02J88j60q0k61J43o2
7521b69L57j52r5J72o7R8j1j58O3J27k2N5l95L40j2J86l37n0J36k7K28k58J04
7544A3J0l6j32P3j8KN9K73m0k52M1K44l97K70j22k85M50j96J52J89k49J1p8L29
7568C11j49k61P9J40j5j47J22R2J35k52k40J09M38k46q3K88m27j33M8J50m8K78
7590A89k06j34L9k44P9K77K8P8j83m7j60L35j01q5L19l71K50k1K25Ok20R4J89
7613C36n18Q0K70j46J45m01L41j42l72N05l15K2J49K81k16k70K99r0M23p60L69
7634a0K16l16J89j92L2J96l6M3j74k59K25k63N37k93J99J38j75j78M95m06R3L68
$$ plain form
7473 -84 322 -26 -49 408 -36 -64 -135 187 208 52 -19 -122 -418 -54 -336 -1 2 -65 139 -493 121 46 -45 24
7497 24 -44 -63 -118 9 123 183 71 49 -222 -28 301 69 -7 44 -123 -50 -139 -37 151 -9 -89 -350 -207 -269
7521 -269 88 -64 -159 13 -54 44 33 -125 -62 65 43 98 -297 43 31 217 -120 -170 -34 -61 167 -91 13
7544 13 23 -13 -145 -72 -90 -88 -29 244 204 -48 -7 237 -160 110 -12 -297 153 -43 109 298 49 60 -18 311
7568 311 162 -99 -20 120 105 -42 80 172 307 55 -185 -76 362 116 33 321 -106 -239 -191 -41 -89 189
7590 189 -17 -151 -112 -356 -277 0 28 106 -77 -124 -284 51 -50 -135 184 -187 63 42 267 273 53 147 336
7613 336 -182 -102 168 22 167 -234 107 -35 -407 98 -217 -195 -46 235 19 -251 48 -42 381 -379 -10
7634 -10 206 -110 79 -113 -81 115 79 122 -52 -311 -86 -349 188 -105 94 232 57 -121 374 -32 61 429
7656D29n37L17l95L55l6k3J46l01j76J14J3O2lJ29j92R2j4j00K05L2p0k36L15
7679A26j10N0n8M8k39L41j52Qj2j59J44O1j12p4L70j21j92K35r6k91K81j27J13
7702C4R6n9L8J79j78k68L53k83K73P2j22r4m6J56l07J37ml26L71R0j18p0J74J70
7726B68n42N06l35j32M33l28L15r8O5k5j80K37k80N9M0j2k29J45J9k79q2M05N3
7749B3K53p6l16l5N3M6MQ6rl15Q0R1m2L34k52O0j76L14j67J34j78J58Qk95J35
7774h2O9j12J70j58K4n3j55K63Jj46M4K71k14k00L02p2Q3k34N6k03J86N6K67O3
7798B26j48q9ML8J94k21q2l9K43j7m32L66j3j02K59N9j40k56j42L20K0m2J35j20
7822B1j51J43j25M22l02L6O5r5L9j37j56J34M41r9k74R6N0j60k7K21p7O4m06J60
$$ plain form
7656 429 -108 209 -186 169 133 110 256 -45 -221 -107 -94 -32 -35 94 -98 -6 -20 -120 85 117 47 -189 126
7679 126 16 66 8 56 -183 158 6 14 2 -157 -13 48 -64 -138 232 111 -81 154 58 -233 48 -79 34
7702 34 130 71 109 288 110 -158 195 -88 185 257 135 41 -5 151 -156 -19 -23 -349 22 112 -6 -76 98 268
7726 268 -274 232 -103 -235 198 -130 185 87 152 127 -53 184 -96 -37 3 -9 -238 -93 -74 -353 -435 -30 23
7749 23 276 200 -116 -151 -98 -52 -48 38 29 -286 -206 -115 -157 177 -75 -15 -191 123 -44 90 -88 70 78 -217 -82
7774 -82 -13 -125 45 -113 -89 -142 -297 -34 -33 -179 -135 136 -78 -278 24 -48 35 -199 -143 -346 -160 -104 163 226
7798 226 78 -11 -7 31 225 4 -78 -117 126 109 -323 43 30 -72 187 246 106 -150 -292 28 48 6 141 21
7822 21 -130 13 -112 310 8 44 109 14 53 -84 -240 -106 335 236 -38 58 108 -52 -79 142 65 129 -277 -117
7846a17K81j55M1K2j51j45L08j00J64j89J45p2Q2k69K99j51o6J12q4l56J78J06
7868a17J61k3O1j7k59L07k64K18K12k47N1J62m18P7M63j56k85J2k12K07N4p3J3
7891g3K84k01O4J53m35J72P8J81l62J36P2j28K54l33lR6K27j98n2n1j37L69m50
7914c37K39k0lr7K81jo1j29LL14k35M0J24m38O29qk18j61j80K66p9J70L4j41k63
7939b71L20k61L14j96J3Mj59M5J15K28q4j49l4q7M78k08J1j58K72k68N4J17Mk60
7963a60L33o9L3k06J18Jp0P3J09k66L41l04q0K80j47N4k29K71j15N6k0J55k19
7986f1K66k12Q9K1J0r3K37r6N0k69J89%n2j50J37J80j36j1j44j17L2J08j6P3J88
8011B23l44k39M07J25Qm55K63j8M1N8o7m4j3M80m20m54L16l5P8K73k97k23L47
$$ plain form
7846 -117 164 9 50 72 -79 -224 84 -16 148 -41 104 32 114 -155 144 -7 -73 39 -45 -401 -223 -117
7868 -117 44 21 82 65 -194 113 -151 67 279 32 83 245 -173 -96 367 211 -74 -62 -274 -67 -13 -86 -73
7891 -73 211 10 74 227 -208 -36 42 223 -139 -3 69 -59 195 -138 -141 -45 182 -16 -68 -119 -256 113 -337
7914 -337 -98 -118 -121 -218 63 62 1 -128 -125 189 -46 -6 118 -320 309 301 83 -78 -258 8 -71 99 133 -8 -271
7939 -271 49 -212 102 -94 -81 -77 -236 -191 -76 152 68 -81 -115 -202 276 68 79 -79 193 -75 -21 96 100 -160
7963 -160 173 104 137 -69 49 50 -20 53 162 -104 237 -67 -147 133 -14 40 -189 82 -33 23 3 158 -61
7986 -61 205 -7 82 103 113 20 257 161 211 -58 131 131 79 -71 66 246 110 99 -45 -162 -130 -22 -38 35 223
8011 223 -121 -360 47 172 180 -275 -12 -30 11 69 2 -42 -55 425 5 -449 -133 -168 -90 183 -114 -337 10
8034A0k33L02L29m58J71j43l34L55K9K7j10K3J12k25J02K46m06J08K1J29j83m5
8056a73K37Q4j86L16m21L96j53p8L6K9m0n6J55m16L37L46l54l4K0j29L95p3n7
8079A81k11J5R3j48J48k7%j88M6M54j01l24J8k23L43O2L12o24J82k6L07l59M4
8102b6J45r0j12L77R9k30M06n64J03l3j05m4M7K60J11n58J29L0j9L45j87j14L76
8125C46l09j47m6K62k18j87M91l25K3K12l6p8j14J92k30J34m2K96j41j84J07j64
8147a58Q1j11J20J89k00JP6M16j46l34K42k86J23N5k40o0M8K70k02k0L64l19Q9
8170bj42M4K29k78P1K91n7k06j08L6J05PM9j01K9J03j21K76j98K88k74
$$ plain form
8034 10 -223 79 408 -50 121 -22 -356 -1 28 55 -55 -32 80 -145 -43 203 -203 -95 -74 55 -128 -173
8056 -173 64 148 -38 278 -143 253 100 22 58 87 47 -9 146 -270 67 413 59 25 45 -84 311 238 181
8079 181 -30 -15 78 -70 78 51 51 -137 -91 363 262 -62 -44 -267 76 138 450 -174 8 -18 289 -70 -26
8102 -26 119 29 -83 294 393 163 569 5 108 75 -30 -74 -27 233 344 -214 -85 -55 -74 271 84 -30 346
8125 346 37 -110 -156 106 -112 -299 192 -133 -110 102 66 -12 -126 66 -164 -30 -72 224 83 -101 6 -158
8147 -158 -77 -188 -68 121 -79 -78 -2 414 268 -66 176 -110 13 68 -172 -232 -184 86 -116 -136 228 -91 -2
8170 -2 -144 -100 129 -149 -78 213 156 -50 -158 -122 -17 -10 39 -62 -33 70 -51 225 27 315 41
8191D1
$$ Imaginary data points
##PAGE= N=2
##DATA TABLE= (X++(I..I)), XYDATA
0@%%%%%%Qj6J6j9K7l2M0n6O8p9R4j15J37j61J92k24K57k97L44l93M45n04N73o50
30c45P33q24R24j033J154j286J432j593J768j960K170k403K661k947L264l620
46a905M021m474M995n596O300p142Q170r454J1111j3346J6548k1545L0504n1558
60c3371J90481J47941l04774n8329Q9332N3649p0360L7736P6291j6251j25299
71a2954m7662M0417O2856L0262K9011l1186r8467o1042P9181R0810j6467m7726
83A7033L4698K6029n7594n3843M5838O8223l089o0802l7306K1183L7669l715j8872
96A5452J4306J8557k6230k7283J2732J3641j1465K422K2889J30k1171L133K5200
109D2313k855l6122p523M2575J4981n8649l9279M6777L9576l5803j7953M5765
$$ plain form
0 0 0 0 0 0 0 0 8 -8 8 -11 16 -16 24 -32 36 -43 51 -64 73 -88 104 -120 137 -160 184 -209 236 -268 305 -345
30 -345 388 -436 488 -545 609 -677 755 -838 930 -1030 1140 -1263 1398 -1549 1715 -1905
46 -1905 2116 -2358 2637 -2959 3341 -3801 4369 -5085 6026 -7320 9228 -12317 18187 -33371
60 -33371 157110 305051 277 -58052 31280 84929 14569 52305 128596 112345 -12954
71 -12954 -60616 -20199 42657 72919 101930 70744 -27723 -88765 -9584 81226 64759 17033
83 17033 51731 77760 20166 -33677 12161 80384 77295 16493 -20813 370 38039 34324 15452
96 15452 29758 48315 22085 -5198 7534 21175 9710 12132 35021 35151 13980 17113 42313
109 42313 39458 3336 -4187 38388 53369 -5280 -44559 2218 41794 5991 -11962 33803
121C3803l16p4199k6585N8175M1039j5554j3501J233k2824k4551K9420O4542J5377
134F6059n1876m2136K472l875j2171M6511P3411j7923r9224m8125L5329M0140
146a1408J2193R212q39l2947m6188j3991M0199O3877K6502k5012l8759l2767j6934
159f6862L1294O9211K7568m0182l8268L864Q606m656J4813L6664Q809m8690n6685
172e4514P909N5890K1941k0280m688M893k7708k2398K9202K9062j8441j7239J4784
185a587J533k2374L116L4764J2009l0878k5985J6160K1585j8816k5485J9133K8783
198A1958j3031j9114J7526J1343k4718j2813K3793J7071q617o832K621l773n733
211a0319J0091K7495J8349k1083m0550r094K0777R955L718K1284M088m1247l7385
$$ plain form
121 33803 33487 -40712 -67297 -9122 31917 16363 2862 4095 -18729 -43280 -13860 50682 66059
134 66059 14183 -27953 -25481 -29356 -41527 4984 78395 60472 -38752 -86877 -51548 -11408
146 -11408 785 9997 9158 -23789 -69977 -83968 -43769 20108 46610 21598 -17161 -49928 -66862
159 -66862 -35568 33643 61211 21029 -17239 -13375 -4769 -9425 5388 42052 50861 2171 -54514
172 -54514 -46605 9285 31226 10946 6258 11151 -16557 -38955 -9753 19309 868 -16371 -1587
185 -1587 -54 -22428 -19312 15452 27461 -3417 -29402 -13242 8343 -10473 -35958 -16825 11958
198 11958 -1073 -20187 -2661 8682 -16036 -28849 -5056 12015 3398 -3434 -813 -4586 -10319
211 -10319 -228 27267 45616 24533 -16017 -25111 -4334 5621 9339 30623 34711 -6536 -43921
224d3921J4959L9984J8708o934j6445j9498k1893p801L2266N4608J3181m1900
236A5314l4530n96K333R207M1683K9298l4597n4103p626K5706J8688J2626J4936
249C8339n705m0600m0731Q061M8333K5317j6926j5011k409j8596j4658K8945L8020
262C2379o902k8988q184K223l247P000K2026J2401j4346k4377m595J8718Q448
275A2556j2552j555J5729k626j9654L357J9213k511j5034M083J3223k05j0009
288D015n072L443K594k311N027J6536j091l0697j5872K0291J5531o207L735R597
302A9519j9272l0433N169L3582J7850q342j6656j1222q452l828J7133L6504J1471
315D3023l3771l3183M752J4783P033K0180J9137k2324m3782j0233K5625K6452
$$ plain form
224 -43921 -28962 11022 29730 22796 6351 -13147 -35040 -42841 -10575 44033 57214 15314
236 15314 -19216 -19812 -17479 -8272 33411 62709 28112 -25991 -33617 -7911 10777 23403 38339
249 38339 32634 -7966 -48697 -40636 7697 33014 16088 1077 -1332 -19928 -34586 -5641 32379
262 32379 25477 -3511 -11695 -9472 -12719 -5719 16307 28708 14362 -10015 -14610 4108 12556
275 12556 4 -1551 14178 11552 -8102 -4745 14468 11957 -3077 1006 14229 14024 4015
288 4015 -1057 2386 4980 2669 7696 24232 23141 -7556 -23428 -3137 12394 6187 9922 19519
302 19519 247 -30186 -25017 8565 26415 18073 1417 -9805 -18257 -22085 -4952 31552 43023
315 43023 9252 -23931 -19179 -4396 2637 22817 41954 19630 -24152 -34385 -8760 17692
327A7692J0194k135j3656k5162k2225O602L9439K8773j6071l2323r221n2j626
340a9771J9203L1729j080l4646k2738M468J5196J4338J0605J842j2160k3765j1375
353b8154K0116K5730l738j5460R42q44j6430O08K5869J0651j7364j2795M925M043
367a901l731j197O133N271o567r226P811J0077j1339j3889J2226J4608q984p720
381h428Q330j895j7224k53K0683J3406p515j6142r052K056L638O117J6771R933
395B0425k1875k9912L085K3977J0560M313P432j2578l0434j0398K3719K9252Q330
408B5896j1992j8623j3463o380O437K7833K5985j2690l8001j5275J0867R664J3213
421C471K1549j015l2690k6151P106K4480J8047M156p008j3506j7953q946J8432
$$ plain form
327 17692 27886 25751 12095 -13067 -35292 -28690 10749 39522 23451 -8872 -18093 -18145 -19771
340 -19771 -568 31161 30081 -4565 -27303 -22835 -7639 6699 17304 19146 6986 -16779 -28154
353 -28154 -8038 17692 13954 -1506 -564 -1408 -17838 -17230 8639 19290 1926 -10869 -5944 -1901
367 -1901 -5632 -6829 -696 4575 -1992 -11218 -3407 6670 -4669 -18558 -6332 8276 -708 -8428
381 -8428 -98 -1993 -19217 -19470 1213 14619 7104 -9038 -18090 -16034 -12396 -6279 10492 20425
395 20425 -1450 -31362 -28277 -4300 6260 10573 18005 5427 -25007 -35405 -11686 17566 25896
408 25896 13904 -4719 -18182 -24562 -18125 9708 35693 23003 -14998 -30273 -19406 -9742 3471
421 3471 25020 24005 -8685 -34836 -27730 -3250 14797 18953 11945 -1561 -19514 -28460 -10028
434a0028L2900N023k2651j3357m7m303K538K2086J4278j5272k1069l545P773P136
448A462M084M221K033q383j3942J410J8079L879j3231p5J1711m360j1493N405
462H00R223o308p345O575R438l010j1803p126N457O425l64L694R064q861k3110
477a7251o84K3765J0851m825p75l168j6410q894J6274K3569O771j4269j9584p828
491a2458L541O467J3312J6989q244l2723j6142J4802J6434P807P613l066k3574
504i242k0390O993K6159J8781j003j4579j3053p016j099J4965K8048P639k6566
517I637k3436K494J0286O908J3135Q832j4574k3449o534J2304J5862N857l824
530A3498o609r197j1285K349K2392J3006j3939j4265L997J768o892M574J2375
$$ plain form
434 -10028 22872 27895 5244 -8113 -8160 -12463 -9925 12161 26439 11167 -9902 -13447 -5674 1462
448 1462 5546 9767 11800 3417 -10525 -9115 8964 12843 -388 -463 11248 6888 -4605 800
462 800 10023 3715 -3630 2945 12383 9373 -2430 -9556 -4099 2326 1962 5656 14720 5859 -17251
477 -17251 -17935 5830 16681 11856 11081 7913 -8497 -17391 -1117 22452 29223 14954 -4630 -12458
491 -12458 -8917 -2450 10862 27851 19607 -13116 -29258 -14456 1978 9785 17398 14332 -9242
504 -9242 -29632 -22639 3520 22301 21298 6719 -6334 -13350 -14449 516 28564 36203 9637
517 9637 -13799 -11305 -1019 5889 19024 27856 13282 -10167 -16701 -4397 11465 17322 13498
530 13498 6889 -2308 -13593 -11244 11148 24154 10215 -4050 -53 1715 -5177 -603 11772
543A1772r47j2089m871M124N059j464m231J955M680l582m191P229M126j1987l936
558h353J6333J1110p544o095K345l037n248N713J4205O520r957j7562n234R770
572B966P809K586N236l220k3168j5071J3788K0371L852k384l535j3791j3943N253
586a3251K2143J8014l856j9865j4336K015P163J0098J7894N459k4086k6797J850
599a7555J6674R680N470J383j3820k0986n823J4420J9650P136r762j4858q274
612a6665l718M931J9881J7102j1083k1374l143P525J779M812J0812rj3609j2310
626a5069J713J2332R513j693n580j207l674o104N296J1573k943q689N845P771
640I084o839o446M930N008n232n403K689O266k573j2877p058R837R270k846l077
$$ plain form
543 11772 10825 -1264 -6135 -2011 3048 1584 -2647 -692 3988 406 -3785 3444 7570 -4417 -8353
558 -8353 7980 19090 11546 5451 7796 4759 -489 5224 19429 25949 15992 -1570 -6804 2966
572 2966 10775 13361 18597 15377 -7791 -22862 -9074 11297 15149 12765 9230 -4561 -18504 -13251
586 -13251 8892 26906 23050 3185 -11151 -9136 -1973 8125 26019 31478 7392 -19405 -17555
599 -17555 -881 8799 14269 15652 1832 -19154 -24977 -10557 9093 16229 6467 -8391 -16665
612 -16665 -20383 -15452 4429 21531 10448 -10926 -14069 -6544 -4765 47 10859 10850 -2759 -15069
626 -15069 -13356 -1024 8489 6796 1216 9 -3665 -9769 -4473 7100 4157 -4532 1313 9084
640 9084 2245 -4201 729 5737 505 -4898 -2209 4057 1484 -11393 -18451 -8614 656 -2190 -5267
655e267j080j1708j0945R412J7367K241m604j722n211q033K969J7153J5737l104
669A3205j9334j3452P340J3119O060O420M754j3135k1684j855J5289J1460K243
682A0430k491j2043j4376j185J4963J7434N198j2721j6365l222M524M995J1709
695F850J4453o145k2299q516J2185J1194M715J741o476j3677r563M200J4138J1867
709A4667k129j2079n627j406l043N517J4105R75j4506o235O655L583j017M716
723D176M213n747r464k598N865N303n305o887O015Q079l838n747L967M95p925
738i398R59J1549L999m279j520q30k140L524J0248Q664l599j5413j2282O073J3500
753I055K663j861K313o731j7750n019J3979J2503j008r268j2705q848L250J3322
$$ plain form
655 -5267 -6347 -18055 -29000 -19588 -2221 20 -4584 -6306 -11517 -19550 -16581 572 16309 13205
669 13205 -6129 -19581 -12241 878 6938 13358 18112 4977 -16707 -18562 -3273 8187 10430
682 10430 7939 -4104 -18480 -19665 -4702 12732 17930 5209 -11156 -14378 -9854 -4859 6850
695 6850 21303 15158 -7141 -15657 -3472 7722 12437 14178 7702 -5975 -15538 -11338 2800 14667
709 14667 12538 459 -5168 -6574 -9617 -4100 10005 10980 -3526 -9761 -3106 477 -540 4176
723 4176 8389 2642 -6822 -9420 -3555 1748 -3557 -10444 -4429 3650 -188 -5935 -1968 -1473 -9398
738 -9398 -8439 3110 7109 2830 1310 480 -1660 1864 12112 20776 17177 1764 -10518 -4445 9055
753 9055 11718 9857 12170 5439 -12311 -17330 -3351 9152 8144 -1124 -13829 -22677 -19427 -6105
767f105J2933L686j0395j5417m876P380P951P306R774n024k1168j0029J4035J8375
781H426M368n337q770r888o558K771J2886J4881l06j5856j0762K000M354O925
795h66J1829K015j6983j2899O178R749K852L481L797n784j1927o209O056J1158
809B447J671q110k545M165k088m265O042O152m766n040M630K767m140j247K649
824a678J282J424L737J874k066q281q514K610J1667L449n977j867j248q939l987
839a6514J1177J2816j629j1686j0710l164P278J1472Q535K695p071j4924n028
852a6753J0632J1389L626K284m352j6209j0538J3122K0142N040q785j1935q505
865a0842l011M382J0879J1279p33j5875j3322L918R699O815P326n66j6085j4513
$$ plain form
767 -6105 6828 10514 119 -15298 -20174 -12794 -4843 2463 12237 7213 -13955 -23984 -9949 8426
781 8426 12794 7457 -1313 -11201 -17759 -14988 -2102 12779 12473 -3383 -14145 -12145 -7791 -866
795 -866 10963 12978 -4005 -16904 -10726 -977 1875 5356 9153 3369 -8558 -14767 -8711 2447
809 2447 4118 -3992 -6537 -2372 -4460 -8725 -2683 3469 -1297 -6337 -1707 1060 -3080 -4327 -1678
824 -1678 -396 1028 4765 6639 4573 -3708 -12222 -9612 2055 5504 -473 -2340 -3588 -12527 -16514
839 -16514 -5337 7479 5850 -5836 -16546 -19710 -12432 -960 7575 10270 3199 -11725 -16753
852 -16753 -6121 5268 8894 11178 6826 -9383 -19921 -6799 13343 18383 9598 -2337 -10842
865 -10842 -13853 -9471 1408 12687 11954 -3921 -17243 -13325 -3626 3189 10515 9949 -6136 -20649
879b0649M784J3901O904J431j873p669q731k856O812J2037M870r989j0470K67
893a1231M306K135O012O431m186r739j557M267J609J569K705k66k731k383o0M387
909A268K133n717l965O000L308o884l570M547J69l915M598O942j495q039n137
924i757J656N465N127L032j02m196r672k796J1881J0578j792n074l808q342n698
939a3498R985J6384L105r618j1700o426J421Q678R678N901m359j4261j1830N747
953a0793J3680P754J795l390j2021j2354L327J4907J0462M38o978j0535n593K114
967g187P579J0206N761r111j4775k469Q882N033L779M471l639j2582m734O647
981b139P051K966q33l551l813k491j51N674O844l815q118N57M884k946k292N471
$$ plain form
879 -20649 -15865 -1964 4940 6371 4498 -3171 -11902 -14758 -7946 4091 8961 -1028 -11498 -11231
893 -11231 -6925 -4790 1222 7653 3467 -6272 -7829 -3562 -1953 -384 2321 2055 -676 -3059 -3119 1268
909 1268 3401 -2316 -6281 -281 3027 -3857 -7427 -2880 -2711 -6626 -2028 4914 3419 -4620 -9757
924 -9757 -8101 -2636 2491 5523 5421 1225 -8447 -11243 638 11216 9424 4350 542 -7800 -13498
939 -13498 -3513 12871 15976 6358 -5342 -11768 -10347 -1669 8009 13910 9551 -4710 -16540 -10793
953 -10793 2887 10641 12436 9046 -2975 -15329 -12002 2905 13367 13805 6827 -3708 -9301 -7187
967 -7187 392 10598 16359 7248 -7527 -9996 -1114 3919 7698 12169 8530 -4052 -8786 -2139
981 -2139 4912 7878 7045 3494 -319 -2810 -2961 2713 9557 5742 -2376 -1819 3065 119 -2173 3298
997C298K431n326j633M751M83m201k018R04K495K332k61p09p26m815l337P005
1013F73Q989j727p593k644j860k131N433J0347K346p151r221n111L005R151O491
1028H997j44m273j0109r409M665J5171O187l330n472p631q441K304J3595J0876
1042A2986j415r992j0491k688O560Q160P147K803q319j4491k887R770Q293J990
1056G426J268m261j1790m751P774J0127L652l671o513n028n09L351N499O493j774
1071G293r515l720M520K879j25M182J027o965m938K878M212M50j226j206m38Q98
1087B06n15r61K818P43l975J17N883J121n023q01K593p01R59M994J419m648n944
1104a715k426L576O425K477l140l070m716o102J881J1893N819o410p561l823k957
$$ plain form
997 3298 5729 403 -1230 3521 4004 -197 -2215 -1311 1184 3516 3255 2546 1820 -2995 -6332 673
1013 673 9662 7935 342 -2302 -4162 -6293 -860 9487 11833 4682 -4539 -9650 -6645 2506 8997
1028 8997 8853 4580 -5529 -14938 -10273 4898 11085 7755 2283 -5348 -13789 -11485 2110 12986
1042 12986 11571 1579 -8912 -11600 -5040 3120 10267 13070 4751 -9740 -12627 -2857 5436 7426
1056 7426 8694 4433 -7357 -12108 -4334 5793 9445 5774 -739 -5767 -6276 -2925 2574 9067 7293
1071 7293 -2222 -5942 -1422 1457 1332 5514 6541 -424 -5362 -2484 1728 2178 952 -254 -692 206
1087 206 -309 -1270 1548 2291 -1684 -1567 4316 5437 414 -387 2206 1505 2464 7458 8877 4229 -1715
1104 -1715 -4141 -565 5860 8337 5197 2127 -2589 -8691 -6810 5083 10902 4492 -3069 -6892 -9849
1119i849K948J0887P647k700j0053q600m41Q112Q517L743j093p726j2162k814
1133a3584J1958J1373k22l681o206r726l289R186J1348L639n135r971o013K263
1147h060O892O620M634j971j0775q485M670Q158K998J467j144p765o616K165O544
1162f68M269m91m236m313o72J009Q65M623L864m373n112K707L958j536p10L124
1178B308l50k664R49J728j638k301j772J122L550P76m010k125k16l142q0P641
1194b24N157n273o271j121J156K796P372N004k466p561n897R31Q747P731O46l763
1210F964n771p569k038J0118J0690q36p478o305n412p55Q476R697J763o846r786
1225e088m779M197Q917M886O87l342r774q211N425J1154L655k813m644o651m697
$$ plain form
1119 -9849 -6901 3986 11633 8933 -1120 -9720 -10161 -2049 6468 10211 9118 1392 -10770 -13584
1133 -13584 -1626 9747 9525 5844 -362 -10088 -13377 -4191 7157 10796 5661 -4310 -10323 -8060
1147 -8060 -1168 5452 10086 8115 -2660 -11145 -6475 1683 4681 6148 5004 -2761 -9377 -7212 -668
1162 -668 3601 3110 -1126 -5439 -6111 -5102 -4237 386 4250 -123 -5235 -2528 1430 -106 -816 2308
1178 2308 1958 -706 243 1971 333 -1968 -3740 -2618 932 1708 -2302 -4427 -4643 -7785 -7865 -224
1194 -224 4933 -340 -6611 -7732 -6576 -3780 3592 8596 6130 -1431 -7328 -6397 2350 10081 10727 6964
1210 6964 1193 -6376 -8414 1704 12394 11558 4080 -2225 -7637 -8392 84 9781 11544 4698 -5088
1225 -5088 -9867 -5670 3247 8133 8820 5478 -4296 -12507 -7082 4072 7727 4914 270 -6381 -11078
1240a1078L172Q121N210j321o049o369PM948L725M078K837n295q044K250P023
1255C215J895q13J049j325m578r54L060K156J08k468k757P4J554j545j122K069
1271c82j790k186L078M795k988m395N43K535R20K481K317k050m020l150Q53N641
1287B202N411k388n539l325l035j331O441P406j654q526n020j380K343O998O497
1302E100j003o410q113k772O090R978L314k379l368o635n548N236J2193M061n217
1317D527p098m776j689M835Q304M435j857o778o839N14P052N228J813K41n088
1332B824q917O78R169M492k342j810k680n106j507K974M064R80k825n454j562
1347g022K873J880l74J591p12m270M42M442O83k176J203K215k3n76J691M50r10
$$ plain form
1240 -11078 -7906 215 5425 4104 -1945 -8314 -8307 -3359 366 4444 7281 1986 -6058 -3808 3215
1255 3215 5110 4297 5346 4021 -557 -1511 1549 3705 3813 1345 -1412 -1338 216 -1329 -2451 -382
1271 -382 -2172 -4358 -1280 3515 527 -3868 -3325 -790 130 2611 4928 2878 -1142 -4292 -3439 2202
1287 2202 7613 5225 -314 -3639 -6674 -8005 -1564 5842 4188 -4338 -9358 -10738 -8395 -1397 5100
1302 5100 4097 -2313 -10426 -13198 -7108 2870 6184 3805 437 -6198 -11746 -6510 5683 9744 4527
1317 4527 -2571 -7347 -9036 -4201 4103 8538 6681 -97 -6936 -6422 630 5858 7671 7912 2824
1332 2824 -6093 -5415 3754 8246 5904 4094 1414 -3692 -5199 -2225 1839 2819 -6 -5460 -7022
1347 -7022 -4149 -2269 -2643 -1052 -1764 -6034 -5592 -1150 -467 -2643 -1440 775 752 176 1867 2317 1407
1364A407j981j503K668M999j319n346j595J014n17K178M715r18o011l751Q82K019
1380c059N113M304j129n136m979k139M749R268J660m884m706l081k834L282R801
1395F230M100o523p921l952m0M661P232K967l018p383o190P50P771N967k76k240
1411B135m555p298k22R056O406k134m596l067l775l31M894M772J296l546o274
1426g239k163N051M643R17l7n20m094j736M135L800m55j12Q28k593p44J759J819
1443C259M82j582l332o87L449P58l647j125K274q43j574K218Q84k873k771R17
1459d193J461K505K459q12k857k333n92L014O368O78n079m017M44K8K162O564
1475E800L118n463p355k432K602N157N437M47m429n537l576J684Q499N970k253
$$ plain form
1364 1407 -574 -2077 591 5590 4271 -1075 -2670 -1656 -2173 5 4720 3802 -2209 -5960 -5078 -3059
1380 -3059 2054 6358 5229 93 -4886 -7025 -2276 6992 8652 3768 -938 -4019 -6853 -3571 6230
1395 6230 10330 3807 -4114 -8066 -8106 -3445 3787 6754 3736 -3647 -9837 -9087 -1316 4651 4375 2135
1411 2135 -2420 -9718 -9940 -884 5522 3388 -1208 -4275 -8050 -8381 -3487 1285 2581 -965 -7239
1426 -7239 -9402 -4351 292 1209 1172 652 -3442 -5178 -1043 2757 2302 2190 3018 425 -319 1440 3259
1443 3259 3741 2159 -1173 -1860 1589 2347 -1300 -2425 -151 -994 -2568 -350 534 -2339 -5110 -4193
1459 -4193 -2732 -227 2232 1420 -1437 -3770 -4362 -1348 5020 5698 619 -3398 -2954 -2926 -764 5800
1475 5800 8918 3455 -3900 -6332 -3730 1427 6864 7311 2882 -2655 -6231 -4547 3952 9922 7669
1490G669n421m623l636O98Q463O512k176o312m381k441K360N907L767Mm131o918
1506d659k885N428P741P15k063j926l855l341M004N786O88k092k264k627j270
1521b620K309L056J767j341m448k683K361K335r29j227J798l13l216J285K265
1536C99o38j684P14L90K70J759k8j308j312j6J318L515J378m144l885J217J770
1553b85M41L255J955l389n343j833K744L726L837q13n084l529k035J701O623N309
1569G280l129o175l197o02J084N970N711j547p223m754L6M126O195K452j757m760
1585b90n430j795N649Q102O83m132l298k970k232L964P468J433m492m079k718
1600d137K1M050M247P75k080m212l765J750N252R11q18m13j578l153K43M179J755
$$ plain form
1490 7669 2248 -2375 -6011 -5313 3150 9662 7486 1174 -3207 -5648 -3288 2619 6386 6390 2259 -4659
1506 -4659 -7544 -2116 5625 6340 4277 2351 -1504 -4845 -841 4945 5633 3541 1277 -1350 -2620
1521 -2620 -311 2745 4512 3171 -1277 -3960 -1599 736 -193 -1420 378 65 -3151 -1866 399
1536 399 -239 -1923 -1209 -819 -549 1210 1182 -126 -1438 -1454 -136 3379 4757 613 -3272 -2055 -285
1553 -285 156 3411 5366 1977 -3366 -5199 -2455 1271 5108 4295 -789 -4318 -6353 -4652 1971 7280
1569 7280 4151 -2024 -5221 -5823 -4739 1231 6942 5395 -1828 -6582 -6546 -2420 3775 6227 4470 -290
1585 -290 -5720 -7515 -1866 6236 6919 2787 -511 -3481 -5713 -1749 5719 7152 2660 -1419 -4137
1600 -4137 -4116 -66 4181 4956 2876 -1336 -5101 -3351 1901 2812 1994 1581 3 -3150 -2907 1272 3027
1617C027j562j641q17l25J493J347p88l58K81j184Q90J924j160k489R06J120l00
1634C64L46K213r83l796j327K234K645K138j591m148j340K48R55L046L936j932
1650C008n980k115J717J832L551L651k127o509l399J966M200M924N32l845l935
1665b529l058o67N444O822K85o237m875j406N64M521O290O71n793m760j804J753
1681d779N525M418o87l543m497l513K506O616L311k823l026k264k369N05N297
1696F77L036j157l618k600q06K156K863P85k62j632k322n05L378J413j354j67
1712a15J668j659j330J893J313j914q71N38R39R92o93k079r27J333M40Q42K130
1729B500p99m166j160K380J508J612K050j231m392k398J896L807L167J67m046
$$ plain form
1617 3027 1465 -176 -993 -1318 175 1522 734 376 657 -527 363 2287 1127 -1362 -456 664 364
1634 364 710 2923 1940 -1856 -3183 -949 1696 3834 2243 -1905 -3245 -2997 -2042 1004 4940 3008
1650 3008 -2972 -5087 -3370 -1538 2013 5664 3537 -2972 -6371 -4405 -205 4719 5251 1406 -2529
1665 -2529 -5587 -6254 -810 6012 6297 60 -4815 -6221 -5657 -1136 5154 5825 32 -4728 -6532 -4779
1681 -4779 746 5164 4477 934 -3563 -7076 -4570 2046 5357 2534 -492 -2756 -5125 -4620 677
1696 677 3713 2556 -1062 -3662 -4468 -2312 551 1336 1074 -558 -2880 -3385 -7 1406 52 -115
1712 -115 1553 -106 -1436 457 1770 -144 -1015 -477 462 1454 761 -1318 -2245 -912 -472 370 2500
1729 2500 1701 -2465 -3625 -1245 263 1875 3925 2694 -1698 -4096 -2200 1607 4774 4941 895
1744H95l614m50N41L530M439N93o098m573J02K095L443M237k09n205m204n80K485
1761b573N094L323j780m486l137j912K142O653L393l508n239j582j141J759M117
1776A123K986k245m062k723l4L359L884R01j586j948k798m44M190K948r39j639
1792I73J24j418j487K324J814l55k272j339j04R59M03j090r18R91l32q97J369
1809a255P25k184j660J983J329Q7R09J92k702j577J531K223K083J75l164k936
1825d241O02J639J504K596R48m197l944O25K768K601K665l29m172l592L93L456
1841f78M147K276k437m777k055l62J835N024L626l598o039j960J016K123M493
1856B634K031l001m686k506R56M497L818O53k672k639k457r47M465M858m71l572
$$ plain form
1744 895 -2719 -3169 -2628 902 5341 5934 -164 -4737 -4635 -2540 903 5140 4931 -274 -4478 -5058 -2573
1761 -2573 2521 5844 4064 -422 -3559 -5471 -3329 3324 6717 3209 -2030 -3612 -4753 -2994 1123
1776 1123 4109 1864 -2198 -4921 -4955 -1596 2288 3189 1603 -345 -3143 -3587 603 3551 2612 973
1792 973 1097 -321 -1808 516 2330 1975 -297 -1636 -1740 -781 -378 -1468 -2386 -1395 -1727 -2624 -1255
1809 -1255 -530 -2714 -4374 -2391 -1062 -975 -66 126 -2576 -4153 -2622 -399 1684 1859 -1305 -4241
1825 -4241 -3639 -2000 -496 2100 3048 -1149 -5093 -4468 -1700 901 3566 3237 -935 -4527 -4134 -678
1841 -678 3469 5745 3308 -1469 -3524 -3886 -2051 2973 6599 3001 -3038 -4998 -3982 -1859 2634
1856 2634 4665 1664 -3022 -5528 -4572 -75 3743 4396 1724 -915 -3372 -4319 146 5004 4533 961
1872I61k125j186m75K678K876k95k953k151r30Q14K521J63p72M34j039j726J310
1889a895K421K02j884N59J151k98N98N02l32o13N11Q00N34N10j980k167O50J536
1907H05M09R14J011l075l375M65L014J459R53j055l298k215M96K258L497J472
1923C735k715m615j640J102J766L490K162k790n726j973K608K931L425J373l312
1938a79m637j635J470M677M477j22l914k808r46R23L686M458k33m896k842n97
1954c118P81L213L471p92l619k973j145J732M013R80j637j629o22j439R99L822
1970B037J130k187j218J04p65J270J731J27j329o59k65K60J053l73j708M12J031
1987F51p06k92J508q90k522K03K361J038o7n91j700j548J323K024J726R97j881
$$ plain form
1872 961 -1164 -2350 -2825 -147 2729 2434 -519 -2670 -3600 -2786 -265 -102 -874 -440 -1479 -3205 -1895
1889 -1895 526 728 -1156 -597 554 256 854 1356 1024 411 922 1722 2256 2766 786 -1381 -731 805
1907 805 1214 2128 3139 64 -3311 -2846 168 1627 2580 1525 -1773 -3988 -3492 -1234 2263 3735
1923 3735 1020 -3595 -5235 -4133 -2367 1123 3285 495 -5231 -7204 -4596 -1665 1760 3133 -179
1938 -179 -4816 -6451 -4981 -304 4173 4051 137 -2671 -3617 -2694 992 5450 5217 321 -2521 -3118
1954 -3118 -2337 876 4347 3555 -64 -3037 -4182 -2450 1563 2543 906 -723 -1345 -2784 -1785 2037
1970 2037 3167 980 -238 -134 -899 371 2102 2229 900 241 -24 236 1289 916 -792 -380 651
1987 651 -55 -347 1161 271 -2251 -2048 313 1351 1284 693 -1007 -2555 -1232 792 2518 3515 1634
2004A634l406o41K584J667J570J123j953m712p95L036L017J841k28k873l796l29
2020b261K418L305L295r65m778k837N3K057L042K726r40n701l666Q98K514L277
2036B437J583j409m504k645k29K922L879J453k854l072o44k59J573M414K132l230
2052A547l099o45L14K176K278K22j374k051o43M4J970J072j024j012J55j028o47
$$ plain form
2004 1634 -1772 -2413 171 1838 3408 4531 2578 -2134 -2929 107 3124 4965 4737 1864 -1932 -2261
2020 -2261 157 3462 6757 5792 1014 -1823 -1770 287 3329 6055 5115 -586 -4252 -3354 -840 2437
2036 2437 4020 2611 -1893 -4538 -4767 -1845 2034 3487 633 -2439 -3083 -3342 -1769 2645 4777 1547
2052 1547 -1552 -2197 -1883 293 2571 2793 1419 -632 -1275 -1231 739 1811 787 -225 -70 -1098 -1745
$$ [...]
8191A42
##END NTUPLES=NMR FID
##END=
