##TITLE=1H_SA_Sl_dioxane
 CDCl3, 8 sc, 
 25.9.2020
##JCAMPDX= 6.0         $$ Bruker NMR JCAMP-DX V2.0
##DATA TYPE= NMR FID
##DATA CLASS= NTUPLES
##ORIGIN= UXNMR, Bruker Analytische Messtechnik GmbH
##OWNER= root
$$ XWIN-NMR		Version 3.5
$$ Fri Sep 25 09:57:14 2020 Russian Standard Time (UT+4h)  she@DPX200
##.OBSERVE FREQUENCY= 200.1315066352
##.OBSERVE NUCLEUS= ^1H
##.DELAY= (6, 6)
##.ACQUISITION MODE= SIMULTANEOUS
##.ACQUISITION SCHEME= undefined
##.AVERAGES= 8
##.DIGITISER RES= 18
##SPECTROMETER/DATA SYSTEM= spect
##.PULSE SEQUENCE= zg30
##.SOLVENT NAME= CDCl3
##.SHIFT REFERENCE= (INTERNAL, CDCl3, 0, 15.7039)
##AUDIT TRAIL= $$ (NUMBER, WHEN, WHO, WHERE, WHAT)
$$ ##TITLE= Audit trail, XWIN-NMR		Version 3.5
$$ ##JCAMPDX= 5.01
$$ ##ORIGIN= Bruker BioSpin GmbH
$$ ##OWNER= she
$$ F:/spectra/data/she/nmr/H-F/1/audita.txt
$$ ##AUDIT TRAIL=  $$ (NUMBER, WHEN, WHO, WHERE, WHAT)
(   1,<2020-09-25 09:56:02.26 +0400>,<she>,<DPX200>,
      <created by zg, POWCHK disabled, PULCHK disabled
       configuration hash MD5:
       00 E9 B6 7A A2 85 ED C7 34 08 36 98 17 FE 4E 26
       data hash MD5: 16K
       A3 9B 2B 15 53 BE 2B 13 02 D9 C0 A9 74 B2 B0 49>)
$$ ##END=
$$ 
$$ hash MD5
$$ 62 68 48 91 7D 71 2C E4 EE CD 06 46 34 21 03 73
##$RELAX= 
##$RELAX= 
##$RELAX= 
##$RELAX= 
##$RELAX= 
##$RELAX= 
$$ Bruker specific parameters
$$ --------------------------
##$DU= <F:/spectra>
##$EXPNO= 1
##$NAME= <H-F>
##$PROCNO= 1
##$TYPE= <nmr>
##$USER= <she>
##$AMP= (0..31)
100 100 100 100 100 100 100 100 100 100 100 100 100 100 100 100 100 100 
100 100 100 100 100 100 100 100 100 100 100 100 100 100 
##$AQSEQ= 0
##$AQ_mod= 1
##$AUNM= <au_zg>
##$AUTOPOS= <>
##$BF1= 200.13
##$BF2= 200.13
##$BF3= 200.13
##$BF4= 200.13
##$BF5= 200.13
##$BF6= 200.13
##$BF7= 200.13
##$BF8= 200.13
##$BYTORDA= 1
##$CFDGTYP= 0
##$CFRGTYP= 5
##$CHEMSTR= <none>
##$CNST= (0..31)
1 1 145 1 1 1 1 1 1 1 1 1 1 1 1 1 1 1 1 1 1 1 1 1 1 1 1 1 1 1 1 1 
##$CPDPRG= <>
##$CPDPRG1= <>
##$CPDPRG2= <>
##$CPDPRG3= <>
##$CPDPRG4= <mlev>
##$CPDPRG5= <mlev>
##$CPDPRG6= <mlev>
##$CPDPRG7= <mlev>
##$CPDPRG8= <mlev>
##$CPDPRGB= <>
##$CPDPRGT= <>
##$D= (0..31)
0 1.2 0 0 0 0 0 0 0 0.06 0 0.03 0 0 0 0 0.0002 0 0 0 0 0 0 0 0 0 0 0 0 
0 0 0 
##$DATE= 1601013361
##$DBL= (0..7)
120 120 120 120 120 120 120 120 
##$DBP= (0..7)
150 150 150 150 150 150 150 150 
##$DBP07= 0
##$DBPNAM0= <>
##$DBPNAM1= <>
##$DBPNAM2= <>
##$DBPNAM3= <>
##$DBPNAM4= <>
##$DBPNAM5= <>
##$DBPNAM6= <>
##$DBPNAM7= <>
##$DBPOAL= (0..7)
0.5 0.5 0.5 0.5 0.5 0.5 0.5 0.5 
##$DBPOFFS= (0..7)
0 0 0 0 0 0 0 0 
##$DE= 6
##$DECBNUC= <off>
##$DECIM= 32
##$DECNUC= <off>
##$DECSTAT= 4
##$DIGMOD= 1
##$DIGTYP= 9
##$DL= (0..7)
0 120 120 120 120 120 120 120 
##$DP= (0..7)
150 150 150 150 150 150 150 150 
##$DP07= 0
##$DPNAME0= <>
##$DPNAME1= <>
##$DPNAME2= <>
##$DPNAME3= <>
##$DPNAME4= <>
##$DPNAME5= <>
##$DPNAME6= <>
##$DPNAME7= <>
##$DPOAL= (0..7)
0.5 0.5 0.5 0.5 0.5 0.5 0.5 0.5 
##$DPOFFS= (0..7)
0 0 0 0 0 0 0 0 
##$DQDMODE= 0
##$DR= 18
##$DS= 0
$$ [...]
##$SUBNAM2= <"">
##$SUBNAM3= <"">
##$SUBNAM4= <"">
##$SUBNAM5= <"">
##$SUBNAM6= <"">
##$SUBNAM7= <"">
##$SUBNAM8= <"">
##$SUBNAM9= <"">
##$SW= 16.880792210976
##$SWIBOX= (0..15)
0 0 2 0 0 0 0 0 0 0 0 0 0 0 0 0 
##$SW_h= 3378.37837837838
##$TD= 16384
##$TD0= 1
##$TE= 0
##$TE2= 300
##$TE3= 300
##$TEG= 300
##$TL= (0..7)
0 120 120 120 120 120 120 120 
##$TP= (0..7)
150 150 150 150 150 150 150 150 
##$TP07= 0
##$TPNAME0= <>
##$TPNAME1= <>
##$TPNAME2= <>
##$TPNAME3= <>
##$TPNAME4= <>
##$TPNAME5= <>
##$TPNAME6= <>
##$TPNAME7= <>
##$TPOAL= (0..7)
0.5 0.5 0.5 0.5 0.5 0.5 0.5 0.5 
##$TPOFFS= (0..7)
0 0 0 0 0 0 0 0 
##$TUNHIN= 0
##$TUNHOUT= 0
##$TUNXOUT= 0
##$USERA1= <user>
##$USERA2= <user>
##$USERA3= <user>
##$USERA4= <user>
##$USERA5= <user>
##$V9= 5
##$VALIST= <valist>
##$VCLIST= <CCCCCCCCCCCCCCC>
##$VD= 0
##$VDLIST= <DDDDDDDDDDDDDDD>
##$VPLIST= <PPPPPPPPPPPPPPP>
##$VTLIST= <TTTTTTTTTTTTTTT>
##$WBST= 1024
##$WBSW= 4
##$XGAIN= (0..3)
0 0 0 0 
##$XL= 0
##$YL= 0
##$YMAX_a= 219247
##$YMIN_a= -331943
##$ZGOPTNS= <>
##$ZL1= 120
##$ZL2= 120
##$ZL3= 120
##$ZL4= 120
##$ABSF1= 10
##$ABSF2= 0
##$ABSG= 5
##$ABSL= 3
##$ALPHA= 0
##$AQORDER= 0
##$ASSFAC= 0
##$ASSFACI= 0
##$ASSFACX= 0
##$ASSWID= 0
##$AUNMP= <proc_1d>
##$AZFE= 0.1
##$AZFW= 0.1
##$BCFW= 1
##$BC_mod= 2
##$BYTORDP= 1
##$COROFFS= 0
##$CY= 11.3945322036743
##$DATMOD= 1
##$DC= 2
##$DFILT= <>
##$DTYPP= 0
##$F1P= 16.9975609425685
##$F2P= -3.02152046262296
##$FCOR= 0.5
##$FTSIZE= 0
##$FT_mod= 4
##$GAMMA= 1
##$GB= 0.15
##$INTBC= 1
##$INTSCL= 1
##$ISEN= 128
##$LB= 0.24
##$LEV0= 0
##$LPBIN= 0
##$MAXI= 10000
##$MC2= 0
##$MEAN= 0
##$ME_mod= 0
##$MI= 1.114404
##$NCOEF= 0
##$NC_proc= 0
##$NLEV= 6
##$NOISF1= 3.799351
##$NOISF2= 2.8
##$NSP= 1
##$NTH_PI= 0
##$NZP= 0
##$OFFSET= 15.70392
##$PC= 1
##$PHC0= -10138.68
##$PHC1= 23.6009
##$PH_mod= 1
##$PKNL= yes
##$PPARMOD= 0
##$PSCAL= 0
##$PSIGN= 0
##$REVERSE= no
##$SF= 200.130013532006
##$SI= 16384
##$SIGF1= 3
##$SIGF2= 2
##$SINO= 400
##$SIOLD= 16384
##$SREGLST= <1H.CDCl3>
##$SSB= 0
##$STSI= 0
##$STSR= 0
##$SW_p= 3612.71676300578
##$SYMM= 0
##$S_DEV= 0
##$TDeff= 0
##$TDoff= 0
##$TI= <>
##$TILT= no
##$TM1= 0
##$TM2= 0
##$TOPLEV= 0
##$USERP1= <user>
##$USERP2= <user>
##$USERP3= <user>
##$USERP4= <user>
##$USERP5= <user>
##$WDW= 1
##$XDIM= 8192
##$YMAX_p= 0
##$YMIN_p= 0
$$ End of Bruker specific parameters
$$ ---------------------------------
##NTUPLES= NMR FID
##VAR_NAME=  TIME,          FID/REAL,        FID/IMAG
##SYMBOL=    X,             R,               I
##VAR_TYPE=  INDEPENDENT,   DEPENDENT,       DEPENDENT
##VAR_FORM=  AFFN,          ASDF,            ASDF
##VAR_DIM=   8192,          8192,            8192
##UNITS=     SECONDS,       ARBITRARY UNITS, ARBITRARY UNITS
##FACTOR=    0.000296,      1,               1
##FIRST=     0,             0,               0
##LAST=      2.424536,      0,               0
##MIN=       0,             -331943,         0
##MAX=       2.424536,      219247,          0
$$ Real data points
##PAGE= N=1
##DATA TABLE= (X++(R..R)), XYDATA
$$ [...]
$$ plain form
873 1876 -1062 -1223 1433 1549 -240 -1985 -26 2824 288 -2002 -1045 1657 2157 -1903 -2882 1172
889 1172 2111 -424 -2504 -1555 2459 857 -3005 -1634 627 1287 -523 -3030 -437 2197 -985 -2257
905 -2257 -780 448 841 -1965 -2159 1104 581 -2135 -2193 -305 1237 -633 -3286 -1193 1875 714
921 714 -3180 -2527 1416 1856 -1156 -3193 -721 2668 734 -3427 -2007 1828 1769 -1508 -2592 231
937 231 2136 112 -2560 -497 1868 598 -1117 -916 1058 1567 -699 -1442 1617 1721 -626 -306 683
954 683 1750 1098 -1748 -213 3114 846 -1352 -556 1601 2844 -529 -2258 930 3420 1238 -2109
970 -2109 -941 2932 2489 -1014 -2172 515 3683 767 -2835 -304 2126 1345 -738 -2074 416 2756
986 2756 -568 -1741 400 920 495 -1321 -1025 1537 436 -1675 -487 723 756 -1171 -2015 611 1454
$$ packed form
873A876k938j61K656J16j789j745J959K850k536k290R57K702N00m060r79M054
889A172R39k535k080R49M014j602l862J371K261O60j810k507K593K634l182j272
905b257J477J228L93k806j94L263n23k716n8J888J542j870k653K093L068j161
921G14l894O53L943M40l012k037K472L389j934m161J420L835n9l277j084K823
937B31J905k024k672K063K365j270j715K01J974N09k266p43L059J04k347L20R89
954F83J067o52k846J535L327k268k198P96K157J243l373j729L188K490k182l347
970b109J168L873m43l503j158K687L168k916l602K531K430p81k083j336K490K340
986B756l324j173K141N20m25j816K96K562j101k111J188J210L3j927q44K626Q43
$$ plain form
1003 1454 -867 -2331 -384 1518 -70 -2530 -1526 1071 1062 -1513 -2472 400 1707 -676 -2378 -813
1019 -813 1532 856 -1793 -1888 1012 1400 -1008 -1894 -282 1526 586 -1739 -1102 1567 728 -1325 -768
1036 -768 564 1084 14 -1629 266 2122 -524 -1362 191 1375 1330 -1210 -1157 1736 1526 -729 -1248
1053 -1248 390 2111 336 -1597 -9 1464 992 -831 -936 1563 1546 -684 -441 892 1366 557 -1633
1070 -1633 172 2511 275 -1101 -382 1123 1889 -706 -1942 1101 2063 183 -1489 -808 1669 1366
1086 1366 -1296 -1404 989 1700 -33 -1678 -369 1441 542 -1224 -1132 633 1073 -596 -1500 -238 618
1103 618 -317 -1045 -590 327 -320 -908 -556 241 -360 -1304 -461 656 278 -1392 -1544 807 1215 -1195 -2019
1122 -2019 -209 1574 766 -2274 -1940 1184 1632 -869 -2388 -410 1948 906 -1598 -1672 580 1959
$$ packed form
1003A454k321j464J947J902j588k460J004K597rk575r59K872J307k383j702J565
1019h13K345o76k649r5K900L88k408q86J612J808r40k325O37K669q39k053N57
1036g68J332N20j070j643J895J856k646q38J553J184m5k540N3K893k10k255n19
1053a248J638J721j775j933J588J473m72j823j05K499j7k230K43J333M74q09k190
1070a633J805K339k236j376P19J505P66k595j236L043R62j880j672O81K477l03
1086A366k662j08K393P11j733j645J309J810q99j766R2J765M40j669r04J262Q56
1103F18r35p28M55R17o47n88L52P97o01r44Q43J117l78j670j52K351M08k410q24
1122b019J810J783q08l040L34L124M48k501j519J978K358j042k504p4K252J379
$$ plain form
1138 1959 -168 -1848 -80 1186 892 -264 -1435 142 1645 -37 -518 51 38 805 187 -510 31
1155 31 90 248 729 259 -528 -478 779 1230 -476 -922 240 1485 1484 -1179 -1654 1377 2074 -263 -1457
1174 -1457 -590 1922 1911 -1527 -1864 783 2040 343 -1671 -816 1686 1349 -726 -1395 17 1567 395
1191 395 -978 -364 525 627 -166 -589 -245 392 9 -110 -15 -302 -498 36 105 -386 -485 -450 325 524 -692
1212 -692 -1224 -29 657 -151 -951 -834 593 815 -650 -1621 -220 1234 118 -1113 -659 486 1003
1229 1003 -437 -1669 247 1103 -231 -511 -380 472 855 -645 -701 757 489 -105 24 257 709 30
1247 30 -246 232 566 460 -222 133 986 264 -397 329 276 608 360 -444 619 868 -206 -227 265 456
1267 456 508 -260 20 699 340 -191 -465 363 747 -193 -435 199 479 334 -563 -831 681 645 -533 -424
$$ packed form
1138A959k127j680J768J266k94j156j171J577J503j682m81N69j3P67o18o97N41
1155C1N9J58M81m70p87N0J257M51j706m46J162J245jk663m75L031O97k337j194
1174a457Q67K512j1l438l37K647J257j697k014Q55K502l37k075o69J412J550j172
1191C95j373O14Q89J02p93m23L44O37l83j19R5k87j96N34O9m91r9L5P75J99j216
1212f92n32J195O86q08q00J17J427K22j465r71J401J454j116j231M54J145N17
1229A003j440j232J916Q56j334k80J31Q52L83j500n6J458k68n94J29K33M52o79
1247C0k76M78L34j06o82L55Q53p22o61P26n3L32k48q04J063K49j074k1M92J91
1267D56N2p68K80O79l59n31k74Q28L84r40k42O34K80j45q97k68J512l6j178J09
$$ plain form
1287 -424 94 508 265 -822 -725 642 405 -554 -515 32 281 -149 -731 -442 359 -51 -350 -105 140 -203
1307 -203 -461 -15 309 -13 -417 2 555 333 -831 -618 779 572 -186 -721 -168 1176 375 -1356 -470
1326 -470 742 659 186 -1082 -140 1292 238 -674 -357 281 1149 347 -745 175 472 312 62 -533 181
1345 181 599 107 238 -83 -271 285 143 346 183 -660 350 849 58 -438 -577 393 1309 -171 -1186
1364 -1186 61 909 724 -905 -1456 585 1335 -361 -1193 -735 641 889 -1083 -1442 166 833 -81
1381 -81 -932 -783 70 381 -638 -911 -261 28 -200 -325 -487 -577 -485 -207 -38 -477 -644 -442 227 228 -1052
1402 -1052 -1017 156 379 -89 -850 -979 756 757 -1126 -946 113 801 449 -1105 -867 980 519 -611
1420 -611 -949 -109 1232 275 -959 -242 623 635 -266 -574 484 745 -67 -85 36 507 166 -557 442 881
$$ packed form
1287d24N18M14k43j087R7J367k37r59L9N47K49m30n82K89Q01m10k99K45K45l43
1307b03k58M46L24l22m04M19N53k22j164K13J397k07p58n35N53J344q01j731Q86
1326d70J212q3m73j268R42J432j054r12L17O38Q68q02j092R20K97j60k50n95P14
1345A81M18m92J31l21j88N56j42K03j63q43J010M99p91m96j39R70R16j480j015
1364a186J247Q48j85j629n51K041P50j696q32M58J376K48j972l59J608O67r14
1381h1q51J49Q53L11j019k73O50K89k28j25j62r0R2K78J69m39j67K02O69Jj280
1402a052L5J173K23m68p61j29J735Jj883J80J059O88l52j554K38J847m61j130
1420f11l38Q40J341r57j234P17Q65J2r01l08J058K61q12j8J21M71l41p23R99M39
$$ plain form
1440 881 -189 -153 192 456 843 -636 -640 1227 843 -202 -398 126 1133 745 -815 -90 1033 856 77
1459 77 -474 413 974 154 -415 10 757 514 -370 -227 598 327 -268 -220 345 671 18 -593 189 805 37
1480 37 -481 -215 674 652 -761 -662 510 488 -366 -930 -489 1005 291 -1433 -755 439 402 -350 -1160 -470
1500 -470 1055 30 -986 -411 5 385 -312 -844 6 59 -383 -404 -291 -97 -470 -767 36 -36 -600 -663
1520 -663 -468 364 88 -1221 -546 549 211 -362 -1001 -357 1048 -56 -1195 -462 406 518 -413 -1311
1538 -1311 51 895 -216 -963 -566 541 529 -634 -910 220 786 11 -698 -6 678 347 -258 -233 415
1557 415 523 -218 -252 350 355 -362 -217 308 499 -51 -584 98 945 294 -613 -84 724 735 -124 -528 313
1578 313 1073 247 -523 -14 532 573 -281 -562 281 443 -101 -565 -97 500 -29 -635 -192 258 356 -340 -680
$$ packed form
1440H81j070L6L45K64L87j479mJ867l84j045j96N24J007l88j560P25J123j77p79
1459G7n51Q87N61q20n69M25P47k43q84J43Q25k71n95M8N65L26o53o11P82O16p68
1480C7n18K66Q89k2j413R9J172k2q54n64M41J494p14j724O78J194l7p52q10O90
1500d70J525j025j016N75M16L80o97n32Q50N3m42k1J13J94l73k97Q03p2n64o3
1520f63J95Q32k76j309O75J095l38n73o39O44J405j104j139P33Q68J12r31q98
1538a311J362Q44j111p47L97J107j2j163k76J130N66p75p09O92O84l31o05K5O48
1557D15J08p41l4O02Np17J45N25J91n50n33O82Q47o51r07N29Q08J1q59m04Q41
1578C13P60q26p70N09N46M1q54k81Q43J62n44m64M68N97n29o06M43M50R8o96l40
$$ plain form
1599 -680 389 542 -212 -592 -252 560 210 -842 -450 485 257 -329 -846 -180 612 -215 -879 -226 389
1618 389 215 -412 -664 252 369 -264 -329 -34 452 67 -471 9 329 -74 -101 -60 331 238 -498 -165 489
1639 489 379 -313 -482 383 931 64 -825 -118 851 848 -323 -820 460 1291 271 -879 -361 755 1015
1658 1015 -325 -950 228 1076 296 -854 -515 456 716 -118 -613 60 582 102 -379 -208 84 50 -5
1677 -5 136 -85 -272 -254 -21 361 -408 -861 152 668 -76 -964 -967 431 879 -684 -1406 -190 1085 322
1697 322 -1347 -1184 510 991 -326 -1432 -538 1144 379 -1133 -1100 -34 908 60 -1262 -546 674
1714 674 280 -503 -914 -165 641 5 -433 -132 31 80 -80 -139 144 -75 -25 512 336 -117 -566 91 918
1735 918 309 -689 -309 888 913 -313 -1064 300 1467 517 -815 -295 1093 1231 -199 -1020 453 1437
$$ packed form
1599f80J069J53p54l80L40Q12l50j052L92R35k28n86n17O66P92q27o64O53O15
1618C89j74o27k52R16J17o33o5K95M86l85n38M80L20m03k7M1L91r3p36L33O54
1639D89j10o92j69Q65N48q67q89P07R69lj171m97J280Q31j020j150N18J116K60
1658A015j340o25J178Q48p80j150L39R71K60q34m95O73N22m80m81J71K92l4n5
1677eJ41k21j87J8K33L82p69m53J013N16p44q88lJ398M48j563p22J216J275p63
1697C22j669J63J694M81j317j106Q94J682p65j512L3J066R42q48j322P16J220
1714F74l94p83m11P49Q06o36m38L01J63M9j60n9K83k19N0N37j76m53m49O57Q27
1735I18o09r98L80J197K5j226p51J364J167r50j332N20J388J38j430q21J473R84
$$ plain form
1753 1437 498 -571 -256 1049 936 -232 -628 371 968 469 -404 -97 845 425 -252 -89 352 511 289
1772 289 -228 244 636 -237 -215 225 325 205 -341 -160 646 111 -628 -421 234 668 -375 -710 205 478
1792 478 -74 -800 -592 630 489 -969 -505 292 292 -314 -1035 -262 743 -57 -1048 -450 255 238 -799 -1023
1812 -1023 149 443 -225 -839 -470 445 81 -997 -605 267 251 -165 -801 -251 433 -220 -785 -345 230
1831 230 247 -210 -577 98 255 -253 -390 107 392 98 -265 -5 523 50 -362 -140 532 571 -251 -425 460
1852 460 735 -106 -635 -59 994 692 -542 -408 683 831 40 -687 18 1224 518 -515 -262 334
1870 334 741 -82 -741 86 608 80 -233 -436 -26 255 -402 -233 28 -88 27 -107 -106 -74 -357 -254 287
1891 287 -2 -277 -439 -122 341 -318 -895 -381 281 292 -456 -1145 -81 666 -160 -798 -721 468 928 -310
$$ packed form
1753A437r39j069L15J305j13j168l96R99N97m99q73L07R42m20o77J63M41J59k22
1772B89n17M72L92q73K2M40J00j20n46J81Q06n35p39K07O55M34j043l35R15K73
1792D78n52p26K08J222j41j458M64P97%o06p21P73J005q00r91N98P05j7j037k24
1812a023J172K94o68o14L69R15l64j078L92Q72j6m16o36N50O84o53n65M40N75
1831B30J7m57l67O75J57n08j37M97K85k94l63K60N28m73m12K22O72L9q22j74Q85
1852D60K75q41n29N76J053l02j234J34J091J48p91p27P05J206p06j033K53N96
1870C34M07q23o59Q27N22n28l13k03M10K81o57J69K61j16J15j34JL2k83J03N41
1891B87k89k75j62L17M63o59n77N14O62J1p48o89J064P47q26o38P7J189M60j238
$$ plain form
1911 -310 -1120 69 689 176 -408 -670 393 905 -172 -660 -15 298 195 -130 -312 286 441 -77 -77 146
1931 146 55 38 323 321 229 68 223 391 444 -131 -289 618 772 -77 -260 97 553 625 -414 -573 689 835
1953 835 208 -292 -210 812 917 -265 -341 458 791 581 -266 -230 578 633 17 -244 172 527 172 -184 -32
1974 -32 265 199 -74 44 474 202 -140 -21 300 175 -99 -286 379 503 -281 -289 30 234 21 -540 -376
1995 -376 475 96 -518 -406 -44 263 -258 -666 -109 336 -101 -457 -355 -73 195 -317 -545 27 174 -221
2015 -221 -356 -253 -124 -60 -416 -256 150 32 -437 -431 80 142 -161 -512 -181 436 235 -506 -440 234 287 -122
2037 -122 -401 -136 466 262 -501 -243 175 106 -31 -291 1 326 -70 -197 59 28 13 -113 -33 289 -17
2058 -17 -232 39 221 76 -172 -116 281 266 -193 -160 79 314 69 -375 19 346 236 -80 -293 117 504
$$ packed form
1911c10q10J189O20n13n84k62J063N12j077m88O45L13j03l25j82N98J55n18%K23
1931A46r1j7K85kr2j61J55J68N3n75j58R07J54q49j83L57M56P2j039j59J262J46
1953H35o27n00Q2J022J05j182p6P99L33k10q47L6Q08N5o16k61M16L55l55l56J52
1974c2K97o6k73J18M30k72l42J19L21j25k74j87O65J24p84qL19K04k13n61J64
1995c76Q51l79o14J12L62L07n21m08N57M45m37l56J02K82K68n12k28N72J47l95
2015b21j35J03J29O4l56J60M06j18m69ON11O2l03l51L31O17k01p41O6O74N3m09
2037a22k79K65O02k04p63K58M18o9j37k60K92L25l96j27K56l1j5j26Q0L22l06
2058a7k15K71J82j45k48N6L97j5m59L3K39K35k45m44L94L27j10l16k13M10L87
$$ plain form
2079 504 -23 -279 0 277 425 -57 -256 38 352 190 -110 -67 264 197 -17 -17 10 112 31 85 102 45 -43
2102 -43 -2 271 163 -110 -125 222 340 146 -239 -96 341 84 -158 -131 209 325 -39 -196 -37 255 74
2123 74 -154 -144 257 173 -92 -59 21 116 19 -163 -4 206 10 -55 -13 35 96 -76 9 83 27 31 -30 -73 182 -26
2149 -26 -150 35 6 137 16 -154 61 80 -60 -8 -43 2 146 -158 -61 8 -162 -63 -38 -125 -6 -169 -280 84
2173 84 -49 -286 -212 -87 155 -63 -352 -217 62 116 -272 -367 -44 244 -151 -246 -271 12 185 -230 -307 -52
2195 -52 159 10 -59 -323 -12 190 -48 -82 -59 -25 270 174 -230 -82 40 207 182 -228 -181 223 217 10 -185
2218 -185 -191 368 345 -16 -94 -75 323 325 -189 -387 168 428 243 -232 -267 296 312 16 -304 -155 485 352 -214
2241 -214 -104 93 243 339 -124 -97 318 211 154 28 -240 193 411 155 -45 -154 163 512 76 -265 -153
$$ packed form
2079E04n27k56K79K77J48m82j99K94L14j62l00M3L31o7k14%K7J02q1N4J7n7q8
2102d3M1K73j08k73j5L47J18j94l85J43M37k57k42K7L40J16l64j57J59K92j81
2123G4k28J0M01q4k65L3Q0R5r7j82J59K10j96o5M2M8O1j72Q5P4n6Mo1m3K55k08
2149b6j24J85k9J31j21j70K15J9j40N2l5M5J44l04R7O9j70R9K5q7J19j63j11L64
2173H4j33k37P4J25K42k18k89J35K79N4l88r5L23K88l95r5k5K83J73m15p7K55
2195e2K11j49o9k64L11K02k38l4K3L4K95r6m04J48J22J67k5m10M7M04ok07j95
2218a85oN59k3l61p8J9L98Kn14j98N55K60j85m75l5N63J6k96l20J49O40j33n66
2241b14J10J97J50R6m63K7M15j07n7j26k68M33K18k56k00j09L17L49m36l41J12
$$ plain form
2262 -153 301 512 -19 -401 64 336 248 -118 -380 168 460 54 -250 -202 129 300 -133 -427 -58 132 157
2283 157 -220 -476 -60 268 -62 -293 -191 -15 240 -86 -281 -125 43 57 -52 -153 -72 34 -99 -51 -197
2304 -197 -253 84 33 -132 -136 -248 39 193 -293 -246 3 96 175 -218 -149 163 195 -88 -246 -66 305 87 -336
2327 -336 -32 -115 133 42 -426 -54 234 -77 -118 -66 -181 209 21 -274 87 116 25 11 -147 -61 122 -95 -110
2350 -110 10 44 10 -162 -39 -27 -57 -7 -26 -43 161 -77 -72 308 -11 -28 202 70 157 17 -139 134 381 -120
2374 -120 -97 134 243 200 -178 -169 366 271 -63 -130 6 402 263 -150 -100 159 201 67 -108 51 262 89 -75
2397 -75 -131 40 243 4 -125 41 105 88 86 -132 -18 99 -31 106 76 -116 71 37 29 43 -129 -19 184 51
2421 51 -120 -218 47 327 -72 -262 -67 188 371 -115 -413 140 426 100 -239 -134 308 358 -89 -186 59
$$ packed form
2262a53M54K11n31l82M65K72q8l66k62N48K92m06l04M8L31J71m33k94L69J90K5
2283A57l77k56M16L28l30k31J02J76K55l26j95J56J68J4j09j01Q1J06j33M8j46
2304a97n6L37n1j65mj12K87J54m86M7K49R3P9l93O9L12L2k83j58J80L71k18m23
2327c36L04q3K48r1m68L72K88l11m1N2j15L90j88k95L61K9r1j4j58Q6J83k17j5
2350a10J20L4l4j72J23J2l0N0j9j7K04k38NL80l19j7K30j32Q7j40j56K73K47n01
2374a20K3K31J09m3l78RN35r5l34o7J36L96j39m13N0K59M2j34j75J59K11j73j64
2397g5n6J71K03k39j29J66O4j7kk18J14J17j30J37l0j92J87l4qJ4j72J10K03j33
2421E1j71r8K65K80l99j90J95K55J83m86k98N53K86l26l39J05M42N0m47r7K45
$$ plain form
2442 59 221 179 -211 -53 210 119 -3 13 -18 106 89 -21 33 -23 -98 80 56 -9 -81 -66 70 133 -94 -248 4
2467 4 165 141 -314 -226 162 210 -103 -345 -229 267 278 -378 -343 156 337 67 -416 -199 286 206 -307 -323 -62
2490 -62 247 35 -365 -127 143 113 -132 -152 54 55 -92 19 86 -42 -37 -63 178 102 -141 -93 125 165 1 -116
2514 -116 -76 353 121 -83 -19 93 285 93 -233 53 452 49 -72 -70 199 371 -12 -273 41 309 133
2535 133 -106 -153 205 267 -28 -180 96 300 38 -108 63 190 75 -131 -23 179 219 -192 -140 185 192 -47
2557 -47 -235 -4 244 -4 -350 -36 135 63 -108 -274 6 194 -133 -234 12 52 -19 -133 -198 83 81 -140
2579 -140 -176 28 104 -146 -256 -14 68 32 -131 -236 96 168 -198 -140 106 139 86 -151 -185 287 85 -242 -113
2602 -113 115 267 51 -281 16 332 45 -148 -150 191 280 -203 -188 106 144 55 -91 -46 272 88 -97 44
$$ packed form
2442E9J62m2l90J58K63r1j22J6l1J24j7j10N4n6p5J78k4o5p2J5J36O3k27j54K52
2467DJ61k4m55Q8L88M8l13k42J16M96J1o56L5M99J81k70m83K17M85q0n13j6K61
2490f2L09k12m00K38K70l0k45k0K06Jj47J11O7j28Nk6K41p6k43M8K18M0j64j17
2514a16M0M29k32k04O4J12J92j92l26K86L99m03j21KK69J72l83k61L14K68j76
2535A33k39m7L58O2k95j52K76K04k62j46J71J27j15k06J08K02M0m11N2L25Pk39
2557d7j88K31K48k48l46L14J71p2j71j66K80J88l27j01K46M0p1j14o5K81kk21
2579a40l6K04P6k50j10K42Q2l6j63j05L32P2l66N8K46L3n3k37l4M72k02l27J29
2602a13K28J52k16l32K97L16k87j93kL41Q9m83J5K94L8q9j46M5L18j84j85J41
$$ plain form
2624 44 93 105 -30 -53 176 193 -128 -87 103 124 20 -203 37 277 100 -213 -74 167 206 -18 -275 72 260
2647 260 135 -141 -163 223 209 -142 -175 110 275 144 -215 -113 304 86 -190 -74 64 236 31 -230 80
2668 80 212 -117 -175 -8 162 67 -127 -157 184 70 -136 -155 66 230 -102 -229 -10 167 -5 -206 -225 177
2690 177 177 -321 -228 2 138 -35 -318 -108 233 -11 -173 -124 -10 194 -152 -317 117 120 14 -123 -143 127
2712 127 205 -259 -157 139 147 1 -270 -32 323 97 -226 -33 156 246 -25 -234 58 248 38 -147 -48 223
2734 223 152 -63 35 138 37 26 -49 84 214 -77 -56 129 175 12 -34 112 297 61 -304 81 264 156
2756 156 -65 -222 93 462 -17 -378 5 243 290 -201 -308 170 418 -1 -344 -201 279 299 -226 -246 81
2777 81 227 143 -286 -196 77 52 -108 -158 -100 102 19 -158 30 -15 -101 29 -19 -42 -37 -213 115 139 -224 -247 26
$$ packed form
2624D4M9J2j35k3K29J7l21M1J90K1j04k23K40K40j77l13J39K41L9k24k57L47J88
2647B60j25k76k2L86j4l51l3K85J65j31l59J02M17k18k76J16J38J72k05k61L10
2668H0J32l29n8J67J70r5j94l0L41j14k06j9K21J64l32j27K19J77j72k01j9M02
2690A77%m98R3K30J36j73k83K10L41k44j62M9J14K04l46j65M34Lj06j37k0K70
2712A27P8m64J02K96Qj46k71K38L55k26l23J93J89R0k71k09K92J90k10j85R9K71
2734B23p1k15R8J03j01j1p5J33J30k91K1J85M6j63m6J46J85k36l65L85J83j08
2756A56k21j57L15L69m79l61L83K38M7m91j07M78K48m19l43J43M80K0n25k0L27
2777H1J46q4m29R0K73k5j60n0N8K02q3j77J88m5q6J30m8k3Nj76L28K4l63k3K73
$$ plain form
2802 26 231 65 -354 -345 272 236 -246 -373 -9 381 48 -317 -249 195 341 -97 -433 77 379 52 -180 -245
2824 -245 120 330 -34 -333 -28 180 117 -99 -214 153 265 -43 -40 13 77 118 -1 -1 163 -3 -55 129 84
2847 84 -50 -49 35 112 89 -193 4 214 211 -141 -203 130 300 64 -235 -55 345 240 -226 -227 121 134 106 -275
2871 -275 -244 312 143 -264 -104 31 129 99 -269 -79 247 65 -160 -80 83 107 20 -176 -57 109 33 -178
2893 -178 -68 128 -55 -1 -87 -37 8 -70 -100 70 74 -152 -16 10 59 -71 -198 -8 233 -2 -281 -119 98
2916 98 158 -129 -310 -9 233 -39 -236 -139 76 210 -144 -232 35 228 -2 -183 -48 85 118 -148 -151 -4
2938 -4 185 -59 -180 -112 36 84 -88 -48 13 46 13 -36 49 -10 21 13 114 88 -69 -139 149 157 -71 -132 -14 219
2964 219 129 -178 -160 158 293 -22 -168 -20 345 229 -86 -213 117 335 0 -191 -30 244 159 -74 -253
$$ packed form
2802B6K05j66m19RO17l6m82j27L64L90l33l65O8M44J46m38l36N10L02l27k32o5
2824b45L65K10l64k99L05K08o3k16j15L67J12l08LN3O4M1j19%J64j66n2J84m5
2847H4j34JQ4P7k3k82J97K10ll52o2L33J70k36k99J80M00j05m66jL48J3k8l81
2871b75L1N56j69m07J60J35R8l0l68J90L26j82k25Q0J63K4q7j96J19J66p6k11
2893a78J10J96j83N4q6N0M5p8l0J70Mk26J36K6M9j30j27J90K41k35k79J62K17
2916I8O0k87j81L01K42k72j97R7K15J34l54q8K67J93k30j81J35J33L3k66lJ47
2938dJ89k44j21O8J48M8j72M0O1L3l3m9Q5n9L1qJ01k6j57p0K88Qk28o1J18K33
2964B19r0l07J8L18J35l15j46J48L65j16l15j27L30K18l35j91J61K74q5k33j79
$$ plain form
2985 -253 120 243 -40 -108 -54 89 133 -73 -124 14 111 66 52 -38 54 44 93 -15 -34 -18 -17 135 47 -155 -182 80
3011 80 190 8 -115 -130 109 194 -94 -225 91 137 49 -209 -174 212 189 -75 -232 -22 216 140 -145 -65 144
3034 144 126 9 -98 2 121 46 -27 24 -14 77 92 -57 43 36 33 69 31 -8 52 38 31 100 -93 -64 121 64 36
3061 36 -92 -38 112 154 -118 -74 46 126 22 -205 -53 50 111 3 -198 -18 146 -87 -144 -23 -47 42 -117
3084 -117 -137 12 80 -142 -140 -71 -15 -66 -176 -59 -69 -61 -76 -104 -31 7 -64 -125 37 -31 -63 -111 -60 -15 -5 -43 -32 15
3112 15 -1 4 -76 -30 55 31 -28 -52 57 53 21 -40 59 46 10 51 -7 92 39 -52 61 96 24 -18 5 53 138 -7 -31 81
3142 81 150 51 -16 -25 120 91 -45 5 18 104 116 -83 15 109 26 46 12 38 139 -36 -39 91 1 39 33 12 26 12 -46
3171 -46 57 48 51 -17 -50 36 86 -12 -86 72 15 -45 -68 -119 101 23 -52 -54 -52 -25 15 -35 -16 30 -20 -20 -90 -43 8 58 -79
$$ packed form
2985b53L73J23k83o8N4J43M4k06n1J38R7m5j4r0R2j0M9j08j9J6JJ52q8k02k7K62
3011H0J10j82j23j5K39Q5k88j31L16M6q8k58L5L86k3k64j57K10K38p6k85Q0K09
3034A44j8j17j07J00J19p5p3N1l8R1J5j49J00plL6l8l9O0j4pO9j93K9J85n7k8
3061C6j28N4J50M2k72M4J20Q0j04k27J52J03O1j08k01J80J64k33n7J21k4Q9j59
3084a17k0J49O8k22KO9N6n1j10J17j0Qj5k8P3L8p1o1J62o8l2m8N1M5J0l8J1M7
3112A5j6Nq0M6Q5k4n9k4J09ml2o1R9j3l6M1n8R9n3r1J13L5p2m2K3M8Q5j45k4J12
3142H1O9r9o7rJ45k9j36N0J3Q6J2j99R8R4q3K0l4K6J01j75lJ30r0L8ok1J4j4n8
3171d6J03rLo8l3Q6N0r8p4J58n7o0k3n1K20p8p5kKK7M0n0J9M6n0%p0M7N1N0j37
$$ plain form
3202 -79 -27 16 -19 11 -60 49 -19 -49 50 -36 -51 -54 10 37 55 -110 -21 -35 -19 28 -110 -47 70 27 -52 -4 -43 -24 63
3231 63 -51 -66 34 -14 8 -59 -14 40 16 -26 56 -30 38 8 19 65 -12 63 48 60 -1 9 -17 62 70 -3 40 -22 104
3260 104 23 -36 7 100 59 59 21 -8 78 74 4 12 8 69 98 0 -25 109 -2 59 15 25 26 29 7 13 -9 53 67 -6 24 -29
3292 -29 -56 113 15 -83 -5 34 -42 34 -66 -40 116 13 -90 -63 31 20 9 -88 -45 -23 61 -5 -126 -18 78 10 -25
3319 -25 -89 21 62 52 -58 -28 -23 105 47 -84 -55 -41 106 47 -112 -83 55 54 12 -97 -110 145 112 -18 -57 6
3345 6 58 113 -77 -76 125 138 97 -70 -20 39 129 29 -42 4 153 139 18 -24 8 115 143 -9 -73 63 50 35 -58
3372 -58 -100 55 125 -25 -67 -5 40 61 30 -161 49 60 43 -26 -104 -25 141 48 -117 -22 -49 70 -5 -135 -64 35
3398 35 28 -86 -96 -56 -26 25 -33 -105 -37 2 12 12 -71 -68 38 15 -73 -34 10 -35 40 -66 3 42 43 -56 -95 1 54 31 -39
$$ packed form
3202g9N2M3l5L0p1J09o8l0R9q6j5lO4K7J8j65Q9j4J6M7j38O3J17m3p9M8l9J9Q7
3231F3j14j5J00m8K2o7M5N4k4m2Q2q6O8l0J1M6p7P5j5J2o1J0k6P9Qp3M3o2J26
3260A04q1n9M3R3m1%l8k9Q6mp0QmO1K9r8k5J34j11O1m4J0JLk2Ok2O2J4p3L0n3
3292b9k7J69r8r8P8L9p6P6j00K6J56j03j03K7R4j1j1r7M3K2Q4o6j21J08R6o8l5
3319b5o4J10M1j0j10L0NJ28n8j31K9J4J47n9j59K9J38jm2j09j3K55l3j30l9O3
3345FN2N5j90JK01J3m1j67N0N9R0j00p1M6J49j4j21m2L2J07K8j52o4J36j3j5r3
3372e8m2J55P0j50m2O2M5K1l1j91K10J1j7o9p8P9J66r3j65R5k7J19p5j30P1R9
3398C5pj14j0M0L0N1n8p2O8L9J0%q3LJ06k3q8L9M4m5P5j06O9L9Jr9l9R6N3k3p0
$$ plain form
3429 -39 -46 84 80 -47 -85 53 34 53 53 -74 32 142 8 -22 -57 74 94 8 -51 80 12 25 -6 -49 3 40 55
3456 55 18 -41 -24 -26 -37 2 44 -3 16 38 -69 -15 -28 -13 14 -42 -52 55 56 -105 -84 -20 60 65 -66 -45 2 128 -41
3485 -41 -110 -21 60 107 -27 -75 -15 123 -25 -98 -49 123 72 -23 -62 -24 74 59 -9 -70 -8 101 72 -72 -44 -18 66
3512 66 41 -37 8 58 60 30 -74 -30 47 71 97 -10 -73 96 103 -12 -6 -36 75 127 -25 -91 16 86 28 -63 -85 68
3540 68 133 5 -122 -11 86 85 -42 -56 36 99 88 -91 -110 36 91 -10 21 -54 14 95 -30 -64 -39 77 72 -9 -39
3567 -39 -41 -31 -43 20 -82 11 93 -26 -45 -113 -5 51 -40 -95 -93 -16 78 16 -158 -31 40 37 -15 -86 -52 132 -19 -140
3595 -140 -76 -21 36 -47 -117 -49 76 -25 -43 -80 -13 76 -35 -38 -82 -2 13 -74 -51 -3 -2 72 26 -34 20 24 -15 -3 -6 -29
3625 -29 -12 23 -26 25 -27 17 38 31 1 -7 35 64 42 10 61 100 -1 -5 24 70 72 31 21 81 81 15 -4 41 192 63 -21
$$ packed form
3429c9pJ30mj27l8J38j9J9%j27J06J10j34l0l5J31K0q6n9J31o8J3l1m3N2L7J5
3456E5l7n9J7kj1L9M2m7J9K2j07N4j3J5K7n6j0J07Jj61K1O4Q0Nj31K1M7J26j69
3485d1o9Q9Q1M7j34m8O0J38j48p3M9J72n1r5l9L8R8j5o8o1O2J09k9j44K8K6Q4
3512F6k5p8M5N0Kl0j04M4P7K4K6j07o3J69Pj15Ol0J11N2j52o6J07P0n8r1k2J53
3540F8O5j28j27J11R7jj27j4R2O3j1j79j9J46N5j01L1p5O8Q1j25l4K5J16nq1l0
3567c9kJ0j2O3j02R3Q2j19j9o8J08N6r1n5KP7R4o2j74J27P1ln2p1L4J84j51j21
3595a40O4N5N7q3p0O8J25j01j8l7O7Q9j11lm4Q0J5q7K3M8JP4m6o0N4Ml9J2lk3
3625b9J7L5m9N1n2M4K1pl0qM2K9k2l2N1L9j01mK9M6Km1j0O0%o6j9M5J51j29q4
$$ plain form
3656 -21 14 68 71 4 18 33 79 57 22 -35 24 15 -52 39 -22 26 54 -38 -35 9 15 -66 18 -34 46 31 -58 -4 -9 -36 -29 -18 7
3689 7 45 -39 -43 -7 -19 -44 -81 -83 -2 -47 -61 -3 12 -46 -79 -36 33 6 -50 -98 -8 19 13 -60 -31 30 -3 -37 -41 -16 54 19 -83
3722 -83 0 31 -8 -14 35 -40 -3 -23 -59 -46 52 -4 -7 3 44 -24 17 1 -34 15 16 26 3 -2 -52 0 -30 51 7 -86 -41 48
3754 48 69 23 -6 52 111 0 -36 27 -12 35 -26 0 66 42 -8 -11 0 36 -64 4 -9 18 21 -10 12 34 49 -42 26 30 -30
3785 -30 -27 -2 9 57 11 -16 9 24 14 18 38 -43 35 -7 -19 -12 -23 52 31 -7 32 30 4 41 33 62 -16 -16 75 15 -48 -20 19
3818 19 22 13 20 -36 -20 -36 30 -42 20 43 -6 -72 -21 12 11 13 -75 9 56 40 -53 28 8 62 -3 -44 -2 14 -16 9 23 20 62
3851 62 76 29 38 -9 58 35 7 -8 32 27 23 -9 23 -1 5 118 -39 18 32 46 42 -40 -34 83 108 25 7 15 49 93 -14 -56
3883 -56 33 22 28 0 35 77 14 3 -25 -6 22 -8 -94 6 0 -2 15 -66 -45 -2 -70 18 -2 -84 -33 53 50 -43 -64 -8 109
$$ packed form
3656b1L5N4Lo7J4J5M6k2l5n7N9ro7R1o1M8K8r2LM4Oq1Q4n2Q0j5q9N4nk7PJ1K5
3689GL8q4mL6j2k5l7kQ1m5j4N8J5n8l3M3O9k7n6m8R0K7op3K9O1l3l4mK5P0l5j02
3722h3Q3L1l9oM9p5L7k0l6J3R8n6lJ0M1o8M1j6l5M9JJ0k3nn0N2l0Q1m4r3M5Q9
3754D8K1m6k9N8N9j11l6O3l9M7o1K6O6k4n0lJ1L6j00O8j3K7Ll1K2K2J5r1O8Mo0
3785c0LK5J1M8m6k7K5J5j0MK0q1P8m2j2Pj1P5k1l8L9kk6L7qK9p8%R1o0o3K8L9
3818A9LrPn6J6j6O6p2O2K3m9o6N1L3jKq8Q4M7j6r3Q1k0N4o5m1M2J6l0K5J4lM2
3851F2J4m7Rm7O7k3k8j5M0nml2L2k4OJ13j57N7J4J4mq2OJ17K5q3j8QL4M4j07m2
3883e6Q9j1Ok8L5M2o3j1k8J9K8l0q6J00okJ7q1K1M3o8Q8k0q2N1Q6lr3k1N6J17
$$ plain form
3914 109 -37 -4 -98 22 40 -16 -79 -35 46 37 -19 -45 -60 13 -45 -72 -41 -35 24 29 -51 -15 17 16 0 -86 39 3 -16 15
3944 15 19 58 74 0 -17 -24 5 88 18 -56 6 -1 15 44 -23 -16 45 -9 -10 -33 -1 70 -3 -36 34 19 11 9 -61 -48 21 -8 -7 0 27
3979 27 1 -5 -52 -16 11 20 -29 30 2 -8 -58 -44 -64 16 47 -40 -36 75 -46 -45 10 -46 -6 -50 30 -33 17 2 88 11 -12
4010 -12 -37 -20 31 64 -60 -94 23 74 51 -58 13 30 83 -35 -56 7 85 83 -26 -7 62 17 38 34 45 65 51 38 11
4039 11 9 121 -45 -18 9 19 21 22 -18 -14 23 -3 37 2 -48 43 -9 -30 12 -22 13 -2 27 -6 -55 -1 88 -6 -40 -3 77
4070 77 53 -50 -75 22 47 17 -97 -14 58 55 -58 -38 8 51 18 -85 -30 -30 38 -57 30 -80 8 35 -21 -29 -49 48 11
4099 11 16 -97 -13 11 69 -20 -41 -43 31 35 -37 -16 22 63 14 3 -11 23 70 7 -84 -28 19 61 -14 -28 -20 26 -17 2 6 -46
4131 -46 89 65 -49 -22 57 -65 61 -21 7 -22 2 -27 -16 -77 -10 14 3 -28 2 33 -2 -14 -93 1 40 46 -69 -7
$$ packed form
3914A09j46L3r4J20J8n6o3M4Q1rn6k6j5P3n8k7L1ON9Nq0L6L2jj6q6J25l6j9L1
3944A5ML9J6p4j7pK9Q3p0p4O2pJ6K9o7PO1n4jk3L2P1p3l3P0j5qkp0J3O9k9JPK7
3979B7k6om7L6K7Rm9N9k8j0n0J4k0Q0L1q7MJ11j21JN5n6M0m4Q0o3N0j5Q6p7k3
4010a2k5J7N1L3j24l4J17N1k3j09P1J7N3j18k1O3P8kj09J9O9m5K1mJ1K0j4j3k7
4039A1kJ12j66K7K7J0KJm0ML7k6M0l5n0R1n2k1M2l4L5j5K9l3m9N4Q9r4l4L7Q0
4070G7k4j03k5R7K5l0j14Q3P2lj13K0M6M3l3j03N5%O8r5Q7j10Q8K7n6qk0R7l7
4099A1Nj13Q4K4N8q9k1kP4Mp2K1L8M1m9j1j4L4M7o3r1N6M7M2p5j4QM6m3J9Mn2
4131d6J35k4j14K7P9j22J26q2K8k9K4k9J1o1O7K4j1l1L0L1l5j2p9R4L9Oj15O2
$$ plain form
4159 -7 46 44 -5 -20 27 65 53 3 -41 90 22 -8 3 5 87 39 -27 35 64 13 58 -56 0 40 -8 19 59 2 -7 -1 -26 49
4191 49 11 4 23 -2 46 -30 -19 -20 23 -27 -22 -48 2 -9 -18 -30 31 -5 -6 -9 -40 54 5 -20 -46 18 -26 -6 -31 2 22 -19 -45
4224 -45 15 -55 27 -63 -72 12 92 -4 -81 -9 -18 -33 -35 -36 -46 3 -11 -29 36 -9 -50 -26 30 28 29 -27 -36 32 31 11 10 -13 10 29 2
4259 2 18 80 73 42 -17 10 6 -49 -16 37 54 -8 -61 3 26 43 -38 -32 32 64 -31 -37 -24 39 -19 20 -16 -15 31 -48 -14 -18 9 -13
4293 -13 -31 16 4 -15 -23 7 27 10 6 -28 -27 -5 11 -4 -21 34 20 -69 17 44 36 -17 13 14 38 5 -19 -3 92 70 3 -36 19
4326 19 4 -59 -18 29 34 15 -57 4 46 6 35 -9 6 82 -22 8 21 42 23 -38 -50 42 -22 -11 26 29 52 -57 -23 3
4356 3 33 41 6 -12 55 52 -19 -57 -9 -32 3 13 -8 15 25 -25 -24 10 -7 18 -35 -13 34 -25 -28 -64 75 -3 33 -15 -2 0 1
4389 1 -30 55 -1 -8 -55 -22 18 -6 -16 -48 39 9 3 -10 22 10 -55 -16 -33 4 22 7 -15 -1 60 0 -18 40 40 3 -5 16 20
$$ packed form
4159gN3km9j5M7L8j2n0m4J31o8l0J1KQ2m8o6O2K9n1M5j14N6M0m8K7M0n7rOk5P5
4191D9l8pJ9k5M8p6J1jM3n0Nk6N0j1rj2O1l6jll1R4m9k5k6O4m4K0k5L3K0m1k6
4224d5O0p0Q2r0rQ4Q0r6p7P2rj5kjj0M9j4j8O5m5m1K4N6kJn6rO8jk0jk3K3J9k7
4259BJ6O2pl1n9K7mn5L3N3J7o2n3O4K3J7q1OO4L2r5oJ3O3n8L9l6JM6p9L4mK7k2
4293a3j8M7j2j9qL0K0j7ml4JK2J6j5j7N5j4q9Q6K7qn3L0JK4l3k4J6R5k2o7l9N5
4326A9j5o3M1M7Nj9p2O1M2m0K9m4J5P6j04L0J3K1j9o1j2R2o4J1L7LK3j09L4K6
4356CL0Ql5j8O7lp1l8M8k3L5J0k1K3J0n0JL4j7K5n3K2M7n9ll6J39p8L6m8J3KJ
4389Al1Q5n6pm7L3M0k4j0l2Q7l0oj3L2j2o5L9j7L7J8j5k2J4O1o0j8N8%l7qK1M
$$ plain form
4422 20 -6 -16 -35 16 -3 50 9 11 29 -20 40 13 -57 1 -18 -16 60 19 -88 -19 27 66 -40 -64 34 20 -9 -23 -26 63 57
4453 57 -16 -59 -26 8 16 26 -34 11 34 6 -50 -20 29 -28 -12 -23 34 -10 16 9 -43 -32 36 -10 -14 24 -47 23 35 34 -22 -24 -13
4486 -13 5 13 -20 17 1 42 -25 -38 -2 53 -9 -58 -18 19 22 -84 -61 -16 22 32 -58 41 5 34 -74 9 -40 64 -5 -70
4516 -70 16 -39 18 -51 -7 -29 24 -32 -41 28 -35 26 19 -42 -9 1 -15 -10 11 7 -23 21 48 25 -42 25 11 -17 6 -9 -18 78 -12
4549 -12 11 -3 -5 60 32 -24 45 50 -26 21 -26 74 78 -15 -40 28 95 27 47 -16 32 55 -29 -11 5 41 50 -25 -19 -51 -32 8
4581 8 -40 16 78 -25 32 5 -74 38 -17 -10 -34 -56 -5 22 3 -34 -39 11 31 15 -25 -7 40 45 -53 -45 7 29 26 -7 -17 -3
4613 -3 52 1 -64 -25 32 91 -4 -41 28 -19 29 -10 -28 32 43 42 -13 -15 27 19 -14 7 11 34 1 -9 41 1 -18 19 6 4 -13
4646 -13 6 -9 4 -59 1 56 32 -85 -78 14 32 63 -47 7 6 36 2 -20 -12 -8 42 -103 -43 61 19 -13 -25 -33 69 46
$$ packed form
4422B0k6j0j9N1j9N3m1KJ8m9O0k7p0N8j9KP6m1j07O9M6L9j06k4R8j4k9j4lQ9o
4453E7p3m3L3L4QJ0o0M5K3k8n6L0M9n7J6j1N7m4K6pn2J1O8m6mL8p1P0J2jn6kJ1
4486a3J8Ql3L7j6M1o7j3L6N5o2m9M0L7Lj06K3M5L8J0r0R9l6K9j08Q3m9J04o9o5
4516g0Q6n5N7o9M4k2N3n6rO9o3O1po1L3J0j6NK1ml0M4K7k3o7O7j4k8K3j5rR6r0
4549a2K3j4kO5k8n6O9Np6M7m7J00Mr3k5O8O7o8K0o3M8K3q4J8J6L6Rp5Ol2J9M0
4581Hm8N6O2j03N7k7p9J12n5Pk4k2N1K7j9l7nN0K0j6m0J8M7Nr8QN2K2ll3j0J4
4613cN5n1o5L9N7N9r5l7O9m7M8l9j8O0J1jn5kM2ql3K1MK3l3j0N0m0j9L7j3kj7
4646a3J9j5J3o3O0N5k4j17PR2J8L1j10N4jL0l4k2QMN0j45O0J04m2l2j2qJ02k3
$$ plain form
4676 46 -45 -37 -55 35 4 -24 -7 32 29 -4 -48 22 -7 -56 -17 -27 -43 -15 -11 -1 -36 -48 20 92 -16 -2 -18 -6 -39 27 -9
4707 -9 -24 42 7 -68 -6 17 60 -7 -20 -4 25 10 27 30 -18 9 -5 56 11 24 -7 3 -28 7 -12 -58 14 -30 -8 -34 3
4738 3 -8 -5 45 -14 -46 32 -49 -9 -16 -17 -13 31 -87 4 67 5 -18 28 10 -1 30 -51 35 44 31 -12 -19 53 -12 -35 -27 53 -10 -66
4772 -66 19 2 13 -6 -41 -5 43 13 -47 -11 -4 -7 -28 -36 12 21 -6 -21 -25 -26 -17 -31 -21 4 -37 -18 -4 25 7 -22 -15 -54 32 -17
4806 -17 10 -33 6 31 -51 -24 8 19 19 -26 7 -3 32 -29 -56 -3 11 -39 6 33 21 -29 -29 11 11 -34 -17 -44 -4 35 -15 -35
4838 -35 -64 16 29 -16 12 61 -3 35 -7 13 7 53 -71 17 12 -42 61 -24 35 11 -13 -13 -25 -8 9 0 -35 15 2 -24 27
4869 27 -23 20 2 46 -43 67 38 -12 12 34 5 -5 9 3 -17 -19 -35 -22 20 1 -57 -11 -48 20 -6 -18 -35 -18 8 -67 -56
4900 -56 8 10 -40 -1 32 -39 -27 -13 -36 -41 5 -39 3 24 -31 8 -17 -27 6 -56 -4 -40 -19 46 -8 -2 16 -50 -30 61 46 -1
$$ packed form
4676D6r1Qj8R0l1k8J7L9ll3m4P0k9m9L9j0j6K8MJ0l5j2O8P2j08J4j6J2l3O6l6
4707ij5O6l5p5O2K3M3o7j3J6K9j5J7Lm8K7j4O1m5J3l1J0l1L5j9m6P2m4K2k6L7
4738Cj1LN0n9l2P8q1M0pjMM4j18R1O3o2k3M6j8j1L1q1Q6Rj3m3pP2o5k3QQ0o3n6
4772f6Q5j7J1j9l5L6M8l0o0L6Plk1qM8Rk7j5mjRj4J0K5m1J9J4K9j8k9Pl9Q6m9
4806a7K7m3L9K5q2K7L2J1%m5L3j0L5o1k7N3J4n0M5K7j2n0%M0%m5J7k7M0L9n0k0
4838c5k9Q0J3m5K8M9o4L8m2K0oM6j24Q8nn4J03q5N9k4k4%j2J7J7rl5N0j3k6N1
4869B7n0M3j8M4q9J10k9n0K4K2k9j0J4ok0kj6J3M2j9n8M6l7O8k6j2j7J7K6p5J1
4900e6O4Kn0L9L3p1J2J4k3nM6m4M2K1n5L9k5j0L3o2N2l6K1O5n4OJ8o6K0R1j5m7
$$ plain form
4932 -1 3 -59 44 -20 -16 23 -1 28 57 -16 6 37 25 -3 -39 -3 39 18 -29 33 16 -11 15 -41 -32 -15 -3 5 13 20 40 16 -17
4965 -17 -69 9 5 14 -37 -9 -13 -13 21 -37 31 7 13 -9 -33 15 -5 17 -26 -6 -73 8 32 -32 -54 -20 -14 -29 5 -27 25 12 -77
4998 -77 -77 -52 39 11 -77 5 1 14 17 2 -16 5 -21 -54 -25 5 63 27 -9 36 49 1 -34 45 -21 -4 -9 8 45 -27 5 69
5030 69 4 16 -37 12 28 5 13 -29 34 21 52 8 6 49 17 -13 17 51 48 4 36 27 -8 -17 -42 -11 2 50 -29 -7 4 17 -15
5063 -15 -28 -18 41 16 10 -9 -30 16 15 48 -22 15 4 -3 -5 3 -42 36 21 -14 9 28 38 46 17 2 -12 -10 13 7 -19 6 23 22 -60
5098 -60 20 27 -2 -25 -38 -55 29 1 -68 -3 54 22 -2 -1 13 -23 31 -36 -18 -34 -17 -6 9 -58 -45 13 7 7 -39 -5 -2 47 -20
5131 -20 35 7 -27 33 -26 -17 -14 17 -34 -14 -18 56 9 -4 30 1 24 -22 16 -2 22 63 28 -27 -41 32 -2 -9 17 -33 24 -30
5163 -30 -7 -49 -11 11 29 -16 -61 -49 41 23 -4 3 43 72 3 27 -34 19 8 -28 -15 11 43 -58 -9 -42 7 -24 -34 -39 -50
$$ packed form
4932aMo2J03o4ML9k4K9K9p3K2L1j2k8l6L6M2k1m7O2j7k7K6n6RJ7J2QQPK0k4l3
4965a7n2P8mRn1K8m%L4n8O8k4Ok2k4M8k0K2m3K0o7Q1K4o4k2L4Oj5L4l2N2j3q9
4998g7%K5R1k8q8Q2mJ3Lj5j8K1k6l3K9L0N8l6l6M5J3m8l5P9o6J7nJ7L7p2L2O4
5030F9o5J2n3M9J6k3Qm2O3j3L1m4kM3l2l0L0L4lm4L2rl5rk5L1J3M8p9K2J1J3l2
5063a5j3J0N9k5oj9k1M6jL3p0L7j1pkQm5P8j5l5K3J9J0Qk9j5j4KK3ok6K5J7jq2
5098f0Q0Pk9k3j3j7Q4k8o9O5N7l2k4JJ4l6N4o7J8j6J7J1J5o7J3N8o%m6L4LM9o7
5131b0N5k8l4O0n9RLL1n1K0mP4m7j3L4k9K3m6L8j8K4M1l5n5j4P3l4pK6n0N7n4
5163c0K3m2L8K2J8m5m5J2R0j8k7PM0K9o9K4o1N3j1l6J3K6L2j01M9l3M9l1j0nj1
$$ plain form
5194 -50 29 -24 -36 -66 10 76 14 -2 12 45 70 41 24 11 42 -1 21 21 26 9 16 -17 5 42 52 -31 8 23 17 -13 31 3
5226 3 8 -19 13 42 21 18 -6 -13 24 29 -26 19 63 4 -62 38 20 5 -13 -38 41 -6 -42 -35 10 -28 6 -36 -26 18 -30 -16 5
5259 5 -7 -2 26 -9 11 -26 3 46 -18 26 -16 -29 -19 -26 0 22 12 18 47 24 -6 23 -16 8 -17 13 22 31 -13 -39 0 42 75
5292 75 -8 -1 25 47 24 20 -14 -13 40 -72 -57 -34 -8 30 12 8 -49 -14 -13 7 22 12 3 38 24 39 45 -6 0 -30 -7 1 32 33 -14
5327 -14 -41 -49 14 -44 -22 37 3 -2 61 -1 41 52 -4 -39 38 27 -34 -1 19 25 -82 -11 38 -17 12 48 14 -5 -11 -56 4 -22
5359 -22 -39 -2 13 -4 -19 -8 -13 27 -36 -63 -9 3 72 -1 -11 -5 31 69 -26 -8 4 54 -8 -1 -28 -16 9 -39 0 -19 -35 33
5391 33 42 -67 17 37 44 -31 -72 -8 -14 45 14 -22 45 45 -19 -37 -1 33 -38 -61 38 -13 -23 -6 11 -25 38 -9 -19 22 57 45
5423 45 5 -2 -30 -19 -17 -15 -38 -69 35 -32 -7 -24 -31 34 4 12 19 28 -1 -1 22 22 -21 43 25 28 22 -10 -45 19 9 -24 -21 -8 63 -14
$$ packed form
5194e0P9n3j2l0P6O6o2j6J4L3K5k9j7j3L1m3K2%Nj7Pl3K2L7J0q3L9J5ol0M4k8
5226CNk7L2K9k1lk4pL7Nn5M5M4n9o6J00j8j5j8k5P9m7l6PM5l8L4m2J0M4m8J4K1
5259Ej2NK8l5K0l7K9M3o4M4m2j3J0pK6K2j0OK9k3l0K9l9K4k5L0RRm4k6L9M2L3
5292G5q3PK6K2k3ml4JN3j12J5K3K6L8j8mn7L5JK0J5j0rL5j4J5On1Ol0K3QL1Jm7
5327a4k7qO3n8K2N9l4nO3o2M2J1n6l5P7j1o1L3K0Oj07P1M9n5K9L6l4j9om5O0k6
5359b2j7L7J5j7j5J1nM0o3k7N4J2O9p3j0OL6L8r5J8J2N0o2Pk7J2K5m8L9j9j6O8
5391C3Rj09Q4K0Pp5m1O4oN9l1l6O7%o4j8L6L4p1k3R9n1j0J7J7l6O3m7j0M1L5j2
5423D5m0pk8J1KKk3l1J04o7K5j7pO5l0QPRk9%K3%m3O4j8Lol2l5O4j0l3LJ3P1p7
$$ plain form
5459 -14 5 23 16 -30 -43 -16 9 40 3 35 32 -22 20 46 -37 27 12 13 -1 -2 -3 -1 74 -43 -33 22 31 29 39 2 13 39 -11 44
5493 44 24 17 6 3 19 -3 -2 -7 -5 -38 -32 2 -22 50 42 -18 -1 -11 23 0 -23 -35 15 31 14 -19 -16 25 -4 -15 46 19 16 -5 -46
5528 -46 -25 -13 25 -12 -46 15 9 -6 33 -19 -2 -21 7 -9 10 -13 -34 -3 -1 -4 18 4 1 -9 18 -50 25 42 -34 36 -40 12
5560 12 -19 -28 -6 10 2 11 -24 -3 16 28 -30 -19 -5 -14 -24 -45 -54 0 -15 6 25 -42 30 39 16 0 -30 -11 -12 53 -9 -39 -27 -35
5594 -35 -7 5 51 -33 -52 1 9 -8 14 17 -7 20 66 14 21 5 47 63 -82 19 -15 -17 62 26 -23 27 -4 -32 -3 -60 43
5625 43 -51 -58 -81 6 -21 -3 -22 -24 -55 5 -8 -43 23 29 -4 -18 40 44 -34 23 32 -21 45 -30 -7 -17 -34 61 -4 42 -19 -1 6
5658 6 43 33 47 37 -11 16 72 -22 20 53 34 -16 -43 4 20 43 53 -28 19 19 68 43 12 16 -11 7 -2 46 23 -30 43 -6
5690 -6 22 0 47 -6 -18 61 10 66 -23 7 30 -27 -31 -20 22 -41 57 13 -17 40 38 50 -57 -50 32 12 22 -51 9 -45 18 -9
$$ packed form
5459a4J9J8pm6j3K7K5L1l7L2ln4M2K6q3O4j5Jj4jjKP5j17J0N5RkJ0l7J1K6n0N5
5493D4k0pj1lJ6k2JnKl3OL4k4P2qo0J7j0L4k3k3j2N0J6j7l3LM1k9j1O1k7lk1m1
5528d6K1J2L8l7l4O1oj5L9n2J7j9K8j6J9k3k1L1KlK2j4lj0K7o8P5J7p6P0p6N2
5560A2l1rK2J6qRl5K1J9J2n8J1J4rj0k1rN4j5K1J9o7P2Rk3j6l0J9jO5o2l0J2q
5594c5K8J2M6q4j9N3Qj7K2Lk4K7M6n2Pj6M2J6j45J01l4kP9l6m9N0l1k8K9n7J03
5625D3r4pk3Q7k7J8j9kl1O0j3l5O6Ol3j4N8Mp8N7Rn3O6p5K3j0j7R5o5M6o1J8P
5658FL7j0J4j0m8K7N6r4M2L3j9n0k7M7J6K3J0q1M7%M9k5l1Mk7J8rM8k3n3P3m9
5690fK8k2M7n3j2P9n1N6q9L0K3n7mJ1M2o3R8m4l0N7kJ2j07PQ2k0J0p3O0n4O3k7
$$ plain form
5722 -9 -6 20 76 15 -3 -82 -47 2 9 12 -30 34 22 30 38 -48 45 39 -18 -51 -20 9 -25 47 -23 21 -21 36 19 13 23 -8 -16 33 4
5757 4 58 3 38 28 16 5 24 33 34 16 38 2 -10 26 -8 -22 62 -17 -6 21 -24 -29 29 18 36 32 -19 49 -1 -53 -24 -12 -37
5790 -37 -13 -45 4 -63 -4 36 -47 -28 -9 -38 32 -27 21 -13 26 49 -72 28 -7 -12 -12 8 -38 42 39 -15 -7 -7 34 -32 26 27
5822 27 40 5 -16 -3 33 0 62 32 -4 51 -8 11 5 -2 -49 -41 -25 9 -35 -6 35 19 -38 -19 10 42 10 34 -10 43 -4 14
5854 14 -50 23 31 -42 31 -17 41 24 28 -32 29 -10 51 -22 27 -45 3 -14 -20 4 26 -6 2 37 43 -34 -24 40 12 -15 -7 -14 27 36
5888 36 -18 2 -14 57 -9 5 60 10 -18 -54 -2 11 5 30 -12 34 50 -44 -5 -37 -18 9 8 9 2 23 8 -7 15 1 20 9
5920 9 8 19 22 -38 48 0 -60 14 19 72 7 35 -44 -8 24 -14 -51 35 62 -26 3 -19 5 18 45 25 9 -10 30 12 19 -11 -6
5953 -6 18 -13 7 -10 -12 39 -8 -52 -6 18 -19 23 9 26 32 82 19 13 -55 17 59 -10 16 10 20 0 45 13 36 -28 34 24 -33
$$ packed form
5722iLK6N6o1j8p9L5M9PLm2O4j2QQq6R3on7l3L1K9l4P2p0M4m2N7j7oJ0l1qM9k9
5757DN4n5L5j0j2j1J9RJj8K2l6j2L6l4j4Q4p9J1K7m5nN8j1J8mn1O8n0n2K9J2k5
5790c7K4l2M9o7N9M0q3J9J9k9P0n9M8l4L9K3j21J00l5n%K0m6Q0ln4Q%M1o6N8J
5822B7J3l5k1J3L6l3O2l0l6N5n9J9opm7QJ6L4m4K9M1j6n7J9K9L2l2K4m4N3m7J8
5854A4o4P3Qp3P3m8N8j7Mo0O1l9O1p3M9p2M8j7oK4K2l2QL5Op7J0O4k8k7QpM1R
5888C6n4K0j6P1o6J4N5n0k8l6N2J3oK5m2M6J6r4L9l2J9K7jJpK1j5j5K2j4J9j1
5920IjJ1Lo0Q6m8o0P4NN3o5K8p9L6L2l8l7Q6K7q8K9k2K4J3K7k0j6j9M0j8Pl0N
5953fK4l1K0j7kN1m7m4M6K4l7M2j4J7ON0o3oo8P2M2o9K6oJ0k0M5l2K3o4O2j0n7
$$ plain form
5986 -33 -8 -24 -5 -39 45 27 36 5 -37 20 60 26 -36 -7 28 -1 8 30 -4 2 24 3 15 22 15 -13 -61 21 27 -20 25 -14 26
6019 26 -30 -17 37 -34 -1 -7 -12 30 -24 -13 -20 -39 38 27 -14 -79 -4 18 -7 20 17 -5 -26 34 -36 25 -51 25 -7 -32 36 -11
6051 -11 -6 48 -23 -11 16 38 -46 -39 5 -26 31 1 -2 5 -27 -8 -7 11 4 -3 -19 -16 29 -9 -10 48 33 -31 -33 19 13 -5 17 41 -9 25
6087 25 26 -7 -9 -34 8 14 33 51 -4 -22 44 5 -54 -28 -19 18 -7 -15 -65 23 -17 36 -23 -14 25 40 -35 5 -21 -57 67 -9 -43
6120 -43 -4 -28 14 -17 8 30 19 9 -10 22 32 43 1 -3 8 30 20 13 -55 22 24 -29 17 15 21 23 18 18 -14 61 33 42 37 -44 12
6155 12 43 1 20 37 85 -38 -37 -12 30 -5 23 -20 -19 -2 30 -5 28 -6 54 1 -20 -42 44 43 31 -39 2 27 -6 20 20 7
6187 7 7 -44 -33 -10 -8 26 -10 -3 -27 35 58 -3 29 -6 -15 -20 -41 -4 -46 -5 -2 48 -2 -12 -14 -21 -1 -57 66 29 19 21 -38 6 -22
6222 -22 30 -10 43 31 -4 18 -13 -18 19 13 3 -21 4 69 -2 -39 29 -19 -66 55 3 2 41 44 27 -7 -16 10 2 -35 -19 25 0
$$ packed form
5986c3K5j6J9l4Q4j8Rl1m2N7M0l4o2K9L5k9RK2l4OK2k1J2Ppk8m8Q2Om7M5l9M0
6019B6n6J3N4p1L3onM2n4J1pj9P7j1m1o5P5K2k5K7lk2k1O0p0O1p6P6l2k5O8m7
6051a1NN4p1J2K7K2q4PM4l1N7l0lPl2J9JJ8ppj6LM5l8jN8j5o4kN2oj8K2K4n0L4
6087B5Jl3kk5M2OJ9J8n5j8O6l9n9K6RL7k5qn0Q8m0N3n9RL9J5p5M0k6l6J24p6l4
6120d3L9k4M2l1K5K2j1j0j9L2J0J1m2mJ1K2j0po8P7Kn3M6kOKn%l2P5k8Rnq1N6
6155A2L1m2J9J7M8j23JK5M2l5K8m3JJ7L2l5L3l4O0n3k1k2Q6jj2p0M1K5l3K6%j3
6187G%n1J1K3KL4l6Pk4O2K3o1L2l5rnk1L7m2M1LN0n0j0kpK0n6J23l7j0Kn9M4k8
6222b2N2m0N3j2l5K2l1nL7oj0k4K5O5p1l7O8m8m7J21n2jL9Lj7l4rK6ql7J6M4k5
$$ plain form
6255 0 24 -5 8 32 -50 1 13 20 19 59 5 16 -2 13 53 5 -1 -9 24 16 -53 3 -29 -56 -27 -21 -34 -13 14 -5 13 -5 18 43
6289 43 -4 -23 25 -57 -22 -53 -3 15 -34 41 1 -22 19 -18 21 26 29 -1 38 36 5 34 18 -6 3 4 -7 -2 -25 17 -40 -22 -14 19
6323 19 15 -21 14 -36 -29 -14 41 -63 19 -11 2 -13 47 -19 6 24 23 11 -20 32 -3 -3 6 1 -59 45 18 -21 -33 7 -4 -42
6355 -42 -28 -27 14 34 44 35 -21 -10 -24 -50 -13 -12 23 -34 -8 -11 -12 17 8 -28 5 8 -7 69 12 4 -4 33 48 33 26 -16 -40 4 29
6390 29 -16 4 -16 -4 -31 17 2 14 -31 -63 -75 7 36 12 -12 35 -21 -24 -7 -68 -42 -33 -14 -18 40 22 10 -32 40 35 23 41
6422 41 20 42 22 44 -6 9 7 33 44 12 2 4 -9 6 -21 6 33 -28 71 8 -15 -25 16 45 -31 15 13 -18 20 53 10 13
6454 13 30 -31 -30 7 14 15 -8 23 2 33 -21 -23 -24 39 18 -17 -46 2 1 27 -24 -14 23 -9 -22 33 30 12 -8 -33 -25 9 2 38 -16
6489 -16 12 -50 -4 24 9 4 16 9 5 29 -18 -33 12 18 -31 29 14 4 -4 22 5 31 36 3 4 19 -8 54 20 1 -2 -7 17 -49 -6
$$ packed form
6255@K4k9J3K4q2N1J2PjM0n4J1j8J5M0m8oqL3qo9N6l2k7K9Oj3K1K7j9J8j8K3K5
6289D3m7j9M8q2L5l1N0J8m9P5m0k3M1l7L9NLl0L9kl1K9j6k4RJj1Nk3M2n7J8QL3
6323A9ml6L5n0PJ5N5j04Q2l0J3j5O0o6K5J8jj2l1N2l5%Rno0J04k7l9j2M0j1l8
6355d2J4JM1K0J0rn6J1j4k6L7JL5n7K6ljK9rl6L3Lj5P6n7qqL7J5j5pm2k4M4K5
6390B9m5K0k0J2k7M8j5J2m5l2j2Q2K9k4k4M7n6lJ7o1K6RJ9mN8j8j2m2P2nj2J8
6422D1k1K2k0K2n0J5kK6J1l2j0Kj3J5k7K7K7o1R9o3k3j0M1K9p6M6kl1L8L3m3L
6454A3J7o1JL7PJk3L1k1L1n4kjO3k1l5k9M8jK6n1J0L7l2j3N5lj8k0k5QL4pL6n4
6489a6K8o2M6K8j5nJ2pmK4m7j5M5Om9O0j5j0qK6j7K6Nl3JJ5k7O2l4j9lnK4o6M3
$$ plain form
6524 -6 11 34 2 21 65 35 23 1 -2 9 18 22 48 -4 -39 -14 -11 39 -12 -35 37 19 35 -20 11 11 0 32 -38 41 -16 23 -31
6557 -31 13 -20 -22 13 49 6 53 -3 -9 0 -13 -40 -4 3 25 25 3 2 2 79 14 12 -36 23 -2 3 26 9 -9 41 35 13 -48 -9 -33
6592 -33 22 -22 3 -33 -37 -47 -24 32 11 -35 -53 -13 -47 19 18 -64 -4 36 -39 -13 -26 -12 0 -37 12 13 16 7 -10 7 43 -7 77
6625 77 -1 26 13 32 29 -46 -3 21 -17 42 5 25 -16 -47 30 -23 69 11 -38 4 43 6 46 -35 -29 -7 -61 18 23 37 -27 7
6657 7 31 51 55 -8 -6 8 12 26 23 23 5 16 -10 -12 18 8 2 9 -23 24 3 6 61 2 -41 -18 53 42 -1 -6 -1 -28 -36 2 1 -12 -1
6694 -1 -37 -17 -20 26 -33 1 -23 -57 10 8 4 -46 -6 2 -33 27 10 -1 58 35 48 -4 -1 27 57 -36 -41 -15 26 45 -15 14 -11 28
6728 28 19 20 19 44 2 1 -39 -2 7 -25 2 71 20 23 76 -30 0 -24 -10 -25 3 31 -1 11 36 -17 27 -23 3 -21 -12 14 -12
6761 -12 27 -18 9 13 -24 -10 6 16 -19 55 -45 -22 -18 -22 34 -8 -32 39 -29 -6 -13 -37 -39 -30 32 -21 -36 -5 -12 -8 -1 51 4 23
$$ packed form
6524fJ7K3l2J9M4l0j2k2lJ1RMK6n2l5K5LN0n1k3P2j8J6n5L1%j1L2p0P9n7L9n4
6557c1M4l3kL5L6m3M7n6oRj3k7L6PK2%k2j%P7o5km8N9k5NK3j7j8N0ok2o1L9k4
6592c3N5m4K5l6mj0K3N6k1m6j8M0l4O6jq2O0M0p5K6j3J4J2l7M9JLrj7J7L6n0Q4
6625G7p8K7j3J9lp5M3K4l8N9l7K0m1l1P7n3R2n8m9M2L9l7M0q1OK2n4P9NJ4o4L4
6657GK4K0Mo3KJ4MJ4l%j8J1k6kL0j0oPl2M7k1LN5n9m3K3P1j1m3nNk7qL8jj3J1
6694al6K0lM6n9L4k4l4O7kmn0M0Ql5O0j7j1N9k3J3n2LK8L0r3nK6M1J9o0K9k5L9
6728B8rJjK5m2jm0L7Rl2K7O9n1LN3j06L0k4J4j5K8K8l2J2K5n3M4n0K6k4RK6k6
6761a2L9m5K7Ml7J4J6J0l5P4j00K3MmN6m2k4P1o8K3pk4kRO2n3j5L1pMPN2m7J9
$$ plain form
6795 23 24 -57 -26 5 14 -16 -31 -46 39 -18 5 4 11 16 -21 -40 -16 55 4 46 6 -17 30 22 50 4 53 7 12 -36 10 7 -5 49
6829 49 7 15 46 -13 -24 29 5 32 10 65 -63 -2 -27 -27 -36 44 49 24 -25 -21 42 15 -46 20 -7 -6 6 64 25 -50 -19 4 5
6862 5 -27 -28 32 15 -16 -14 14 -20 24 -11 6 38 53 13 1 10 -16 -9 -23 41 -81 -4 30 46 -42 4 41 -34 -8 63 23 23 -7
6895 -7 -20 41 67 17 -10 -19 -57 -8 22 38 19 8 4 66 39 -54 -4 -6 28 24 19 0 -52 -8 46 25 0 8 -23 -12 37 -5 1 9 30
6930 30 -24 34 8 -17 -6 -28 48 42 42 46 18 15 -22 6 80 -41 33 -14 -16 -3 4 19 -19 -26 5 -17 -28 22 0 -3 63 47 -14 1
6964 1 7 24 -21 73 -2 -21 -36 -51 19 11 71 8 -6 -3 32 -11 23 11 35 61 -18 33 -48 -37 60 1 7 44 -7 14 -46 -6 28
6997 28 33 -50 -39 14 -23 30 -5 22 -9 3 6 7 2 -14 -25 -22 77 -2 42 20 0 2 8 -24 60 -5 -21 -26 24 8 -4 -3 9 14 -11
7032 -11 20 -9 36 37 20 -7 48 -2 22 -9 -1 10 -25 -1 -40 40 -17 -38 52 6 9 -25 -11 32 6 -33 -3 19 -41 18 4 47
$$ packed form
6795B3Jq1L1L1Rl0j5j5Q5n7K3jPNl7j9K4P1n1M2m0k3M7qK8m6M9m6Nm8M6lj2N4
6829D9m2QL1n9j1N3k4K7k2N5j28O1k5%rQ0Nk5m9MO3k7o1O6k7JJ2N8l9p5L1K3J
6862El2jO0j7l1KK8l4M4l5J7L2J5m0j2Rk6Pj4O4j22P7L4J6q8M6L7p5K6P1m0%l0
6895gj3O1K6n0k7rl8M9L0J6j9j1mO2k7r3N0kL4mnj9n2M4N4k1k5Ql1J1M9m2OQK1
6930C0n4N8k6k5J1k2P6o%Mk8ll7K8P4j21P4m7kJ3PJ5l8pL1k2j1N0k2lO6j6o1J5
6964AOJ7m5R4p5j9j5j5P0qO0o3j4LL5m3L4j2K4K6p9N1q1J1R7n9OL7n1K1o0M0L4
6997B8Nq3J1N3l7N3l5K7l1J2LJnj6j1LR9p9M4k2k0KOl2Q4o5j6nN0j6j2JJ2Nk5
7032a1L1k9M5Jj7k7N5n0K4l1QJ1l5K4l9Q0n7k1R0m6Ll4J4M3k6l9L0K2o0N9j4M3
$$ plain form
7064 47 25 14 5 -32 -2 16 -19 5 20 -18 57 -24 20 -23 -14 26 -18 -8 37 24 3 14 35 -19 -29 3 -50 -36 -21 39 48 19
7096 19 22 -18 -17 -9 4 -12 -23 -21 4 -31 0 0 18 6 11 -27 22 5 5 20 -10 25 1 14 -5 25 -38 -42 -17 19 2 -11 18 -29
7130 -29 10 -9 19 28 19 -17 36 -46 -11 -7 35 28 -9 19 11 17 22 12 45 39 -33 6 -46 3 13 29 11 -5 -4 23 66 -11 -15 18 15 46
7166 46 -10 11 15 26 -22 35 -5 29 18 -2 -35 -19 -1 -57 -30 -3 1 6 -34 55 -7 5 57 12 -29 27 -22 8 15 32 -4 -37
7198 -37 25 -48 8 -31 10 34 15 -22 7 67 -19 50 3 -5 -13 6 46 -35 -20 9 10 -10 -9 -1 3 -1 25 42 10 18 -40 40 -60 9
7232 9 1 6 1 54 12 -6 3 49 17 25 4 -38 21 -46 -32 13 -1 -13 12 11 -9 -9 39 -10 -6 -26 -50 -27 63 52 -9 -3 53 32 22
7267 22 39 41 36 -42 -22 2 -23 11 2 -36 -18 -2 -8 16 -9 8 -23 -19 -21 -37 -13 41 15 21 23 -3 10 16 28 9 -13 12 -27 30 29
7302 29 19 50 -25 44 55 36 -6 26 0 -28 6 45 32 -6 15 -3 0 8 16 -62 -6 17 31 12 -36 5 -30 -9 3 8 40 -33
$$ packed form
7064D7k2j1rl7L0J8l5K4J5l8P5q1M4m3RM0m4J0M5j3k1J1K1n4j0L2n3J4J5O0Rk9
7096A9Lm0JQJ3j6j1KK5l5L1%J8j2Nl8M9j7%J5l0L5k4J3j9L0o3mK5L6j7j3K9m7
7130b9L9j9K8Rrl6N3q2L5MM2pl7K8qONj0L3op2L9n2M9J0J6j8j6JK7M3p7mL3lL1
7166D6n6K1MJ1m8N7m0L4j1k0l3J6J8n6K7K7MNm0Q9o2J2N2m5m1N6m9L0PJ7l6l3
7198c7O2p3N6l9M1K4j9l7K9O0q6O9m7qqJ9M0q1J5K9Jk0JQMmK6J7l2Qn8Q0j00O9
7232IqNnN3m2j8RM6l2Qk1m2N9o7J4M5j4j2K5jk0%M8m9Mk0k4K3R0j1o1ON6k1j0
7267B2J7Knp8K0K4k5L4rl8J8J6oK4k5J7l1Mkj6K4N4k6OKk6J3OJ2j9k2K5l9N7j
7302B9j0L1p5O9J1j9m2L2k6k8L4L9j3l8K1j8LQQp8N6K3J4j9m8M1l5K1J2NL2p3
$$ plain form
7334 -33 3 63 21 20 79 8 91 2 22 11 9 0 15 39 24 20 7 -10 -25 -5 -28 5 25 -17 53 -11 20 -38 -75 2 0 17 2
7367 2 -4 24 12 -10 24 -12 19 0 14 23 -24 2 -31 -7 -17 -33 -15 -8 21 16 -35 7 4 -64 -29 -27 70 34 23 11 -31 21 -1 -21
7401 -21 -49 31 -3 20 -46 28 -6 -25 1 -27 14 -50 31 -3 -1 -24 -6 -3 28 -2 42 -4 -32 19 10 -8 14 49 -8 -19 -6 26
7433 26 50 11 -11 4 -39 22 -51 -17 32 -22 34 -16 -63 11 -57 -27 -1 -52 -32 0 -1 -40 19 15 17 27 0 -13 -18 39 -86 -5
7465 -5 44 -14 5 -4 -2 -17 -39 -13 21 0 45 -33 -22 51 -25 4 -13 -27 -44 17 17 -45 -2 -51 11 29 10 -21 -18 5 -26 17 1
7498 1 6 -64 -16 -6 -8 -14 -43 23 21 2 26 -19 8 -13 -21 -4 10 28 -29 20 -17 21 -44 -9 10 -18 29 -26 -20 29 14 -46 -2 -12
7532 -12 20 -48 21 -52 16 -31 1 -31 30 33 -16 -14 -8 -40 41 -7 62 45 -49 -2 -9 22 13 60 -7 -100 -39 -14 12 31 -29 21 -47
7565 -47 -2 -25 -30 -16 3 25 -18 -9 -17 29 -26 -78 27 -8 -37 -3 -45 31 -22 -59 -21 -17 -11 -27 -2 -25 -9 -6 -39 40 26 50 -95
$$ packed form
7334c3L6O0m2jN9p1Q3q9K0j1krJ5K4j5mj3j7j5K0k3L3K0m2P0o4L1n8l7P7kJ7j5
7367BoK8j2k2L4l6L1j9J4Rm7K6l3K4j0j6J8PK9nn1M2lo8L5KR7l6j1j2m2N2k2k0
7401b1k8Q0l4K3o6P4l4j9K6k8M1o4Q1l4Kk3J8LL1l0M4m6k8N1rj8K2L5n7j1J3L2
7433B6K4l9k2J5m3O1p3L4M9n4N6n0m7P4o8L0K6n1K0L2jl9N9mKJ0k7j3nN7j25Q1
7465eM9n8J9rKj5k2K6L4k1M5p8J1P3p6K9j7j4j7O1%o2M3m9O2J8j9l1LK3l1M3j6
7498ANp0M8J0kok9O6kj9K4m5K7k1qJ7J4J8n7M9l7L8o5L5J9k8M7n5OM9j5o0M4j0
7532a2L2o8O9p3O8m7L2l2O1Lm9KOl2Q1m8O9j7r4M7pL1rM7o7r3O1K5K6J9o0N0o8
7565d7M5k3nJ4J9K2m3RqM6n5n2J05l5k9L4m2P6n3l7L8MOj6K5k3J6Ll3P9j4K4j45
$$ plain form
7598 -95 -37 5 -15 -14 -25 1 -18 17 -10 47 -17 32 30 12 25 -1 2 2 -6 36 -23 -50 -31 -27 34 -37 9 -28 35 5 -16 14 -2
7631 -2 -7 18 -16 4 3 -3 -29 53 3 -23 31 -25 26 -29 48 27 35 -23 -6 30 -14 8 15 7 11 -20 17 8 28 -41 30 -5 -53 41 -22
7666 -22 29 28 -27 29 11 44 24 -9 -40 -26 22 -21 13 3 -33 27 -20 -21 1 -12 -45 -25 -63 55 -22 -19 34 2 5 23 -18 28
7698 28 -9 -49 51 19 15 14 16 10 68 -4 42 -8 58 51 8 -44 0 -4 8 -22 -8 35 -23 20 34 7 -1 -35 -15 -2 -45 3 -40
7731 -40 9 0 -10 -50 21 29 -12 20 43 22 10 -51 -24 12 -1 10 -13 12 -30 13 16 -10 32 33 -65 4 -2 15 -4 -42 -14 7 21
7764 21 -7 -39 7 1 12 42 -38 47 -10 -23 -30 -5 -25 -2 -19 -21 -15 1 34 -17 70 -12 8 33 15 59 -6 23 -15 -8 -36 -8 5
7797 5 -38 -22 6 -20 -24 -20 57 -28 68 -10 32 17 34 -23 3 32 -48 -7 -40 2 1 21 -24 -3 -18 -25 17 16 43 -28 7 -10 53
7830 53 -31 -20 21 15 16 47 2 -3 5 42 -1 15 43 0 17 8 -27 -12 -43 -22 -44 -25 33 -55 -8 -8 -23 -13 17 -1 23 -11 -39
$$ packed form
7598i5N8M2k0Jj1K6j9L5k7N7o4M9kj8J3k6L%qM2n9k7J9MO1p1M6l7O3l0k1L0j6
7631bnK5l4K0jok6Q2n0k6N4n6N1n5P7k1Qn8J7L6m4K2PqMl1L7rK0o9P1l5m8R4o3
7666b2N1jn5N6j8L3k0l3l1J4M8m3L4j0l6O0m7jK2j3l3K0l8J18p7LN3l2LJ8m1M6
7698B8l7m0J00l2mjKoN8p2M6n0O6pm3n2M4mJ2l0J4M3n8M3J4k7ql4K0J3m3M8m3
7731d0M9rj0m0P1Qm1L2K3k1j2o1K7L6j3J1k3K5m2M3Lk6M2Jr8O9oJ7j9l8K8K1J4
7764B1k8l2M6oJ1L0q0Q5n7j3pK5k0K3j7kOJ6L3n1Q7q2K0K5j8M4o5K9l8Pk8K8J3
7797Em3J6K8k6mMP7q5R6p8M2j5J7n7K6K9q0M1l3M2jK0m5K1j5pM2jK7p1L5j7O3
7830E3q4J1M1oJL1m5nQL7m3J6K8m3J7rl5J5l1K1k2J9N8q8M7%j5J0L0j8K4l4k8
$$ plain form
7863 -39 22 -20 -9 -2 18 -5 7 3 23 -9 -26 22 -11 33 -26 -22 47 -39 27 -7 -34 -32 28 10 -84 -77 -33 -11 -21 -69 -2 20 -18
7896 -18 -9 2 -50 -15 -2 -13 14 8 31 -24 13 -27 6 -4 5 2 1 22 -9 -25 41 -18 49 -54 -29 -3 -11 30 -22 37 4 -2 -28
7929 -28 0 -1 -54 15 -30 -47 -38 -31 4 -11 26 3 -12 -34 67 -40 -9 13 4 -10 -29 -7 -37 7 -32 -19 13 20 42 -23 -9 -3
7961 -3 -5 1 21 -36 32 29 7 -17 2 20 67 -26 -15 35 -38 11 -2 -50 -17 46 15 19 34 -13 -33 20 -8 -39 44 -9 -11 -2 38 30
7995 30 9 -37 32 13 -15 -47 3 -5 -4 -6 0 18 0 -67 18 10 -2 -3 -9 -47 -39 -36 -24 6 -19 32 -46 7 -6 17 -11 36 -35 -17 32
8030 32 -49 38 15 -19 -20 -3 -36 -27 -1 15 -14 18 -35 19 5 15 -22 -7 21 -32 -12 16 -29 -45 -15 15 -3 15 30 1 20
8061 20 -19 -35 -50 13 -31 -31 1 -17 25 -23 11 28 22 39 9 45 -27 -32 13 53 -25 8 8 37 50 -1 -24 -18 28 -21 9 -24 31
8094 31 41 -27 -30 12 10 -24 -6 -3 -7 -16 -11 -2 23 -79 -25 11 -2 21 14 -8 13 -17 -4 -12 -4 -8 12 -49 -4 -9 13 -34 -48 -7 25 -17
$$ packed form
7863c9O1m2J1PK0k3J2mK0l2j7M8l3M4n9MO9q6O6l4k7KO0j8r4PM4K2j0m8O7K2l8
7896a8RJ1n2L5J3j1K7oK3n5L7m0L3j0RljK1l1j6O6n9O7j03K5K6qM1n2N9l3ok6
7929b8K8jn3O9m5j7RPL5j5L7k3j5k2J01j07L1K2rj4j9K2l0M4l9J3L2PK2o5J4O
7961ckOK0n7O8lk2k4J9J8M7r3J1N0p3M9j3m8L3O3l1MJ5m7k0N3k8l1Q3n3kRM0q
7995C0k1m6O9j9k8l2N0qJkOJ8j8o7Q5qj2jol8QLJ2L0k5N1p8N3j3K3k8M7p1J8M9
8030C2q1Q7k3l4jJ7l3RK6J6k9L2n3N4j4J0l7J5K8n3K0K8m5j6L0L0j8J8J5k9J9
8061B0l9j6j5O3m4%L2j8M2m8L4J7oJ7l0L6p2nM5M0p8L3%K9J3n1k3OM6m9L0l3N5
8094C1J0o8lM2kl4J8LmrNRK5j02N4L6j3K3pk2K1l0J3qQmK0o1M5nK2m7j4M1L2m2
$$ plain form
8130 -17 -4 64 13 46 28 -41 3 -10 -32 -48 19 -16 -1 -4 -32 4 62 -9 18 23 -33 -41 46 -9 90 -20 10 10 -31 -31 -14 11
8162 11 3 -13 0 -64 11 49 19 11 23 7 -17 -10 4 -7 14 -13 48 -4 -30 4 12 5 23 14 11 -39 -1 -14 -20
$$ packed form
8130a7J3O8n1L3j8o9M4j3k2j6O7l5J5lk8L6N8p1K7Nn6qQ7n5R9j10L0%m1%J7K5
8162A1qj6J3o4P5L8l0qJ2j6k4PJ4j1K1k7O1n2k6L4QpJ8rln0L8j3o
8191b0
$$ Imaginary data points
##PAGE= N=2
##DATA TABLE= (X++(I..I)), XYDATA
$$ plain form
0 0 0 0 0 0 0 0 0 0 0 0 8 -8 8 -8 8 -16 16 -24 24 -32 40 -45 50 -63 72 -82 96 -112 128 -146 168 -191 216
33 216 -244 274 -309 346 -388 431 -481 535 -592 656 -726 805 -886 978 -1080 1188 -1309
50 -1309 1440 -1587 1751 -1932 2138 -2368 2633 -2940 3297 -3723 4236 -4875 5689 -6764 8261
65 8261 -10480 14105 -21022 38794 -177300 -331943 94749 33793 -35863 -188056 -136055 165649
77 165649 82528 -169431 -126746 61011 128487 -69902 -140071 -8274 92670 14100 -143477
88 -143477 -74806 88006 31402 -91339 -75634 50157 62137 -50971 -105099 7542 101744
99 101744 -24391 -113188 -504 81791 32631 -103732 -93899 75883 69056 -75480 -116597
110 -116597 6428 106245 -27712 -143683 -54690 73737 58047 -104840 -113353 56175 79321
$$ packed form
0@%%%%%%%%%%Qj6J6j6J6k4L2m0M8n6P2q5R5j13J35j54J78k08K40k74L14l59M07
33B16m60N18n83O55p34Q19r12J016j127J248j382J531j691J864k058K268k497
50a309K749l027L338l683M070m506N001n573O237p020P959r111J0564j2453J5025
65H261j8741K4585l5127N9816k16094j54643M26692o0956o9656j52193N2001L01704
77A65649q3121k51959M2685J87757O7476j98389p0169J31797J00944p8570j57577
88a43477O8671J62812n6604j22741J5705J25791J1980j13108n4128J12641R4202
99A01744j26135q8797J12684Q2295m9160j36363R833J69782o827j44536m1117
110a16597J23025R9817j33957j15971Q8993J28427j5690j62887q513J69528K3146
$$ plain form
121 79321 -41991 -116093 -28955 97222 22076 -97978 -50437 57874 56018 -60075 -85412
132 -85412 26701 66504 -21479 -72432 -5128 64820 13885 -73380 -33103 61531 40354 -42967
144 -42967 -42897 40415 67844 -23142 -60806 15807 64782 25228 -54817 -24683 71049 32489 -46400
157 -46400 -39308 20556 60513 -11242 -65318 12988 53885 2660 -49100 -30139 48206 39564
169 39564 -42096 -38065 32307 46047 -17632 -58322 3812 59538 6461 -50748 -19767 48881
181 48881 38857 -47124 -50493 35310 54008 -11527 -55085 -2760 65897 15380 -57600 -25352
193 -25352 45938 50018 -23967 -47135 28038 58823 -2174 -44995 -4253 55978 27933 -35630
205 -35630 -17662 38447 37004 -22519 -37259 25223 47981 -7129 -38042 4147 49125 13603
$$ packed form
121G9321j21312p4102Q7138J26177p5146j20054M7541J08311j856j16093k5337
132h5412J12113L9803q7983n0953O7304O9948n0935q7265M0277R4634k1177q3321
144d2967P0Q3312K7429r0986l7664P6613M8975l9554q0045L0134R5732l8560p8889
157d6400P092N9864L9957p1755n4076P8306M0897n1225n1760J8961P8345q642
169C9564q1660M031P0372J3740o3679m0690O2134N5726n3077n7209L0981O8648
181D8881j0024q5981l369Q5803J8698o5535m3558N2325O8657n0517p2980L2248
193b5352P1290M080p3985k3168P5173L0785o0997m2821M0742O0231k8045o3563
205c5630J7968N6109j443n9523j4740O2482K2758n5110l0913M2189M4978l5522
$$ plain form
217 13603 -48164 -19789 45665 35274 -30023 -43927 23853 53485 -12726 -57584 -9023 52108
229 52108 27323 -50466 -41523 37293 40586 -24520 -56398 -3647 56284 9999 -56216 -22563
241 -22563 35520 28859 -29360 -47510 18771 44697 -10889 -39552 -4221 37778 11817 -41603
253 -41603 -16606 36138 21817 -23755 -29559 21242 39755 -19217 -40333 10682 42508 8882
265 8882 -40979 -18092 44589 27744 -34994 -35277 21944 48561 -6070 -48589 -3379 44976 17847
278 17847 -38828 -31744 30518 38302 -19230 -39142 2721 37062 5316 -40766 -14499 30709
290 30709 16792 -23327 -26002 13699 26734 -15857 -29891 7757 26052 -359 -29508 -6116
302 -6116 30006 8818 -28950 -16678 25835 26954 -19194 -29964 15141 35654 -1119 -35304
$$ packed form
217A3603o1767K8375O5454j0391o5297j3904O7780K9632o6211m4858M8561O1131
229E2108k4785p7789Q943P8816L293o5106l1878N2751N9931m6285o6215L3653
241b2563N8083o661n8219j8150O6281K5926n5586k8663L5331M1999k5961n3420
253d1603K4997N2744j4321m5572n804N0801J8513n8972k1116N1015L1826l3626
265H882m9861K2887O2681j6845o2738k83N7221K6617n4631m2519M5210M8355k7129
278A7847n6675P084O2262P784n7532j9912M1863L4341l1746m6082K6267M5208
290C0709j3917m0119k675L9701J3035m2591j4034L7648J8295k6411k9149K3392
302f116L6122k1188l7768J2272M2513J119m6148j0770M5105K0513l6773l4185
$$ plain form
314 -35304 -5558 40386 19636 -27592 -22141 24070 35675 -10051 -33748 8303 37904 8704
326 8704 -25839 -13135 28800 24071 -18822 -19613 16066 26636 -2892 -23999 3234 26907 2518
339 2518 -19945 -7580 21119 16645 -21628 -16451 18616 16836 -10292 -24092 982 29917 124
352 124 -31491 -6916 21906 14873 -19987 -26859 14763 27549 -9874 -28143 -2595 26077 9538
365 9538 -27466 -15385 19072 16866 -13492 -24770 6085 23234 -6543 -23432 -2265 16491
377 16491 6251 -20827 -13176 17550 9604 -16603 -16390 7709 17719 -8411 -24428 1772 21009
390 21009 457 -23968 -11803 17908 12234 -18677 -23203 6530 21272 -7043 -28551 -5607
402 -5607 19208 6236 -19755 -17749 11873 17903 -10544 -19954 1870 17144 1915 -17944 -6077
$$ packed form
314c5304K9746M5944k0750m7228N451M6211J1605m5726k3697M2051K9601k9200
326H704l4543J2704M1935m729m2893p91L5679J0570k9528k1107K7233K3673k4389
339B518k2463J2365K8699m474l8273N177L5067j780k7128j3800K5074K8935k9793
352A24l1615K4575K8822p033l4860o872M1622J2786l7423j8269K5548K8672j6539
365I538l7004J2081L4457k206l0358j1278L0855J7149k9777j6889K1167J8756
377A6491j0240k7078P651L0726p946k6207K13K4099J0010k6130j6017K6200J9237
390B1009k0552k4425J2165K9711n674l0911m526K9733J4742k8315k1508K2944
402e607K4815j2972k5991K006K9622O030k8447r410K1824J5274j5229j9859J1867
$$ plain form
415 -6077 15135 7316 -12182 -11224 9111 13023 -9181 -12272 6480 13821 171 -15839 -1223
428 -1223 20024 4997 -14450 -4704 15357 17428 -7992 -15839 12288 21482 449 -14740 -2240
441 -2240 21989 13441 -16177 -11176 13454 15822 -3663 -16999 2258 19219 2463 -13098 -5951
454 -5951 10533 11969 -8347 -10703 9481 9925 -3787 -9452 -399 10624 278 -12064 -2277 9570
468 9570 3311 -11247 -10387 7478 8705 -9255 -12713 2608 12690 -32 -15536 -5089 13189
481 13189 8005 -9282 -9846 8498 15533 -3006 -13382 919 14351 4477 -10755 -4617 10317
494 10317 9672 -5839 -10413 5915 12753 -1443 -7321 2678 11507 5497 -7836 -2092 11174 7038
508 7038 -4238 -3860 7930 10863 -2931 -8365 3970 10290 2325 -8726 -3040 12521 5497 -9407
$$ packed form
415f077K1212p819j9498R58K0335L912k2204l091J8752P341j3650j6010J4616
428a223K1247j5027j9447R746K0061K071k5420p847K8127R194k1033j5189J2500
441b240K4229q548k9618N001K4630K368j9485j3336J9257J6961j6756j5561P147
454e951J6484J436k0316k356K0184M44j3712n665R053J1023j0346j2342R787J1847
468I570o259j4558Q60J7865J227j7960l458J5321J0082j2722j5504J0447J8278
481A3189n184j7287n64J8344P035j8539j0376J4301J3432r874j5232O138J4934
494A0317o45j5511m574J6328O838j4196n878R999Q829o010j3333N744J3266m136
508G038j1276L78J1790K933j3794n434J2335O320p965j1051N686J5561p024j4904
$$ plain form
522 -9407 -5353 4472 9137 1090 -10975 2315 13680 1154 -5629 -1963 7264 9816 -3337 -5000
536 -5000 7945 8565 -847 -6111 1137 10921 2944 -7057 -452 10487 7302 -6339 -6564 7994
550 7994 11249 -1379 -7600 1236 13292 5414 -11092 -4361 10300 8061 -3651 -8159 2839 11358
564 11358 -826 -10741 -2634 7329 4054 -6929 -6054 3179 4544 -4344 -8798 43 4048 -2601 -5465
579 -5465 -1766 2114 -905 -8654 -4323 3774 -738 -7980 -5817 2819 3076 -7521 -11560 -713 7142
594 7142 -1733 -12418 -6238 7244 4145 -9702 -12844 -12 10524 -845 -14446 -4309 7930
607 7930 4058 -6389 -12032 1275 11166 -1684 -9289 -2086 5545 3927 -5566 -5953 3289 5107 -242
622 -242 -3618 629 4569 -779 -2231 2250 2721 629 -552 1494 5315 716 -5177 1556 6817 3045
$$ packed form
522i407M054R825M665q047j2065J3290J1365j2526o783L666R227K552j3153j663
536e000J2945O20r412n264P248R784p977j0001O605J0939l185j3641k25J4558
550G994L255j2628o221Q836J2056p878j6506O731J4661k239j1712m508J0998Q519
564A1358j2184r915Q107R963l275j0983Q75R233J365q888m454Q841M005o649k864
579e465L699L880l019p749M331Q097m512p242K163Q636K57j0597m039J0847P855
594G142q875j0685O180J3482l099j3847l142J2832J0536j1369j3601J0137J2239
607G930l872j0447n643J3307R891j2850p605P203P631j618r493l87R242J818n349
622b42l376M247L940n348j452M481M71k092j181K046L821m599n893O733N261l772
$$ plain form
638 3045 -2666 -2842 5546 7698 -2283 -6682 1105 8324 4154 -5943 -3990 5478 6706 -1452 -7812
653 -7812 -235 8335 3534 -4541 -3884 3414 5838 -1505 -5475 198 4869 2570 -3217 -2122 2526
668 2526 1326 -1715 -1855 668 2003 -553 -1686 1499 624 -2531 -1384 1385 2443 -1034 -3055 1352
684 1352 3516 -641 -4154 -1576 4412 2600 -4072 -2270 1919 3212 -1003 -6274 -239 5338 -165
699 -165 -3763 -1828 1746 3086 -2990 -4545 2062 3550 -616 -3137 -106 3357 703 -3252 -1373
714 -1373 2716 3241 -1633 -3153 2722 2978 -1227 -2436 -482 3809 2642 -3326 -1258 3711 2102 -1381
730 -1381 -2422 1842 4579 202 -2488 682 4151 1520 -3284 -773 4651 2661 -2011 -2089 2400 4589
746 4589 -1732 -4624 1552 5255 851 -4409 -1820 4838 3323 -4037 -4027 2507 5737 -593 -5548 -318
$$ packed form
638C045n711j76Q388K152r981m399P787P219m170j0097J953R468J228q158o360
653g812P577Q570m801q075O57P298K424p343l970N673M671k299n787J095M648
668B526j200l041j40K523J335k556j133L185q75l155J147K769J058l477k021M407
684A352K164m157l513K578N988j812o672J802M189J293m215n271O035N577n503
699a65l598J935L574J340o076j555O607J488m166k521L031L463k654l955J879
714a373M089N25m874j520N875K56m205j209J954M291j167n968K068M969j609l483
730a381j041M264K737m377k690L170L469k631m804K511N424j990m672p8M489K189
746D589o321k892O176L703m404n260K589O658j515p360J0O534L230o330m955N230
$$ plain form
762 -318 4764 1734 -4336 -3734 3034 4340 -2045 -4328 85 3396 396 -4055 -1711 2619 1746 -2219
778 -2219 -2740 1279 1745 -2263 -2280 858 1608 -157 -3290 -379 3418 -814 -3889 -813 2618 2286 -2835
795 -2835 -4266 2455 3863 -1836 -4688 -864 4996 2185 -4636 -3326 2865 4204 -1610 -5507 330
810 330 4999 894 -3345 -2706 2471 3642 -2041 -3097 1475 2944 398 -1817 -613 2348 603 -1514
826 -1514 171 1434 971 -855 -587 2111 1166 -1907 -608 2115 2467 -672 -2460 1289 3250 609
842 609 -2666 -1267 3523 3036 -1893 -2689 1187 3523 597 -3583 -1215 3248 2118 -2000 -2665 1010
858 1010 2540 -79 -2620 -466 2537 1023 -1889 -629 1444 382 -846 -1225 482 1425 -1509 -1994
874 -1994 854 863 -1384 -2195 -503 2091 -435 -3035 -1018 1180 1166 -2381 -3165 1104 1997 -1439 -2799
$$ packed form
762c18N082l030o070O02O768J306o385k283M413L311l000m451K344M330q73l965
778b219n21M019M66m008j7L138P50j765l133K911L797m232l075L076L431l32n121
795b835j431O721J408n699k852L824N860k811o821J310O191J339n814l897N837
810C30M669m105m239O39N177J171n683j056M572J469k546k215J204K961j745k117
826a514J685J263m63j826K68K698r45l073J299K723L52l139j788L749J961k641
842F09l275J399M790m87m929p96L876K336k926m180K368M463j130m118o65L675
858A010J530k619k541K154L003j514k912J260K073j062j228l79J707R43k934m85
874a994K848Rk247q11J692K594k526k600K017K198j4l547p84M269Q93l436j360
$$ plain form
891 -2799 -1317 1887 694 -3589 -1927 1213 769 -1206 -2905 -795 2045 -934 -2807 -288 812
906 812 524 -1434 -1895 1443 1267 -1814 -1369 901 1610 -109 -2327 -254 2588 904 -2481 -1579 2544
923 2544 2350 -1117 -2191 634 3385 1262 -2655 -867 3317 2461 -1122 -1649 1443 2897 515 -1789
939 -1789 260 2831 1120 -915 -193 1566 1699 -307 -1075 1612 2090 -837 -481 1160 1349 759 -1288
956 -1288 -327 3035 912 -1997 -184 1576 1879 -929 -2575 915 2852 174 -2755 -1116 2605 1689
972 1689 -2070 -2243 702 2853 195 -3581 -741 2386 574 -1705 -2053 155 2251 -847 -2730 320
988 320 759 -366 -1404 -1290 1083 347 -2057 -797 804 204 -1183 -1811 647 1566 -1051 -2038 102
1005 102 1806 -66 -2088 -875 1709 1131 -1476 -1993 734 1998 -691 -2111 -147 2001 863 -1521
$$ packed form
891b799J482L204j193m283J662L140m44j975j699K110K840k979j873K519J100
906H12k88j958m61L338j76l081M45K270P09j719k218K073K842j684l385R02M123
923B544j94l467j074K825K751k123l917J788M184q56l583n27L092J454k382k304
939a789K049K571j711k035P22J759J33k006p68K687M78k927L56J641J89n90k047
956a288R61L362k123k909J813J760L03k808j646L490J937k678k929J639L721r16
972A689l759j73K945K151k658l776K840L127j812k279l48K208K096l098j883L050
988C20M39j125j038J14K373p36k404J260J601o00j387o28K458R19k617r87K140
1005A02J704j872k022J213K584n78k607n17K727J264k689j420J964K148j138k384
$$ plain form
1021 -1521 -1323 1599 1871 -938 -1340 662 2012 771 -1283 -559 2045 1329 -1163 -268 1395 1371 147
1038 147 -955 393 2329 -52 -1376 854 1610 1037 -912 -889 1940 1738 -971 -1044 855 1887 243
1055 243 -1808 -160 1514 446 -1151 -1093 1017 1144 -1303 -1243 706 606 -240 -1634 -489 2039 -297
1072 -297 -2048 -478 769 909 -1087 -2255 757 1833 -851 -1882 -800 1294 806 -1801 -1644 909
1088 909 1360 -728 -1907 -478 1448 332 -1455 -889 837 1133 -664 -1307 74 1062 -47 -827 -188
1105 -188 626 97 -700 -152 463 54 -887 -44 1021 280 -1122 -946 1135 1400 -949 -1569 682 1898
1123 1898 580 -1854 -1354 1917 1863 -950 -1929 371 2290 721 -1723 -1223 1169 1936 -124 -1933
1139 -1933 167 1680 586 -483 -1092 320 1885 160 -930 407 397 610 314 -557 90 511 298
$$ packed form
1021a521J98K922K72k809m02K002J350j241k054P24K604p16k492Q95J663k4j224
1038A47j102J348J936k381j324K230P56n73j949K3K829k02k709p3J899J032j644
1055B43k051J648J674j068j597N8K110J27k447O0J949j00q46j394J145K528k336
1072b97j751J570J247J40j996j168L012J076k684j031J082K094m88k607J57K553
1088I09M51k088j179J429J926j116j787N66J726K96j797o43J381R88j109p80O39
1105a88Q14n29p97N48O15m09r41Q43J065p41j402J76K081K65k349o20K251J216
1123A898j318k434N00L271n4k813r79K300J919j569k444N00K392P67k060j809
1139a933K100J513j094j069o09J412J565j725j090J337j0K13k96q71O47M21k13
$$ plain form
1156 298 526 85 -596 -258 661 905 -688 -1096 544 1137 710 -1380 -1600 1379 1860 -911 -1681 -147
1174 -147 1582 1350 -1829 -2056 1143 1848 -280 -1998 -797 1508 948 -1523 -1587 159 1318 57 -1504
1191 -1504 -530 593 347 -534 -711 -150 521 156 -275 -81 -135 -278 61 326 -236 -272 17 359 472 -644
1211 -644 -928 348 970 -16 -813 -337 819 908 -545 -1146 240 1593 240 -1027 -207 842 909 -289
1229 -289 -1239 466 1671 -170 -584 90 579 835 -415 -673 884 735 -332 -33 205 505 61 -383
1247 -383 337 585 244 -208 -83 694 145 -702 185 467 165 190 -518 141 698 -456 -521 333 312 156 -302
1268 -302 -298 514 105 -529 -531 215 597 -373 -671 137 275 -166 -668 -786 515 542 -875 -712 56 227 -171
1289 -171 -840 -697 615 423 -751 -591 60 201 -361 -644 -332 368 86 -593 -241 18 -174 -431 -6
$$ packed form
1156B98K28m41o81L38R19K44j593m08J640N93m27k090k20K979M81k771p70J534
1174a47J729k32l179k27L199P05k128j718J201K305n60k471o4J746J159j261j561
1191a504R74J123k46q81j77N61O71l65m31J94n4j43L39K65n62l6K89L42J13j116
1211f44k84J276O22r86p97M76J156Q9j453o01J386J353j353j267Q20J049O7j198
1229b89r50J705J205j841m14O74M89K56j250k58J557j49j067K99K38L00m44m44
1247c83P20K48l41m52J25P77n49q47Q87K82l02K5p08O59N57j154o5Q54k1j56m58
1268c02MQ12m09o34kP46L82r70k98Q08J38m41n02j18J301K7j417J63P68J71l98
1289a71o69J43J312j92j174J60O51J41n62k83L12P00k82o79L52K59j92k57M25
$$ plain form
1308 -6 217 -35 -405 -32 487 112 -686 -539 925 741 -410 -508 128 1131 416 -1234 -280 1213 613
1327 613 -64 -776 -201 1298 178 -1009 -221 516 863 245 -1003 7 699 97 -55 -396 67 662
1345 662 -35 -188 -86 -401 148 159 -43 80 -603 49 715 -344 -742 -376 301 944 -355 -1344 165
1364 165 857 187 -915 -1273 729 1355 -552 -1345 -294 751 708 -1117 -1365 535 971 -287 -1023 -486
1382 -486 359 469 -525 -779 124 362 0 -262 -327 -294 -92 107 100 -214 -373 -105 284 371 -788 -708 632
1403 632 674 -155 -630 -380 815 933 -988 -716 813 1030 399 -785 -511 1334 959 -632 -512 417
1421 417 1458 511 -994 72 1074 697 -54 -351 729 1112 59 28 467 667 569 -264 609 1217 -5
1440 -5 -117 553 651 628 -209 -568 1293 1044 -517 -419 290 846 472 -871 -290 1096 547 -328 -665 220
$$ packed form
1308fK23k52l70L73N19l75p98J47J464j84j151r8O36J003p15j650R54J493o00
1327F13o77p12N75J499j120j187P88P37L47o18j248J010O92o02j52l41M63N95
1345F62o97j53J02l15N49J1k02J23o83O52O66j059l98L66O77O43j299r89J509
1364A65O92o70j102l58K002O26j907p93J051J045m3j825k48J900M36j258p36N37
1382d86Q45J10r94k54R03K38l62k62o5L3K02J99pl14j59K68L89Q7j159Q0J340
1403F32M2q29m75K50J195J18j921K72J529K17o31j184K74J845l75j591J20R29
1421D17J041r47j505J066J002l77p51k97J080L83j053l1M39K00r8q33Q73O08j222
1440ej12O70R8k3q37l59J861k49j561R8P09N56l74j343N81J386n49q75l37Q85
$$ plain form
1460 220 785 -80 -626 -19 583 117 -645 -525 375 103 -667 -522 41 166 -533 -912 -256 312 -491 -959
1480 -959 -389 282 191 -1049 -1019 338 241 -808 -1011 -452 600 101 -1666 -1018 534 97 -843 -1236 -588
1499 -588 729 -157 -1519 -584 132 132 -413 -848 -13 345 -276 -303 -49 66 -46 -385 331 347 -475 -302 77
1520 77 519 303 -840 -320 1095 491 -295 -359 210 1365 388 -824 196 1203 858 49 -522 583
1538 583 1497 169 -565 102 1018 857 -316 -520 580 1056 54 -607 130 917 343 -247 -117 474 650
1557 650 -97 -147 491 551 -181 -233 438 407 -126 -580 26 708 53 -907 -318 587 340 -501 -818 98 805
1578 805 -53 -814 -127 582 379 -379 -569 362 534 -194 -424 0 498 18 -658 -143 410 172 -302 -547
1598 -547 376 643 -296 -522 -12 665 428 -552 -227 851 467 -217 -381 189 893 131 -669 22 628 215
$$ packed form
1460B20N65q65n46O07O02m66p62J20R00k72p70J45N63J25o99l79O56N68q03m68
1480i59N70O71r1j240L0J357r7j049k03N59J052m99j767O48J552m37r40l93O48
1499e88J317q86j362R35P16%n45m35Q35L58o21k7K54J15j12l39P16J6q22J73L79
1520G7M42k16j143N20J415o04p86o4N69J155r77j212J020J007l45q09n71J105
1538E83R14j328p34O67R16j61j173k04J100M76j002o61P37P87n74n90J30N91J76
1557F50p47n0O38O0p32n2O71l1n33m54O06O82o55r60N89R05k47q41l17R16P07
1578H05q58p61O87P09k03p58j90R31J72p28k30M24M98m80o76N15N53k38m74k45
1598e47R23K67r39k26N10O77k37r80L25J078l84o84j64N70P04p62q00O91O06m13
$$ plain form
1618 215 -431 -440 346 564 -315 -271 106 376 102 -465 36 456 -8 -161 111 220 221 -439 -243 511 189 -471
1640 -471 -476 285 595 -229 -1057 -271 803 389 -731 -965 347 965 -145 -1206 -380 853 680 -590
1658 -590 -1058 235 932 13 -1088 -428 587 554 -326 -778 4 519 25 -528 -204 240 200 -57 69 -33
1678 -33 -186 86 209 451 -122 -586 440 973 -69 -708 -389 806 1121 -455 -1043 411 1342 369 -1109
1697 -1109 -699 1092 1255 -233 -1019 0 1450 659 -1045 -559 722 1175 235 -1019 -206 1131 458
1714 458 -507 -482 144 948 144 -593 -8 265 131 -24 -70 195 75 -25 360 175 -308 -471 151 788 151
1735 151 -794 -227 803 540 -652 -1071 163 1301 54 -1172 -463 885 712 -732 -1191 293 1283
1752 1283 68 -1008 -372 788 595 -635 -818 285 828 46 -702 -408 556 176 -623 -341 269 231
$$ packed form
1618B15o46rP86K18q79M4L77K70k74n67N01M20m64j53K72J09Jo60J96P54l22o60
1640d71nP61L10q24q28P86J074m14j120k34J312O18j110j061Q26J233j73j270
1658e90m68J293O97r19j101O60J015l3q80m52P82N15m94n53L24M44m0k57J26j02
1678c3j53K72J23K42n73m64J026N33j042o39L19J195L15j576n88J454R31r73j478
1697a109M10J791J63j488p86J019J450p91j704M86J281M53r40j254Q13J337o73
1714D58r65K5O26Q04q04p37N85K73j34j55m6K65j20j00L85j85m83j63O22O37o37
1735A51r45N67J030k63j192m19J234J138j247j226P09J348j73j444m59J484R90
1752A283j215j076O36J160j93j230j83J103N43p82p48K94R64l80p99K82O10l8
$$ plain form
1770 231 -99 -474 -127 326 -397 -541 179 261 -70 -413 -330 294 52 -785 -423 351 391 -451 -902 122 385
1791 385 -272 -822 -417 581 503 -944 -678 578 261 -342 -757 -64 872 94 -948 -303 558 169 -570
1810 -570 -777 514 691 -266 -709 -151 616 181 -764 -331 680 431 -189 -563 -52 641 -42 -627 -23
1829 -23 480 280 -247 -452 45 352 -258 -351 100 373 -22 -298 -124 336 70 -416 -2 391 395 -341 -495
1850 -495 374 579 -321 -737 62 750 379 -913 -677 559 542 -387 -843 -29 1027 308 -841 -324 490
1869 490 571 -152 -670 226 762 -15 -351 -268 101 377 -178 -259 190 -2 -45 -31 -229 -66 -93 -47 381 190
1891 190 -267 -127 125 511 -52 -596 95 663 405 -336 -710 137 803 -76 -773 -351 598 874 -402 -1041
1911 -1041 243 982 126 -395 -287 569 1015 -128 -651 209 720 225 -6 -119 318 529 -69 -202 136
$$ packed form
1770B31l30l75L47M53p23j44P20Q2l31l43Q3O24k42q37L62P74M0q42m51J024K63
1791C85o57n50M05R98p8j447K66J256l17o03m15O93R36p78j042O45Q61l89p39
1810e70k07J291J77r57m43N58P67m35r45M33J011k49o20l74N11O93o83n85O04
1829b3N03k00n27k05M97L07o10r3M51K73l95k76J74M60k66m86M14L93Mp36j54
1850d95Q69K05r00m16P99O88l71j292K36J236j7r29m56Q14J056p19j149N17Q14
1869D90Q1p23n18Q96N36p77l36Q3L69K76n55q1M49j92m3J4j98J63k7M6M28j91
1891A90m57J40K52L86n63n44O91N68k58p41l74Q47O66q79o97M22R49K76j276o39
1911a041J284P39q56n21J08Q56M46j143n23Q60N11m95k31j13M37K11n98j33L38
$$ plain form
1930 136 182 10 240 180 26 -18 124 193 161 -100 -192 532 582 -265 -431 105 370 322 -438 -668 515 577 -446
1953 -446 -697 -443 377 501 -729 -797 323 404 -69 -661 -590 404 372 -414 -468 20 230 -68 -645 -286 -23
1974 -23 -119 -310 -306 71 -185 -567 -278 36 -113 -341 -409 70 337 -456 -486 80 173 -73 -432 -255 384 140
1996 140 -608 -278 105 188 -159 -581 -74 406 -139 -508 -217 30 213 -130 -442 89 353 -178 -270 30 68
2017 68 78 -231 -177 281 97 -379 -306 156 161 -173 -413 30 463 130 -497 -372 455 393 -188 -303 112 519
2039 519 388 -409 -193 487 230 64 -43 113 408 92 -158 156 151 19 97 96 322 79 -227 111 272 94
2061 94 -88 18 339 309 -154 -183 155 267 32 -309 -3 339 122 -263 -285 53 333 -12 -475 -30 227
2082 227 174 -236 -400 -5 242 -22 -194 -152 89 79 -187 -159 -62 -90 -26 -56 -4 -48 -145 -126 119 86 -294 -175
$$ packed form
1930A36M6j72K30o0j54m4J42O9l2k61r2P24N0q47j66N36K65m8p60k30J183O2j023
1953d46k51K54Q20J24j230o8J120Q1m73n92P1R94l2p86n4M88K10k98n77L59K63
1974b3r6j91ML77k56l82K89L14j49k28o8M79K67p93l0N66R3k46l59J77O39k44
1996A40p48L30L83Q3l47m22N07M80n45l69K91K47J83l43l12N31K64n31r2L00L8
2017F8J0l09N4M58j84m76P3M62Nl34k40M43M33l33o27J25Q27o2n81j15M15M07
2039E19j31p97K16O80k57j66j07J56K95l16k50L14nj32P8jK26k43l06L38J61j78
2061I4j82J06L21l0m63k9L38J12k35l41L06L42k17l85k2L38K80l45m63M45K57
2082B27n3m10j64L95K47k64j72M2K41j0k66K8R7k8O4l0N2m4r7J9K45l3l80J19
$$ plain form
2106 -175 88 174 -71 -392 -155 296 -1 -249 -126 180 270 -107 -261 -20 263 27 -223 -42 164 207 -192
2127 -192 -162 28 66 58 -122 22 218 7 -181 -5 -39 88 -109 -55 157 -48 -53 -56 -99 28 -8 -202 -8 27
2151 27 -80 -81 -249 -63 3 -137 -141 -87 -108 61 -197 -227 51 -164 -134 -25 -139 -46 -109 -268 -7 -4 -393 -150 -19
2176 -19 18 -56 -407 -182 112 -24 -405 -302 -9 220 -180 -344 -198 77 167 -155 -316 96 237 -34 -25 -181
2198 -181 5 340 76 -108 82 97 229 212 -116 38 366 314 318 31 60 444 438 190 92 108 429 576 23
2221 23 -13 245 466 475 -27 -75 415 554 194 -124 -118 490 477 3 -164 -24 480 276 -318 -221 220 225 213 -223
2245 -223 -304 273 184 -89 -120 -267 8 292 -104 -357 -227 -41 270 -241 -552 -214 158 143 -320 -642 -221
2266 -221 181 -116 -415 -549 -13 273 -259 -562 -260 70 101 -244 -524 -68 225 -75 -314 -449 -62 183
$$ packed form
2106a75K63Q6k45l21K37M51k97k48J23L06R0l77j54K41K83k36k50J81K06M3l99
2127a92L0J90L8qj80J44J96k11j88J76l4J27j97N4K12k05nlm3J27l6j94J94L5
2151B7j07jj68J86O6j40mN4k1J69k58l0K78k15L0J09j14R3o3j59K61Ll89K43J31
2176a9L7p4l51K25K94j36l81J03K93K29m00j64J46K75R0l22j61M12J41k71Rj56
2198a81J86L35k64j84J90J5J32j7l28J54L28n2Mk87K9L84ok48r8J6L21J47n53
2221B3l6K58K21Rn02m8M90J39l60l18OO08j3m74j67J40N04k04n94R7M41Nj2m36
2245b23q1N77q9k73l1j47K75K84l96k53J30J86L11n11l11L38L72j5m63l22M21
2266b21M02k97k99j34N36K86n32l03L02L30L1l45k80M56K93l00k39j35L87K45
$$ plain form
2286 183 -179 -437 -228 -24 65 -118 -425 -75 81 24 -153 -209 -70 81 -49 -92 -101 -104 181 60 -111 -83 -60
2309 -60 35 213 -161 -239 139 177 119 -128 -103 245 330 -4 -44 192 413 282 -137 128 280 250 262 -140 129
2332 129 496 120 -6 161 56 304 302 -177 215 349 121 112 125 28 307 147 -14 198 166 117 -9 36 72
2355 72 31 17 44 22 43 -76 -140 171 -32 -201 166 65 23 -27 -135 36 221 -213 -249 102 138 -23 -255 -296
2379 -296 142 123 -286 -208 -4 162 12 -354 -228 120 155 -150 -285 -48 167 -3 -179 -112 -34 165 -75 -189
2401 -189 18 55 2 -8 -77 -66 106 -74 -17 31 -104 71 111 29 75 -51 -15 295 110 -104 -130 129 400 -66
2425 -66 -305 76 308 216 -117 -382 198 471 -41 -237 -19 296 383 -135 -227 190 321 146 -54 -91 225 188
2447 188 -27 67 13 76 135 -10 1 19 -57 71 110 -13 -16 -39 96 50 -117 -250 31 136 -23 -298 -268 184
$$ packed form
2286A83l62k58K09K04Q9j83l07L50J56n7j77n6J39J51j30m3rlK85j21j71K8K3
2309f0R5J78l74p8L78L8n8k47K5L48Q5l34m0K36K21j31m19K65J52l0J2m02K69
2332A29L67l76j26J67j05K48km79L92J34k28rJ3r7K79j60j61K12l2m9j26M5L6
2355G2m1j4K7k2K1j19o4L11k03j69L67j01m2n0j08J71J85m34l6L51L6j61k32m1
2379b96M38j9m09P8K04J66j50l66J26L48L5l05j35K37K15j70j76O7P8J99k40j14
2401a89K07L7n3j0o9J1J72j80N7M8j35J75M0q2M6j26L6L10j85k14k6K59K71m66
2425f6k39L81K32r2l33k65N80K73n12j96K18L15Q7n18r2M17J31j75k00l7L16l7
2447A88k15R4n4O3N9j45J1J8p6J28L9j23lk3J35m6j67j33K81J05j59k75L0M52
$$ plain form
2471 184 138 -195 -384 -33 222 114 -463 -424 219 236 -135 -457 -223 299 154 -415 -327 62 205 8 -410
2492 -410 -147 148 38 -119 -119 25 63 -131 -76 79 -43 -59 30 56 159 -63 -73 166 113 -87 -74 -38 291 106
2516 106 -197 54 176 180 55 -217 52 437 97 -144 35 184 306 26 -247 133 354 126 -104 -98 209
2537 209 274 -81 -171 44 238 88 -222 -4 163 2 -148 -27 145 135 -244 -71 208 73 -120 -160 -37
2558 -37 205 58 -300 -65 211 -12 -148 -272 49 238 -123 -336 -17 107 -102 -104 -144 75 101 -143 -136 96
2580 96 52 -138 -179 -5 162 -45 -223 -177 75 143 -195 -185 144 86 -92 -122 -123 233 200 -263 16 236 152 47
2604 47 -249 14 353 25 -148 -34 219 342 -77 -186 172 198 50 -78 -22 234 123 -144 133 213 30
2625 30 39 -54 208 181 -171 -68 268 80 7 -151 65 312 43 -197 -87 185 136 -98 -235 68 300 9
$$ packed form
2471A84m6l33j89L51K55j08n77L9O43J7l71l22K34N22j45n69Q8L89J43j97m18
2492d10K63K95j10j57%J44L8j94N5J55j22j6Q9K6J03k22j0K39n3k00J3L6L29j85
2516A06l03K51J22Mj25k72K69L85l40k41J79J49J22k80k73L80K21k28k30OL07
2537B09O5l55r0K15J94j50l10K18J67j61j50J21J72j0l79J73K79j35j93m0J23
2558c7K42j47l58K35K76k23j36j24L21J89l61k13L19J24k09km0K19K6k44PK32
2580I6m4j90m1J74J67k07j78M6K52O8l38J0L29n8j78l0jL56l3m63K79K20q4j05
2604D7k96K63L39l28j73J14K53J23m19j09L58K6j48j28N6K56j11k67K77Q0j83
2625C0Rr3K62k7l52J03L36j88p3j58K16K47k69k40J10K72m9k34j37L03K32k91
$$ plain form
2647 9 -135 -112 198 251 -173 -134 125 222 45 -224 -158 289 70 -203 -65 125 83 -12 -227 -26 217 -72 -155
2670 -155 94 147 30 -187 -186 105 88 -201 -144 68 123 -32 -291 51 129 35 -195 -96 151 225 -246 -201 87 125
2694 125 -16 -309 -94 234 22 -222 -93 78 116 -60 -288 158 233 -153 -137 -89 127 192 -215 -162 229 161
2716 161 -49 -186 -56 340 123 -232 13 300 193 9 -191 81 278 81 -47 38 254 158 -75 -38 205
2737 205 63 30 33 56 140 -93 -102 135 133 -88 -89 88 221 30 -310 37 293 73 -161 -211 46 390 -53 -454
2761 -454 26 243 99 -263 -363 87 345 -96 -413 -130 158 208 -275 -323 86 157 -12 -331 -140 253 100
2782 100 -221 -113 -45 85 17 -252 -13 8 -89 15 2 -102 -92 -59 57 159 -106 -157 123 211 70 -225 -95
2805 -95 282 311 -206 -237 125 388 58 -328 -143 292 335 -88 -322 117 478 89 -181 -136 174 390 -29 -257
$$ packed form
2647Ij44K3L10N3m24L9K59R7j77k69O6M47k19k73J38J90m2r5k15K01K43k89q3
2670a55K49N3j17k17JK91j7k89N7K12N5j55k59L42P8r4k30R9K47P4m71M5K88L8
2694A25j41k93K15L28k12k44J29J71L8j76k28M46P5l86J6M8K16O5m07N3L91o8
2716A61k10j37J30L96k17l55K45K87j07j84k00K72J97j97j28Q5K16r6k33L7K43
2737B05j42l3LK3Q4k33rK37kk21jJ77J33j91l40L47K56k20k34n0K57L44m43m01
2761d54M80K17j44l62j00M50K58m41l17K83K88N0m83m8M09P1j69l19J91L93j53
2782A00l21J08O8J30o8k69K39K1r7J04j3j04J0L3J16J02k65n1K80Q8j41k95J30
2805i5L77K9n17l1L62K63l30l86J85M35M3m23k34M39L61l89k70M5L10K16m19k28
$$ plain form
2827 -257 73 316 89 -137 -149 129 222 -146 -70 4 69 23 -13 -27 104 54 -79 122 59 -52 -37 71 119 -14
2851 -14 -177 -125 209 24 -201 -211 87 203 -84 -273 -136 236 106 -297 -282 234 176 -16 -165 -206 321 152
2873 152 -335 -134 170 101 -21 -208 -158 292 52 -248 -86 137 112 -22 -134 -32 187 29 -110 -17 118
2894 118 35 -61 -42 9 98 -19 -134 21 70 -141 -58 125 54 -51 -124 48 176 33 -208 -43 208 137 -30
2917 -30 -193 110 243 -25 -266 -8 200 191 -87 -221 71 216 -28 -210 -17 177 134 -69 -138 152 182 59
2939 59 -153 -5 151 123 -72 -61 54 82 27 -92 64 -3 -102 36 52 33 -78 -52 172 187 -123 -137 79 208
2963 208 136 -263 -77 190 260 -46 -195 54 296 150 -223 -183 203 288 -72 -171 68 176 120 -133 -253 103
2985 103 351 -57 -91 7 101 157 -99 -127 53 143 -23 -41 -24 -18 37 20 -11 -32 17 -2 101 44 -66 -140 106 170
$$ packed form
2827b57L30K43k27k26j2K78R3l68P6P4O5m6l6j4J31n0j33K01o3j11J5J08M8j33
2851a4j63N2L34j85k25j0K98J16k87j89J37L72j30m03J5N16n8j92j49m1N27j69
2873A52m87K01L04o9j22j87N0M50k40l00J62K23k5j34j12J02K19j58j39R3J35
2894A18q3r6J9N1Q9j17j15J55M9k11Q3J83p1j05p3J72J28j43k41J65K51p1j67
2917c0j63L03J33k68k41K58K08rk78j34K92J45k44j82J93J94m3k03o9K90L0j23
2939E9k12J48J56k8j95J1J15K8n5j19J56o7r9J38J6j9j11K6K24J5l10j4K16J29
2963B08p2l99J86K67P0l06j49K49K42j46l73M0L86Q5l60r9K39J08n6k53j20L56
2985A03K48m08l4R8R4N6k56k8J80R0j66j8J7ON5j7l1k1M9j9J03n7j10p4K46O4
$$ plain form
3011 170 -79 -75 -11 183 171 -151 -252 45 212 30 -214 -142 189 165 -150 -222 -14 176 76 -253 -143 163
3033 163 61 -92 -129 -26 127 43 -127 -47 3 20 25 -36 -70 25 -29 8 15 -122 -24 -43 -34 16 -86 -120 97 -1 -32
3060 -32 -102 -87 98 39 -138 -144 38 76 1 -205 -62 54 57 -91 -170 3 162 -72 -90 9 75 47 -7 -95 31 49
3086 49 -83 -74 53 49 31 -83 -16 77 15 -12 -4 51 52 27 -8 115 83 -2 86 45 146 91 -12 15 79 80 91 35 82 116
3116 116 40 -18 69 44 77 -33 13 97 171 -2 61 76 90 89 -46 76 145 9 -15 38 41 115 18 -65 114 107 33 -44
3144 -44 -35 45 32 -114 -70 49 1 -54 -117 -29 -32 -25 -86 -36 -84 25 -12 -73 23 -71 -56 -1 -70 -13 -50 -64 -22 1 -58 16
3174 16 -70 -48 49 -40 -10 76 -1 -55 -21 -54 27 17 -63 -55 -36 72 -6 -70 -9 62 3 22 -45 -51 138 27 -15 31 35 47
3204 47 42 -13 29 -52 11 42 60 -8 70 -9 54 122 14 51 87 -3 23 6 -50 40 31 -52 32 51 -22 49 -130 23 80 -8
$$ packed form
3011A70k49MO4J94j2l22j01K97J67j82k44P2L31k4l15p2K08J90j00l29J10L06
3033A63j02j53l7J03J53q4j70Q0N0J7No1l4R5n4L7Pj37R8j9RN0j02l4K17r8l1
3060c2p0J5J85n9j77oJ82L8p5k06J43J16Lj48p9J73J59k34j8R9O6k8n4q8J26J8
3086D9j32RJ27mj8j14O7R3o2k7QN5Jk5l5J23l2q5Q8m1J01n5j03K7O4JJ1n6M7L4
3116A16p6n8Q7k5L3j10M6Q4P4j73O3J5J4jj35J22O9j36k4N3LP4r7q3J79pp4p7
3144d4RQ0j3j46M4J19m8n5o3Q8lPo1N0m8J09l7o1R6r4J5N5o9N7l7j4M2K3n9P4
3174A6q6K2R7q9L0Q6p7n4L4l3Q1j0q0QJ9J08p8o4O1P1n9J9o7oJ89j11m2M6MJ2
3204D7nn5M2q1O3L1J8o8P8p9O3O8j08L7L6r0K6j7n6R0rq3Q4J9p3P1j79J53N7q8
$$ plain form
3234 -8 11 -23 -12 23 29 -37 4 24 39 61 -15 72 10 -34 77 42 -3 27 22 30 34 -21 -11 -7 35 30 -28 -52 79 90 -22 -10
3266 -10 27 81 12 -34 -18 -10 38 7 -54 -50 70 11 0 -21 -12 46 12 14 -52 -25 -45 39 7 -60 -33 -8 101 -37 -80 -32 36
3297 36 -4 14 -58 -86 91 -1 -44 -31 60 49 37 -90 -37 64 56 -22 -93 -16 97 33 -72 -30 31 67 71 -50 -8 40
3325 40 103 86 -87 -8 9 92 70 -78 -44 84 108 -29 2 -61 131 139 -84 -104 55 102 67 -48 -161 86 172 8
3351 8 -111 -63 74 114 17 -88 -17 141 8 -66 -72 3 33 46 -95 -67 28 43 -12 -70 -76 53 69 -18 -60 -9 56 60 0
3380 0 -135 -7 77 -15 -73 -113 -42 103 -7 -134 -26 49 47 38 -140 -56 110 31 -87 -55 81 41 34 -5 -6 12 40 -45
3408 -45 -13 8 -34 74 84 -3 -31 107 7 55 -38 -43 107 70 -30 -69 93 60 21 -45 -46 90 61 -1 -91 44 88
3435 88 28 49 -66 41 112 -4 -87 -8 61 55 8 -60 -3 81 45 19 16 42 96 31 -15 57 -2 -2 -43 -6 67 7 7 25 6
$$ packed form
3234hJ9l4J1L5Oo6M1K0J5K2p6Q7o2m4J11l5m5L0nQMn5J0MM2nn8k4J31J1j12J2
3266a0L7N4o9m6J6QM8l1o1MJ20n9j1k1RN8l4Ko6K7k0Q4l2o7K7K5J09j38m3M8O8
3297C6m0J8p2k8J77r2m3J3R1j1j2j27N3J01qp8p1P7J13o4j05M2O1L6Mj21M2M8
3325D0O3j7j73P9J7Q3k2j48L4J28K4j37L1o3J92Qk23k0J59M7l5j15j13K47Q6j64
3351Hj19M8J37M0r7j05P1J58j33p4oP5L0J3j41K8R5J5n5n8oJ29J6q7m2N1O5Mo0
3380@j35J28Q4r2n8m0P1J45j10j27J08P5krj78Q4J66p9j18L2J36m0pl9jJ8K8q5
3408d5L2K1m2J08J0q7k8J38j00M8r3nJ50l7j00l9J62l3l9o6jJ36k9o2r0J35M4
3435H8o0K1j15J07P1j16q3P9O9om7o8N7Q4l6k6lK6N4o5m6P2n9%m1L7P3o0%J8j9
$$ plain form
3466 6 -19 36 -6 32 -54 -17 121 80 -43 -58 56 115 14 -96 -21 127 105 -58 -101 20 100 78 -58 -81 55 85
3492 85 53 -46 10 64 83 0 -74 13 145 58 24 -5 13 113 36 -30 -36 35 18 43 -40 -43 17 61 -52 -41 14 35 1 16
3522 16 -60 -98 37 77 -89 -74 -19 26 64 -73 -133 105 150 -52 -96 -82 142 132 -77 -80 5 82 76 -74 -63 -23 46
3549 46 33 -61 -103 52 60 11 -37 -33 39 76 -38 -132 -18 24 52 -18 -61 22 55 -2 -57 -97 51 48 -12 -39 -48 41 73 36
3579 36 -106 -19 21 50 24 -124 -1 129 7 -43 -54 -31 115 36 -115 27 82 91 -21 -103 -8 60 70 -33 -24 6
3605 6 74 50 -3 -12 76 27 -32 -31 21 15 68 34 -27 42 103 -5 -2 29 -10 44 61 10 21 50 -7 74 -21 -21 -31 19 30 17 -39
3638 -39 62 27 -45 -50 -46 62 80 -39 -2 38 49 21 -59 5 100 46 -6 -32 -13 11 -18 -45 19 34 -15 -41 -38 40 0 -116
3668 -116 3 -8 -43 15 -19 -35 6 6 -44 -19 -60 -21 -8 -42 -20 36 -57 27 -26 -40 2 -28 -22 38 -28 16 24 46 45 -30 -12
$$ packed form
3466Fk5N5m2L8q6L7J38m1j23j5J14N9j01j10P5J48k2j63m3J21Q0k2j36k3J36L0
3492H5l2r9N6N4J9q3p4Q7J32q7l4k9J8J00p7o6oP1j7K5q3lO0M4j13J1N5K1l4J5
3522A6p6l8J35M0j66J5N5M5L8j37o0K38M5k02m4J4K24j0k09lQ5P7oj50J1M0O9
3549D6j3r4m2J55Qm9m8MP2L7j14r4J14M2K8p0m3Q3L3n7n5m0J48lo0k7rQ9L2l7
3579C6j42Q7M0K9k6j48J23J30j22n0j1K3J46p9j51J42N5Rj12q2R5O8J0j03RL0
3605FO8k4n3rQ8m9n9JN2oN3l4o1O9O1j08LL1l9N4J7n1J1K9n7Q1r5%j0N0J1j3n6
3638c9J01l5p2nMJ08J8j19L7M0J1k8q0O4R5n4n2k6J9K4k9k7O4J5m9k6LP8m0j16
3668a16J19j1l5N8l4j6M1%n0K5m1L9J3l4K2N6r3Q4n3j4M2l0OO0o6M4QK2jp5J8
$$ plain form
3699 -12 -18 51 -49 -3 2 73 54 -31 -51 60 70 -6 -47 6 120 45 -36 7 38 19 32 -34 -2 103 -31 37 -23 21 28
3728 28 13 32 24 67 80 61 14 36 27 17 81 36 -27 8 12 1 39 -14 9 26 -8 -9 -51 -16 19 -73 -11 6 18 36 37 -75
3760 -75 9 16 1 7 -11 -28 29 -27 30 70 -39 -16 -30 -3 34 -14 24 10 17 16 -40 -39 89 28 -12 84 21 21 -35 -36 -18 111
3792 111 -20 -13 26 13 81 -5 -31 39 -32 -3 -18 -2 -11 66 -12 -9 -24 -2 17 54 9 47 -1 -32 4 43 -22 -28 20 72 -7
3823 -7 -28 -68 -15 77 4 -70 -43 62 29 -5 -108 74 46 0 -22 -3 -35 -45 3 -68 14 89 -17 10 -77 14 -40 26 -45
3852 -45 16 21 17 -1 -13 -4 -16 111 -3 -1 -3 5 27 51 -84 -24 16 33 18 -49 -53 -14 31 -10 -91 48 86 46 -83 -8 -1 83
3884 83 -29 -66 29 52 45 -16 -31 -26 46 24 -56 24 43 57 33 -42 -41 45 -11 27 -23 -43 15 57 2 -6 -13 78 98 -34 -52 55
3916 55 37 45 -31 -31 54 -24 44 -7 -34 -44 100 45 -47 -4 38 89 4 -44 -31 31 42 8 -60 5 -2 -42 22 65 18 16 16 -72
$$ packed form
3699a2oO9j00M6NP1j9q5k0J11J0p6m1N3J14p5q1M3L1j9J3o6L2J05j34O8o0M4P
3728B8j5J9qM3J3j9m7K2rj0O4m5o3L5Mj1L8n3K3J7l4jm2L5L5r2O2J7J2J8Jj12
3760g5Q4Pj5Oj8j7N7n6N7M0j09K3j4K7L7m8L8j4Pjn6JJ28o1m0R6o3%n6jJ8J29
3792A11j31PL9j3O8q6k6P0p1K9j5J6rP7p8Lj5K2J9L7m5L8m8l1L6L9o5oM8N2p9
3823gk1m0N3R2p3p4K7J05l3l4j03J82k8m6k2J9l2j0M8p1Q2P5j06K7q7R1n4O6p1
3852d5O1Nmj8j2Rj2J27j14KkQK2K4j35O0M0J7j5o7mL9M5m1q1J39L8m0j29P5PQ4
3884H3j12l7R5K3po1j5NP2k2q0Q0J9J4k4p5JQ6n6L8n0k0N8M2n5qpR1K0j32j8J07
3916E5j8Qp6%Q5p8O8n1k7j0J44n5r2M3M2N1q5m8J3O2J1l4o8O5pm0O4M3m7k%q8
$$ plain form
3948 -72 -17 4 -8 -9 -46 -1 23 -23 7 19 -34 31 13 -24 -75 -29 48 24 -31 -7 60 6 24 -49 -22 85 -53 -28 -51 -14
3978 -14 28 11 1 12 -2 59 6 -28 -14 50 -30 28 37 37 86 -5 -25 -28 15 18 -10 -72 68 27 -27 25 -7 -18 42 18 -52 31
4010 31 -12 42 31 -23 -11 100 61 7 -62 -79 36 43 9 -71 -24 82 54 2 -29 37 8 29 -58 48 18 -4 -8 -12 -35 21
4040 21 -55 5 21 15 19 5 0 -20 44 -38 10 -18 17 -6 7 5 -33 1 -9 72 -1 -54 -3 0 -16 -19 -65 -12 55 18 -12 -46 66
4073 66 69 -36 -89 -25 56 98 -22 -24 -17 21 57 -35 18 60 49 -42 -53 17 9 72 -22 13 10 7 32 0 -48 1 48 8 -22 -50
4105 -50 -51 102 60 -30 -22 15 58 40 -56 38 53 43 13 -60 9 67 39 -20 -6 15 102 -28 -36 9 10 -38 66 -45 39 1
4135 1 19 -21 -30 -39 -18 51 -15 -3 -29 36 13 14 -93 -6 -33 83 -14 -52 -14 10 -29 -78 -81 38 -3 -95 -58 -18 32 8 -45
4166 -45 -45 5 -21 -28 -37 -34 20 -10 -44 -18 1 57 -30 -4 3 14 -13 -26 0 36 -2 -30 -2 -31 21 -14 4 8 42 -30 -50 -4 14
$$ packed form
3948g2N5K1j2jl7M5K4m6L0J2n3O5j8l7n1M6P7k4n5K4O7n4J8p3K7J07j38K5k3L7
3978a4M2j7j0J1j4O1n3l4J4O4q0N8R%M9r1k0lM3Lk8o2J40m1n4N2l2j1O0k4p0Q3
4010C1m3N4j1n4J2J11l9n4o9j7J15Pl4q0M7J06k8n2l1O6k9K1q7J06l0k2mmk3N6
4040B1p6O0J6oMj4nk0O4q2M8k8L5k3J3kl8L4j0Q1p3n3N1Lj6lm6N3O7l7l0l4J12
4073F6Lj05n3O4Q1M2j20kPL8L6r2N3M2j1r1j1P0qO3r4L5llK5l2m8M9M7m0l0k8
4105e0jJ53m2r0QL7M3j8r6R4J5j0l0p3O9N8k8n9J4K1Q7j30qM5Jm8J04j11Q4l8
4135AJ8m0rrK1O9o6J2k6O5k3Jj07Q7k7J16r7l8L8K4l9m9lJ19m1r2L7M0N0k4n3
4166d5%N0k6prLN4l0l4K6J9N6q7K6PJ1k7j3K6L6l8k8K8k9N2l5J8ML4p2k0M6J8
$$ plain form
4199 14 41 -32 -43 -8 49 -27 -52 41 1 4 -43 -19 70 23 -33 18 1 -28 7 21 47 58 13 16 3 75 -4 3 36 66 52 -21
4231 -21 -15 90 40 -30 -24 -2 27 56 -3 0 56 60 58 -26 9 -4 46 -46 -32 4 19 -30 -8 7 56 16 -23 20 53 -51 -33 34
4263 34 39 18 -30 -4 22 -5 29 8 43 28 25 -37 17 19 -38 -6 8 -2 20 26 -45 -4 0 11 54 -9 -2 -20 22 -45 32 36 19 23
4297 23 32 59 24 56 -18 15 43 51 49 38 28 15 -14 23 46 37 36 -23 -17 41 16 -14 -41 54 35 -27 -53 85 26 15 -10 49 48
4330 48 -33 -3 0 9 12 -9 -13 31 18 -33 -16 21 22 11 15 56 74 -18 6 -4 21 11 -34 -26 17 45 -4 -46 -46 82 -2 -14 -12 9
4364 9 2 40 -12 -26 12 63 -10 -21 48 32 27 -9 10 -43 17 1 -14 49 -47 21 -38 21 4 13 -6 24 27 -4 66 6 63 12 -28
4397 -28 29 22 54 -19 -6 44 49 10 10 -8 58 37 -31 37 42 83 -12 -6 9 49 63 -53 -40 23 57 13 -18 31 3 -15 17 0
4429 0 13 12 -37 2 -60 -29 -8 38 102 -13 -20 -62 50 60 -15 -15 -32 81 -25 -34 5 11 67 26 -28 -2 46 26 -49 7 45
$$ packed form
4199A4K7p3j1L5N7p6k5R3m0Lm7K4Q9m7n6N1j7k9L5J4K6J1m5Lj3P2p9PL3L0j4p3
4231b1OJ05n0p0OK2K9K9n9LN6Mkq4L5j3N0r2J4L6J5m9K2J5M9m0l9M3L3j04J8O7
4263C4Nk1m8K6K6k7L4k1L5j5lo2N4Kn7L2J4j0K2Op1M1MJ1M3o3Pj8M2o7P7Mj7M
4297B3RK7l5L2p4L3K8Qkj1j0j3k9L7K3rjn9ON8k5l0k7R5j9o2k6J38n9j1k5N9j
4330D8q1L0LRLk1mM4j3n1J7L7Jj1MM1J8r2K4j0K5j0m5QM3K8m9m2%J28q4j2KK1
4364IpL8n2j4L8N1p3j1O9j6nl6J9n3O0j6j5O3r6O8n9N9j7Rj9L0Ll1P0o0N7n1m0
4397b8N7pL2p3J3N0Nl9%j8O6k1o8O8NM1r5OJ5M0J4j16J3O3L4m4l1M9k8j8L2j7
4429@J3jm9L9o2L1K1M6O4j15pm2J12J0p5%j7J13j06rL9ON6m1n4K6M8k0p5N6L8
$$ plain form
4460 45 31 -6 17 50 9 -3 38 -22 19 -20 60 -7 18 -25 -8 20 -22 26 -15 44 -13 24 -34 47 19 27 -22 -28 -1 19 27 -28
4492 -28 -27 36 -12 14 -13 50 58 48 -13 -2 40 56 68 -37 1 52 40 18 25 -30 30 42 -79 -55 59 29 -47 -14 -3 4 3
4523 3 -16 64 -5 34 -3 25 5 48 5 29 38 -2 17 -5 -4 11 -37 0 55 16 3 -34 17 18 21 -14 20 21 37 -7 -27 63 33
4556 33 -3 -30 -22 19 -6 -54 -7 -13 14 18 -45 -80 11 -12 -12 15 9 19 -1 -27 -1 21 7 3 -25 35 57 -1 -15 -56 22 18 42 4
4590 4 -31 2 1 36 21 -5 -25 6 29 -16 -20 33 -15 54 -16 -27 -10 80 -7 -35 -44 11 50 22 -17 -25 56 85 11 -36 45 56 -21
4623 -21 -20 47 76 29 -31 -45 26 -31 -13 12 -17 8 24 -16 -1 -20 -17 49 40 -57 -42 -14 1 15 -50 -18 -23 71 -18 -24 -45 -37 36
4656 36 14 -42 -32 48 70 17 -56 -53 60 -22 -3 -11 46 63 31 -20 -2 26 12 -40 -69 42 9 20 -34 -35 33 26 -15 9 -7
4687 -7 -13 0 -7 -36 -21 16 42 21 -35 -8 -24 38 -12 -21 -17 6 84 -6 -34 -16 77 -14 -36 29 8 41 -14 -13 -10 -2 0 -41 -46 -2 67
$$ packed form
4460D5j4l7K3L3m1j2M1o0M1l9Q0o7K5m3J7K8m2M8m1N9n7L7n8Q1k8Qm9oK7K0Qn5
4492b8JO3m8K6k7O3Qj0o1J1M2J6J2j05L8N1j2k2Pn5O0J2j21K4J14l0p6L3J1Pj
4523Cj9Q0o9L9l7K8k0M3m3K4Rm0J9k2JJ5m8L7N5l9j3l7N1JLl5L4JJ6m4k0R0l0
4556C3l6k7QM1k5m8M7oK7Mo3l5R1k3%K7oJ0k0k6K6K2j4mk8O0K2n8j4m1P8mK4l8
4590Dl5L3jL5j5k6k0L1K3m5mN3m8O9p0j1J7R0q7k8rN5L9k8l9qQ1K9p4m7Q1J1p7
4623b1JO7K9m7o0j4P1n7J8K5k9K5J6m0J5j9LO6rr7J5K8J5J4o5L2nR4q9ok1QP3
4656C6k2n6J0Q0K2n3p3LJ13q2J9qN7J7l2n1J8K8j4n2k9J11l3J1n4jO8pm1K4j6
4687goJ3pk9J5L7K6k1n6K7j6O2n0rMK3P8r0k8J8R3r1k2O5k1L3n5JLQKm1nM4O9
$$ plain form
4722 67 48 -78 31 -16 -25 -24 -36 63 -7 -51 -38 -16 32 16 -40 40 -3 15 7 6 3 21 -23 -61 24 12 57 -2 1 46 14 22 3
4755 3 -33 24 -34 -63 33 16 -1 -61 4 6 14 -58 23 6 -6 -43 5 -34 14 7 44 -13 12 60 -37 18 50 37 12 40 8 -3
4787 -3 11 -3 -17 46 -17 28 24 -23 4 -21 -8 -15 -12 -44 -32 -14 0 -31 -62 0 36 27 -37 13 15 20 -64 -13 41 -22 21 -22 -28 -10
4821 -10 48 10 6 104 23 13 -34 -7 41 31 48 -37 -21 3 42 -36 -28 8 27 6 28 34 -19 6 24 -10 10 -5 39 -17 5 -26
4853 -26 -14 56 34 -10 2 7 16 18 -5 -48 12 11 19 48 13 -22 86 -35 -22 33 5 9 9 0 10 66 -4 -9 5 -25 -21 8 -62 4
4887 4 3 -57 -36 22 4 13 13 6 25 36 25 36 -17 44 7 3 24 28 5 6 29 -5 38 9 -46 17 41 3 -42 -11 20 35 -3 13
4921 13 -21 6 -28 -60 53 -64 11 10 -32 -25 -81 -42 -38 -22 -35 1 12 24 21 -1 -11 -24 3 -25 5 -1 -19 -16 -12 -12 -28 -31 -13 16
4955 16 -27 81 -10 -9 6 -18 23 -12 -8 22 17 -15 7 -21 -8 10 16 -16 -24 33 41 42 8 5 -12 -17 54 -6 -13 38 19 -10 -3 -26 55
$$ packed form
4722F7j9j26J09m7rJj2R9p0m4J3K2M8j6n6Q0m3J8qjlJ8m4l8Q5j2M5n9LM5l2Qj9
4755Cl6N7n8k9R6j7j7o0O5KQp2Q1j7j2l7M8l9M8pL7n7K5M8r7N5L2j3k5K8l2j1
4787cJ4j4j4O3o3M5mm7K7k5J3pLl2J2J8J4l1l1O2L6ro4N0KNq4N1N4o3M3m3oJ8
4821a0N8l8mR8q1j0m7K7M8j0J7q5J6K4L9p8QL6J9k1K2On3K5J8l4K0j5M4n6K2l1
4853b6J2P0k2m4J2NRKk3m3O0jQK9l5l5J08j21J3N5k8M%rJ0N6p0nJ4l0MK9p0O6
4887Djo0K1N8j8R%pJ9J1j1J1n3O1l7mK1Mk3JK3l4M3k9n5O3K4l8m5L1L1J5l8J6
4921A3l4K7l4l2J13j17P5jm2Pn6L9MJ6j3L6J1J2lk2j0j3K7k8L0oj8LM%j6lJ8K9
4955A6m3J08r1JJ5k4M1l5ML0nl2K2k8J3J8Ol2qN7QJl4lj7nP1o0pN1j9k9Pk3Q1
$$ plain form
4990 55 1 53 28 12 68 20 -13 -18 8 12 -8 -109 -10 80 54 26 16 -16 48 -9 -30 -26 -34 -1 12 -83 -4 42 45 7 38 15
5022 15 -2 -19 26 48 -37 21 -30 30 9 -25 66 86 -33 -28 -25 -17 20 -8 -19 56 70 -4 -7 -23 -5 33 -11 25 2 5 -12 -11 -68
5055 -68 15 28 -32 -14 -10 52 5 -43 1 25 -25 32 -4 -17 26 66 20 -27 21 -19 -48 -30 -24 41 -6 6 -17 -45 4 16 -2
5086 -2 -21 -27 -13 -11 26 -9 10 -26 31 -24 -41 -24 -12 -18 46 -19 22 47 15 -3 63 11 17 -3 9 -3 11 28 32 1 42 38 39 70
5120 70 -49 30 37 -39 -1 8 14 36 16 22 -3 38 0 8 -53 36 5 3 51 -16 24 28 32 -14 -45 5 26 26 -46 -66 -23 49 34 -25
5154 -25 -19 14 36 21 13 22 48 23 -6 -20 42 -39 -64 17 -38 34 -27 -45 -52 -58 22 -7 11 0 -20 -18 -10 33 34 -23 -17 21 6 32 -6
5189 -6 46 6 16 -10 -15 -2 33 -61 17 -17 21 85 34 -7 -2 16 3 8 -26 70 49 -17 -14 5 45 26 -19 1 42 21 4 -1 18
5222 18 28 -4 5 -55 27 -20 -14 -14 -40 -73 23 -24 -15 -21 5 48 -1 2 -36 55 -26 -32 -32 47 11 -12 -11 -11 25 -11 32 -46 -46 58 64 22
$$ packed form
4990E5n4N2k5j6N6m8l3nK6Mk0j01R9R0k6k8j0l2O4n7k1MqL3J3r5P9M6Ll8L1k3
5022A5j7j7M5K2q5N8n1O0k1l4R1K0j19NLQL7k8j1P5J4p4lj6J8L8m4L6k3Lj7Jn7
5055f8Q3J3o0J8MO2m7m8M4K4n0N7l6j3M3M0m6m7M8m0k9J8OO5m7J2k3k8M9J2j8
5086bj9oJ4KL7l5J9l6N7n5j7J7J2oO4o5M1K5l2j8O6n2Ok0J2j2J4J7Ml1M1mJL1
5120G0j19P9Pp6L8ROK2k0Ok5M1l8Qo1Q9l1kM8o7M0MMm6l1N0K1%p2k0M3P2j5n9
5154b5OL3K2j5qRK6k5k9j4O2q1k5Q1n5P2o1j8poQ0k9J8j1k0KQM3Jn7OL8j5K6l8
5189fN2m0J0k6nJ3L5r4P8l4L8O4n1m1NJ8j3Nl4R6k1o6LJ9M0j9m5K0M1k1j7nJ9
5222A8J0l2Ro0Q2m7O%k6l3R6m7RoK6M3m9Ll8R1q1o%P9l6k3J%L6l6M3p8%J04Om2
$$ plain form
5258 22 0 -21 31 43 -14 -40 4 17 -8 -4 15 -29 18 49 -6 17 -2 31 11 16 -13 -10 10 -14 -4 25 22 -21 -35 5 22 -17
5290 -17 8 -18 3 -63 -17 -34 -4 -17 19 23 9 -34 14 32 -9 4 38 7 14 24 4 37 18 24 -29 -40 13 -10 -13 -15 -20 7 15 20
5324 20 10 10 24 13 -41 -22 -51 9 9 33 -24 25 -21 25 -31 14 13 20 -25 -10 18 8 -6 41 15 19 36 -62 -18 14 9 -3 8
5357 8 34 26 10 12 -5 20 57 68 73 1 -41 -9 -38 -71 -20 -8 -30 -21 -8 -4 28 -19 -60 18 -51 -15 -11 24 23 -34 -6 -20 14 21 29
5392 29 40 38 25 48 -1 -40 48 20 50 66 4 18 -14 20 60 47 -8 29 71 -22 20 5 7 -21 24 9 41 -25 31 59 10
5423 10 -8 -4 22 -14 69 -3 33 54 30 7 -6 -1 30 21 76 -20 -14 4 47 14 1 10 -17 -8 -51 -13 12 3 -45 -51 -37 -45 60 19
5457 19 -4 8 -27 -43 8 -66 2 -9 -11 -39 -13 44 29 -11 -2 5 5 -1 -10 -86 -5 4 -30 13 -50 -6 59 14 35 34 36 -45 -36 -4 -60
5492 -60 -19 14 12 33 -9 -15 0 9 -19 19 12 -39 8 -14 -24 -7 11 4 0 -21 -46 -27 15 4 21 12 6 3 27 21 -31 -11 32 19 21 -4
$$ packed form
5258B2k2k1N2J2n7k6M4J3k5MJ9m4M7L1n5K3j9L3k0Nk9LK0k4J0K9lm3j4M0J7l9
5290a7K5k6K1o6M6j7L0j3L6Mj4m3M8J8m1J3L4l1PJ0k0L3j9On3j1N3k3lknK7QN
5324B0j0%J4j1n4J9k9O0%K4n7M9m6M6n6M5jPm5J5K8j0j4M7k6MJ7r8M4L2nj2J1
5357HK6qj6Kj7K5L7J1Np2m2L2k9l3N1J2k2RJ3ML2m7m1P8o9L6ML5jn7K8j4L4PQ
5392B9J1kj3K3m9l9Q8k8L0J6o2J4l2L4M0j3n5L7M2r3M2j5Kk8M5j5L2o6N6K8m9
5423A0j8MK6l6Q3p2L6K1k4k3j3NL1rN5r6OJ8M3l3j3Rk7Rm3L8K5rm8oJ4qJ05m1
5457A9k3J2l5j6N1p4O8j1kk8K6N7j5m0RP%orp6Q1Rl4M3o3M4O5m5K1jKq1RL2n6
5492f0M1L3kK1m2oJ5Rk8L8pn1M7k2j0J7J8pmk1k5J9M2j1J7rolK4on2K0M3j3Kk5
$$ plain form
5528 -4 -5 20 -22 -72 -62 -8 11 -83 35 4 36 -4 -9 -14 24 -10 -14 15 9 -23 29 58 42 21 -5 4 -10 7 52 24 -24 6 31
5561 31 -8 -23 25 7 32 -8 20 -2 -18 -41 -21 6 10 5 -19 32 -5 -72 -6 76 19 12 -16 33 25 1 18 17 57 21 2 13 62
5594 62 29 81 14 -33 23 27 -2 -17 -11 -73 28 -8 48 58 -25 21 4 18 37 -31 -11 29 -8 -12 -10 39 -42 -40 27 -17 8 0 -56
5627 -56 -29 -9 19 10 10 25 17 4 16 -20 69 11 42 -1 -29 -6 -49 26 50 -19 36 32 28 -22 -24 20 -46 -49 -17 -8 -43 8 19 3
5661 3 52 15 -29 -11 37 37 33 22 -33 20 17 -25 35 65 -25 49 -1 32 45 -26 -12 -21 5 37 39 -8 14 -8 8 44 35 24 36 -8
5695 -8 -48 24 -7 -17 4 39 38 8 13 -31 -49 -13 0 -11 22 -7 -10 26 15 -27 -14 19 -3 30 15 -18 -45 9 28 29 9 -6 19
5728 19 12 -16 -25 0 9 25 38 -1 18 2 0 35 3 52 11 -34 7 -9 20 24 36 16 -11 -17 16 -5 1 40 11 -6 0 -20 -45 16
5762 16 -49 -5 -1 -46 45 -12 -23 -2 -3 -1 6 -27 13 22 7 -30 -41 -56 28 24 -23 -22 51 21 -49 -46 16 28 -20 34 73 27 23 44 -48
$$ packed form
5528djK5m2n0J0N4J9r4J18l1L2m0nnL8l4mK9ol2N2K9j6k1k6Rj4J7M5k8m8L0K5
5561C1l9j5M8j8K5m0K8k2j6k3K0K7Mnk4N1l7o7O6Q2n7pk8M9qk4J7jM0l6j9J1M9
5594F2l3N2o7m7N6Mk9j5Oo2J01l6N6J0q3M6j7J4J9o8K0M0l7mKM9q1KO7m4K5qn6
5627e6K7K0K8r%J5qj3J2l6Q9n8L1m3k8K3m3P5K4o9N5mmn0kM4o6lL2Rl5N1J1j6
5661CM9l7m4J8M8%mj1n5N3lm2O0L0r0P4n0L3J3p1J4rK6L2Km7K2k2J6L6rj1J2m4
5695hm0P2l1j0K1L5jl0Nm4j8L6J3j1L3k9lL6j1m2J3L3k2L3j5l3k7N4J9Jk0j5K5
5728A9pk8rK5RJ6J3l9J9j6kL5l2M9m1m5M1j6K9MJ2k0k7oL3k1OL9k9j7Ok0k5O1
5762A6o5M4Mm5R1n7j1K1jKPl3M0Rj5l7j1j5Q4mm7JP3l0p0LO2J2m8N4L9m6mK1r2
$$ plain form
5797 -48 1 63 -1 35 53 21 11 0 36 -3 -27 -44 18 21 -20 34 -16 16 11 26 22 3 4 8 -38 13 40 7 55 -7 16 43 11
5830 11 -24 11 38 24 -6 3 14 51 10 13 -10 17 -12 48 -15 -32 8 -31 48 3 50 -2 -16 -7 -69 -14 -28 3 17 34 27 -43
5862 -43 -22 -16 11 -25 -3 -16 -27 3 28 3 59 -34 23 -22 28 20 12 -5 37 23 16 -9 -23 -15 67 -56 15 18 33 40 2 -38 55
5895 55 6 7 20 40 79 24 -6 14 2 45 59 27 20 2 45 21 7 -2 64 6 -33 -33 -4 29 46 -12 -16 19 -36 6 -25 -18 -3
5928 -3 -6 12 -36 -17 8 -5 67 4 11 10 22 -86 -29 -17 15 -23 11 -3 6 67 -52 -44 -2 24 23 8 79 49 6 -70 -15 -3 -9
5961 -9 11 5 49 3 56 -11 30 -14 -42 16 -14 -35 -2 -26 18 31 -16 35 19 22 -6 -39 32 -35 13 9 38 -23 5 33 33 -10 -31
5994 -31 62 13 40 -9 62 40 74 -20 12 23 -1 20 -11 16 48 21 -5 -16 -5 2 42 -8 37 -21 22 -5 -15 -35 -8 -3 -8 -19
6026 -19 -20 26 -38 1 14 1 4 23 5 0 -7 22 13 4 7 -5 -3 29 30 18 35 -29 -6 -9 -13 -12 36 2 19 -23 18 -24 -20 -18 -21 -7 -36 34
$$ packed form
5797d8M9O2o4L6J8l2j0j1L6l9k4j7O2Lm1N4n0L2nJ5mj9JMm6N1K7l3M8o2K3K7l2
5830A1l5L5K7j4l0RJ1L7m1Lk3K7k9O0o3j7M0l9P9m5M7n2j4Ro2N5j4L1J4J7pp0
5862d3K1OK7l6K2j3j1L0K5k5N6r3N7m5N0qqj7M2j4pk5j4QQ2j23P1LJ5Pl8m0R3
5895E5m9JJ3K0L9n5l0K0j2M3J4l2pj8M3k4j4rO6n8l9%K9L3J7n8mL5n5M2l1PJ5
5928clJ8m8J9K5j3P2o3PjJ2j08N7J2L2l8L4j4RO1j19QM2K6jj5P1l0m3p6N5J2o
5961iK0oM4m6N3o7M1m4k8N8l0k1L3k4M4J3m7N1j6Lk8l3P1o7M8mK9o1K8K8%m3k1
5994c1R3m9K7m9P1k2L4r4L2J1k4K1l1K7L2k7k6j1J1PM0n0M5n8M3k7j0k0K7Nnj1
6026a9jM6o4L9J3j3LJ9j8npK9rrLj2KL2Jj2J7o4K3lmJM8l4J7m2M1m2MKlJ4k9P0
$$ plain form
6064 34 19 17 28 6 -3 8 -9 15 24 60 11 20 -47 0 -21 14 -10 68 -26 29 -50 -15 -12 16 28 -17 8 12 36 39 -3 -7 27 23 -11
6099 -11 -17 18 21 2 -17 38 -6 18 2 20 12 -25 -44 55 16 -31 56 -11 42 -64 28 9 -10 61 -23 82 32 6 -3 1 50 -30
6131 -30 5 7 -8 16 12 -54 -40 18 -22 -14 48 4 -14 -10 23 9 -8 -7 10 22 -87 12 -23 41 47 -29 28 4 5 32 -17 50 39
6164 39 2 -28 -16 64 7 43 -9 0 -41 -2 8 -19 37 -4 12 -26 -6 -14 30 -6 -42 12 8 13 5 30 20 45 39 16 53 -32 65
6197 65 -56 -1 21 -12 34 19 -14 9 8 5 -9 -32 42 43 -6 -15 -13 18 15 -33 -10 11 25 30 7 -53 -22 58 8 -16 -30 24 76
6230 76 19 -4 1 27 49 -8 41 -13 -10 65 29 -43 31 -19 -12 1 -31 3 -53 36 -27 8 27 1 -13 6 16 58 33 5 -28 -27
6262 -27 22 -2 16 27 -42 1 49 2 8 -40 20 -7 -17 -22 5 14 -3 -3 -11 -49 4 -5 -72 21 59 24 -11 18 -6 28 -51 -54 -13 -18
6296 -18 34 1 3 8 7 -11 -34 -32 2 4 -6 -19 13 29 71 -4 16 -14 -17 44 -23 17 -20 20 27 16 -29 11 1 0 41 4 -8 16
$$ packed form
6064C4j5kJ1k2rJ1j7K4RL6m9Ro7M7k1L5k4P8r4N5p9L5LK8J2m5K5MK4Lm2mL4ml4
6099a1oL5Lj9j9N5m4K4j6J8ql7j9R9l9m7Q7o7N3j06R2j9j9P1q4J05n0k6rMM9q0
6131c0L5Kj5K4mo6J4N8m0QO2m4j8ML3j4j7JJ7J2j09R9l5O4Op6N7k4JK7m9O7j1
6164C9l7l0J2Q0n7L6n2Rm1L9J0k7N6m1J6l8K0qM4l6l6N4mNqK5j0K5ok3L7q5R7
6197F5j21N5K2l3M6j5l3K3jlj4k3P4Jm9rKL1lm8K3K1J4Nk3o0L1Q0n0k4j4N4N2
6230G6n7k3NK6K2n7M9n4LP5l6p2P4n0PJ3l2L4n6Q9o3L5J9k6j4J9J0M2k5k8l3J
6262b7M9k4J8J1o9M3M8m7Om8O0k7j0nK7Rj7%ql8N3ro7R3L8l5l5K9k4L4p9lM1n
6296a8N2l3KNjj8k3KL4Kj0j3L2J6M2p5K0l0lO1o7M0l7M0Pj1m5M0j0jM1l7j2K4
$$ plain form
6330 16 18 13 25 -45 37 -3 -8 1 19 -5 15 -18 11 -25 1 -21 -4 33 45 -17 -32 -10 37 27 16 6 -2 -15 15 -9 -30 46 68
6363 68 43 -31 11 -18 -18 35 -11 12 12 5 8 -48 -51 -27 -37 -46 -43 -20 -27 -69 23 -1 -27 -7 -3 43 -13 -12 45 -3 -33 -13 5 -6 -18
6398 -18 6 9 33 52 22 50 29 1 26 0 -24 34 5 -11 -20 -1 18 29 -29 25 -1 -18 -2 -41 11 41 35 23 28 33 -4 16 -25
6431 -25 47 4 11 -37 5 -18 -31 59 23 83 -30 31 -57 -48 7 -16 1 9 31 -35 -11 25 -4 28 28 8 5 -47 -56 4 -32 41 25
6464 25 -19 9 -26 78 -4 -23 -5 29 15 -14 -24 31 -27 0 -43 12 -30 29 -3 -5 15 -40 -3 -17 15 -3 35 23 4 33
6494 33 -21 39 -36 12 -37 7 -34 -14 13 1 -22 43 53 -15 43 5 -22 -33 -24 3 26 18 23 46 74 -33 -2 -16 41 49 -38 31
6526 31 24 14 -30 -37 -1 -22 -10 -28 -40 -22 -3 -25 25 -10 2 6 4 -18 -1 27 2 -27 -7 -2 -26 -11 -13 31 18 -14 -49 -20 47
6559 47 26 -40 41 14 -16 -19 12 -30 15 6 34 1 -33 -16 -2 3 -2 -28 -60 37 6 -6 -30 -18 25 -27 -22 -27 27 51 9 14 -52 -7
$$ packed form
6330A6KnJ2p0Q2m0nRJ8k4K0l3K9l6K6k2J7L7J2o2j5K2M7j0j1j0qj3L0k4k1P6K2
6363F8k5p4M2k9%N3m6K3%pLn6lK4j0rLK3pm2R2k4k6K0MM6n6JN7m8l0K0J8j1j2
6398a8K4LK4J9l0K8k1k8K5k6k4N8k9j6rJ9J9J1n8N4k6j7J6l9N2L0oj2NNl7K0m1
6431b5P2m3Pm8M2k3j3R0l6O0j13O1q8RN5k3J7QK2o6K4L6k9L2%k0ln2rO0l6P3j6
6464B5m4K8l5J04q2j9J8L4j4k9j0N5n8K7m3N5m2N9l2kK0n5L7j4L2j8L8j2j9K9
6494C3n4O0p5M8m9M4m1K0K7j2k3O5J0o8N8l8k7j1RK7K3qNK3K8j07L1j4N7Qq7O9
6526C1pj0m4pL6k1J2j8j2J8J9k2N0l5J2Mkk2J7K8k5k9K0Nk4J5kM4j3l2l5K9O7
6559D7k1o6Q1k7l0lL1m2M5rK8l3l4J7J4Nnk6l2R7l1j2k4J2M3n2NnN4K4m2No6M5
$$ [...]
8191a9
##END NTUPLES=NMR FID
##END=
