##TITLE=1H_SA_Sl_SOH
 CDCl3, 108 sc, 
 25.9.2020
##JCAMPDX= 6.0         $$ Bruker NMR JCAMP-DX V2.0
##DATA TYPE= NMR FID
##DATA CLASS= NTUPLES
##ORIGIN= UXNMR, Bruker Analytische Messtechnik GmbH
##OWNER= root
$$ XWIN-NMR		Version 3.5
$$ Fri Sep 25 09:49:28 2020 Russian Standard Time (UT+4h)  she@DPX200
##.OBSERVE FREQUENCY= 200.1315066352
##.OBSERVE NUCLEUS= ^1H
##.DELAY= (6, 6)
##.ACQUISITION MODE= SIMULTANEOUS
##.ACQUISITION SCHEME= undefined
##.AVERAGES= 108
##.DIGITISER RES= 18
##SPECTROMETER/DATA SYSTEM= spect
##.PULSE SEQUENCE= zg30
##.SOLVENT NAME= CDCl3
##.SHIFT REFERENCE= (INTERNAL, CDCl3, 0, 15.7039)
##AUDIT TRAIL= $$ (NUMBER, WHEN, WHO, WHERE, WHAT)
$$ ##TITLE= Audit trail, XWIN-NMR		Version 3.5
$$ ##JCAMPDX= 5.01
$$ ##ORIGIN= Bruker BioSpin GmbH
$$ ##OWNER= she
$$ F:/spectra/data/she/nmr/H-F/1/audita.txt
$$ ##AUDIT TRAIL=  $$ (NUMBER, WHEN, WHO, WHERE, WHAT)
(   1,<2020-09-25 09:48:12.89 +0400>,<she>,<DPX200>,
      <continue with go, POWCHK disabled, PULCHK disabled
       configuration hash MD5:
       00 E9 B6 7A A2 85 ED C7 34 08 36 98 17 FE 4E 26
       data hash MD5: 16K
       50 C9 2B E0 A3 51 17 BC 54 12 0B FB E1 B7 70 11>)
$$ ##END=
$$ 
$$ hash MD5
$$ DD 5F B0 51 8B 55 3E D1 2A 8F E0 B3 48 32 57 FA
##$RELAX= 
##$RELAX= 
##$RELAX= 
##$RELAX= 
##$RELAX= 
##$RELAX= 
$$ Bruker specific parameters
$$ --------------------------
##$DU= <F:/spectra>
##$EXPNO= 1
##$NAME= <H-F>
##$PROCNO= 1
##$TYPE= <nmr>
##$USER= <she>
##$AMP= (0..31)
100 100 100 100 100 100 100 100 100 100 100 100 100 100 100 100 100 100 
100 100 100 100 100 100 100 100 100 100 100 100 100 100 
##$AQSEQ= 0
##$AQ_mod= 1
##$AUNM= <au_zg>
##$AUTOPOS= <>
##$BF1= 200.13
##$BF2= 200.13
##$BF3= 200.13
##$BF4= 200.13
##$BF5= 200.13
##$BF6= 200.13
##$BF7= 200.13
##$BF8= 200.13
##$BYTORDA= 1
##$CFDGTYP= 0
##$CFRGTYP= 5
##$CHEMSTR= <none>
##$CNST= (0..31)
1 1 145 1 1 1 1 1 1 1 1 1 1 1 1 1 1 1 1 1 1 1 1 1 1 1 1 1 1 1 1 1 
##$CPDPRG= <>
##$CPDPRG1= <>
##$CPDPRG2= <>
##$CPDPRG3= <>
##$CPDPRG4= <mlev>
##$CPDPRG5= <mlev>
##$CPDPRG6= <mlev>
##$CPDPRG7= <mlev>
##$CPDPRG8= <mlev>
##$CPDPRGB= <>
##$CPDPRGT= <>
##$D= (0..31)
0 1.2 0 0 0 0 0 0 0 0.06 0 0.03 0 0 0 0 0.0002 0 0 0 0 0 0 0 0 0 0 0 0 
0 0 0 
##$DATE= 1601012487
##$DBL= (0..7)
120 120 120 120 120 120 120 120 
##$DBP= (0..7)
150 150 150 150 150 150 150 150 
##$DBP07= 0
##$DBPNAM0= <>
##$DBPNAM1= <>
##$DBPNAM2= <>
##$DBPNAM3= <>
##$DBPNAM4= <>
##$DBPNAM5= <>
##$DBPNAM6= <>
##$DBPNAM7= <>
##$DBPOAL= (0..7)
0.5 0.5 0.5 0.5 0.5 0.5 0.5 0.5 
##$DBPOFFS= (0..7)
0 0 0 0 0 0 0 0 
##$DE= 6
##$DECBNUC= <off>
##$DECIM= 32
##$DECNUC= <off>
##$DECSTAT= 4
##$DIGMOD= 1
##$DIGTYP= 9
##$DL= (0..7)
0 120 120 120 120 120 120 120 
##$DP= (0..7)
150 150 150 150 150 150 150 150 
##$DP07= 0
##$DPNAME0= <>
##$DPNAME1= <>
##$DPNAME2= <>
##$DPNAME3= <>
##$DPNAME4= <>
##$DPNAME5= <>
##$DPNAME6= <>
##$DPNAME7= <>
##$DPOAL= (0..7)
0.5 0.5 0.5 0.5 0.5 0.5 0.5 0.5 
##$DPOFFS= (0..7)
0 0 0 0 0 0 0 0 
##$DQDMODE= 0
##$DR= 18
##$DS= 0
$$ [...]
##$SUBNAM2= <"">
##$SUBNAM3= <"">
##$SUBNAM4= <"">
##$SUBNAM5= <"">
##$SUBNAM6= <"">
##$SUBNAM7= <"">
##$SUBNAM8= <"">
##$SUBNAM9= <"">
##$SW= 16.880792210976
##$SWIBOX= (0..15)
0 0 2 0 0 0 0 0 0 0 0 0 0 0 0 0 
##$SW_h= 3378.37837837838
##$TD= 16384
##$TD0= 1
##$TE= 0
##$TE2= 300
##$TE3= 300
##$TEG= 300
##$TL= (0..7)
0 120 120 120 120 120 120 120 
##$TP= (0..7)
150 150 150 150 150 150 150 150 
##$TP07= 0
##$TPNAME0= <>
##$TPNAME1= <>
##$TPNAME2= <>
##$TPNAME3= <>
##$TPNAME4= <>
##$TPNAME5= <>
##$TPNAME6= <>
##$TPNAME7= <>
##$TPOAL= (0..7)
0.5 0.5 0.5 0.5 0.5 0.5 0.5 0.5 
##$TPOFFS= (0..7)
0 0 0 0 0 0 0 0 
##$TUNHIN= 0
##$TUNHOUT= 0
##$TUNXOUT= 0
##$USERA1= <user>
##$USERA2= <user>
##$USERA3= <user>
##$USERA4= <user>
##$USERA5= <user>
##$V9= 5
##$VALIST= <valist>
##$VCLIST= <CCCCCCCCCCCCCCC>
##$VD= 0
##$VDLIST= <DDDDDDDDDDDDDDD>
##$VPLIST= <PPPPPPPPPPPPPPP>
##$VTLIST= <TTTTTTTTTTTTTTT>
##$WBST= 1024
##$WBSW= 4
##$XGAIN= (0..3)
0 0 0 0 
##$XL= 0
##$YL= 0
##$YMAX_a= 115711
##$YMIN_a= -161770
##$ZGOPTNS= <>
##$ZL1= 120
##$ZL2= 120
##$ZL3= 120
##$ZL4= 120
##$ABSF1= 10
##$ABSF2= 0
##$ABSG= 5
##$ABSL= 3
##$ALPHA= 0
##$AQORDER= 0
##$ASSFAC= 0
##$ASSFACI= 0
##$ASSFACX= 0
##$ASSWID= 0
##$AUNMP= <proc_1d>
##$AZFE= 0.1
##$AZFW= 0.1
##$BCFW= 1
##$BC_mod= 2
##$BYTORDP= 1
##$COROFFS= 0
##$CY= 11.3945322036743
##$DATMOD= 1
##$DC= 2
##$DFILT= <>
##$DTYPP= 0
##$F1P= 16.9975609425685
##$F2P= -3.02152046262296
##$FCOR= 0.5
##$FTSIZE= 0
##$FT_mod= 4
##$GAMMA= 1
##$GB= 0.15
##$INTBC= 1
##$INTSCL= 1
##$ISEN= 128
##$LB= 0.24
##$LEV0= 0
##$LPBIN= 0
##$MAXI= 10000
##$MC2= 0
##$MEAN= 0
##$ME_mod= 0
##$MI= 1.114404
##$NCOEF= 0
##$NC_proc= 0
##$NLEV= 6
##$NOISF1= 3.799351
##$NOISF2= 2.8
##$NSP= 1
##$NTH_PI= 0
##$NZP= 0
##$OFFSET= 15.70392
##$PC= 1
##$PHC0= -10136.32
##$PHC1= 23.6009
##$PH_mod= 1
##$PKNL= yes
##$PPARMOD= 0
##$PSCAL= 0
##$PSIGN= 0
##$REVERSE= no
##$SF= 200.130013532006
##$SI= 16384
##$SIGF1= 3
##$SIGF2= 2
##$SINO= 400
##$SIOLD= 16384
##$SREGLST= <1H.CDCl3>
##$SSB= 0
##$STSI= 0
##$STSR= 0
##$SW_p= 3612.71676300578
##$SYMM= 0
##$S_DEV= 0
##$TDeff= 0
##$TDoff= 0
##$TI= <>
##$TILT= no
##$TM1= 0
##$TM2= 0
##$TOPLEV= 0
##$USERP1= <user>
##$USERP2= <user>
##$USERP3= <user>
##$USERP4= <user>
##$USERP5= <user>
##$WDW= 1
##$XDIM= 8192
##$YMAX_p= 0
##$YMIN_p= 0
$$ End of Bruker specific parameters
$$ ---------------------------------
##NTUPLES= NMR FID
##VAR_NAME=  TIME,          FID/REAL,        FID/IMAG
##SYMBOL=    X,             R,               I
##VAR_TYPE=  INDEPENDENT,   DEPENDENT,       DEPENDENT
##VAR_FORM=  AFFN,          ASDF,            ASDF
##VAR_DIM=   8192,          8192,            8192
##UNITS=     SECONDS,       ARBITRARY UNITS, ARBITRARY UNITS
##FACTOR=    0.000296,      1,               1
##FIRST=     0,             0,               0
##LAST=      2.424536,      0,               0
##MIN=       0,             -161770,         0
##MAX=       2.424536,      115711,          0
$$ Real data points
##PAGE= N=1
##DATA TABLE= (X++(R..R)), XYDATA
0@%%%%%%%%%%%%%%%%%%%%%%%%q4J92k16K16k16K16k16K18l25M31m32M33n37O44
38C24o50P55q61R39j048J163j278J410j581J730j897K095k312K547k808L099l414
55a787L767m174M630n152N754o468P328q376R696j1418J3776j7224K2925l4844
69b1567J20808j14824L3613P2476n0245P5450j35579J935R4373m3591l5702J6273
81A3420n7385Q8469j2526m1501m421J137L6644J643j4470m4748M6476P736j6489
94C985J969l2977L0804L569Q576l7560j947K0901J7019n892k5908r586L0699K9639
108C3291o0326M0649k4265p61N5163o2356K0093j360r742M4269j6916o4520N1815
121E034J4752j2045J4448o4149N1835K2002k9270n529O424L420J1282J1035m8364
$$ plain form
0 0 0 0 0 0 0 0 0 0 0 0 0 0 0 0 0 0 0 0 0 0 0 0 0 0 -84 108 -108 108 -108 108 -108 110 -215 216 -216 217 -320 324
38 324 -326 429 -432 507 -541 622 -656 754 -827 903 -994 1101 -1211 1336 -1472 1627 -1787
55 -1787 1980 -2194 2436 -2716 3038 -3430 3898 -4478 5218 -6200 7576 -9648 13277 -21567
69 -21567 99241 -15583 18030 90506 40261 115711 -19868 -17933 76440 32849 -2853 13420
81 13420 -43965 44504 31978 -9523 -13944 -12807 23837 25480 11010 -33738 12738 20474 3985
94 3985 5954 -27023 3781 7350 15926 -21634 -23581 -2680 14339 8447 -17461 -27047 3652 33291
108 33291 -27035 13614 -10651 -11412 43751 -18605 1488 128 -9614 34655 17739 -46781 5034
121 5034 19786 7741 22189 -41960 9875 31877 2607 -2922 3502 6922 18204 29239 -19125
134a9125K4001J664J2068N461l4460o202K7610K0830l3688J666j3647L5320N586
147B7084k6516j0720O34M7969k2976j7059k5748K6583M0743l5897k9061J5487
159i477K3238j923k266m5816M7740R643k9345K3357l7297J4805K5051r415k1954
172a3659O948r064K3930P970m8129K9560N319J537o385p862j564K0005p54k1138
186a3286J9887k8469K2741P967j4833j076j010J1076k491Q228k0942J5617N701
199I110K899o643j0552N748Q510K1512m2905Q815J0643L749M928k5848R665J6627
213A6258k362j9340J9347j7813J3475J1036k1967J2702j9832J1436J5572q247
225A0265k9556J9251R930q077K978k9860K9137P392j0014j4777J363J0791R635
$$ plain form
134 -19125 4876 6540 18608 24069 -10391 -16593 11017 31847 -1841 -175 -13822 21498 27084
147 27084 568 -10152 -9518 38451 15475 -1584 -27332 -749 39994 4097 -24964 -9477
159 -9477 13761 11838 9572 -36244 11496 21139 -8206 15151 -22146 -7341 17710 8295 -13659
172 -13659 -6711 -15775 8155 16125 -32004 -2444 2875 4412 -1973 -9835 -11399 8606 7852 -13286
186 -13286 6601 -21868 873 8840 -5993 -7069 -8079 2997 506 8734 -12208 3409 9110
199 9110 12009 5366 -5186 562 9072 30584 -12321 -3506 7137 10886 15814 -10034 -369 16258
213 16258 13896 -5444 13903 -3910 9565 20601 -1366 11336 -8496 2940 18512 10265
225 10265 -19291 -40 9890 1813 4791 -25069 4068 11460 1446 -13331 -11968 -1177 8458
238H458j427l1177J9606M436R206j8107p757J5799L375K731k5802J4235J270P101
252A947l183p158m794O569J6229j9250Q896j4943K0038O414k4542O108J0554N850
266H735j2305N604j0794K0211j0510n622K0325j7170L816j212Q934n740L387r752
280b093J0643P304k0454J3589r136J2133j013m090j0010O627J2234j1953M908
293H689j4225J5808j210m797p712O890P374j3381J4746j7951M660L160M703j135
307E619j0672l941R940J5268l2174J0577K415O113J27k1987J0550R627P97j3758
321a1499J0121j3450J3176M916j4927R285r252J3168k096n719q240J6471J627
334C581q377L848j1669J8549o126J547n152K191L871j943L219j3404J5816k963
$$ plain form
238 8458 7031 -24146 -4540 -104 9102 -9005 -16762 -963 2412 5143 -20659 -6424 -5154 1947
252 1947 -1236 -8394 -13188 -6619 9610 -9640 -744 -15687 4351 10765 -13777 -7669 2885 8735
266 8735 -3570 2034 -8760 11451 941 -4681 15644 -1526 2290 1078 10012 4272 7659 -2093
280 -2093 8550 15854 -4600 8989 -147 11986 10973 6883 -3127 3500 15734 3781 8689
293 8689 -5536 10272 9062 4265 -3447 3443 10817 -2564 12182 -5769 -1109 2051 6754 5619
307 5619 -5053 -8994 946 16214 -15960 -5383 -2968 3145 3272 -18715 -8165 1462 2259 -11499
321 -11499 -1378 -14828 -1652 3264 -11663 -2378 -11630 1538 -558 -6277 -14517 1954 3581
334 3581 -4796 -948 -12617 5932 -194 1353 -3799 -1608 2263 320 3539 -9865 5951 2988
348B988j74q208Q159L450o503O833p461J6520j6062p41J0813L466r029o592J0820
363H279k217N743k1034J3255N429o392J16q096P645r3P572j2805M577m385O911
378D505N701j6934O602j81R999j1463k136j894P551N511j1459L78p125J5850m592
393C13j240j1081N809J4952j4799j032m703J4045j557n170q860R079K579q441
407a0106J3303j5892O286J190L154n61n551J642Q224P316k1558J1909L55N722
421E433j745j0200P094%J718p165Q045q426Q377j137m454P786o928R669m141N445
437I371m943J328k121L261P515j3951p2q09J2756j1732m230R24O273P809j9374
452g995N158K936P328m915j319n564K476Q460q498M610j4867J1062O843p121r620
$$ plain form
348 2988 2814 -5394 2765 6215 -288 6545 -916 15604 -458 -1199 9614 13080 4051 -2541 8279
363 8279 6062 11805 -9229 4026 9455 3063 3179 -4917 2728 2635 10207 -2598 1979 -2406 4505
378 4505 10206 -6728 -126 -307 9692 -1771 -3907 -5801 1750 7261 -4198 -3820 -10945 4905 313
393 313 -927 -12008 -6199 8753 -6046 -7078 -11781 2264 707 -4463 -13323 -4244 -1665 -10106
407 -10106 3197 -12695 -6409 -5219 -2065 -2626 -8177 -6535 1689 9005 -12553 -644 -289 5433
421 5433 3688 -6512 582 582 2300 -4865 3180 -5246 3131 1994 -2460 5326 -1602 8067 3926 9371
437 9371 4428 5756 3635 6896 14411 460 388 -421 12335 603 -3627 -2703 3570 11379 -7995
452 -7995 -2837 99 7427 2512 1193 -4371 -1895 6565 -1933 2677 -12190 -1128 5715 -1406 -11026
467a1026K557J2870k858j532j6399J6825L730l739l143o997J1129J111P13j1986
481h745P066K737P029p011q571J1747k075Q677j1538K413K04K290L984n388j50
496B669l793J2760m984k019r249J1258R751j3260K42l296J1346m651k119l873
510G82O085p31n927R100j0786N811j533M376k781m168M04L296O600j1573N076
525D031o848Q270J095n796j044k596J1550o026j803q772J0760M492o015n415k348
540f465J0645m919M980j2169L360N121M88P38j3228O350P571O114j8278n74P836
555b430Q175k727j8273J2012M479K557r102M70J997P439J390j1304P344n519J1533
570H041j398p937j625M470N052n174L60p248J2083l083Q09l256l362J1769j552
$$ plain form
467 -11026 -8469 4401 1543 11 -16388 437 4167 428 -2715 -9712 1417 2528 3241 -8745
481 -8745 -1679 1058 8087 1076 -7495 4252 2177 10854 -684 1729 1933 4223 8207 2819 2669
496 2669 -1124 11636 6652 4633 -4616 6642 16393 3133 3375 79 11425 6774 4655 782
510 782 6867 6136 209 9309 -1477 4334 2801 7177 4396 228 632 3928 10528 -1045 4031
525 4031 -2817 5453 6548 752 -292 -2888 8662 2636 833 -7939 2821 7313 1298 -4117 -6465
540 -6465 4180 -739 4241 -7928 -4568 553 1041 1779 -11449 -5099 2472 8586 -9692 -10266 -2430
555 -2430 5745 3018 -15255 -3243 1236 3793 -5309 -4839 -2842 4597 5987 -5317 2027 -3492 8041
570 8041 6643 -1294 -2919 1551 6603 1429 1789 -5459 6624 3541 4350 1094 -2268 9501 7949
585G949R59j1494O922M513J851q347l512R000m462J785q810O956k810L86K284
600C170m228Q12l555R280l672m09q334P198N032q100J270m986Q616l827j82m746
616f661K293J939J311J518j1816P665j11O223o458n090M929L134K774r774K950
631e174k23J0142m829o122p96N069J1863j3197k213N93J1693j520q838j087P407
646B768O900j1775L273l803P868M9l621O05m646O674P41J167j0123O890J636J315
662E918k132q983J1653r38J0n907J616N40M242j435p381N566l726P093o535j195
678a594J552J591R73n339L867m885N758k999K777m023k941N845j221K177r663
693h125O964J080Q6m746n70N191k225K469o397N794m724M076K579m673j67j788
$$ plain form
585 7949 8908 -2586 4336 8849 10700 2353 -1159 7841 3379 5164 -3646 3310 500 886 3170
600 3170 -1058 -246 -3801 5479 1807 1398 -6936 262 5294 -2806 -1536 -6522 2094 -1733 -1915 -6661
616 -6661 -4368 -2429 -1118 400 -11416 -3751 -3862 2361 -4097 -9187 -4258 -1124 1650 -8124 -5174
631 -5174 -5397 4745 -84 -6206 -7002 -1933 9930 -3267 -5480 -4887 6806 5286 -3552 -4639 2768
646 2768 9668 -2107 1166 -2637 5231 5280 1659 2264 -2382 4292 5033 6200 -3923 2967 4603 5918
662 5918 3786 -5197 6456 5518 5528 -379 1237 1777 6019 4584 -2797 2769 -957 6136 -399 -1594
678 -1594 -42 1549 2522 -2817 1050 -3835 1923 -1076 1701 -2322 -5263 582 -639 1538 -8125
693 -8125 -1161 -81 5 -4741 -5311 -120 -2345 124 -6273 -479 -5203 -1127 1452 -3221 -3388 -5176
709e176Q810m054j937m586R134J462n448q77l203J2155m024k229m930M978N008
724E083j245m458m423J2449l413p94o767M784N764l947o91l963O105k476L942
739E950m892P55k27J348M834j0398L529N51N281o032l469K486K749Q34p733N987
755A553l804M016l404j74K310l186L962k952K347n242N218j917M9L61m122M508
771d77m445M861m142J088j560K817M16m394L777j788N797o469K597K73N66J328
787B45k463N013o165K923J29L541m933j223M172Q06O19r622Q998J200j45m439
803a344j55N045l19J128o401O381k886M142l272l946N013j032L243o706J770k77
819C84N234m792q27K880l632N832o108K330k421K558J93k965j318q57O647o401
$$ plain form
709 -5176 3634 -420 -2357 -6943 2191 3653 -1795 -2672 -5875 6280 2256 27 -4903 75 5083
724 5083 3838 -620 -5043 7406 3993 3199 -3568 1216 6980 3033 2342 -1621 4484 2008 5950
739 5950 1058 1813 1586 2934 7768 -2630 899 1450 6731 699 -2770 -284 2465 3299 -4434 1553
755 1553 -2251 1765 -1639 -1813 497 -2689 1273 -1679 668 -4574 644 -1273 -1224 -863 -4985 -477
771 -477 -4922 -61 -4203 -3115 -4675 -1858 -1442 -5836 -2059 -3847 1950 -4519 -1922 -1649 -1083 245
787 245 -2218 2795 -3370 -447 -318 3223 -1710 -2933 1239 2045 2664 -6958 2040 3240 3095 -1344
803 -1344 -1499 3546 3227 4355 -2046 4335 1449 5591 2319 -1627 3386 2354 5597 -1109 661 384
819 384 5618 826 -1 2879 -753 5079 -1029 1301 -1120 1438 1631 -1334 -2652 -3509 3138 -3263
835c263J309k754N341j283m628L915m01K507n992M156j068J122k723M63M224n611
851d686L329l130N057k783K79O70l68J358k612N033n146L646j650J615l96k088
867a872M036k720M250m265K824k006K770J222k772P33k432P046n586p82j308M951
883D089K42o154J643R31M862o475K182p75K735m30l027L630m106L860j644R48
899B511m400K707J773k124P66n467P059k543m29j376J385J512j995O69l257N333
915B124l800K975l344nL134l330J762k901M939l659L97j614L510P85m893L914
931fj068L959n824K254J675J133j434l170M785l257L007l393K420j578p7L038
947B464l012K197l203O220j941m10j917K903K785l399J684m502N792k679n5k310
$$ plain form
835 -3263 -1954 -4708 633 -650 -5278 -1363 -1764 743 -5249 -1093 -2161 -1039 -3762 -3299 925 -4686
851 -4686 -1357 -4487 570 -2213 -1934 -1264 -1632 -274 -2886 2147 -2999 647 -1003 612 216 -1872
867 -1872 2164 -556 3694 -571 2253 247 3017 4239 1467 2200 -232 6814 1228 446 -862 4089
883 4089 4331 -1823 -180 751 5613 -862 1320 545 3280 2850 -177 3453 -653 3207 1563 2511
899 2511 -1889 818 2591 467 1233 -4234 2825 282 -147 -1523 -138 1374 -621 48 -3209 2124
915 2124 -1676 1299 -2045 -2050 1084 -2246 -484 -3385 1554 -2105 -1708 -3322 188 973 -3920 -6
931 -6 -1074 2885 -2939 -685 990 2123 689 -2481 2304 -953 2054 -1339 1081 -497 -574 2464
947 2464 -548 1649 -1554 4666 2725 2315 398 3301 6086 2687 4371 -131 5661 2982 2927 617
963F17n31M130k336j53m633O348j070O39l739O13M565m156K226m178L664k330
979c24J355j698j543J124r21M881p104J599L11L271j725l876L194L80J342o107
995e841M584j456J638j490j671L811l737K982j687K826k447J456o16L20K884m028
1011b472L579l751M498j509j341k85J753L360n462J985j677N419k978q57M24J25
1027H11K763l599L084l737L027j1J036k466k450N447o19J30o567M860J747n69
1043B887k923k335N914k325L11m056K833l07K045r90m221L841j982M161m620L0
1059a737N86K041q27k941K001k568N369l750K34k001J289L674l388p33j819O331
1075A761l359o23j982L347K466m949K290j563L668k960J754n34K00l53j002M282
$$ plain form
963 617 86 4216 1880 1727 -2906 3442 2372 3011 -728 -115 4450 294 2520 -1658 2006 -324
979 -324 1031 -667 -2210 -1086 -2007 2874 -4230 -2631 -2320 951 -774 -4650 -1456 -1076 266 -5841
995 -5841 -1257 -2713 -1075 -2565 -4236 -425 -4162 -1180 -2867 -41 -2488 -1032 -1648 -1328 1556 -2472
1011 -2472 1107 -2644 1854 345 -996 -1281 472 3832 -1630 355 -1322 4097 1119 262 686 811
1027 811 3574 -25 3059 -678 2349 2338 3374 908 -1542 3905 3286 3416 -3151 1709 3456 2887
1043 2887 -36 -2371 3543 1218 1529 -2527 306 -1 2044 1054 -3167 674 -1308 2853 -1767 -1737
1059 -1737 -1151 890 63 -2878 -877 -3445 1924 -1826 -1592 -3593 -2304 1370 -2018 -2751 -4570 1761
1075 1761 -1598 -2221 -4203 -856 1610 -3339 -1049 -2612 1056 -1904 -150 -684 -484 -837 -1839 2443
1091B443m429K213j849K895r07j610J535q04L333k948K003l146L018R87l43n75
1107A816k950N464k417J230l638K237J167n64J0l650K844n92L489n026p62J289
1123e3K462P70o654L028J146K939n830k94K008J973Km840L042k090L299k008n24
1140a624j312N35K795k513K90l816O284j321j388j235l66M567k628N39k643L500
1156c36j03J481l183j061M678j735J406m179L164J041O5j625n46K570k687L163
1172B113k451J896k057J182J820j890K23j722M750k795L77k038K031J141j967
1187F13K033l171K668j848K895k207j198R46M24K127m957J639p77M044l198j854
1203a821P11J35L602m195J21j213M471r80k940r42J734M086m992M42j645M122
$$ plain form
1091 2443 -1986 227 -1622 1273 366 -1244 291 -513 2820 -128 1875 -1271 1747 2734 2391 1816
1107 1816 -1134 4330 1913 3143 -495 1742 2909 2345 2355 -1295 1549 957 4446 -580 -1342 -53
1123 -53 2409 3179 -3475 -447 699 3638 -2192 -2486 -478 1495 1497 -3343 -301 -2391 908 -1100 -1624
1140 -1624 -2936 -2401 394 -2119 -1829 -5645 639 -682 -2070 -3305 -3671 896 -1732 -1193 -3836 -336
1156 -336 -439 1042 -2141 -3202 1476 -259 1147 -3032 132 1173 1238 -387 -933 1637 -1050 2113
1172 2113 -338 1558 -499 683 2503 613 836 -886 3864 1069 1446 -592 1439 2580 613
1187 613 2646 -525 2143 295 3190 983 -215 731 1155 3282 -1675 -36 -813 3231 33 -1821
1203 -1821 -1110 -975 2627 -1568 -1447 -2660 1811 831 -2109 -3051 -1317 2769 -2223 -1781 -3426 696
1219F96q32j959j30q1K492k095K244l957K181P99N36m60m087M249M61R77m197
1236c163J987J065J459p26k920M190j990K916k699J42L09J500K49k934J907j808
1252e16L448k653O47n5q3J585j717K006k669K524j229J736k420r38K918j912R45
1269A617k935K657j817R22m55l5O37k335L699k097P46k852K573J511k435p66j588
1286b953M888k683m07k193K185J234j216n21j878M607j714J014l162Q40K773m79
1302C35p61k841L752j369J464k772J335M95o70K377l597J699m96L021j681j161
1318h70J21J601K475m623K509l99K411k260m57J133L6J051k399K358k738K256
1334B205p73N79L0k070K997j724J174k154K268j091L49o9j600J830k272K318k177
$$ plain form
1219 696 -136 -2095 -2225 -2306 186 -1909 335 -3622 -1441 -642 -106 -566 -4653 -404 57 1034 -3163
1236 -3163 -1176 -111 1348 622 -2298 1892 -98 2818 119 261 570 2070 2319 -615 1292 -516
1252 -516 2932 279 926 871 788 2373 656 2662 -7 2517 1288 3024 604 -334 2584 672 1617
1269 1617 -1318 1339 -478 444 -11 -46 591 -1744 1955 -142 604 -2248 325 1836 -599 -1365 -2953
1286 -2953 1935 -748 -1155 -3348 -1163 71 -1145 -1666 -3544 1063 -651 363 -2799 -1959 814 335
1302 335 -426 -3267 485 -884 580 -2192 -857 -362 -1032 1345 -2252 -553 -1049 1972 291 -870
1318 -870 -749 852 3327 -1296 1213 814 3225 965 508 1641 1677 2728 329 2687 -51 2205
1334 2205 1432 2011 2041 -29 2968 1244 2418 264 2532 1441 1790 1721 121 1951 -321 1997 -180
1351a80R02r18M07K76j395K080k467J917k104K206j261j089P44K62J492m456K200
1368a384K78J644k391j007K293L9M92l439L181n14R78j383n54J422p17K081k417
1385a398Q65j018K810r19j097Q85p03L102l094J163p14J514m23n44o6j012K979
1402B330k163J241j837J943N08j368J67m04K276k347J010j321J570j304p90K045
1418A556j723O76j695K609j522L18n12L63R44k626K347j458J576j616O57J94j354
1435a266P11q94K314k946J444j116J352r1j245R09j030K837k338N52j243K061
1451A1Q16k067L6o21L350k266k08o36K013J74k091J435j191K095j435J134j357
1468h08O99Q62j28R24l146L114k60N0j742P82J377p00K74k018K728j473J070j034
$$ plain form
1351 -180 722 -196 211 487 -908 1172 -1295 622 -1482 724 -537 -1626 -882 -620 872 -3584 -1384
1368 -1384 -1106 538 -1853 -2860 -567 -528 -36 -3475 -294 -808 170 -1213 -1767 -345 -1062 1019 -1398
1385 -1398 -533 -1551 1259 340 -757 128 -575 2527 -567 596 -118 1396 973 429 363 -649 2330
1402 2330 167 1408 -429 1514 2022 654 821 417 2693 346 1356 35 1605 301 -489 1556
1418 1556 -167 509 -1186 1423 -99 219 -293 70 1014 -1612 735 -723 853 -763 -106 88 -1266
1435 -1266 -555 -1449 865 -2081 -637 -1753 -401 -492 -1737 -828 -1858 979 -1359 -807 -2050 11
1451 11 827 -1240 -1204 -1825 1525 -741 -949 -1585 428 602 -1489 -54 -1245 850 -585 549 -808
1468 -808 -109 753 625 1549 -1597 1517 1257 1307 -435 347 1724 1024 1298 -720 2008 535 1605 571
1486E71R8R67j342J417j513J368j528J508j376L96Q21k070J574j063J486k290
1502i76P21J85P76q09j647K330j495J558k600J384j56l30J39q15J147k253K683
1519a58j054K40j471P08K021j484K45j620L150r95n7j100O98J739j136O08k209
1536a875K346j81P45j855q2K283q01N98k645K235L57M41j330k86J232n97J975
1553B560k562P28l82J854n01k005Q94N17J824l551R37k01J706o95j781J721r78
1570H5Q94j564J695j476M25n6o2P17k286K050j112J393j559L19j97L38Q97j962
1588a461R91j352K442j110q64j08O52J065k024J004j301K050j049N97m48j104
1604b020J988o30J290k764J565Q54Q89j700j381K909m48N99k743J724N17N64n39
$$ plain form
1486 571 669 1636 294 1711 198 1566 38 1546 170 566 1387 -683 891 -172 1314 -976
1502 -976 -255 -70 706 -103 -1750 580 -915 643 -1957 -573 -729 -1059 -920 -1735 -588 -2841 -158
1519 -158 -1212 -972 -2443 -1735 286 -1198 -953 -2573 577 -418 -475 -1575 -877 862 -274 334 -1875
1536 -1875 471 290 1035 -820 -902 1381 580 1178 -1467 768 1125 1566 236 -50 1182 585 2560
1553 2560 -2 726 344 2198 1697 -308 586 1103 2927 -624 313 112 1818 1123 -658 1063 85
1570 85 979 -585 1110 -366 59 3 -59 658 -1628 422 -690 703 -856 -537 -734 -396 501 -1461
1588 -1461 -470 -1822 620 -490 -1354 -1462 -810 255 -1769 -765 -2066 -16 -1065 -468 -916 -2020
1604 -2020 -32 -662 628 -2136 -571 283 1172 -528 -1909 1000 552 1151 -1592 132 649 1213 674
1621F74j250J670r58K210k027k8j12J878L28k265N68l36K681k237k26p27J038
1638H81J184j710j73r91K744j259j41j569J121J878j952j21j133K169j203k0n31
1655h26M69j8j009J744j828Q88r94J607m31j126K38K02J854k318R54q67J226k20
1673d55n33M73r76J620p83Q73k119J396N24J29j17j714K300n90R71j849N84K75
1691IJ097L11k515J355l8K317k099p01N07J456L96k654J485m98J631j245j6k68
1709E30J24J218j071M85k148K423J40m41j363l70K382j100k68j901K400k86j67
1726E87j067n95K038q26N57k293J080M95N92j396n78J279q76J274j949J164l03
1743h17J37J50n04M75j417K210j076N80j360J019R17j059N15r56J981j568J080
$$ plain form
1621 674 -576 1094 136 2346 319 291 179 2057 2385 120 688 352 3033 796 570 -157 881
1638 881 2065 355 182 -809 1935 676 535 -1034 87 1965 13 -108 -1241 928 -275 -295 -826
1655 -826 -357 -375 -1384 360 -1468 -580 -1574 33 -398 -1524 -1286 -1084 770 -1548 -594 -1461 -235 -455
1673 -455 -988 -515 -1491 129 -654 219 -1900 -504 20 149 32 -1682 618 28 999 -850 -266 9
1691 9 1106 1417 -1098 257 219 2536 437 -264 243 1699 2095 -559 926 428 2059 814 798 530
1709 530 654 1872 801 1286 -862 1561 1701 1260 -103 -473 1909 809 541 -1360 1040 754 587
1726 587 -480 -1075 963 137 694 -1599 -519 -24 568 -828 -1406 -127 -1003 271 -1678 -514 -817
1743 -817 -680 -530 -1034 -559 -1976 234 -842 -262 -1622 -603 314 -745 -230 -1186 795 -773 307
1760C07p42P57j25k15J478j927O21l55J848j268o37M92L78J405k056O57l97J783
1778B004n92o15k46Q3J804k000O11j637J975j2r99l06j10J435j153P80j548J274
1796G48l5R3P4k018J302K7J053k491L91N58Q43p28j925K394p62O79j457N22K27
1815e05L91o3j043R59j155K047j466j00p2L40Q34j520Q34q00J695j355Q83m09
1833e05l59J133r75J218j428J119k78M68n24kP75j159J344r80J309j684J011M83
1851I66k72j53j131K166q08K38j353J220P51j120j94m50J614j221Q02j323M51
1868A83M28k13J94j158J273q37J054j453M16J73qM06j661J089p52R24m45l52n42
1887a281M68J323k061Q05n44J451o97o74J46L92O99j570J397r11J047p77N65K28
$$ plain form
1760 307 -435 322 197 -18 1460 -467 154 -201 1647 379 -258 234 612 2017 -39 618 221 2004
1778 2004 1412 797 551 634 2438 438 1049 -588 1387 1375 376 70 -40 1395 242 1022 -526 748
1796 748 713 806 880 -1138 164 191 1244 -1247 -856 -298 545 -183 -2108 286 -476 203 -1254 -732 -505
1815 -505 -114 -177 -1220 -261 -1416 631 -835 -935 -1007 -667 167 -1353 -519 -1319 376 -979 -96 -505
1833 -505 -864 269 -706 512 -916 203 -75 393 -131 -133 642 -517 827 -153 1156 -528 483 966
1851 966 694 541 -590 1576 768 1006 -347 873 1624 504 310 -140 1474 253 1055 -268 183
1868 183 611 398 592 -566 707 -130 924 -529 -113 60 52 458 -1203 -114 -866 58 -387 -739 -1281
1887 -1281 -813 510 -1551 -746 -1290 161 -536 -1210 -1064 -672 27 -1543 -146 -1057 -10 -787 -222 6
1905Fp81J101j017J155j234J066m28O16l30p06J560j141R33r91J080o74K69J27
1923F11l66R99j435J257r59J091p34M6J12j60Q71j813J039m90J254j058o19O86
1941C32J93M95j844J254m39Q28j068j24N90n76Q34j171J175j529J088j37m51q8
1959f38m37J856j412K48q59J166m26k07K4k82J223j334R99j105O64K50l18J26
1977d62p00J359r96P32r01R99j98l67Q80p05P47r32J118n03K55n09J24J127j380
1996c12J035o13R32q55O22l9n6Q3q13J499j209M80q15Q54K95r30K62m19J431j387
2016D5M31p85R76L12q58j40p36J720r52qr52J023K90j110L62q07J569j041M53
2035b08o93M59m3p6N53j611J392k99O23j259M24M52L4J26j422J594o31N54p69
$$ plain form
1905 6 -775 326 -691 464 -770 296 -132 484 154 -552 1008 -133 800 -191 889 215 484 611
1923 611 245 1244 -191 1066 107 1198 464 510 622 462 1333 -480 559 69 1323 265 -354 332
1941 332 525 1020 -824 430 -9 819 -249 -373 217 -359 475 -696 479 -1050 38 -99 -550 -638
1959 -638 -1075 781 -631 -383 -1242 -76 -502 -709 -685 -967 256 -1078 -79 -1184 -520 -270 -588 -462
1977 -462 -1162 197 -799 -67 -968 31 -167 -534 346 -359 388 -544 574 71 326 -183 -59 1068 -312
1996 -312 723 110 1042 187 809 770 714 797 -16 1483 274 754 -61 793 1088 158 420 1 1432 45
2016 45 476 -309 667 979 121 -19 -755 965 13 5 -947 76 366 -744 -382 -1189 380 -661 -208
2035 -208 -901 -442 -485 -561 -8 -1619 -227 -526 97 -1162 -738 -286 -252 -126 -1548 46 -585 -31 -800
2054h00N07L35o18P26q49J193j263J152l46M1R3n89J315j101Q40q56P49l11M46
2073F64q3o30Q88o23J008j143N44k15K80M4p39Q87r35J112r28P46q76l4R98o07
2093C58J7j184J756o12J91j195L20J006p19N0q64J171l93K15p49O9O73o09P75
2112B76j530Q04J12M77j013j82P06j06R65j753R68m79J146n39o31K82P4J276j760
2131i07M88l21J321m33r41Q26k6O87r93R69j053R24l54K33N44j181Q99l46R67
2150A303j307K97J05K86K27j018R57p02O98o10k0L0j4O69r03K70o40J499r34J42
2170C35l27k46P03o59P46j330Q54l99R21q59n18J046l35O13j548Q09K9O02q39
2189d02m20P88m83R93j217M38n32Q72K29q72J66m78J834q48l95l52J057Q6o77
$$ plain form
2054 -800 -293 42 -576 150 -699 494 -769 383 37 78 171 -418 897 -204 636 -220 529 218 664
2073 664 581 -49 839 216 1224 81 625 410 690 734 -5 882 -53 1059 131 877 1 -33 965 358
2093 358 375 -809 947 335 526 -669 -349 657 -62 -12 -876 295 -98 117 -632 -563 110 -499 276
2112 276 -1254 -450 -338 139 -874 -1056 -350 -456 509 -1244 -276 -755 391 -148 -779 -497 -423 853 -907
2131 -907 -419 -740 581 148 -793 33 7 694 -299 670 -383 541 187 420 964 -217 682 336 1303
2150 1303 -4 293 398 684 911 -107 850 148 846 236 216 246 232 901 -2 268 -372 1127 193 335
2170 335 8 -238 465 -194 552 -778 76 -323 598 -261 -779 267 -68 545 -1003 -194 -165 437 -402
2189 -402 -822 -34 -517 476 -741 -303 -835 37 266 -606 -440 -918 916 68 -327 -679 378 464 -213
2208b13j9k14J412j124N53j043R49O27q15K89q62J366m67K86q90O81M20p68N87
2227G55o30P11p99J038m73k28r3M0Q65j328M97o24J042l90q02M48lN16p85M71
2247B28q64P49l80K98O0j039R90k61M35j207N33K5L08n3q42N87l22J156j069n8
2267g26k75P25M19j207N50m71J172q36J21m0L36K77o31M83q09J166j69J61p55
2286e09M4J022j91M0j152J320m7J12r92L17J047p98N51r06P59k46N54n80k29N02
2306F18k35P92j292N92j39M49m06l00M01m99Q37j103N48o17J99M86m65J00p06
2325g40J140p40M17r28O72L28p79Q11o22Q20j201Q98m30k0k78M76P23j442K81
2344f14k04J031q84J18R1q0O90m30L50q87J005k8j33j30l74J033n78L47q47J040
$$ plain form
2208 -213 -232 -446 966 -158 395 -648 301 928 113 402 -460 906 439 725 -165 516 936 168 755
2227 755 125 836 37 1075 602 374 281 321 1186 -142 355 -269 773 383 -419 29 26 542 -243 228
2247 228 -636 113 -267 31 91 -948 42 -219 216 -991 -458 -433 -125 -178 -1020 -433 -755 401 -668 -726
2267 -726 -1001 -276 143 -1064 -514 -985 187 -649 -528 -568 -232 45 -586 -103 -912 254 85 246 -509
2286 -509 -465 557 366 406 -746 574 527 639 -353 -36 1011 213 764 -142 617 371 925 345 116 618
2306 618 383 1175 -117 475 336 785 379 79 480 -19 818 -285 263 -354 -155 331 -134 -34 -740
2325 -740 400 -340 77 -851 -179 149 -630 181 -441 379 -822 76 -354 -374 -652 -176 547 -895 -614
2344 -614 -818 213 -671 -553 -462 -542 148 -282 68 -819 186 158 25 -105 -479 554 -24 323 -524 516
2364E16l57K48l77k75P50j56R87j056o7j26N53k54p84O98J86P29j583O02J1K10
2384D55Q5n24N63l35O06p93L14o79M86J08l12L01r24R84p64L07l17K34K73o32
2404e64P17p20O70o27L09l17J59J28o63J021r50O20n66L63O6K44j9o46P27k88
2424c36L84p58P59J08k54Q2n34Q31m83O63p21O20j21k68N41o66O00n17Q66o70
2444A26K28j81Q4M56p55O60o75R75q23J23J9o9N69o31M02p68Q78m40j54k04L89
2465B09K25p27M48k78N09n32rK74l04M66p12O63q18N33l48L14j88m98P86n56M70
2486g3n42N98l40K5j17j9N14p23M71k74O37p12K73K00j61M30n29M04o60R61l60
2507Ck36K89N1N06p63L03k77R49n77j22J34j17O02r08P37n88P64m74L35k60m13
$$ plain form
2364 516 159 407 30 -245 505 349 1336 280 213 87 640 386 -398 300 486 1215 -368 234 245 455
2384 455 540 16 579 244 850 57 371 -308 178 286 -26 275 -649 335 -429 -122 -439 -205 68 -564
2404 -564 153 -567 103 -524 -215 -532 -373 -245 -908 113 -837 -217 -783 -420 -354 -110 -129 -775 -48 -336
2424 -336 48 -710 49 157 -97 -15 -549 282 -201 462 -259 361 240 -28 513 -153 447 -70 796 126
2444 126 354 173 257 713 -42 618 -57 918 95 218 237 168 737 106 508 -260 618 178 24 -180 209
2465 209 434 -293 155 -123 386 -146 -155 119 -185 281 -431 232 -586 -53 -401 -87 -275 -773 13 -543 -73
2486 -73 -615 -17 -357 -332 -449 -468 46 -677 -206 -480 157 -555 -282 -82 -243 187 -342 62 -598 363 3
2507 3 -233 56 107 613 -150 153 -124 825 248 126 260 143 745 -163 574 -14 750 276 611 351 -62
2528f2Q68m43K55q11O64P8k20j32q8M64n95L01k85L05j46k19K24n15N94n88M85
2549A34n87K86k7j77L90l49L69p06O84m87N11p86K61L55q20P28n03N74l16K07
2569b59k9J43K8n00P18m00K37n26P22n8j06o0j49Q48n35K11p72J141r2m99K54
2590C17k91O84n47L45m08K46J11J0M6m08P30n26O59r03L53k2JJ84p46N45j51M41
2612F70p72J64R9K07J66q65O47k18M84p98Q0Q4j33M26o50O98q28N52j53J31l36
2633c45k11P39o70K72l28M76l50K42p8k35N66l52L41o28N15m53M06n1l73O30l80
2654b67Q28r93N48k98J81K58j28p1m20P45j67K22n86L44O36n82K99p71J017m26
2674C69N0m86L32J40j02L31o39L96l20N69m56l6J5n1O56q68K37k36O52k67l15
$$ plain form
2528 -62 806 363 618 -193 471 549 329 197 109 573 -22 279 -6 299 153 -66 158 -357 237 -351 134
2549 134 -453 -167 -194 -371 19 -330 39 -667 17 -470 41 -745 -484 -129 -949 -221 -724 -150 -466 -259
2569 -259 -288 -145 -117 -617 101 -299 -62 -588 134 76 -30 -90 -239 609 74 285 -487 654 562 63 317
2590 317 26 710 163 508 100 346 457 467 513 105 835 309 968 65 418 396 397 581 -165 380 229 670
2612 670 -102 62 161 368 534 -331 316 98 582 -216 -136 -52 -185 241 -409 289 -539 13 -140 -9 -345
2633 -345 -556 183 -487 -215 -543 -67 -417 -175 -253 -488 78 -274 67 -561 -46 -499 -93 -144 -517 113 -267
2654 -267 561 -432 116 -182 -1 257 129 58 -362 383 216 438 -148 196 832 250 549 -222 795 369
2674 369 419 -67 265 405 303 634 -5 391 71 640 184 148 163 112 768 -100 137 -99 553 286 -29
2695b9j36M7M74q13L45m74P81k47k77K48j91L64n86M15k85L02j42j32K40m77N35
2716c8m12P57o07qQ3K15J91q40Q49l93N32o36M19r0J73L2m08N04l99N62n94M68
2738C60k07n1L88l86M66o52L48j66L29r3k83N55j80K34n04K61j01K86m77l67M25
2759A85J04M10q43M46l19N74l64k30Q6m84J100n49j8m66O59l22l04J1l01Q95m75
2780b05J30n56N39l6k28J51m16P08n06K24l18J95k8K1K93n05O86m71L88l21N0
2801b05j21K01M99o17K87l66L82L4j07q9K14N29n88K18k53L77k79Q9M20o55N93
2822E63n19M84m71L41l33K23J79m05M53n82O69o18K87l21M11j27q2Pl56O61o38
2843a74N1p4L00ol55K93n95O57l54L45n40k2N00j97l8p18O05J50K62o23n1O17
$$ plain form
2695 -29 -165 -118 356 -457 -112 -586 195 -52 -329 -81 -272 92 -494 -79 -364 -62 -204 -336 -96 -573 -38
2716 -38 -450 307 -300 -308 -225 -10 181 -659 190 -203 329 -307 112 22 195 227 -181 323 -76 486 -108 360
2738 360 153 102 490 104 570 -82 266 100 429 336 53 608 428 662 158 419 318 604 127 -240 185
2759 185 289 699 -144 302 -17 557 193 -37 49 -435 665 116 98 -368 291 -31 -335 -324 -625 270 -205
2780 -205 -75 -631 -92 -128 -356 -205 -621 87 -419 -195 -513 -318 -346 -325 -32 -537 149 -322 66 -255 -205
2801 -205 -326 -125 374 -243 44 -322 60 94 -13 -102 112 641 53 271 18 395 116 205 625 -30 563
2822 563 44 528 57 398 65 288 467 62 515 -67 602 -16 271 -50 361 234 152 159 -197 464 -174
2843 -174 -123 -197 103 97 -258 35 -560 97 -257 88 -452 -474 26 -171 -209 -927 -322 -172 90 -533 -584 33
2865C3j0j70m54O27l03K47l55K19J50m89P68m28L32l09M29k61q0K06j73M61o09
2886a69N48m22K30K18k42L3k3M88o22L39m31M39j30L0K76n56M35m05L25j62K39
2907D38k97j7K26l79L23l75N69l48k64K56l55M09o65N44l85M04m07K73k08m0J88
2928a10k10L96q15O74l06L77l48J2L16l06L10n40L27k85N11k1m28L48k55O88p44
2949d09M19j22L90m16j99N35k50L98m90M97k87J37p8j50R6k31N91l94L79m31M45
2970D30l3n37L01NK70m21L92k45J14M2l04M51n31P32o28K49k19O1Ml22N12m79
2992a56N15o25J14j5J79J34n15N93o17M71o23M38L0j01p9M1J44l38M19l36K79
3013d8l08K15K26l40J72k47M61m98L63k70K45J37m24M86m42M38l50M39l23J79
$$ plain form
2865 33 23 -147 -601 26 -277 -30 -385 -166 -16 -505 263 -165 167 -142 287 26 -54 152 -21 440 -169
2886 -169 379 -43 187 405 163 196 173 661 39 378 -53 386 256 286 562 6 441 36 361 199 438
2907 438 141 124 350 -29 294 -81 488 140 -124 132 -223 186 -479 65 -320 84 -323 -50 -258 -298 -110
2928 -110 -320 76 -739 -65 -371 6 -342 -330 -14 -320 -10 -550 -223 -508 3 -18 -446 -98 -353 335 -409
2949 -409 10 -112 278 -138 -337 198 -52 346 -144 353 66 203 125 -25 71 -160 431 37 416 -15 430
2970 430 397 -140 161 166 436 15 407 162 276 318 14 465 -66 666 38 287 68 129 133 -189 323 -156
2992 -156 359 -266 -152 -167 12 146 -369 224 -393 78 -545 -107 -77 -178 -257 -216 -72 -410 9 -327 -48
3013 -48 -356 -141 85 -255 -83 -330 131 -367 -4 -274 -29 108 -316 170 -272 166 -184 255 -68 111
3033A11K04m21J89j35M20k48K31k36Q1Rm41Q35m23M73o20M89m13Q8P5j45M49n26
3055D6O07m96jj74m9N39p16L25m59Q25m53J25J46j99J77p76P36m66M94m96J27
3076a38j78K24R1l73L24n00P35p68M90j40l2K52l75M12m53N67o36O12m18O3K88
3097D7k58L65n24L61J69J70n16J54M74m72K89n07O33k50J00J95l02M36o27O41
3117E78p31O22l66P7J15l18M25m11N39p39N62j61P4l1j92L09n26M87m96L41k59
3138a01J63j31p8M36m05L04m74M85j32j50o4j74P23m65O6n14N84j14l76N1J39
3159b27K82m57M98o21M10j05N8J79n30N74k76K99m55N1L92M5j23k89N55m59O76
3180D77m62P1M3N5P6m87N84m12N72m93K13q0J09M5l08M16m09L42m06L70j49k01
$$ plain form
3033 111 315 -106 83 -52 368 120 351 115 196 205 -236 599 176 649 29 518 105 193 268 123 572 46
3055 46 653 157 156 -18 -67 472 -244 81 -378 447 -6 119 265 66 243 -533 203 -263 231 -265 -138
3076 -138 -316 -92 -1 -374 -50 -550 185 -583 -93 -233 -265 -13 -388 24 -429 138 -498 114 -304 -241 47
3097 47 -211 154 -370 -9 160 330 -186 -32 442 -30 259 -248 385 135 235 430 128 564 -63 578
3117 578 -153 469 103 180 295 -23 402 -9 530 -209 353 192 266 235 43 352 -174 313 -183 158 -101
3138 -101 62 -69 -147 289 -116 188 -286 199 67 -83 -147 -321 402 -63 3 -511 73 -41 -417 -366 -227
3159 -227 55 -402 96 -525 -115 -220 -162 17 -513 61 -215 84 -371 -320 72 117 -6 -295 260 -199 477
3180 477 15 86 129 184 260 -227 357 -55 517 24 237 157 266 311 3 419 10 352 -54 316 167 -34
3202c4M13l89M28m94M04j76k6l30J65K93k18J62m57J96j74K13j30o8R5k32N00
3223A41l91K31l51M52o0p3n1m27N03k07M25o05J75K35k30O8l68M02j31J95j87
3244b54J40J67j59J04m68N35m0K39k30j29J1K32K83p17L86r6M75k58k08K0K18
3265B51R1m66N55n33N45k61J80k0k29L80m31J35k36L69m13P4M8k89N36l59L24
3286B51l53J19j90K18J21m20M59m8pn51K59l3K10lm31M03l90M20n17K79p6q2J08
3309b54j5L22m48L38j98J67k09K5L88l16K44k98J44q2N54m38j41L07l05M73o60
3330d02O63m66N08j05j62Q3l4O5l3J13j74K66J35k17j92lN02l92J39m86O08J00
3352E16m75J61j98M39m91M6k50M27j13n0l5l11M26j13R7j78MJ52j38j07k60O85
$$ plain form
3202 -34 379 -10 418 -76 328 152 126 -204 -39 254 36 198 -259 -63 -237 -24 -154 -222 -127 -359 141
3223 141 -250 -19 -370 82 22 -51 -102 -529 -26 -233 192 -413 -238 -3 -233 -165 -533 -131 -262 -67 -254
3244 -254 -114 53 -106 -2 -470 65 25 264 34 -95 -84 148 431 -286 100 4 479 221 13 33 251
3265 251 342 -124 431 -102 443 182 362 342 113 493 62 197 -39 330 -83 -9 39 -250 286 -73 251
3286 251 -102 17 -173 45 166 -254 205 157 150 -401 -142 -175 35 32 -399 4 -386 34 -483 -204 -280 -362 -254
3309 -254 -269 53 -395 -57 -255 -88 -297 -272 116 -200 44 -254 -110 -192 362 -76 -217 90 -215 258 -402
3330 -402 261 -205 303 198 36 119 85 150 117 230 56 322 457 240 48 45 547 155 294 -192 416 516
3352 516 41 202 4 443 -48 -2 -252 175 62 12 -23 -334 92 -21 76 -102 -98 54 -84 -191 -451 234
3374B34n41M21l04j52J76N9J45n33M08k78N27r5k94P4o2P2j15M35l82Q4j84K04
3396a01P9LJ53j96K64m68J51N1K33j31j17N03n44L68m94M92k42M21q4l48L0j13
3418i0M51j31mj44K49J0j40P8m14M84k52L53m59KL38k58K20o33L42N4K00n73K41
3441g6K87m19K47l46L25j37J85k13Nm9j50M51m01Q3j52K15m3mP0j39L35l15L30
3464H9m84N98k85LJ35l80M86j65N9r6J08K6j95L34j46J75l84L04k27N0L2J86K52
3487D75m98K19l51O28n41J74k1O3J21j41K93m74M93k66P2j09j06L33m91K91m24
3508b60L68j13K78m12J3M7k19M90m12P6j26L79j95k47K11j5K39l30J2m9J81J22
3530C8l29K44k11K08l01L80l04P9K71l08K48k03L33l64K25k50J64p2J34K46j91
$$ plain form
3374 234 -307 114 -190 -342 -166 -107 38 -495 -87 -365 162 67 -227 -153 -215 -143 -258 177 -205 -121 -305 -101
3396 -101 -22 -19 134 -62 202 -266 -115 -64 169 38 -79 424 -120 248 -246 246 4 425 341 -7 23 -90
3418 -90 361 230 226 82 331 341 201 279 -135 349 97 450 -9 -7 331 73 293 -340 2 56 256 -317 -76
3441 -76 211 -208 39 -307 18 -119 66 -147 -142 -191 -341 110 -291 -208 -360 -145 -188 -192 -122 -261 74 -241 89
3464 89 -395 203 -82 -79 56 -324 162 -3 56 -40 68 94 -101 233 87 262 -122 182 -45 5 37 223 475
3487 475 -23 196 -155 473 -68 106 85 148 269 128 421 -53 440 174 246 137 31 364 -127 164 -260
3508 -260 108 -5 273 -139 -126 -79 -298 192 -220 -144 -270 109 -86 -333 -122 -137 102 -228 -216 -265 -84 38
3530 38 -291 -47 -258 -50 -351 29 -275 -196 75 -233 15 -188 145 -219 6 -244 -80 -152 -18 228 37
3551C7K46m91L88k21J36J16p9J08l60M18k84J80M4J72j30k72L19l27K22j61J98
3572B59K32j79r1k59M39n44M50l57K48l58K96L7l97L79l42L88j07j48j79L38j31
3593b6j63K90j54N8l40K96j66J51K7j14P0l30K84p1K08k44Q7J85j91K12l77M78
3615A70m99J33K6J35J03l33M57m16L10j49K97l63L41J56m17L07m17N02k95K1k1
3636D8K18K8k78J45P5J06l72J90r0K25k13j71K50k79M34l27j4q5O2K59l48M07
3658B70m34L41k82M06k19n2K58m84L76m77L21j78J01l09J62J79j37J88l10L17
3678C7k30K43j85j91L29j73J61l26R0J1J36J89k53P0j01M43l88J78k10J31o5O0
3700d4J90k69L66k38J18j1M6l6K5J54j93K51l09L29l82J85J4l28N23k58K35l35
$$ plain form
3551 37 283 -208 180 -41 95 211 132 240 -120 298 14 194 238 410 280 8 327 0 222 61 259
3572 259 491 312 221 -38 401 -143 307 -50 198 -160 136 173 -224 155 -187 201 94 -54 -233 105 -26
3593 -26 -189 101 -53 5 -335 -39 -205 -54 -27 -141 -71 -401 -117 -188 20 -224 -137 48 -143 69 -308 170
3615 170 -329 -196 -170 -35 68 -265 192 -224 86 -63 234 -129 212 368 -49 258 -159 343 48 69 48
3636 48 266 294 16 161 236 342 -30 160 70 295 82 -89 161 -118 316 -11 -25 -110 -48 211 -137 270
3658 270 -164 177 -105 301 82 30 288 -196 180 -297 24 -154 -53 -362 -200 -21 -158 30 -280 37
3678 37 -193 50 -135 -326 3 -170 -9 -335 -245 -234 -98 91 -162 -92 -193 250 -138 40 -170 -39 -104 -44
3700 -44 146 -123 243 5 123 112 158 122 147 301 108 359 50 379 -3 182 196 -132 391 133 368 33
3722C3J89r8J40l32O8L70m64J99j67L14k11Q1j33j33L73j54M1m19M35j59Q9q1
3744a9k40K59j9L20q19L24rK59K7l92K00j96L94l14J38k41L45j67OP5K1K14l52
3767a86K43k99P5K40l72L65k10M06k60M8k66K68K54n74M87k75M03k17J12k32K80
3788B90O9l55J96n5Lj37J59%K0j05q5K66j68J65k81N2o7J49J74l47K76k50K49
3811B18l85K79m3j55J93l37N29m35K79l88J19K12o6K2l16K42l42M95k46J5j05
3832b15j41L07k10J52m5K89k66K67j44j83K40k54L47m39L50j29J57j06MK99l02
3853b2L30m55M52k74J94j65P3K20l93K84l01L18l5p3R1k65L76k15J51l59J13p3
3875b8k8L3M0J63k81L91j86Q0l62J91Q4o7l4l60M69k42J91l5j18p9J19J71m51
$$ plain form
3722 33 222 124 264 -68 0 370 -94 105 -62 252 41 122 -11 -144 229 75 116 -303 132 -27 62 -19
3744 -19 -259 0 -19 301 -518 -194 -203 56 83 -309 -109 -305 89 -225 -87 -328 17 -150 -144 -69 -48 166 -186
3767 -186 57 -242 -167 73 -299 66 -144 262 2 50 -216 52 306 -268 219 -56 347 130 242 10 290
3788 290 359 4 200 145 148 11 170 170 190 85 0 266 98 263 -18 34 -33 116 290 -57 219 -31 218
3811 218 -167 112 69 -86 107 -230 299 -136 143 -245 -126 86 20 42 -274 -32 -374 121 -125 -110 -215
3832 -215 -356 -49 -259 -107 -152 137 -129 138 -6 -189 51 -203 144 -295 55 -74 83 -23 -19 280 -22
3853 -22 308 -147 305 31 225 60 133 353 -40 244 -57 261 226 153 244 -21 355 140 291 -68 45 -28
3875 -28 -56 -23 17 180 -101 290 104 184 -178 13 97 30 -4 -364 105 -137 54 19 -99 -178 -59 112 -339
3898c39K54nJ18j64l7Q1l8J44k55K86k73J87M3k29J78k55M13m6ok01J75j0P1j74
3922h2J6L93l42K12k76J30K08l6j24k15K2p7M76m69L05l51L09J19j99L3k8K00
3944B24q6j1J65k4k0j79L44k67J37l49K98k44k11M52r3l8m05L42l47L55K3m53
3966c87K49j13L43k83L06k53MQ9k27K00l79N45j76J90j58J04j4k88l1J5K66m15
3988d13P19j49n15M87k55K2J2m9K11J8k14K36m1j32L40n31L28P7P0k26j20J76
4010E1L8r0J2M04l43K62j81o5O7j52L69k50n4J78j23J73k00j64N3L21l20Mp0M76
4034C96k94k18R9q1J19o2qo8J79j55l9qn8M06m82K78k28J46n4L1L3l24L37m98
4058e53O42j72PMo8J47k04L11l68L21l17K12j69K2K14j69L66j14J13l64K36j59
$$ plain form
3898 -339 -85 -90 28 -136 -173 -92 -130 14 -241 45 -228 -41 2 -227 -49 -304 109 63 57 -144 31 21 92 -82
3922 -82 -66 327 -15 197 -79 51 259 223 99 -116 -94 -171 305 -164 141 -210 99 218 19 52 24 224
3944 224 138 127 292 268 248 69 413 146 283 -66 232 -12 -223 229 136 98 -307 35 -312 43 66 -387
3966 -387 -138 -251 92 -191 115 -138 -134 -45 -272 -72 -451 94 -82 108 -50 54 40 -248 -279 -264 2 -413
3988 -413 306 157 -358 129 -126 -104 -92 -141 70 88 -126 110 69 -63 277 -254 74 151 221 -5 -125 51
4010 51 89 -1 11 415 72 334 153 88 155 3 372 122 68 246 123 296 96 -68 -15 306 -14 -10 -80 396
4034 396 102 -116 -17 -98 21 -41 -49 -117 62 -93 -132 -140 -198 208 -274 4 -224 -78 -132 -101 -68 -392 -55 -553
4058 -553 89 -83 -76 -72 -140 7 -197 114 -254 67 -250 -38 -207 -185 29 -140 226 112 225 -139 97 -62
4080f2O5K13k68M33m21J97l57O18k98l5J29l12L18l05M67m52J95Q2k41J36P9Q1
4102B62m48L66k05J96j02p1J61l89L46j90J64l11K11K5k75J58P3K12k65r1K9J66
4124B2k84L8J04j02K82l58K83j59O1k02J98J6j22L27k63O1k95N64k43r5J48r8
4146a17K27o0J80k25k0J16l2J86m46M08m4pk12K92l8kj38k72N74r6k11K03Lj26
4170A43q4P6n9K83l41K79l37J62o0q4Q2o2Q4k55K69j72J41m6n5J72l33M24l99
4193a72K06k75n0K20l04L90j79J85k45J07l3K02n5j56K65l02K09j97P9q0lL29
4215A41l55Q6j02J39K0M5L2N7J05j96mK14r5m3K39j80n9J11J5J29l43M60k64M0
4239A92K2k16K15l2J7j56R6o6L3Q0k07R5J1J21k92J96k88L24q4k07R1p0OJ12J46
$$ plain form
4080 -62 3 216 -52 381 -40 157 -200 418 120 85 214 -98 220 -85 382 -70 125 207 -34 102 181 262
4102 262 -186 180 -25 171 69 -2 159 -230 116 -74 90 -221 -10 15 -260 -102 -29 183 -82 -173 -144 22
4124 22 -262 -224 -120 -222 60 -298 -15 -174 -113 -315 -117 -101 -223 104 -159 -98 -393 171 -72 -167 -19 -117
4146 -117 110 50 230 5 -15 101 69 255 -191 217 173 166 -46 246 208 206 68 -204 370 274 63 266 269 143
4170 143 59 135 76 359 18 297 -40 122 62 -22 60 -2 82 -173 96 -76 65 19 -36 136 -197 227 -172
4193 -172 34 -241 -291 -71 -375 15 -164 21 -224 -117 -150 52 -3 -159 106 -196 13 -184 -105 -185 -188 141
4215 141 -214 -128 -230 -91 -71 -26 6 63 168 -28 -32 182 87 44 283 103 44 155 170 299 -44 416 152 192
4239 192 214 -2 213 181 198 42 138 72 105 185 -22 73 84 205 -87 109 -179 145 61 -146 -55 -125 -119 -7 139
4264A39l42K95k13K24k98J38K05l45J90p0%n2j2J18k58L15k07N6j3J13p7m3J35
4287bk3J52m67L05MK05j11r1L17m31J53k3K51k38O1Q8j01L1j48K36k51N9n3J99
4311A22K67l95K45j43K40j50p1J30l6K0j20j23O5N1M0o6k25K45J47k73N5q9R1
4334B7j56L7p1K49Q8j96K58k99K60k38L46n45J40Jr5Q8K0J57j90R4j06J57P4l47
4358b47J95K5P6l8j63N2J82j99R2R9l04L07j57J66J26k12L6k13M19j89K35k46
4380D2P5P6n3q7j5J71j93K9N3O5J5n8R9o7J26j27K9p6N1q0J30n8Q6k53j08J87
4406E9k0J24l17L4J81L1k20j16L20k67l9l2J03K66l09N5k39L84r1J54k90O7K0
4429a42k7o7J63K36r3k47M9p5K56p9J51j68K39l34J77k1j48K68j72R4k17J85N8
$$ plain form
4264 139 -203 92 -121 103 -195 -57 148 -197 -7 -77 -77 -129 -141 -23 -281 34 -173 -117 -130 -17 -94 -137 -2
4287 -2 -25 127 -340 -35 -31 174 63 -28 289 -142 11 -12 239 1 62 150 49 80 -68 168 -83 -24 -77 122
4311 122 389 -6 239 96 336 186 115 245 209 229 109 -14 51 102 142 76 -149 96 243 -30 25 -64 27
4334 27 -129 -92 -163 86 174 -22 236 -63 197 -41 305 -240 -100 -99 -194 -106 -86 71 -119 -25 -131 26 100 -247
4358 -247 -52 -27 49 11 -152 -100 82 -117 -25 74 -230 77 -80 86 212 0 36 -177 242 53 288 42
4380 42 117 193 140 53 38 209 16 45 98 163 178 120 219 152 278 151 180 104 155 75 205 147 233 -20 -128 59
4406 59 39 163 -154 -120 61 92 -128 -244 76 -191 -230 -262 -159 107 -202 -147 -386 -2 -93 61 -229 -162 -142
4429 -142 -169 -236 -73 163 70 -177 -128 -203 53 -26 125 -43 196 -138 39 18 -130 138 -34 60 -157 28 86
4452H6Q9p6Q1R3j36J5k46K27j36O8J15rN9l34J24m4J11q7N2j29N4J11o4J56r3
4477H7R0k79J64P2j85R6l1J18m6R8k70J83j1k73R3Q7k1r0J16r5j36J89k53J89
4501a08k6K40l01J0k5K09J43l52K35k88M82l61k4%J63rj83L07k12O5RO5j08J9
4525e0M0N7q2p8L48k78J08j08J68J92m08L39k60M0k0J16j20k3J79k50K71k32L91
4548C40k48q8L0J53k9j60N3r1K99l62L19l73J06O7m4p5j36K66k06J78l8j67K86
4571H0k67K40k05J40k31J64K24k98K33m94M86k32K58%%Nl24K73k32K04k22J12
4593h6J6q2J03Q0N9k07J62p9K04k05R7n3n6J20l2N1l0J38l3r4j36O9r0R0K23k99
4619g0K89k0k66Q0qJ03j25J25j5M4j40O1J24l90R3j0P7o7L8L04j98k42N9K14k90
$$ plain form
4452 86 175 99 180 273 137 152 -94 133 -3 65 180 171 230 -104 20 -24 87 0 52 -77 -23 88 24 180 87
4477 87 177 -102 62 134 -51 45 14 132 86 184 -86 97 86 -187 -94 -7 -28 -118 -2 -97 -233 -44 -297 -108
4501 -108 -134 106 -195 -185 -210 -1 142 -210 25 -263 219 -142 -166 -166 -3 -12 -195 112 -100 -35 -26 39 -69 -50
4525 -50 -10 47 -35 -113 235 -43 65 -43 125 317 -91 248 -12 28 8 124 4 -19 160 -90 181 -51 340
4548 340 92 4 34 187 158 -2 51 -40 259 -103 216 -157 -51 16 -28 -103 -239 27 -179 -1 -39 -206 80
4571 80 -187 53 -152 -12 -243 -79 145 -153 80 -414 72 -160 98 98 98 103 -221 52 -180 24 -198 -86
4593 -86 -70 -152 -49 31 90 -117 45 -34 170 -35 62 9 -47 73 41 92 62 200 167 73 -63 6 -84 6 229 -70
4619 -70 219 199 -67 13 5 108 -17 108 93 137 -3 58 182 -208 -115 -125 -48 -115 -77 227 29 -213 -154 60 -230
4644b30J53j77K29r9j08K30j95J14j17J77q3M9k44L87k54j2K02m1Q6k52j5pQ3
4667a24J10j05R4j27J32p2K27k3K7M1j65j8J11K8j50Q5L3j34Qp1K87j66K6K53
4691C07K01l23l32J60j71L25k45J40j57N9R9R7j23j63J73n7L7j35J38J10j51J55
4713A44j70Pk20L97l02p2J70n5R3k33L89k96K09j86j09J69j7J17k48K67j75lK5
4736i9J4K44k01L3j63M7K03j1j66R1m4O2O7j4O4j56K53j83J76n2j64L30k58j12
4760c9K4J81n6p3K05k31Q8j05J88l37K61j34N1R0p7O9k22K32j5j15J23k90J43
4783c9N9J34k96J15j19J16J7j10K39j49P3j62J91q0K9j08k56K54O9P1k42K31j84
4806a47K30j97N5J3q2K22k49J57j04J50j45L4J31m9J00k25R6j11J11J94k43J72
$$ plain form
4644 -230 -77 -254 -25 -124 -232 -2 -197 -83 -200 -23 -106 -57 -301 86 -168 -180 22 -19 67 -185 -200 -207 -124
4667 -124 -14 -119 -25 -152 -20 -92 135 112 139 180 15 -3 108 136 -14 71 104 -30 -22 -93 194 28 54 307
4691 307 508 185 -147 13 -158 167 -78 62 -95 -36 63 160 37 -126 47 -10 27 -108 30 140 -11 144
4713 144 -26 -19 -239 158 -144 -216 -46 -101 -8 -241 148 -148 61 -125 -234 -65 -82 35 -213 54 -121 -124 -99
4736 -99 -85 159 -42 -9 -172 -125 78 67 -99 -8 -52 10 77 63 127 -29 224 41 217 165 1 331 73 -39
4760 -39 -15 166 110 37 242 11 99 -6 182 -155 106 -28 23 113 36 105 -117 115 100 -15 108 -182 -39
4783 -39 20 154 -142 -27 -146 -30 -13 -123 116 -33 40 -122 69 -11 18 -90 -346 -92 -23 48 -194 37 -147
4806 -147 83 -114 -59 -46 -128 94 -155 2 -102 48 -97 -63 68 19 119 -106 -10 -121 -10 184 -59 113
4828A13k6K53n02J83OJ83j87Q0K3j18J82pr1j35L33k88r9j1K69Nk48K17q6j4J2
4853D7p9N3k33L80o5j91J18j86J53J70q0j17j2k92L25k23J94J3j13M1q4K04M7
4876G0j36l5n7J7J03Oj12m7J30M0n8J26j54k9J96j26J67l7L9k11J75m1K6N1l38
4901b35N59k60j76K36j89J17j7j8N0Qj12L00j68J01Q7j04j69m3Q6O0M2q6J21L0
4925B20r2j09j40K92j91J45p4j36R3k10J70j8pP2m6L0j98K48Q1p2k48K24k54L83
4949A63l03j04Q6J78K9j50P5LJ91k81LJ5q2K05j91J16jj94K95K9L1j85K27j24
4973C1K13j06k27j31K35O1L9l8Q2j01j32P8jJ82j9j50K07l68K77k94K28j17K49
4996A98j48j23K92l18J44n5J80Rl17L08j25M7j35p0K08o0j66J82k06J58O4k37
$$ plain form
4828 113 87 340 -162 21 27 210 23 103 126 8 190 183 92 -43 290 2 -97 -108 161 166 -82 135 49 35 47
4853 47 -32 21 -212 168 103 -88 30 -156 -3 167 87 -30 -42 -334 -9 -232 -38 -25 -138 -97 -181 23 70
4876 70 -66 -101 -158 -141 -38 -32 -144 -191 -61 -21 -79 47 -107 -136 60 -66 101 64 103 -108 67 26 52 103 -235
4901 -235 324 64 -112 124 -65 52 35 17 67 75 -37 263 95 196 283 179 10 -33 53 113 155 69 190 220
4925 220 128 19 -121 171 -20 125 51 -85 8 -202 -32 -50 -57 15 -31 -1 -199 49 130 58 -190 34 -220 163
4949 163 -140 -244 -158 20 49 -101 -26 -23 168 -113 -110 -95 -177 28 -163 -47 -48 -242 53 82 113 -72 155 31
4973 31 244 138 -89 -220 15 76 115 77 159 58 -74 4 3 185 166 16 223 -145 132 -162 66 -51 198
4996 198 50 -73 219 -99 45 -10 170 179 -138 170 45 92 -43 -113 95 35 -131 51 -155 3 67 -170
5018a70J24jk1p9M9K8n4J51l31L29o6P5rJ82j69j18R9%J7j73%P3N0L25m26K48
5044A33o8J46k47Q1r5p9L92l05K45k15Q7J6j80J29k55L79j4N3j20J19j99j27K47
5067A23j31J04LL3k49L36j23J07p1o8l5J1p8k8K92k31M1j06p1P0K8KPj36J83p0
5093e7J26k14K60k28K63p4j56J55j87n7j17L56j53n3R1J55r8k2k8J42J1k37K00
5116G8L8M3k39j08J82oJ24j57L4J17j33J28k64K52o3J42k45J03l1J42J52j71j29
5139a1K3J80k99K99j77m9N7J53p8j24J92j88j2M7K84j96j08J9%L9j75J14l4k4
5163f8N0j22m7J39K3QJ31k79K15j97j0j9K14j77N7j26J45l9R7j56J74k7R0p1o2
5188e7P3J1pM6j59K46L7k74K71j39k8k9R1L9n0M6j26K0j08Q6K26k03K34l90K99
$$ plain form
5018 -170 -46 -47 -68 -147 -98 -70 -124 27 -304 25 -41 34 25 207 38 -80 19 19 36 -137 -137 -64 -14 311 -115 133
5044 133 65 211 -36 45 -50 -129 263 -42 203 -12 75 91 -89 40 -215 164 150 203 83 202 3 -124 123
5067 123 -8 96 99 132 -117 219 96 203 132 64 29 40 -38 -66 226 -5 36 -70 -141 -71 -43 -41 -34 -170 13 -57
5093 -57 69 -145 115 -113 150 76 -80 75 -112 -169 -286 70 -83 -136 -45 110 12 -10 -38 104 115 -122 78
5116 78 116 159 -80 -188 -6 -12 112 -45 -11 106 -27 101 -163 89 26 168 -77 26 -5 137 289 118 -11
5139 -11 12 192 -107 192 15 -34 23 176 98 -26 166 -22 -34 13 297 101 -7 12 12 51 -124 -10 -44 -68
5163 -68 -18 -140 -187 -48 -25 -17 114 -165 50 -147 -157 -176 38 -139 -82 -208 -63 -102 -5 -161 13 -14 76 5 -57
5188 -57 16 27 20 66 -93 153 190 -84 187 48 20 -9 82 121 71 117 -9 11 -97 -11 215 12 246 -144 155
5213A55j2j34P3J50N1j43j95MN8MJ07j7j09J59j54n1J9K35k72PJ6J54j19K55j12
5238A29k02J75p3J13j73l9J14j50M2k63K99j63K90L9q2r4j66K73k12J77k8j25
5260a19J06J66k30J09%j9q2o1K75r5lk2M7P0j28K7%J5J49k27J61j95J75k58K85
5285A46k31J83Kl2K26k63ro8K75l96J85q0R4j17Q4O5p4J30j75R1j54o7L29k34
5309i0K26j67j3n7j0M9r0l3K08K19l43J8J2J10K05k14k0J78k76l3M8j13m1J88
5333c9p3O3j06N7N7j01J60R6j08j82K70kmq8J86j57R1J25o4p8o9J94k36K63j12
5358A43jN4k03P2q0J72j20J56L6k8j65k7l0k4Q8l29L65j00j31J41n2K15j66q3
5382i7o5J46j33R3J27j70J09j17J33j71J34j47M0J66k33P3M3K58n89P2M57l83
$$ plain form
5213 155 143 9 82 232 283 140 -55 -51 7 11 118 101 -8 151 -3 -54 -35 200 -72 -65 -49 105 -14 241 129
5238 129 -73 102 29 142 -31 -70 44 -106 -64 -327 -28 -191 99 138 56 -38 -204 69 -143 34 6 -119
5260 -119 -13 153 -77 32 32 13 -69 -130 145 50 47 25 72 142 14 41 41 56 205 -22 139 -56 119 -139 146
5285 146 -85 98 100 68 294 31 22 -46 229 -167 18 -62 32 -85 -1 64 -10 120 -55 36 -118 -185 144 -90
5309 -90 136 -31 -44 -101 -111 -62 -152 -185 23 242 -101 -83 -71 39 244 30 10 188 -88 -121 -73 -186 -227 -39
5333 -39 -112 -49 -155 -98 -41 -142 18 114 6 -176 94 92 88 0 186 29 120 245 181 103 34 228 -8 255 143
5358 143 142 196 -7 65 -15 157 37 193 229 201 36 9 -21 -45 43 -286 79 -21 -152 -11 -63 152 -14 -97
5382 -97 -162 -16 -149 -56 71 -99 10 -107 26 -145 -11 -158 -118 48 -185 -112 -69 189 -400 -328 129 -254
5404b54L93j78O0j96L3K34j2k75L77q7l58K37j55J65J43R7n1j66j76K07M4m01
5426c19K61K7L30O0j9m07Pp7Q1P6k82K47J72l15K73m6o6L7Q1l43J40P1r5L53j98
5451D9J39k66R5K5J31k96k8J48j28J24k33J98jK25k49O1L8n0k4j90L01j83J5p9
5475a78k6K79k54J59k67K92J02O7l59L75k01j6J08j9K41l35k21K52n2m0K2K02
5497A31N0o2N5j54j37R9J86r8J3j40K94j28J32q2k2K6j34J59l42K68O4n7k49O0
5521f8M9J57l74j21M44k98J13J08k33K02j27K22k02R4J01kk7j33J35l58J90j58
5543b86M58l39J69K62l21K6r2J04o3p8J50K87n14M76j54k29J12mP2j05j86L57
5565A02Q1j68K06p8j85J71k21J08Kp8J56m4L4k23j7%J17L23k22j24j89J10K46
$$ plain form
5404 -254 139 -39 21 -175 -142 92 80 -195 182 95 -263 -26 -181 -16 127 224 173 7 -169 38 82 -319
5426 -319 -58 -31 299 359 340 -67 -60 -137 -56 20 -262 -15 157 -158 115 69 3 40 121 -222 -82 -11 -106 247 49
5451 49 188 -78 17 42 173 -123 -151 -3 -131 -7 -240 -42 -43 182 -67 -6 32 -18 -42 -232 69 -114 -99 -178
5475 -178 -204 75 -179 -20 -287 5 107 174 -185 190 -11 -27 81 62 303 -32 -253 -1 -53 -93 -71 131
5497 131 181 119 174 20 -117 -18 168 70 83 -57 237 109 241 159 137 163 29 188 -154 114 178 121 -128 -68
5521 -68 -19 138 -236 -357 87 -211 -98 10 -223 -21 -148 74 -128 -34 67 65 38 -95 40 -318 -128 -286
5543 -286 172 -167 2 264 -57 -31 -123 -19 -82 -160 -10 277 -237 239 85 -144 -32 -36 36 -69 -255 102
5565 102 183 15 221 143 -42 129 -92 16 18 -60 96 52 86 -137 -154 -154 -37 286 64 -60 -249 -139 107
5588A07r0K38j34k7k87M10Kk62N4J5O5k06J47n6p7K65k17k08J13N1J31JJ41p0
5612A06j79J7k01K24K06l01Q9j21j5J66R6k38k7q1K75k9j69K92K2K3j32r9J82
5635A06l4K2k89M87L9p2r5k17L57n16L49J97m22K11J7m5j85Q2J25j81J98j04J71
5658B01jm81K80m2K54j12j52J23n6R3j36r1J74r1L43m00M20j77j91J44K7K43n19
5681a47J81j4k7J89m10J39q2O2L0N7j26N5L05o47J97K09Q4l38j2K01J16l22L57
5704E7J72l45k58jL63K8L28m35K94k70L44l11NJ8pJ42K1j37l7J48J35r7r0J6O7
5729A50L9j77J80j2j28j35J51P8o2j02J65j22MJ39j73O1j44K67j24j14j8P0K26
5752B19m33K23Jl5j9O4p1L8L14l64J70j67j55K44j3q8m0J40j0r3k1N8oL0p9Q2
$$ plain form
5588 107 17 255 121 94 -193 217 219 -43 11 26 91 -115 32 -24 -101 164 -53 -261 -148 -97 34 35 176 106
5612 106 -73 -56 -257 -33 173 -128 -39 -160 -175 -9 87 -151 -178 -259 16 -13 -182 110 132 155 23 -76 106
5635 106 72 94 -195 292 331 259 164 -53 304 -212 137 334 -88 123 140 95 -90 -8 117 -64 134 30 201
5658 201 200 -281 -1 -43 211 99 -53 70 14 107 -29 -120 54 -37 306 -94 326 149 -42 102 129 372 -147
5681 -147 34 20 -7 182 -228 -89 -171 -109 -79 -22 -148 -93 212 -435 -238 -29 55 -283 -295 -94 22 -300 57
5704 57 229 -116 -374 -375 -12 16 344 -91 203 -67 277 -34 -29 -11 -18 124 145 8 -29 119 254 157 67 83 150
5729 150 189 12 192 180 52 -83 68 146 84 -18 147 25 29 168 -5 56 -88 179 55 -59 -77 -7 219
5752 219 -214 9 10 -25 -44 20 -51 -13 301 -63 107 -60 -215 29 16 -72 -112 28 18 -75 -96 -38 -44 -14 -93 -11
5778a1k07KJ61j2P2K82j76j94L3J15j00K8J9M5J1m7J5K0Mk84L18l7J71j24l1j9
5804E4l8P4P8J0k2j17J13K2o7j80J33J6J7r1K30l76K79p8j22K25p5j5k30L11O4
5829B15o9k93J29m0q5J59j6R5k89K29J19k11l3m5J76j39P6J35j42J9r6J40q9J56
5853A01k45j21J23K02M5j47K28k12KJ08k4Nr1L3pK4m3J33j89p7K22k0N4j60J12
5878E6o0N4Q7j85P2J48j8r4p7L6K01r4p1M9Pj34J04qQ8j15j89R7o2PJ5J45p1j11
5906a23J27r3l7L20k25m6K23k06j26K50L0J2j71J9NM3j2J15OK3n3L1k01m2J60
5931B9P6j76N3j0p8O8j0R0q3j50J12N7j19L20r0j92m8k9L04j90l5J47R5q3j06
5956d8P1j26J42j2rR4k44K46j09J76k78J08J00l3o0L5j16K49n0j68O5j43J76j26
$$ plain form
5778 -11 -218 -216 -55 -67 5 287 111 -83 -50 65 -35 -7 12 57 68 21 36 56 60 -224 94 57 228 104 73 54
5804 54 16 90 168 178 156 39 152 174 107 -73 60 76 93 2 232 -144 135 57 -65 160 85 70 -160 151 215
5829 215 146 -147 -18 -58 -143 16 0 95 -194 35 154 -57 -90 -135 41 -98 -22 113 -29 -10 -106 34 -55 101
5853 101 -144 -265 -142 60 105 -42 186 -26 -24 84 60 65 -26 7 0 24 -19 114 -75 -152 70 50 104 -56 56
5878 56 -4 50 137 -48 24 172 154 60 -17 19 220 126 55 104 111 -23 81 73 161 46 -143 -46 -108 -101 -86 59 -12 -123
5906 -123 4 -89 -126 194 -31 -77 146 -60 -186 64 94 106 -65 -46 -41 2 -10 105 111 134 81 112 -89 -131 29
5931 29 105 -71 -18 -28 -106 -38 -48 42 -41 -191 -79 -22 -141 179 89 -103 -151 -180 124 -66 -101 46 141 58 -48
5956 -48 23 -103 39 27 18 112 -132 114 5 181 -97 11 111 78 18 53 -63 186 136 -32 33 -110 66 -60
5980f0K55j57j11O9j15p3K19j54N2N0J14P3j13j24J99k32J26Pjj23J24j04rJ52
6004F4o7m4j96J37J11J97r5q4J2o5K4M6nk5m3P4R4l20L75l31O4R5Qj31L73l73
6030a05K65j11j27J29L5j6Q9j43p5J11o8N8p4QO1L0j50K35k79J43j0L8M7o3q0
6055e2J11j24k8J66r1j24K36Kk7j63J85j88L5K3j68J11K79l78J79K0j49J92J09
6078A56j9m7pr9R5j38J41j70j4J59R4ok73L21j75K8o3Q4K6j78p9L9O6P1p3j2K18
6105A45l4j18J8j02J25O7m7j5l4j6Q5Mj34R5r3J60j24j03K53j01PK2NK7p3q0O0
6132am3m8l7M7J59rl01J61J53j92J04j05N4n3mJ1K49l60J48o7J93k7q7n4J59j19
6158f9L7J29j82K28k56L05j54J23j55R9j47j17K40j2jjq5J26p7rj05J96l35L49
$$ plain form
5980 -60 195 38 -73 -4 -119 -192 27 -127 -75 -25 89 162 49 -75 124 -108 18 25 24 -99 25 -79 -88 64
6004 64 -3 -47 -243 -106 5 202 107 23 35 -30 -6 40 35 10 -33 41 135 -185 190 -141 -77 18 26 -105 268 -105
6030 -105 160 49 -78 51 86 70 159 16 -59 52 -16 42 -32 -24 37 67 -83 152 -127 16 6 44 91 28 -52
6055 -52 59 -65 -93 73 -18 -142 94 96 69 -94 91 -97 -62 -39 -207 -96 183 -195 -16 4 -145 47 156
6078 156 137 90 83 -16 79 -59 82 -88 -102 57 151 145 -128 193 18 46 -17 67 93 -85 -164 -125 -59 12 -61 -73 145
6105 145 111 -7 11 -91 34 101 54 39 5 -11 74 78 -56 39 -54 106 -18 -121 132 31 38 60 65 92 19 -61 -1
6132 -1 -44 -92 -129 -82 77 68 -233 -72 81 -111 -7 -112 -58 -111 -115 -104 145 -215 -67 -134 59 32 -55 -109 50 -69
6158 -69 -32 97 -85 143 -113 192 38 161 6 105 -42 -159 81 69 68 67 -18 108 31 22 -83 113 -222 127
6182A27k53K14m7l2p4r2K49j13l9M5J15N3j62JJ43j44K20j75qo9kj04K64p6j35
6207i4J01k5J6J28l5j82L53n73J50L72k68j46J07N9J18j04j64K24Q5J95l91N8
6229a6Q8l78M20k77N01l00o5J38j00J00l03K49j63K61k00J62J8j35J21j97J24
6250D8l5J04M1k22K54lk95P7n3o1N1L5J42j45R0Q8j58L03l11j02J71L0k3k0l7
6275c1K69j39k09R3J44Jr3r4o5J21J07o9Jj10R5Q5l5L6j31l2m3J32K58m02qJ39
6301B0L2K2p7j56L52q5o1k50K30j29Q7j02K26j90m5Q5J50p7j6J6k70K72l3j4J54
6326A41j78J2P7o2J4P4j44K02j12N9K9k86K23Q4j84R4j4lm3N5j01j58K63j81K06
6351F7K3j85J43o7N3J59k80Q0R7O7J7j57r5J69m32K93K72m63J03K41r5j8J33J8
$$ plain form
6182 127 -126 88 41 9 -65 -157 92 -21 -60 -15 100 153 -9 -8 135 -9 211 36 28 -41 -43 -147 117 41 -94
6207 -94 7 -18 -2 126 91 -91 262 -311 -161 211 -57 -203 -96 -37 81 -23 -187 37 122 317 -74 -16
6229 -16 72 -306 114 -163 338 38 -27 111 11 111 -192 57 -106 155 -45 117 135 0 121 -76 48
6250 48 13 117 158 -64 190 187 -108 -31 -84 -145 -94 -59 83 -62 28 116 -42 261 -50 -152 19 49 26 6 -31
6275 -31 238 99 -110 -17 127 128 35 -59 -124 -3 104 35 36 -74 21 106 71 107 -24 -56 -99 33 291 -111 -119 20
6301 20 52 74 -3 -159 193 108 47 -203 27 -102 -15 -117 109 -81 -126 -41 109 32 16 32 -238 34 1 -13 141
6326 141 -37 -25 52 -10 4 78 -66 136 24 83 112 -174 49 133 -51 43 29 26 -17 38 -63 -221 42 -139 67
6351 67 90 -95 48 -19 34 193 -87 -7 90 157 174 17 -78 91 -341 -48 224 -239 -136 105 10 -8 125 143
6375A43J09k12j85J10j99K64r7L66o19M11k81K25rk78J51qj60M68r6l00K47o8
6397a8j74N7p9RM28m13K14r0L39j94J12J29k45J40l6J20m44K91j0r2m3m14M54
6420D1j90o9k6j79K68J8J23n2K37J10j68j32q3J98R2p9l19N5O3k64Q04m42k11
6443b05J62k1R1Q8j51o5O6J36K1O9j55r0p3K19k43O5J32m0P9p2J1rm2Q7j88qK44
6470A08J08j74k4j20K33m1k11K52j14j5j81K24M6j92J40J2rN4P7k16J47k1J02
6493A85j33N5j75J16J45j75M3q2n0OJ05L7r7Q4J7j64j03Q1J26o7P4Q6k4l6k04
6518a50K26j82N2n4L4J46k15J78l3O9N8k62n6L54j27o6j81L29J17j43k2j89J61
6541D4j87q7J78k6L4K53l67J15P6M9j97J35q9O3q3J86n5J33k69P2J05j11O7N4
$$ plain form
6375 143 252 40 -145 -35 -234 30 -67 299 -320 91 -190 35 26 -252 -101 -109 -269 199 103 -197 50 -18
6397 -18 -192 -135 -214 -205 223 -190 24 -66 273 79 191 320 75 215 179 299 -145 146 136 44 1 -413 41
6420 41 -149 -218 -244 -423 -155 -137 -14 -66 171 281 113 -19 -102 96 188 109 -210 -155 -92 -356 448 6 -205
6443 -205 -43 -64 27 115 -36 -101 -35 101 122 191 36 -54 -127 92 -151 -86 46 6 85 13 24 15 -27 60 -128 -136 108
6470 108 216 42 18 -102 131 90 -121 131 17 2 -179 45 91 -101 39 51 42 96 173 -43 104 83 185
6493 185 52 107 -68 48 193 18 61 -21 -71 -65 40 77 -20 64 81 -83 -186 -105 21 -46 28 114 90 54 -150
6518 -150 76 -106 -54 -108 -74 72 -143 35 2 71 129 -133 -189 165 38 -28 -209 120 237 94 72 -117 44
6541 44 -143 -230 -52 -78 -44 209 -158 -43 33 82 -115 20 -69 -6 -89 97 42 175 -94 -22 83 -28 39 93
6565I3Kr9K06k78J49k04K91n2j3k58J93p0J33m9j05R1j73J12m24L91R9j26P3O3
6589D5k13k2K56K5j06J41r3m6K61j59r6M1l6J15O6r7J43k69J1o9L32k92J76n2
6613F2l3OM6l2K2J38l90L43j46j09m6R3J96j71j64P8R8K3m7O5j01O6j44K44j09
6638a2O4l9J9k98J78J31j9j70J90l0L1J9q8K7J53j77J28j94J32K52m11K77k40
6661g7J08j76J20j0L8J10j61M2O9j00K05r4Qk33J38j66K73j72LP6J6l1m7Q4j09
6686h6K31O3q0j68j41K33r6RK1J1O3j09Q3k72L13j34r4K69l1j11j30J07M6K45
6710B42j89k04P3J10j35kJ06m1J14k49K21oj22K69k17J58j63J91l08J73j25P7
6732b7R0R2j92l5K7J09k17J91O7k91k7O7J3J09QK3o2l4J82n3K6p2J05j80J16j8
$$ plain form
6565 93 95 -4 202 -76 73 -131 160 108 95 -163 30 -40 93 44 -61 30 -143 -31 -455 -64 35 -91 -18 45
6589 45 -168 -190 66 91 -15 126 33 -13 248 89 -7 34 -2 113 179 82 225 -44 -33 -102 230 -62 114 62
6613 62 29 35 81 49 71 209 -181 162 16 -93 -139 -46 150 -21 -185 -107 -9 14 -33 32 -69 -3 -147 97 -12
6638 -12 52 13 32 -266 -88 43 24 -146 44 14 45 64 -24 3 156 -21 107 -87 45 297 -114 163 -77
6661 -77 31 -145 -25 -35 3 113 -48 -6 63 -37 168 74 82 -151 -13 -179 94 -78 -75 1 17 -14 -61 23 -86
6686 -86 145 208 128 -40 -181 52 -44 -35 -14 -3 60 -49 34 -238 75 -59 -153 116 85 -26 -156 -49 -3 242
6710 242 53 -151 -78 32 -103 -105 1 -40 74 -175 46 40 -82 187 -30 128 -35 156 -152 21 -104 -27
6732 -27 63 155 -37 -72 -45 64 -153 38 105 -186 -213 -146 -133 -24 -16 7 -55 -89 93 40 66 -6 99 -81 35 17
6758A7K41l64L05j42P7L25l25l9k9q3O4J9J2q3j05K71j55j35K72j27J60O4l00
6781f0o7J19l1R0J77m21l5O6K54j61J63p7J7j17j44M56k52P3J0j79J47J62k29
6804c9L3J71j57K6n5l4R0N9j48J8j27P4J68o0J10Pj14J27Lj10k42J24j0j11J63
6829c4MJ17j78P8K15j04q3J31k40L1J40k8j7L8J9m2P6m9j6J4j41J20p6K31j75
6854C1o9k2p6J87m5J46j74J33Q1j91MM6j37m8mK8L7N6J05N8p3K3J48k69J04n5
6880B4Oj11J47J1k12J17nL5k8n4M2m9Q2J9J49j80R9o3l8J40k38J92j92K29o6r
6906D7l5l2M5k26J33O1J07k06K56j48j1M1L2j4Q5p2j28J98j69J98j28J45j94J34
6930A19O0k89J39k9P7k22j9K40j63J62j79K12r0K8Q6k31L2R9j21J46L2Pj54k1
$$ plain form
6758 17 258 -106 199 57 134 459 134 95 66 -17 47 66 78 -5 -110 161 6 -129 143 16 176 240 -60
6781 -60 -127 -8 -39 51 228 -193 -228 -162 92 -69 94 17 34 -83 -227 229 -23 50 60 -119 28 190 -39
6804 -39 -6 165 8 34 -21 -55 35 94 -54 -36 -163 -89 79 19 129 136 22 149 152 42 -200 -76 -86 -197 -34
6829 -34 -30 87 -91 -13 202 98 15 146 -94 -63 77 49 32 70 89 47 123 74 58 72 -69 51 -25 206 31
6854 31 -38 -60 -136 51 6 152 -22 111 192 1 5 51 -86 -134 -138 -110 -73 -17 88 146 73 96 244 -25 79 24
6880 24 30 -81 66 77 -135 -18 -23 12 -16 -70 -28 -77 5 24 173 -7 92 29 -9 131 -107 85 -107 122 56 47
6906 47 12 -20 25 -201 -68 -7 100 -106 150 2 -9 32 64 50 135 63 -65 133 -36 162 34 179 -15 119
6930 119 179 -110 29 0 77 -145 -164 76 -87 75 -104 108 18 46 132 -99 -67 32 -89 57 89 96 -58 -79
6954g9R2m1K1J05k17J15j07L2J72p3j8l6K7K8L8N8l9k8J25j05q5J65k5k7j94p1
6980a67k2O5J19N5k30R0J09J07j55M8M9j82N2P3o0o8J48m8L0J8J0Q5j46K66j49
7005I7J6j78P0K51m20P1L1%O5m1O7k7l9Q8J84m12J54m4nJ55j92Q7J5M4j4L2m09
7032c54L44M8r6K21k68lk9K95k44L43L3m91N8J70M3j19j3J81j84N7J60j30m9J44
7056A17j00J41p5k8q2J87j03j4nk48Q8K52j14n8nm3R8N1j09L5o5J51m8jK1j13
7082g0K46j76r8K40j43M7j37Q9JJ25j40N4K6P5n9k8k5L0J02j97j30J92L5j1J09
7107A57j84J60k42L48l84m6J46o6J17k03L11j85k0J5J35p5J1J21j38R5J11j19
7129F5q5r0J14N0r4J8R8J46m6k03K7Q8j40J46o3M3j31J02j99J4P1l0k4L2K09j62
$$ plain form
6954 -79 13 -28 -7 98 -119 -4 -111 -79 93 20 2 -34 -7 21 59 117 78 50 175 70 -15 150 125 98 -96 -167
6980 -167 -189 -124 -5 50 -180 -90 19 126 -29 19 68 -114 -62 11 -49 -117 31 -17 13 31 41 126 -20 246 97
7005 97 113 -65 5 256 -164 -93 -62 -62 3 -38 29 2 -37 51 235 -177 -23 -67 -72 83 -109 -22 -7 37 23 55 -354
7032 -354 -10 38 -58 163 -105 -108 -137 158 -86 257 290 -201 -143 27 70 -49 -62 119 -65 -8 152 22 -27 117
7056 117 17 158 83 55 -27 160 57 43 38 -210 -122 130 16 -42 -47 -90 8 59 -50 -15 -80 71 23 22 43 -70
7082 -70 176 0 -98 142 -1 46 -91 -2 -1 124 -16 38 64 139 80 52 27 57 159 -38 -168 24 59 48 157
7107 157 -27 133 -109 239 -145 -191 -45 -111 6 -197 114 -71 -91 -76 59 -16 -5 116 -22 73 184 65
7129 65 -20 -110 4 54 -40 -22 76 222 176 -27 0 88 -52 94 31 74 -57 45 -154 -140 -69 -99 -123 -91 118 -44
7155d4o7J68lj37Jl1j09L19l13M64k73J42J95l01O3j04K31j82J27J8p7k47K3o2
7179a99K08Pq0J71k48N1J90j55J54q0M9j89J31R9r9j95R8J29J54j93j12J25l8
7202b2R3j11N3J75j52k32J26K50j89K35jj77j3N6j69J29jp9K0o3J38j59K0J15
7226D2j57K8n6O1J64K5J1o4k78J93R7j69QJ38n4J4K03k71p6Q5J15j54K75k25O3
7251A8J8Q3q8J69k03K44j54j67l6K66l85J69r9%J42l8J01k9P9r2m4K14k49J01
7275B0n0J4K20l08P3J15M3j54K40j02O3j96Q4rM8Qq1M8O4j49P7j75j09R4L7L5
7301e0L4j20J78m3J29j67k3K11k85N2J8mJ76L1k07n8J67M3l1J0J98r6j59J41k8
7326A17j77K33r3O0m2j73J73k71K61j62P6J25M8p5q5M8j38n4J54Q3m60L84k19
$$ plain form
7155 -44 -111 57 54 -83 -82 -113 -222 97 -216 248 -25 117 312 11 74 -30 201 19 146 164 87 -160 -137 -199
7179 -199 9 16 -64 107 -141 -90 100 -55 99 19 68 -121 10 109 10 -185 -87 42 196 3 -109 16 -22
7202 -22 71 -40 13 188 36 -196 -70 180 -9 226 225 48 35 91 -78 51 50 -29 -9 -72 66 -93 -73 42
7226 42 -115 -87 -143 -82 82 107 118 54 -224 -31 66 -103 -95 43 -11 3 206 -65 -141 -56 59 -95 180 -45 18
7251 18 36 119 31 200 -3 241 87 -80 -116 150 -235 -66 -165 -165 -23 -61 40 11 90 -2 -46 168 -81 20
7275 20 -30 -16 204 -104 -31 84 127 -27 213 111 174 -22 62 53 101 109 28 76 140 -9 68 -107 -216 -122 -85 -50
7301 -50 -16 -136 42 -1 128 -39 -62 149 -136 -84 -66 -70 106 137 -70 -128 39 82 51 61 259 163 4 145 117
7326 117 -60 173 80 140 98 -75 98 -173 88 -74 2 127 175 100 15 63 -75 -129 25 108 -352 32 -187
7349a87k5K69l08K05j24M5rm1P1R2O3j77MJ61j11PP6j90K02j46L28q4j82J54N8
7374A51m4o0m0J0M8J0n1L6k2j80J57P9j10j1L6j02K9n2P5j7K82m47L94k14Q6q3
7400d0J09j51J70o4N7m9j59M31k34j70Q6K7n9K05l11J66j3k9L6Q1o5L1j0o6J06
7425H5o6o8J78n9m69L94q7J40j7j03l6L7J8k3J8j87L78n4j59K17j79N2L7k42L02
7450A07k14j24J68J68k78K40l6K8L1k7J43k05j41K55j24P1k67K70j83M7o1L9j6
7473a09k6N7K7J78Lj69P7j19J54P6P6l39J97l0j7L9j91K97k48Q2J45j14J26j92
7497b0J26N7j95o4R8k9R9n6n0P3K2Rj05K2j0o5k3l5R7J4M3Q4l10J38J18J1P0j57
7525c8q4J65o1m2J41k03L4o0J89J30k50J52N8j74rj09j0K58n5M0j83J96j71r6
$$ plain form
7349 -187 -212 57 -251 -46 -170 -125 -134 -175 -104 -12 51 -126 -122 39 -72 -65 11 -179 23 -123 205 121 -61 93 151
7374 151 107 47 7 17 65 75 24 60 38 -142 15 94 -16 -27 9 -93 -64 -116 -41 -58 224 -223 171 -43 43 -40
7400 -40 69 -82 88 24 81 32 -127 304 70 -100 -14 13 -46 159 -152 14 1 -28 8 89 24 55 45 -21 85
7425 85 19 -49 129 70 -399 -5 -92 48 31 -72 -108 -71 -53 -76 -58 -245 133 79 -80 137 -42 10 47 -195 107
7450 107 -107 -231 -63 105 -173 67 31 59 90 63 206 1 -140 115 -9 62 -205 65 -118 -71 -132 -93 -109
7473 -109 -135 -78 -51 127 130 -39 38 -81 73 149 225 -114 83 53 36 75 -116 181 -67 15 160 46 172 -20
7497 -20 106 163 -32 -96 2 -27 72 16 -34 39 61 70 -35 -13 -23 -88 -111 -146 -49 -35 8 92 -218 -80 38 49 119 -38
7525 -38 -122 43 -18 -60 81 -122 -88 -148 41 171 -79 73 131 -43 -52 -161 -171 87 32 72 -111 85 -86 -182
7549a82L9K77k65K10M9j91M4j49K07j89r7L09j57M7O8p1O9n3P3j06J76j13r0K18
7573A23n9J50k72J06J05j53J19r1K3j93K4N3R7j14k14K56n4N3J11p5j52K62j35
7596c0j39J21J81j35J8j11M2J33j4j48J24J5j1J9j2j15P0%J92j09p4j22K32j70
7620d3J4J59j55P2j67qK47j76j51M00l88K29K3J3j02j32J68J13k4j13k02J57J74
7643A08P9Lk51J68q3k4K28j57J1o8r2O8m3k1N6J39k37K46L53n27J98j49j00J29
7667C4j13m1j15M60k4l04P3M5j85J60j81K13Q0m49K18j54K49kk1J42M7k82J70
7690B0m9k4K15j69l5Q8N9r6r5nR8J80o8k8J15l53K82k83J28K89k94l8q2J85j36
7715i6J04j43J94n4k0Q5m3K01j76j51K50j59O6r4J7K20j08j02O1J28k04K35N3
$$ plain form
7549 -182 -143 134 -131 79 128 -63 -19 -168 39 -150 -247 62 -95 -48 20 -51 18 -35 38 -68 108 -5 -95 123
7573 123 64 214 -58 48 153 0 119 28 51 -142 -118 -65 32 -82 -296 -40 -94 -41 70 -5 -157 105 -30
7596 -30 -169 -48 133 -2 16 -95 -53 80 66 -82 42 57 46 65 53 -62 8 8 200 91 17 -105 127 -43
7620 -43 -29 130 -25 47 -120 -128 119 -57 -208 192 -196 33 56 69 -33 -165 3 116 92 -21 -223 -66 108
7643 108 187 190 -61 107 24 0 228 71 82 14 -78 -10 -53 -74 -18 121 -116 130 483 -44 154 5 -95 34
7667 34 -79 -120 -235 225 201 -103 -30 15 -170 -10 -191 22 102 -347 -129 -283 -34 -36 -57 85 132 -150 20
7690 20 -29 -53 162 -7 -42 46 105 9 -86 -91 7 187 119 91 206 -147 135 -148 -20 269 -25 -63 -145 40 -96
7715 -96 8 -135 59 5 -15 70 27 228 52 -99 151 -8 58 -36 -19 201 93 -9 52 180 -24 211 264
7738B64j63r3J73N1k64L3j03K23l48j9L0K77l78M05L2j78R4o3k17k09K71K11q2
7761e3J11l4r5O0j19K29J44j74K21m67L86j06l13J0J49J82j05p0L28m97J00j5
7783a28J06O0j16P2J29k86K54J06l80K44k42P1j20L22j7l83L37J72q0j3M1j37
7805A2k5M0L5j46k20K52J44N4j2j74R5j3k6Q5j26K07j69j32N3J26j33J67k05Q5
7829b6J6k9j11k3J11l5LK29l04K60k96J70Q6j39n5J6J41N1l2J4K9K0l9Q4J30j94
7855G7j42KQ2K8k69J31l7l7L9J18n2l2J5m8q3P2K03j70J41j11j13J56L7k12L51
7880A46j6k21l6J75O8j84J25j43j5P1j28J97j16O8J7N9j63q4L6J17O2o4k9J36
7904G8k42J56q1J25k4p1J14j83J49j18K9J12rll7k26K32j23O5J05k31K49N3p9
$$ plain form
7738 264 101 8 181 232 -32 1 -102 121 -227 -246 -216 61 -317 88 120 -58 36 -27 -244 -453 -182 29 -53
7761 -53 58 24 -71 -11 -130 99 243 69 290 -177 209 103 -210 -200 -51 131 26 -44 284 -213 -113 -128
7783 -128 -22 38 -78 -6 123 -163 91 197 -183 61 -181 -110 -230 92 75 -308 29 201 121 108 149 12
7805 12 -13 27 62 -84 -304 -52 92 146 134 -40 55 42 16 101 -25 182 13 -119 -66 60 -73 94 -111 -26
7829 -26 -10 -39 -150 -173 -62 -97 -94 135 -169 91 -205 -35 51 -88 -143 -127 14 65 33 47 76 96 57 141 271 77
7855 77 -65 -63 19 47 -222 -91 -128 -165 -126 -8 -60 -92 -77 -125 -208 -136 67 -103 38 -73 -186 -30 7 -205 146
7880 146 130 -91 -127 48 116 -68 57 -86 -101 -30 -158 39 -77 -9 8 67 -96 -180 -144 -27 35 -29 -58 78
7904 78 -164 -8 -89 36 12 -59 55 -128 21 -97 -68 44 35 32 -5 -231 1 -122 -57 48 -183 66 119 40
7928D0n2l0k0j67M09j31J79k36K60j96n8r5J68q8j07RL52rk79M58m87j08K46K1
7952G9k1m27N70kJ21l62k78L51o4K9o6K05r4l1j38K75m27N31l05L01j63q5K15
7975B14rl28K98j65j29L94k54J52Q1j32j71k1J39j88J11M79n60N9j10J18j36M2
7997a16j2J18J9J43k41P2pJ03j21p8K15j92K16l11K76J62kj95J21J35k41k4K04
8020B44l40K61r2j13J37r0r4q8K02l12J28J17k9M5O2j94NM2m9M05j91k8J9J0j31
8045g4jJ49r9k5r6K82j36L6J24j3n6r9J54k61M1J41k2l82L87O7J24l81m9P3J44
8070B8j04J07j78K15p0j33k0K7J18p9K0o6K35q9J36j67nJ08N0m1r9M0m2j37K06
8095F0j6p0n9L4n2J85k63K14l3M5P0k40N7R2k02L06k47j28J90J87k43l9L4J28
$$ plain form
7928 40 -12 -42 -62 -229 180 49 228 -8 252 56 -2 -97 71 -17 -124 -115 237 228 -51 407 -80 -188 58 79
7952 79 58 -369 201 199 320 -42 -320 31 -33 -4 -70 135 41 10 -128 147 -280 251 -54 247 84 -1 214
7975 214 205 -123 175 10 -119 275 21 173 254 122 -49 -70 69 -119 -8 471 -89 -30 -140 -22 -158 -116
7997 -116 -128 -10 9 152 -89 -17 -24 79 -42 -120 95 -97 119 -192 84 246 244 49 170 305 64 40 244
8020 244 -96 165 73 -40 97 7 -87 -175 27 -285 -157 -40 -69 -24 38 -156 -151 -109 -158 247 56 28 47 57 -74
8045 -74 -75 74 -25 -50 -146 136 0 36 160 147 91 -8 146 -115 -74 67 45 -337 50 117 241 -140 -189 -116 28
8070 28 -76 31 -147 68 -2 -135 -155 -128 -10 -89 -69 -135 100 11 147 -20 -25 83 133 92 -7 33 -9 -146 60
8095 60 44 -26 -85 -51 -103 82 -181 33 0 45 115 -125 -68 24 -178 128 -119 -247 -57 130 -113 -152 -118 10
8119A0j13J16P1r0q2K73r8o3j41J04L0%J32m5j43K29j45p5J09N1N6j86J82j83
8143aN8l9lo6mlN4K99m61J72P6l91L26k4m1lN7P0J36j85J19o5k33K75r8m5j6o3
8171i9J75K1O5l03Q5J37k5rN4k34K47n5m1m3j12J29R7O8j48o5
$$ plain form
8119 10 -103 13 84 -6 -88 185 87 24 -117 -13 17 17 149 104 -39 190 45 -30 79 130 186 0 182 -1
8143 -1 57 18 15 -51 -55 -58 -4 295 -166 6 82 -309 17 -7 -48 -51 6 76 212 27 146 81 -152 123 25 -20 -36 -99
8171 -99 76 97 162 -141 -56 81 56 47 101 -133 114 59 18 -25 -137 -8 89 157 9 -56
8191e6
$$ Imaginary data points
##PAGE= N=2
##DATA TABLE= (X++(I..I)), XYDATA
0@%%%%%%%%%%%%%%%%%%%%%%%%%j08K16k16K16k16K16k16K16l20M28m32M32m68
38b52N76o48O72p80Q64r61J069j176J291j410J584j720J876k074K292k528K797
55A472l104L447l840M292m826N472o255P235q511J0234j2709J6534k3357L8912
69B4996j31846n4920J98528j02789N8313o7343k8009J24128j8808p7668N1143
80b4275k9298M5782K6081q0874J9658R363L1487j749k1315j9281K9208M2868m4351
93a6696J7971k0153K6787J6019j1230j8026j1574L6721J376p893k9159N170K1489
106A0802L1528n1248N068L2817l9825O4335m6236j3374L7037k5514K6961o777
118B5574n9837L1583M7998n0417J4828l8385J9198N2750n2554k078J0421J2636
$$ plain form
0 0 0 0 0 0 0 0 0 0 0 0 0 0 0 0 0 0 0 0 0 0 0 0 0 0 0 -108 108 -108 108 -108 108 -108 108 -212 216 -216 216 -252
38 -252 324 -324 348 -432 432 -529 540 -636 655 -755 829 -891 985 -1089 1203 -1325 1472
55 1472 -1632 1815 -2025 2267 -2559 2913 -3342 3893 -4618 5616 -7093 9441 -13916 24996
69 24996 -106850 -161770 36758 -66031 -7718 -75061 -103070 21058 2250 -75418 -24275
80 -24275 -53573 -7791 18290 -62584 -42926 -33563 -2076 -3825 -25140 -44421 -15213 27655 -16696
93 -16696 1275 -18878 7909 23928 12698 -5328 -16902 19819 21195 13302 -15857 -10687 10802
106 10802 42330 -8918 -3850 28967 -10858 53477 7241 -6133 30904 5390 32351 25574
118 25574 -34263 -2680 45318 -5099 9729 -28656 -9458 43292 -9262 -11340 -919 11717
130A1717m541J2227l7590Q124L0015j6679J0606l4959m04K4722J8225l7760q310
143b4607J0257J1167J9146m3414L128M736L6991j4947l5385N398J3402M4383l8551
156h296l0777K3509L0810j2471p199k3432K1342M1181n4673K0522j1584l302L6182
169B1812j7288k1652N523J1243N55K0145m6110J7115K8154j7690J529r497R257
182C096R762R709k9003J8143n847JK6658k8699L969p56J1700n672J400j1120K254
197E595J7501j3623N43j4351J4241K719J3121k8798r702L4360j2781O119k2938
210g994M842J8584n069k2019J0855K685j0708K4721k9806P817k013j188K0639
223A1346j3124k0260R012K6549k3325N222j7588J4300K1482k5927n523Q7J9237
$$ plain form
130 11717 7176 19403 -18187 -10063 19952 3273 13879 -21080 -21484 3238 21463 -16297 -24607
143 -24607 -14350 -3183 15963 -27451 -24323 -19587 17404 2457 -32928 -27530 -14128 30255 -8296
156 -8296 -39073 -15564 15246 2775 -4424 -27856 -6514 34667 -20006 516 -11068 -14370 21812
169 21812 4524 -17128 -11605 -362 193 20338 -25772 -8657 19497 1807 3336 -6161 3096
182 3096 12858 22567 -6436 11707 5860 5861 32519 3820 7789 7033 18733 13061 14461 3341 5595
197 5595 23096 9473 10016 -4335 9906 12625 25746 -3052 -12754 21606 8825 14944 -7994
210 -7994 -3152 15432 10363 -11656 -801 1884 -8824 15897 -13909 -6092 -8105 -9293 11346
223 11346 -1778 -22038 -13026 13523 -9802 -4580 -22168 -7868 13614 -12313 -17836 -17749 1488
236A488j549N12k5451J3902J9569q002m256j6092K5537j054q08j8360O848J6178
250H462p644L132j3278N362J387J7676j7791o55M443N92J9369l0342O994J3612
264A1319L670j4144J696L36M486O787k1919K4010j3042m902P201J313l58o014
278D39K317l254J6117k3572Q464L682k603P491j3818M64o57J7619j5935M71l930
293f705M472R155j5648K441r38J4126j7113P536l900o394J5099n655L111j2954
307a3367L935N458J4436k3650k293K2122r042O795k0794J0148J3806k763j3392
320h601N291K373k961J6988k2136R560j048L371N087j1350K82P857J0641j8924
334c570Q165o688J0356L621j1491M984n188J0475p847M837r795Q132N056j0480
$$ plain form
236 1488 -61 451 -25000 -11098 8471 469 -3787 -19879 5658 4604 3796 -14564 -7716 8462
250 8462 818 3950 -9328 -3966 -2579 15097 -2694 -3349 1094 1686 21055 -9287 -2293 11319
264 11319 14989 845 2541 2877 7363 14150 -7769 16241 3199 -1703 5498 6811 6453 439
278 439 2756 -498 15619 -7953 511 4193 1590 9081 -4737 -4273 -4930 12689 -3246 -2775 -6705
293 -6705 -2233 6922 -8726 -6285 -7223 6903 -10210 -2674 -6574 -12968 2131 -3524 -413 -13367
307 -13367 -9432 -3974 10462 -13188 -15481 6641 -2401 4394 -16400 -6252 7554 4791 -8601
320 -8601 -3310 -937 -3898 13090 -9046 514 -534 2837 7924 -3426 -3144 4713 15354 -3570
334 -3570 4595 -2093 8263 11884 393 5377 189 10664 2817 7654 -2141 5991 11047 567
348E67M95j358J1727j4216P058n381N900l748j2312J8536l357n332r656J4378
362C301j841J33r722J047J8374j6803K738o490O534J314N34o861l690Q056m258
377g634J1855j7788M928O973K213l804q577Q897M5Q975j4981Q87r15R102J959
392B135j1751J670j741K0008j5007m008N285Q445L771j1299p7K867J1768j4739
406b673R282o614m408J1226o228L426q371N473L200P402j7040L668J4017o242
420F118N142j3327Q928J866l00n737K769p31l779P635j3236R223o589K969L39
435A290l852J429n681N911l572R224j2924j463N483N747l931j2499J0711p54Q010
450C129j7254J68J1255l77k167p400L387j848J2262r816J552l299K059J4555j3162
$$ plain form
348 567 1062 -296 11431 -2785 4273 -1108 4792 1044 -11268 7268 3911 -1421 -11077 3301
362 3301 1460 1593 -8129 -7082 11292 -5511 -2773 -9263 -2729 -1415 -881 -7742 -11432 -3376 -7634
377 -7634 4221 -13567 -8639 -1666 547 -3257 -11834 -2937 -2892 6083 -8898 -8011 -8926 176 2135
392 2135 -9616 -7946 -9687 10321 -4686 -8694 -3409 5036 8807 -2492 -2569 298 12066 -2673
406 -2673 6609 -5 -4413 6813 585 4011 -4360 1113 4313 11715 -5325 -1657 12360 6118
420 6118 11260 -2067 6861 8727 8427 2690 5459 4728 949 8584 -4652 4571 -2018 951 1290
435 1290 -2562 -1133 -6814 -903 -4475 4749 -8175 -9638 -4155 1592 -2339 -14838 -4127 -4881 3129
450 3129 -14125 -13957 -2702 -3079 -5246 -12646 -9259 -11107 1155 -8661 -7109 -10408 -8349 6206 -6956
465f956l712J239J5689o033m847q059R005J4250j4623K488n870J1667K824l216
479C846o372L165J0742l402p03j2908J4021k51j52n005n949R110m488N859p552
494c9Q47j290Q121o20q912J044K826J4348j7290j486K516O148L1r072K530J93
510a05N955j0900Q433n308r01N711m050K218q420M864q7O400j0792L78L207r00
526d297Q396j1005L519j788R602k834o618l51M117R817j2876j900k662J1160l590
541a310k711k822l324J3298n856K596r280N751J0201L06j1449m732J6777L90m89
556G346j7540R902J1060n475n089l528Q706J29M149j3528O537J868J887M804j3454
571b226L500K906O533p845n09k634N748L118r287L830o621J1405k244m222n487
$$ plain form
465 -6956 -10668 -9429 6260 227 -4620 -12679 -3674 10576 -4047 -1559 -7429 4238 7062 3846
479 3846 -2526 639 11381 7979 7276 -5632 8389 8138 7986 2981 -2968 6142 1654 7513 -39
494 -39 808 -482 7639 7019 -1893 -849 1977 16325 -965 -2451 65 6213 6244 -2828 -298 -105
510 -105 5850 -5050 3383 -1925 -2826 2885 -1165 1053 -7367 -2503 -2590 3810 -6982 -6604 -3397 -4297
526 -4297 4099 -6906 -3387 -5175 4427 1593 -5025 -5376 -1259 8558 -4318 -6218 -8880 2280 -1310
541 -1310 -4021 -6843 -10167 3131 -2725 -129 -9409 -3658 6543 6849 -4600 -9332 7445 7835 7346
556 7346 -10194 -292 10768 5293 204 -3324 5382 5511 9660 -3868 2669 4537 6424 11228 -2226
571 -2226 1274 4180 10713 2868 2359 -275 5473 8591 -696 3134 -3487 7918 5674 1452 -4035
586d035K216R869n209l309o734J2360l487k087l263J425M791p014N817o522J899
601c283k035N824n38n920j48J246J1110j1570J984m50N078J156n587J569j587
616c151O729m104K910r627M810O165k402p3q794R893J396J964p771J553N259K830
632G587J03j1530N980J890R348j1593o899P688M955J438j3559L280N147O996j1943
647a112r39M236R01N211j0264L575l296M885J279k351n395J220Q288o693J920
662A465q865R229K443n981j762j500N460j701K351r200N923j26P68K76o766P285
678g01j616K512o028L844j037J751J598l451K578o105Q299j855J4n395K616O906
694C930n796k7l165Q431l418P47l277K196K210k917P469p883K197q03O371j751
$$ plain form
586 -4035 -1819 8050 2841 -468 -7202 5158 1671 -416 -3679 -2254 2537 -4477 1340 -5182 -3283
601 -3283 -5318 506 -32 -5952 -6100 -4854 6256 -5314 -3330 -3780 1298 2454 -3133 -1564 -3151
616 -3151 3578 -526 2384 -7243 -2433 3732 1330 1257 -7537 2356 3752 5716 -2055 -502 4757 7587
632 7587 7690 -3840 2140 4030 13378 1785 -5114 2574 7529 8967 -4592 -1312 3835 10831 -1112
647 -1112 -2051 2185 3086 8297 -1967 1608 -1688 3197 4476 2125 -3270 -2050 6238 -455 1465
662 1465 -7400 1829 4272 -1709 -3471 -4971 489 -1212 1139 -8061 -2138 -2264 -1496 -1220 -7986 -701
678 -701 -2317 195 -5833 -1989 -3026 -1275 323 -3128 -550 -6655 1644 -211 -197 -5592 -2976 3930
694 3930 -1866 -1893 -5058 3373 -45 702 -2575 -379 1831 -1086 6383 -1500 697 -106 6265 4514
710D514n465J245L616N616j0781K388j817Q520j158q135R26J453P518o112j920
725D08m587J0616k52p731K34J14R247p525p88k317M579L43j855l28l973N003l149
742a961N331q730R00N073p17j329o503O663L50J813p719L896J348j705K332n311
758f269O002m447L144j237P18j598J731L510m903M729n330N294j300R65j88k876
774b055L152j260L704o952M281k46K051k359k505N801l502M241m359M347k878
789A461k7L855r67p27n039P392k215N81p290M511N907o320m43l250P242k304J26
806B493m772L157J969k912K153p343P195j425N50l964j146M044J79l44n873O739
822G00m263L426k631j752K973j675L273n221J642j334O080l743k880K613K55L413
$$ plain form
710 4514 -951 294 3910 9526 -1255 1133 -684 7836 6678 -1457 -531 922 8440 2328 408
725 408 -4179 6437 6185 -1546 -1312 -1198 8049 524 -264 -2581 1998 2341 486 158 -3815 1188 -1961
742 -1961 3370 -5360 -4460 613 -104 -1433 -7936 -1273 -923 890 -6829 -2933 -1585 -3290 -958 -6269
758 -6269 -267 -4714 -1570 -2807 -2089 -3687 -1956 1554 -3349 1380 -3950 1344 44 1009 821 -2055
774 -2055 1097 -163 3541 -3411 870 624 2675 316 -2189 3612 110 4351 -8 4339 1461
789 1461 1434 5289 4322 3595 -1444 5948 3733 4314 -2976 1535 7442 1122 679 -2571 4671 2367 2493
806 2493 -2279 878 2847 -65 2088 -5255 1940 515 1065 -2899 -4045 -1 178 -166 -6039 700
822 700 -3563 -137 -2768 -4520 -1547 -3222 51 -5170 -3528 -4862 1218 -2525 -5405 -2792 -2537 876
838H76p491N121K70Q24l276J104L500k655J948k826O705n101J232R65P59J666
854C621m169L796k732K988l287L200k023q81K905l144L415m749M629j975J114
869B708j158j244K389j795L835n468K367k196M775k148n009M201Q1L220q625K926
885a141J588K131m067k211L962k406L077n881M482k048R69J406k451N75o21N351
901B715n012J952m003M157J465n371K141j491L483l734J428k134L728m96j574
916b746K462l738O568l934J436r21K200k11l221K307r37M150o828L787P85O76
932A835j483j791O071k420J212m027N145j358r4J08j542K503l965M590l999J204
948A989j417K273J335m756K027l90N160n655J286j481K241J359m773K079l074
$$ plain form
838 876 -6615 -1494 -1224 -400 -3676 -2572 928 -1727 221 -2605 4100 -1001 231 1196 1955 3621
854 3621 -548 3248 516 3504 217 3417 1394 513 3418 274 3689 -1060 3569 1594 2708
869 2708 1550 306 2695 900 4735 -733 1634 -562 4213 2065 -2944 1257 1338 4558 -4067 -1141
885 -1141 447 2578 -1489 -3700 262 -2144 933 -4948 -466 -2514 -1545 -139 -2590 -2015 -2636 2715
901 2715 -2297 -345 -4348 -191 1274 -4097 -1956 -3447 36 -3698 -2270 -4404 -676 -1172 -2746
916 -2746 -284 -4022 2546 -1388 48 -873 1327 1116 -2105 202 -735 3415 -3413 374 1159 1835
932 1835 352 -1439 4632 2212 3424 -603 4542 3184 3090 3198 1656 4159 194 4784 785 1989
948 1989 572 2845 4180 -576 1451 1061 6221 566 1852 371 2612 3971 -802 1277 -1797
963a797N327l585q94k238L025K183m512R70k908O650m539N91n75Q07J754k542
979b283K059l559L603j621L434m312j670M643q41J336o128M593O42N05l309J307
995a601L577k602K644m200N235k425Q55O62n83P82k237K847k785L910m165K016
1011A930j64m16K716m817K765o01L972n203K96J344J073M43m911L756j982L009
1027C210l318R55n76l42L179l363O97l940N998r03j978l453J575N404m806j94
1043a855k903N854j079j919j088M24L409j774J803o019M629K68O9p43l184M182
1059G4p69J141m683L837j184K524r09l247K891j544N218m362m21n21M339l65m202
1076b183J994K45M566o195J718R12R21j50j915K829k762K240k312L987k938p71
$$ plain form
963 -1797 3530 -55 -949 -3187 -162 2021 -2491 -1521 -4429 2221 -2318 -1727 -2302 -1495 259 -2283
979 -2283 -224 -3783 -180 -1801 1633 -2679 -4349 294 -547 789 -5339 -746 -104 401 -2908 -1601
995 -1601 1976 -626 2018 -2182 3053 628 1483 2145 1562 2344 107 2954 169 4079 -86 1930
1011 1930 1766 1350 4066 -751 2014 1413 5385 182 478 1822 2895 3338 -1573 2183 201 3210
1027 3210 -108 847 271 -71 3108 -255 442 -3498 2500 1597 -381 -3834 -2259 3145 -1661 -1855
1043 -1855 -4758 1096 17 -1902 -2990 -2566 843 -931 872 -5147 -518 -250 -181 -924 -4108 74
1059 74 -695 446 -4237 -400 -1584 940 31 -3216 -325 -1869 3349 -1013 -1434 -1955 2384 2019 -2183
1076 -2183 -189 56 4622 -1573 145 1057 1978 1828 -87 2742 -20 2220 -92 3895 957 186
1092A86J879r91K183m348L104j292K289j931o72L76l54L370m053J487l042M045
1108B236l02k410j19p53L704l429J114l019K296R19k40j538l147M742p36J286
1124F04o364K998L207n31k411l107N659o70Q20m705K649J282R7P63l380K249j011
1141a851L863l122j04r85K908K295n159K293j919M926j863j612m34J512K552k378
1157I22N72l125N868k209k49j943N93L924l229L37k120L578k419J098o1j330J449
1174A656j931L470l389P52j176K993j003k764J375r21L300l943J909j949Q08O74
1190a39n51Q30l325K860r16K011l933K39K363M77j96m702L735o01L021l312j598
1207c737K121J319J378n268J737O69M342m632j567K343J142J801m546K525o97
$$ plain form
1092 186 2065 1074 3257 -1091 2013 721 3010 1079 407 783 429 3799 -254 1233 -1809 2236
1108 2236 1934 -476 -595 -1348 2356 -1073 41 -2978 -682 237 -3 -1541 -4688 54 -682 604
1124 604 -5760 -2762 445 -86 -2497 -5604 55 -615 205 -4500 -1851 -569 -472 291 -3089 -840 -1851
1141 -1851 2012 -1110 -1214 -2199 709 3004 -2155 138 -1781 3145 1282 -330 -764 748 3300 922
1157 922 1494 -1631 4237 2028 1779 -164 429 4353 1124 1461 -659 2919 500 1598 1537 207 1656
1174 1656 -275 3195 -194 558 -618 2375 1372 -1392 -17 -938 2362 -1581 328 -1621 -813 -139
1190 -139 -690 140 -3185 -325 -1241 770 -3163 -2924 -561 -84 -280 -4982 -1247 -1848 1173 -2139 -3737
1207 -3737 -1616 -297 1081 -4187 -2450 -1781 2561 -2071 -3638 -1295 -153 1648 -2898 -373 -1070
1222a070K794j540M00o77o07L842k153Q34m094L903J459j628j997m70M187j747
1238A436P98l827M014j97p00J55k194K944r02J786l840J686k53P28n3k649K671
1255A603k391K283k268J078j074L1J396j576P79l091M688k056j00j209P75J213
1271H1k044J619k098K208k757K280j06j537K15j75L597l673M96r47M220q79k783
1288b283R85M1L173l505N12j657L529m01j925K22j023M697k406N7j759L142O20
1305B019j393J17j227L248k423K066k539O2J518J05L28l247K091K10K562m410
1321i13Q97K464p16O4k629K926j186R52k283J180m58p20J930k336J784k552K385
1338G89o99l17o71J37J489k177J877k470J865j125N52M5j354J593j477K080k399
$$ plain form
1222 -1070 1724 184 584 -93 -700 3142 989 1823 -2271 1632 3091 1463 -534 -1004 3183 1436
1238 1436 2234 -1593 2421 2224 1524 1679 -515 2429 1527 3313 -527 1159 906 1634 1581 -1068 1603
1255 1603 -788 1495 -773 305 -769 -738 658 -918 -139 -3230 1458 -598 -698 -1907 -1132 81
1271 81 -1963 -344 -2442 -234 -2991 -711 -817 -2354 -2139 -2314 1283 -2390 -1894 -2841 1379 500 -2283
1288 -2283 -1298 -1257 1916 -1589 -1077 -2734 795 394 -1531 -1309 -2332 2365 -41 16 -1743 1399 2019
1305 2019 626 743 -484 2764 341 2407 -132 -70 1448 1553 1881 -1366 725 935 3497 -913
1321 -913 -16 2448 1732 1796 -833 2093 907 1859 -424 756 298 -422 1508 -828 956 -1596 789
1338 789 90 -227 -898 -761 728 -1449 428 -2042 -177 -1302 -750 -705 -2059 -466 -1943 137 -2262
1355b262K208j334K51L21l70J555k958K484l89J137k603P50K582r82k12k443L953
1372A688m31j60k288K002J618j855R52k349K995j355J721j645m98J120K73J054
1388B842l212K526j138J838j603j123J698k91R02k425J413j664K448j137r13L14
1404D75n79K153l076R34p07J698j351n67J071p01J171k670K970j578K65m74M75
1421d91Q04j953J370j430K240k737J398K00m35N88j159J955k037J486p83J679
1437F95j228o76J263p12J753k649J667r65J700o52j492J384Q6K128l241R28J81
1454A70K415j139j994J451K17J550l443J702n14Q47l2q02N01q59K328j803J281
1471A876k338J434J510j951r1m92K676k256L72j755J966P7j612J218j632K110
$$ plain form
1355 -2262 -54 -1388 -1137 -816 -1186 369 -2589 -105 -494 643 -1960 -1210 1372 390 178 -2265 1688
1372 1688 1257 1097 -1191 811 2429 574 1526 -823 2172 817 2538 893 395 1515 1788 2842
1388 2842 -370 2156 1018 2856 1253 130 1828 1537 2439 14 1427 -237 2211 1074 161 475
1404 475 -104 2049 -1027 -93 -800 898 -453 -1020 51 -650 521 -2149 821 -757 -492 -966 -491
1421 -491 313 -1640 -270 -1700 540 -2197 -799 -599 -1034 -446 -1605 350 -1687 -201 -984 695
1437 695 -533 -1209 54 -658 1095 -1554 113 -852 848 196 -1296 88 174 2302 -939 -11 170
1454 170 2585 1446 -548 903 1120 2670 -773 929 415 1262 1230 428 929 70 2398 595 1876
1471 1876 -462 972 2482 531 440 -52 2624 368 740 -1015 951 1028 -584 634 -998 1112
1487A112k071J197j080L26K4l55O28j638K041k048J422m05R7m76j123K028p58
1504a079P04k483K457j99m65q7o47K115j814J193p97J254j098Q95J176j969Q33
1521a1q49L104k180j1n72J750O34k493J208n22K555j987J35p77J091J276j535
1538H16K18j797L566j427l92j019O12J747j597O1j720K358j174J164j546q88J586
1555E68j39O17k948J249M85J317k591k64J730l44O79k819K485o84J76m78J82L64
1573d15j150J523j280J377j828R72M29n03L20j451J789q26J313j873O43K06N84
1590a70P54k356J760k99J397j661L84K60K76P24j540J304j878K212l85M7r56j48
1608b75K474j134l05k089L443k22q21j064J56K027j257L62j993J896l19M96n71
$$ plain form
1487 1112 -959 238 -842 -516 -492 -847 -219 -1857 184 -1864 -442 -847 -750 -1226 -2349 -321 -1079
1504 -1079 -375 -2858 -401 -600 -1065 -1152 -1799 316 -1498 -305 -1102 152 -946 -51 1125 -844 -11
1521 -11 -860 2244 64 53 -519 1231 1865 -628 580 58 2613 626 761 -16 1075 2351 816
1538 816 1034 -763 2803 1376 984 -35 577 2324 727 788 -932 1426 252 1416 -130 -1018 568
1555 568 429 1046 -1902 -653 -168 1149 -1442 -1706 24 -320 359 -2460 25 -659 -483 -961 -779 -415
1573 -415 -1565 -42 -1322 55 -1773 -801 -372 -875 -555 -2006 -217 -1043 270 -1603 -960 -754 -170
1590 -170 584 -1772 -12 -311 1086 -575 -191 69 345 1069 -471 833 -1045 1167 782 829 -127 -275
1608 -275 2199 1065 760 -1329 2114 1892 1071 7 163 2190 933 1295 -698 1198 879 1375 804
1625H04j640J680k90J257l009Q59K59J381j087j860J492l68J684k531L5m3J600
1642B23l54j621K99l04K898k560j70O8J345o2j310P58n30J599j645J334p14m75
1660a221P78n9R83k279J009K03J261j666q8J264l99J484k086J382r39J379l71
1677F35k89n6m01J890j427L49j592J808K82o77j60r88K011p60J172k686J130R66
1695A207L25q98j981K225lQ48k858J048P77j13j30j489J244p87J591j441J31q54
1713a158Q75J529k292o5o45K655j273j046n74J528J116j817J78j006K373o44m82
1730g48q47J63J945j305M79j729K394j119P61n05j67J362j196J204j137O28n66
1747c83J317o5q57J87n82J985j677P62m63R44k61l33O21r24J231j268J711j661
$$ plain form
1625 804 -836 844 554 1811 -1198 -339 -80 1301 214 -1646 -154 -522 1162 -1369 -1334 -1377 223
1642 223 -131 -1752 -1453 -1757 1141 -1419 -1589 -1521 -176 -238 -1548 -790 -1320 279 -1366 -32 -746 -1221
1660 -1221 -443 -502 481 -1798 -789 -586 675 -991 -1079 185 -214 1270 -816 566 -373 1006 635
1677 635 346 290 -111 1779 352 701 -891 917 1199 522 362 -626 1385 625 1797 -889 241 1207
1695 1207 1532 634 -1347 878 875 1723 -1135 -87 690 577 447 -1042 202 -585 1006 -435 -304 -1158
1713 -1158 -283 1246 -1046 -1111 -1756 899 -374 -1420 -1994 -466 650 -1167 -989 -1995 378 -266 -748
1730 -748 -1595 -1432 513 -792 -313 -2042 352 -767 -6 -511 -678 684 -512 692 -445 183 -383
1747 -383 934 869 12 199 -383 1602 -75 687 224 1168 907 574 1195 271 1502 234 1945 284
1765B84j74P58L81qk026J384l62J309j753k20R77l8Q11k309J031k62J688j795
1783c24k60Q9L51J158k259R23o76J571j296j6j1m57J506j415J170j988J277P47
1801I0r5j182m63K202o12k0j842K022L02p66j19p44J685o16O52j517J035j51M93
1820C54K38j190J433o22J351j586P74n35O03M3r29J050j223J482r36N15q06M37
1838D53P43o78M94r65J679j485P49k76j98J8p66J470j301M09j219J609R8j079
1856b45j1P6J401j876N15p33J489n54o73L10p39J159r15M94j068Q43P1p2k46p95
1876a569J959j454R94j504P02K07k4L62r18P72k95J363j754N56O68Q0M35j806
1894a226J356J22O98j567P18M39k86O49j103J494j331J042m66J41k72k9J045j070
$$ plain form
1765 284 110 868 1249 1241 -785 599 237 1546 -207 -427 550 512 1323 -986 45 -217 1471 -324
1783 -324 -584 -495 -144 1014 -1245 -322 -998 573 -723 -739 -750 -1207 299 -1116 54 -1934 -657 90
1801 90 -5 -1187 -1650 552 -60 -80 -1922 100 402 -364 -483 -1227 458 -158 494 -1023 12 -139 354
1820 354 592 -598 835 213 1564 -22 752 217 820 863 -66 984 -239 1243 307 822 16 453
1838 453 1196 518 1012 47 1726 241 990 714 516 534 -232 1238 -63 346 -873 736 834 -245
1856 -245 -256 -180 1221 -655 -140 -873 616 62 -611 -301 -1040 119 -796 -302 -1370 -527 -456 -528 -774 -1569
1876 -1569 390 -1064 -70 -1574 -872 -665 -689 -327 -1245 -473 -768 595 -1159 -603 65 145 580 -1226
1894 -1226 130 252 950 -617 101 540 254 903 -200 1294 -37 1005 539 680 408 379 1424 354
1912C54Q39j563J810q91j94K45j69M98j067J227j108Q15j056L90K47o09O38j324
1930i18J286p87R09j389J95O43l6K69j876J849o13N92j594N31P42l50J02j174
1948a619J723r50L99l74O4J51l21J201j414P92o01J206o52m82N19L36N13j227
1966g36P99p30J154o49Q3K73n81J380j060N90o16Q97l71n8J53m42J077j441J260
1985I82n35K53m94K39M87p54M74q12J787j527L37J2j01J51p59J093j141N50o89
2004d47R78n04o97O70m96J014j611O51k22Q01q69k07N16l25J101j508P32l94J066
2023B49l67j050L67j65J485j585M71j51P14k64m58K55l45J266j071R22j341R79
2041h9M77k15j34p87J653o24L05j025R96L42o63L20q01J254r30P16m75L85j94
$$ plain form
1912 354 1193 -370 1440 549 355 600 431 929 -138 1089 -19 796 -260 130 377 -232 406 -918
1930 -918 368 -419 490 -899 -704 -61 -97 172 -1704 145 -468 124 -1470 -939 -197 -547 -445 -1619
1948 -1619 104 -846 -447 -821 -757 -606 -927 274 -1140 -348 -949 257 -395 -877 -358 -22 491 -736
1966 -736 63 -667 487 -162 -79 194 -387 993 -67 523 -93 804 433 375 528 86 1163 -278 982
1985 982 447 700 206 445 932 178 652 -160 1627 100 437 449 348 499 -260 833 -308 242 -447
2004 -447 531 27 -670 0 -496 518 -1093 -442 -664 137 -732 -939 -423 -748 353 -1155 -423 -817 249
2023 249 -118 -1168 -801 -966 519 -1066 -595 -746 -32 -296 -754 -499 -844 422 -649 273 -1068 -89
2041 -89 388 173 39 -748 905 281 586 -439 557 899 236 556 -245 1009 79 795 320 705 511
2060E11j13P27j180R14j094J162m25j65j10q6M18p52P91j229J209l90O5k19n70
2079e36J077q34L81j027J042o27J96P9l28M60j040J396q75J72r09J010N55r14
2097g22j64j90J481j262K77n59O38M54o69K50p66J492p79P74r54K54J038m89j06
2116bj055J605n17N69r23M1P84l02O69j505J071j73J040r62k62N56r0Q72j764
2135c48J063m02O41p02l6M46m70N67p29R67j231N81N07l62k91o15J007n96K83
2154B80r63N49J48k13K36r76R30p35Q15r93K87l07M99O15j461J003p02J009q20
2173g99J91k04l0P22l15J68j412J550k32L09j098L17J279n49m3r35J388m08M40
2192C39l56k60O55k41Q61j355N06j32J121o50j094P03K74R42j423M10R0Q76o28
$$ plain form
2060 511 398 1125 -55 859 -235 927 502 337 227 141 559 -193 598 -631 578 188 253 34 -536
2079 -536 541 -293 88 -939 103 -524 -328 -249 -577 -117 -1157 239 -636 -464 -1373 -363 192 -722
2097 -722 -886 -1076 405 -857 -580 -1139 -501 -47 -716 -466 -1232 260 -519 255 -699 -445 593 104 -2
2116 -2 -1057 548 31 600 -323 -282 502 200 869 -636 435 262 1302 340 78 634 544 1416 -348
2135 -348 715 313 954 252 216 662 192 759 30 997 -234 347 854 492 201 -414 593 -3 280
2154 280 -683 -134 14 -199 37 -939 -9 -744 71 -922 -635 -942 -443 172 -1289 -286 -988 21 -799
2173 -799 -608 -812 -842 -120 -435 -267 -1679 -129 -361 -52 -1150 -833 446 -103 -146 -1081 307 -101 339
2192 339 -17 -277 378 137 998 -357 149 17 1138 488 -606 97 371 1313 -110 300 390 1266 638
2211F38l81K08k47J542j568O0k34P92o5m99J23m49J218j225M94m56K80K36n43
2230g6O22j172Q33n81R43j058j80N42j53M69j308J194m49M38o05Nj2m50R28o56
2250g26P41j142R54p6j05k16k89R01m81O53j175J049mj27j20o22R96j51N50j290
2270f80P34J96K60p9q92J053m36Q38j187Q63m86K75M79o42K78q91J651p11l84
2289B39o48R48N93r95J20p25J563q09l18j95L64L89o00J91p91R28n60O85q98q3
2309f02R12p39N62r21P87o55P46m70k26K25k72J063r67L18o16Q51k46l17K88j51
2329d30Q23q97Q56q47J31k68L11M43r63J020l35J104j642M34M91J38L97j349J207
2348F24m75O69o24K01Jj24N58r29M25m06J209j005Q6p5K74M79n72K8p27R71l62
$$ plain form
2211 638 257 465 218 1760 192 252 18 810 745 246 369 -80 1138 -87 407 -49 231 467 -76
2230 -76 546 -626 207 -374 569 -489 -669 -127 -280 189 -1119 75 -374 64 -541 -536 -548 -998 -70 -726
2250 -726 15 -1127 -173 -249 -354 -570 -859 42 -439 214 -961 88 84 -43 -163 -785 211 60 610 -680
2270 -680 54 250 510 431 -461 592 156 994 -193 670 184 459 938 296 574 -317 1334 623 239
2289 239 -409 539 1132 137 257 -468 1095 286 -32 -227 137 526 -74 117 -674 254 -306 379 -519 -602
2309 -602 310 -429 133 -788 -1 -656 90 -380 -606 -381 -653 410 -557 -239 -855 -4 -250 -567 -279 -430
2329 -430 393 -504 352 -495 -364 -632 -321 122 -841 179 -156 948 -694 -260 231 369 766 -583 624
2348 624 149 818 194 395 396 272 830 -99 326 -80 1129 124 210 135 409 888 316 344 -383 588 226
2369B26K44n91l32R41m43N28j135Q38k32M56p29l12Q65m54r3p06P64j52J74J35
2389ho66N65m20O83j103N04k66M71o3m08P65j028J123r27O65j75p1J28k63N05
2409A1o75R52p76Q06m98K06L26o41N46l05L81p15Q51l33K04k15j42R62n50j13
2429B82n58R81m42Q4l3k26P27o95L35l74N11j90k8j3n74O98l52O65j032K46l0
2450a8R3J76o29N86n07P60j028N00l47K18K62p60N95l70M43q21L65J09N6O3m74
2471g28O21m90M23m40N89k94q7K07m07O25q55P49l69M6J75Q6L09o51N71m07Q73
2492E46r28M37J93j86M01o15O46l69N39n84J84K7m1L13q33Q17m01O91q88K71L62
2513E82pn8p89J000o34M32l36J33j09j25J89n30O06j060R60J2m97K6M8M72o97
$$ plain form
2369 226 470 -121 -453 488 45 573 -562 276 44 500 -229 -541 324 -130 -223 -929 -165 -317 -143 -8
2389 -8 -674 -109 -529 154 -949 -445 -711 -240 -303 -711 54 -974 149 -778 -113 -288 -359 -231 -494 11
2409 11 -664 288 -488 318 -180 26 352 -289 257 -48 333 -382 469 136 340 125 -17 945 395 282
2429 282 -276 705 263 347 314 88 815 120 455 81 592 402 374 361 -213 485 133 798 -234 12 -18
2450 -18 75 251 -378 208 -299 461 -567 -67 -414 -196 66 -694 -99 -469 -26 -847 -482 -373 -317 -254 -728
2471 -728 -107 -597 -174 -614 -25 -319 -406 -199 -606 19 -836 -87 -456 -410 -235 -149 160 -491 80 -327 546
2492 546 -382 55 248 62 463 -152 494 125 664 80 264 291 250 563 -270 547 146 837 -51 220 582
2513 582 575 517 -272 728 94 526 190 323 214 89 278 -252 354 -706 254 266 -231 -205 -157 315 -382
2534c82L49o37Q20n56K12j59j71M06m81M61o82P58n58L23r5k64N69m60N24m28
2554d51L46k63K21Q4l08M68m49R53q96L01j27k0K19k31M79m21M38p67Q39k31k05
2575b1J77m7N07n10J20l4N20l44l17K60L0M98j035M71k91O14l23l50J97k12Q71
2596G81j097M04n44N76l6l54L49m42N69n76N15n80L19j09N0k8o63Q79m13L22p76
2617h54N42L23k90N8l57P43m72J46l64N76m12M2M97n12M29o82Q78k58j55o9P6
2638a15K80l62M05n22P65k57L0j03j7L57l83N38m92M07m39L46l96O9L80n06O06
2659E91n56M35n51N77P8k37k26l90J178n40q4l52M02j85l07Q4l65R17o13J48m49
2680d45K99J78j64J99q01M84p8L23p19K97M22k47J06o59N58q4N31n77k00LL31
$$ plain form
2534 -382 -33 -670 150 -406 -194 -353 -524 -118 -599 -138 -820 -62 -620 -297 -392 -656 -87 -547 -23 -451
2554 -451 -105 -368 -147 -63 -371 97 -352 601 -295 6 -121 -141 78 -153 326 -95 343 -424 415 184 -21
2575 -21 156 109 616 106 226 192 712 368 51 311 341 839 -196 275 -16 598 275 -75 122 -90 781
2596 781 -316 88 -456 120 84 -270 79 -363 206 -370 145 -435 -116 -225 -175 -203 -866 13 -400 -78 -854
2617 -854 -312 11 -279 -221 -578 165 -307 -161 -525 51 -361 -319 178 -334 95 -587 291 33 -122 -191 -115
2638 -115 165 -197 208 -314 451 194 224 121 104 461 78 616 124 531 92 438 42 111 491 -15 591
2659 591 35 470 -81 496 574 337 111 -279 899 359 275 -77 325 140 -167 -83 -448 469 -144 4 -445
2680 -445 -146 32 -132 67 -734 -250 -328 -5 -724 -427 -5 -252 -146 -805 -247 -331 200 -377 -577 -574 -243
2701b43M26q44P03k96P22o73J14J15j26L21o05O78o91M50J19J33j47k19M55j45
2721B47M70j045O40J69j56j44l33Q13n84M19n96L06K5PK66n74M13n09P24o67K55
2742A46l9K65%k80L78r43P90k95Q9j88j70N98k45P7q01N51j43K66m60k6L32k83
2764c81N13q62O05m21P52o71j83P3L4P83o25k41m2P57m38j68M97k77N97o43M06
2785F5m15L82J33o5j16k60P60o28O16p18O69k42L8J01j55L06l65M16l63J9Q2j9
2807B41K99p05M73k07K89l26Jq2J41K4l00M64o27L51J07J2m02QJ65k00N59r73
2829f88Q51m07K15j27j81J89l33N34m85M14l97J67N3l88L53j43N27o19L42l46
2849d69L27J4k12K37m21P47l05L2k48K50K52l10l0j63O35k00K1k39L00K03m54
$$ plain form
2701 -243 183 -661 42 -254 468 -205 -91 24 -102 219 -386 292 -399 51 170 303 156 -63 392 247
2721 247 717 -328 312 481 325 181 -152 661 77 496 -100 206 231 238 504 -70 343 -166 558 -109 146
2742 146 107 372 372 92 470 -473 317 22 111 -77 -247 351 106 183 -618 -67 -210 56 -404 -430 -98 -381
2764 -381 132 -730 -125 -546 206 -465 -648 -575 -541 242 -383 -624 -666 91 -347 -515 -18 -295 302 -341 65
2785 65 -350 32 165 100 -16 -276 484 -144 472 -246 423 181 219 320 165 471 106 522 159 178 260 241
2807 241 540 -165 308 101 390 64 65 -17 124 148 -152 312 -315 36 143 155 -247 -239 -74 -274 285 -688
2829 -688 163 -244 -29 -156 -337 -148 -481 53 -432 -18 -415 -248 -195 -583 -230 -373 154 -465 -123 -469
2849 -469 -142 -128 -340 -103 -524 223 -82 -50 -298 -48 204 -106 -136 -299 336 136 157 -82 218 421 -33
2870c3L82l52O88q11O15l78J89J62m02M20p35O14l74M74j65k14O4OL07n36N07
2891D28n22M06k06J1r9LM56j005N57k96K91j97j56M75m07K32n46P30n88K03M8
2912a82K3J75n67N97l17N62p04J60k18K21k8k27M40m93M34j71K54m98K75M19k53
2933i8K76p35Q56l02J81j08j87N58l97M65p64N04n8K16l12rM26j60P4m24M55l00
2955A57J47j01l7M04o23N17l66j1j82M72j79r3J53k68M27n55J70k21K74j14m91
2976e20M88k66M81o22M42j40j08K73j36J07j80K45p96P54k58K04l12k06O44o01
2996e07N57l06K11j44N7O0k67M48m18L93l14K64l06J58J47k6O9k70O35q28N84
3017A97j35O8R5j94K68k97M48n50N11l60K17N2l29L72l61M50m19K80k98M68o4
$$ plain form
2870 -33 349 -3 685 -126 489 111 300 462 60 480 -255 359 -15 459 294 80 144 150 457 -79 428
2891 428 -94 312 106 117 18 21 477 -528 29 -267 24 -173 -329 146 -261 -29 -575 155 -433 -230 -182
2912 -182 -159 16 -551 46 -271 291 -413 -253 -471 -250 -278 -505 -65 -558 -124 -295 -41 -539 -264 155 -98
2933 -98 178 -557 299 -3 178 70 -117 441 44 509 -255 249 191 407 95 86 512 352 426 2 457 157
2955 157 304 203 166 570 -53 464 98 87 -95 377 198 105 258 -10 417 -138 32 -189 85 -29 -520
2976 -520 -32 -298 183 -439 3 -137 -245 28 -108 -1 -181 64 -732 22 -236 -32 -344 -550 94 -507
2996 -507 50 -256 -45 -189 -132 -72 -339 109 -309 84 -230 34 -272 -114 33 7 76 -194 441 -387 197
3017 197 62 130 225 31 299 2 450 -100 411 51 268 320 -9 363 2 452 33 313 15 483 419
3038D19m90M68l88L19n70N46j63n5Q1k95M28n56L41m96M11q9j4K46n10K21k46
3059c92N67p45L13j70K08kl91M21l35P91q81M59L5J65m0k14K98l36O59n41p3J50
3081e4O0J53m18M64l17M64m44K97j29j18K52l48L55l94N23j75J89l67J79L28m48
$$ plain form
3038 419 -71 397 9 328 -242 304 141 86 167 -128 300 -256 85 -411 0 -89 -103 143 -367 -146 -392
3059 -392 175 -570 -257 -427 -219 -221 -612 -191 -526 265 -616 -157 -122 43 3 -211 87 -249 410 -131 -204 -54
3081 -54 6 159 -259 205 -112 352 -92 205 76 -42 210 -138 217 -177 346 171 360 -7 172 500 52
$$ [...]
8191a48
##END NTUPLES=NMR FID
##END=
