##TITLE=1H_SA_Sl.SF
 CDCl3, 8 sc, 
 20.10.2020
##JCAMPDX= 6.0         $$ Bruker NMR JCAMP-DX V2.0
##DATA TYPE= NMR FID
##DATA CLASS= NTUPLES
##ORIGIN= UXNMR, Bruker Analytische Messtechnik GmbH
##OWNER= root
$$ XWIN-NMR		Version 3.5
$$ Tue Oct 20 13:18:49 2020 Russian Standard Time (UT+4h)  she@DPX200
##.OBSERVE FREQUENCY= 200.1315066352
##.OBSERVE NUCLEUS= ^1H
##.DELAY= (6, 6)
##.ACQUISITION MODE= SIMULTANEOUS
##.ACQUISITION SCHEME= undefined
##.AVERAGES= 8
##.DIGITISER RES= 18
##SPECTROMETER/DATA SYSTEM= spect
##.PULSE SEQUENCE= zg30
##.SOLVENT NAME= CDCl3
##.SHIFT REFERENCE= (INTERNAL, CDCl3, 0, 15.7039)
##AUDIT TRAIL= $$ (NUMBER, WHEN, WHO, WHERE, WHAT)
$$ ##TITLE= Audit trail, XWIN-NMR		Version 3.5
$$ ##JCAMPDX= 5.01
$$ ##ORIGIN= Bruker BioSpin GmbH
$$ ##OWNER= she
$$ F:/spectra/data/she/nmr/H-F/1/audita.txt
$$ ##AUDIT TRAIL=  $$ (NUMBER, WHEN, WHO, WHERE, WHAT)
(   1,<2020-10-20 13:17:32.31 +0400>,<she>,<DPX200>,
      <created by zg, POWCHK disabled, PULCHK disabled
       configuration hash MD5:
       00 E9 B6 7A A2 85 ED C7 34 08 36 98 17 FE 4E 26
       data hash MD5: 16K
       92 FB 1F 04 76 E1 8C E2 17 1A 1F 93 F2 CA 55 DF>)
$$ ##END=
$$ 
$$ hash MD5
$$ 69 A1 BA 91 11 25 35 9F B8 68 68 CC 31 40 31 67
##$RELAX= 
##$RELAX= 
##$RELAX= 
##$RELAX= 
##$RELAX= 
##$RELAX= 
$$ Bruker specific parameters
$$ --------------------------
##$DU= <F:/spectra>
##$EXPNO= 1
##$NAME= <H-F>
##$PROCNO= 1
##$TYPE= <nmr>
##$USER= <she>
##$AMP= (0..31)
100 100 100 100 100 100 100 100 100 100 100 100 100 100 100 100 100 100 
100 100 100 100 100 100 100 100 100 100 100 100 100 100 
##$AQSEQ= 0
##$AQ_mod= 1
##$AUNM= <au_zg>
##$AUTOPOS= <>
##$BF1= 200.13
##$BF2= 200.13
##$BF3= 200.13
##$BF4= 200.13
##$BF5= 200.13
##$BF6= 200.13
##$BF7= 200.13
##$BF8= 200.13
##$BYTORDA= 1
##$CFDGTYP= 0
##$CFRGTYP= 5
##$CHEMSTR= <none>
##$CNST= (0..31)
1 1 145 1 1 1 1 1 1 1 1 1 1 1 1 1 1 1 1 1 1 1 1 1 1 1 1 1 1 1 1 1 
##$CPDPRG= <>
##$CPDPRG1= <>
##$CPDPRG2= <>
##$CPDPRG3= <>
##$CPDPRG4= <mlev>
##$CPDPRG5= <mlev>
##$CPDPRG6= <mlev>
##$CPDPRG7= <mlev>
##$CPDPRG8= <mlev>
##$CPDPRGB= <>
##$CPDPRGT= <>
##$D= (0..31)
0 1.2 0 0 0 0 0 0 0 0.06 0 0.03 0 0 0 0 0.0002 0 0 0 0 0 0 0 0 0 0 0 0 
0 0 0 
##$DATE= 1603185451
##$DBL= (0..7)
120 120 120 120 120 120 120 120 
##$DBP= (0..7)
150 150 150 150 150 150 150 150 
##$DBP07= 0
##$DBPNAM0= <>
##$DBPNAM1= <>
##$DBPNAM2= <>
##$DBPNAM3= <>
##$DBPNAM4= <>
##$DBPNAM5= <>
##$DBPNAM6= <>
##$DBPNAM7= <>
##$DBPOAL= (0..7)
0.5 0.5 0.5 0.5 0.5 0.5 0.5 0.5 
##$DBPOFFS= (0..7)
0 0 0 0 0 0 0 0 
##$DE= 6
##$DECBNUC= <off>
##$DECIM= 32
##$DECNUC= <off>
##$DECSTAT= 4
##$DIGMOD= 1
##$DIGTYP= 9
##$DL= (0..7)
0 120 120 120 120 120 120 120 
##$DP= (0..7)
150 150 150 150 150 150 150 150 
##$DP07= 0
##$DPNAME0= <>
##$DPNAME1= <>
##$DPNAME2= <>
##$DPNAME3= <>
##$DPNAME4= <>
##$DPNAME5= <>
##$DPNAME6= <>
##$DPNAME7= <>
##$DPOAL= (0..7)
0.5 0.5 0.5 0.5 0.5 0.5 0.5 0.5 
##$DPOFFS= (0..7)
0 0 0 0 0 0 0 0 
##$DQDMODE= 0
##$DR= 18
##$DS= 0
##$DSLIST= <SSSSSSSSSSSSSSS>
$$ [...]
##$SUBNAM2= <"">
##$SUBNAM3= <"">
##$SUBNAM4= <"">
##$SUBNAM5= <"">
##$SUBNAM6= <"">
##$SUBNAM7= <"">
##$SUBNAM8= <"">
##$SUBNAM9= <"">
##$SW= 16.880792210976
##$SWIBOX= (0..15)
0 0 2 0 0 0 0 0 0 0 0 0 0 0 0 0 
##$SW_h= 3378.37837837838
##$TD= 16384
##$TD0= 1
##$TE= 0
##$TE2= 300
##$TE3= 300
##$TEG= 300
##$TL= (0..7)
0 120 120 120 120 120 120 120 
##$TP= (0..7)
150 150 150 150 150 150 150 150 
##$TP07= 0
##$TPNAME0= <>
##$TPNAME1= <>
##$TPNAME2= <>
##$TPNAME3= <>
##$TPNAME4= <>
##$TPNAME5= <>
##$TPNAME6= <>
##$TPNAME7= <>
##$TPOAL= (0..7)
0.5 0.5 0.5 0.5 0.5 0.5 0.5 0.5 
##$TPOFFS= (0..7)
0 0 0 0 0 0 0 0 
##$TUNHIN= 0
##$TUNHOUT= 0
##$TUNXOUT= 0
##$USERA1= <user>
##$USERA2= <user>
##$USERA3= <user>
##$USERA4= <user>
##$USERA5= <user>
##$V9= 5
##$VALIST= <valist>
##$VCLIST= <CCCCCCCCCCCCCCC>
##$VD= 0
##$VDLIST= <DDDDDDDDDDDDDDD>
##$VPLIST= <PPPPPPPPPPPPPPP>
##$VTLIST= <TTTTTTTTTTTTTTT>
##$WBST= 1024
##$WBSW= 4
##$XGAIN= (0..3)
0 0 0 0 
##$XL= 0
##$YL= 0
##$YMAX_a= 440034
##$YMIN_a= -351978
##$ZGOPTNS= <>
##$ZL1= 120
##$ZL2= 120
##$ZL3= 120
##$ZL4= 120
##$ABSF1= 10
##$ABSF2= 0
##$ABSG= 5
##$ABSL= 3
##$ALPHA= 0
##$AQORDER= 0
##$ASSFAC= 0
##$ASSFACI= 0
##$ASSFACX= 0
##$ASSWID= 0
##$AUNMP= <proc_1d>
##$AZFE= 0.1
##$AZFW= 0.1
##$BCFW= 1
##$BC_mod= 2
##$BYTORDP= 1
##$COROFFS= 0
##$CY= 11.3945322036743
##$DATMOD= 1
##$DC= 2
##$DFILT= <>
##$DTYPP= 0
##$F1P= 16.9975609425685
##$F2P= -3.02152046262296
##$FCOR= 0.5
##$FTSIZE= 0
##$FT_mod= 4
##$GAMMA= 1
##$GB= 0.15
##$INTBC= 1
##$INTSCL= 1
##$ISEN= 128
##$LB= 0.24
##$LEV0= 0
##$LPBIN= 0
##$MAXI= 10000
##$MC2= 0
##$MEAN= 0
##$ME_mod= 0
##$MI= 1.114404
##$NCOEF= 0
##$NC_proc= 0
##$NLEV= 6
##$NOISF1= 3.799351
##$NOISF2= 2.8
##$NSP= 1
##$NTH_PI= 0
##$NZP= 0
##$OFFSET= 15.70392
##$PC= 1
##$PHC0= -10689.56
##$PHC1= 15.40089
##$PH_mod= 1
##$PKNL= yes
##$PPARMOD= 0
##$PSCAL= 0
##$PSIGN= 0
##$REVERSE= no
##$SF= 200.130013532006
##$SI= 16384
##$SIGF1= 3
##$SIGF2= 2
##$SINO= 400
##$SIOLD= 16384
##$SREGLST= <1H.CDCl3>
##$SSB= 0
##$STSI= 0
##$STSR= 0
##$SW_p= 3612.71676300578
##$SYMM= 0
##$S_DEV= 0
##$TDeff= 0
##$TDoff= 0
##$TI= <>
##$TILT= no
##$TM1= 0
##$TM2= 0
##$TOPLEV= 0
##$USERP1= <user>
##$USERP2= <user>
##$USERP3= <user>
##$USERP4= <user>
##$USERP5= <user>
##$WDW= 1
##$XDIM= 8192
##$YMAX_p= 0
##$YMIN_p= 0
$$ End of Bruker specific parameters
$$ ---------------------------------
##NTUPLES= NMR FID
##VAR_NAME=  TIME,          FID/REAL,        FID/IMAG
##SYMBOL=    X,             R,               I
##VAR_TYPE=  INDEPENDENT,   DEPENDENT,       DEPENDENT
##VAR_FORM=  AFFN,          ASDF,            ASDF
##VAR_DIM=   8192,          8192,            8192
##UNITS=     SECONDS,       ARBITRARY UNITS, ARBITRARY UNITS
##FACTOR=    0.000296,      1,               1
##FIRST=     0,             0,               0
##LAST=      2.424536,      0,               0
##MIN=       0,             -351978,         0
##MAX=       2.424536,      440034,          0
$$ Real data points
##PAGE= N=1
##DATA TABLE= (X++(R..R)), XYDATA
$$ [...]
$$ plain form
2542 3082 3778 -956 -3899 -1389 2325 2582 -2030 -4100 -1104 2966 1795 -2322 -3830 -429 3022
2557 3022 1292 -3068 -4392 -121 2832 386 -4287 -3749 804 2945 -369 -4311 -2462 2415 3490
2572 3490 -589 -3366 -718 3487 3384 -1153 -3185 -144 3798 2238 -2077 -2747 247 3253 1189
2587 1189 -2410 -2411 1053 3011 600 -2627 -1754 1456 2293 -90 -2762 -1709 1263 1514 -1116 -3203
2603 -3203 -1791 911 1206 -1334 -3455 -1774 1344 1385 -1594 -2768 -1032 1462 1147 -2149 -3255 -574
2619 -574 1955 209 -2754 -3361 -156 1639 -548 -3282 -2624 599 1334 -717 -3222 -1850 1201 1200 -1436
2636 -1436 -3402 -1304 754 687 -2224 -2736 -927 788 0 -2421 -2218 -128 1069 -379 -1992 -1333
2652 -1333 484 998 -504 -1672 -1092 305 689 -355 -1455 -1071 354 371 -347 -1322 -1182 500 711
$$ packed form
2542C082O96m734k943K510L714K57m612k070K996M070j171m117j508L401L451
2557C022j730m360j324M271K953k446m673N38M553K141l314l942J849M877J075
2572C490m079k777K648M205j03m537k032L041L942j560m315o70K994L006k064
2587A189l599jL464J958k411l227Q73L210Q37k383k672J053K972K51k630k087
2603c203J412K702K95k540k121J681L118M1k979j174J736K494l15l296j106K681
2619e74K529j746k963o07L205J795k187k734O58L223P35k051k505J372L051jk636
2636a436j966K098K058o7k911n12J809J715p88k421K03K090J197j448j613O59
2652a333J817N14j502j168N80J397L84j044j100L84J425J7p18r75J40J682K11
$$ plain form
2669 711 -612 -1356 -422 197 602 -1202 -1819 -745 470 34 -1795 -2410 -998 143 -863 -1947 -2236
2686 -2236 -851 52 -1270 -1992 -1843 -280 -582 -1475 -1922 -1271 -234 -848 -1119 -1120 -631 -262 -435 -1108 -529
2705 -529 -166 -227 -275 -418 -70 77 -311 226 114 -12 -50 -187 191 575 -95 -312 -241 -123 210 -403 -616
2726 -616 -422 103 -358 -524 -599 -437 68 -476 -351 -714 -465 -351 -495 -578 -621 -577 -335 -321 -676 -898 -820 -175
2748 -175 92 -408 -875 -674 514 238 -501 -1273 -369 530 170 -926 -1565 42 730 -45 -1348 -1056 458
2767 458 978 -499 -1912 -840 778 830 -624 -1978 -476 1351 875 -1147 -1608 100 1770 777 -1087
2784 -1087 -1053 555 1887 -49 -1161 -841 856 1810 120 -1102 -685 1171 1208 424 -1157 -595 1239
2801 1239 1220 -164 -1697 -297 1247 1163 -653 -1840 -656 1607 1361 -1206 -1711 -111 1925 1097 -1553
$$ packed form
2669G11j323p44R34O19M05j804o17J074J215m36j829o15J412J141j006j084k89
2686b236J385R03j322p22J49J563l02q93m47O51J037o14k71jM89L69j73o73N79
2705e29L63o1m8j43L48J47l88N37j12j26l8j37L78L84o70k17P1J18L33o13k13
2726f16J94N25m61j66p5J62N05n44J25l63K49J14j44q3m3M4K42J4l55k22P8O45
2748a75K67n00m67K01J188k76p39p72R04Q99l60j096o39J607O88p75j303K92J514
2767D58N20j477j413J072J618N2j454j354J502J827m76k022m61J708J670r93j864
2784a087L4J608J332j936j112L20J697R54j690j222M17J856L7p84j581N62J834
2801A239j9j384j533J400J544q4j816j187J184K263k46k567n05J600K036q28k650
$$ plain form
2818 -1553 -2069 364 2405 573 -2172 -1440 1116 2028 248 -2011 -1089 1924 2209 -438 -2152 -488
2834 -488 2390 2174 -599 -1895 287 2659 1886 -1353 -1844 734 2539 1523 -1452 -1626 1104 2786
2850 2786 717 -1773 -1350 1478 2665 226 -1714 -1026 1936 2677 285 -2134 -641 2417 2638 -114
2866 -114 -2156 -186 2924 2883 -735 -2189 542 3302 2257 -1380 -2134 924 3770 1841 -2130 -2050
2882 -2050 1547 3796 612 -2529 -1551 2247 3155 -246 -2712 -953 3004 2641 -708 -2832 -250 3297
2898 3297 2418 -1098 -2416 754 3259 2167 -1422 -1715 1614 3588 1775 -1600 -1255 1897 3817 1764
2914 1764 -1575 -509 2456 4029 942 -1859 -610 2620 3452 251 -2271 -723 2935 3048 -737
2929 -737 -3148 -419 2941 2204 -1870 -3197 43 3164 1419 -2554 -2928 1031 3174 402 -2801 -1859
$$ packed form
2818a553n16K433K041j832k745P32K556R12j780k259R22L013K85k647j714J664
2834d88K878k16k773j296K182K372p73l239m91K578J805j016k975j74K730J682
2850B786k069k490M23K828J187k439j940O88K962P41k392k419J493L058K21k752
2866a14k042J970L110m1l618j454K731K760j045l637p54L058K846j929l971Q0
2882b050L597K249l184l141R78L798R08l401k466J759L957l63l349k124K582L547
2898C297q79l516j318L170K505j092l589k93L329J974j813l375L45L152J920k053
2914A764l339J066K965J573l087k801J249L230Q32l201k522J548L658J13l785
2929g37k411K729L360p37m074j327L240L121j745l973l74L959K143k772l203R42
$$ plain form
2945 -1859 1682 3345 355 -2591 -827 2914 3632 -118 -1968 -34 3487 3312 -134 -1725 995
2960 995 4102 3032 -460 -1678 1576 3977 2548 -1171 -1713 1955 3952 1699 -1822 -1360 2040 3411
2976 3411 759 -2579 -1393 1835 3106 5 -2925 -1224 2265 2766 -808 -2832 -426 2795 2179
2991 2179 -1229 -2740 -51 3171 2078 -1680 -2535 1264 3704 1431 -2300 -1544 2170 3536 1201
3006 1201 -2163 -707 2329 3236 118 -2152 -320 2491 2736 -537 -2169 -268 2811 2037 -1047 -2031
3022 -2031 170 2776 1668 -1062 -1784 217 2683 1268 -1784 -1925 1188 2943 970 -2167 -1500 1706
3038 1706 3030 680 -2062 -565 2415 3037 328 -1979 -115 2935 2891 -693 -1932 312 2816 1922
3054 1922 -1207 -2011 549 2845 845 -1947 -2175 994 2213 262 -2300 -1896 846 1481 -262 -2557
$$ packed form
2945a859L541J663k990k946J764L741P18l750j850J934L521j75l446j591K720
2960I95L107j070l492j218L254K401j429l719n42L668J997k253l521M62L400J371
2976C411k652l338J186L228J271l101k930J701L489N01l574k024K406L221o16
2991B179l408j511K689L222j093l758q55L799K440k273l731P56L714J366k335
3006A201l364J456L036R07l118k270J832K811K45l273j632J901L079p74l084r84
3022b031K201K606j108k730p22K001K466j415l052j41L113J755j973l137O67L206
3038A706J324k350k742J497K980O22k709k307J864L050m4l584j239K244K504q94
3054A922l129q04K560K296k000k792k28L169J219j951k562M04K742O35j743k295
$$ plain form
3070 -2557 -1747 848 1009 -832 -2348 -875 1257 995 -1030 -2192 -222 1536 1357 -788 -1419 177
3086 177 2029 1231 -880 -1051 689 2175 1083 -851 -1168 1282 2355 625 -1143 -847 1481 2022
3102 2022 105 -1410 -413 1544 1856 -567 -1883 -491 1322 1068 -1418 -2134 -493 1228 5 -1713
3118 -1713 -1762 -67 1105 -163 -1739 -1262 365 1043 -346 -1462 -1074 675 592 -417 -1291 -552 538
3135 538 584 -304 -1077 -434 486 734 -330 -780 -3 913 681 -535 -1070 -154 802 392 -966 -1023 -133 663
3155 663 -125 -957 -847 232 931 -74 -974 -662 803 562 -407 -1006 -272 485 29 -776 -773 -9 420 75
3175 75 -839 -412 90 176 -66 -371 -283 -135 290 122 -301 -82 -244 -219 -241 -329 -111 -201 -427 -385 -76 -404 -398
3198 -398 -429 -296 -489 -332 -526 -332 -181 -243 -181 -365 149 -12 -426 -124 -241 138 69 -28 -436 -99 -174 41
$$ packed form
3070b557Q10K595J61j841j516J473K132k62k025j162J970J758j79k145o31J596
3086A77J852p98k111j71J740J486j092j934l17K450J073j730j768K96K328N41
3102B022j917j515R97J957L12k423j316J392J813k54k486p16J641J721j223j718
3118a713m9J695J172j268j576M77J627O78j389j116L88J749q3j009q74P39J090
3135E38M6q88p73O43R20K48j064m50P77R16k32j216n35R16R56m10j358n7Q90P96
3155F63p88q32J10J079O99j005r00L12J465k41r69n99P34P57m56q05LP64M29l45
3175G5r14M27N02Q6k42l05Q8J48M25j68m23K19j62K5k2q8K18r0k26M2L09l28O
3198c98l1J33j93J57j94J94J51o2O2j84N14j61m14L02j17L79o9r7m08L37p5K15
$$ plain form
3220 41 -67 -365 -188 -242 204 -50 -119 -395 -49 506 100 -431 -661 53 269 126 -859 -523 -90 38 -501
3241 -501 -1260 -717 -11 523 -750 -1252 -371 595 541 -807 -657 -29 1261 320 -1075 -696 1006 1289 -165
3260 -165 -556 -471 946 1209 230 -608 -16 1192 1119 -20 -721 -83 1004 843 -328 -904 -185 604 874
3279 874 -726 -1335 -267 848 655 -1096 -1348 -190 1152 488 -1013 -1348 226 1461 201 -1147
3295 -1147 -1154 901 1613 96 -1564 -673 1598 1299 -369 -1764 -293 1862 1339 -556 -1431 410 2041
3312 2041 1138 -1226 -1272 443 1729 420 -1657 -1117 789 1538 68 -1483 -807 1115 1555 -284 -1309
3329 -1309 -522 1440 1375 -103 -1449 -57 1750 1200 -95 -1385 31 1923 1608 -384 -1240 697
3345 697 2409 1437 -656 -966 1199 2655 1260 -1308 -1028 1355 2512 233 -1829 -1132 1794 1901
$$ packed form
3220D1j08k98J77n4M46k54o9k76L46N55m06n31k30P14K16j43r85L36M33J28n39
3241e01p59N43P06N34j273n02Q81R66n4j348J50O28J290r41j395L79J702K83j454
3260a65l91Q5J417K63r79q38N92J208p3j139p01O38J087j61j171n76P19P89K70
3279H74j600o09J068J115j93j751k52J158J342o64j501l35J574J235j260j348
3295a147pK055P12j517j660Q91K271k99j668j395J471K155n23j895q75J841J631
3312B041r03k364m6J715J286j309k077N40J906P49j470j551O76J922M40j839j025
3329a309P87J962o5j478j346J392J807n50j295j290J416J892l15j992q56J937
3345F97J712r72k093l10K165J456j395k568K80K383J157k279k062O97K926J07
$$ plain form
3361 1901 -834 -2260 -918 1825 1783 -604 -2021 9 2128 1273 -1375 -1764 369 2014 741 -1840
3377 -1840 -1718 805 2168 441 -1956 -1055 1553 2583 550 -1046 -119 2093 2763 657 -1142 -42
3393 -42 2520 2615 162 -1231 28 2566 2143 -310 -1602 487 2696 1787 -894 -1605 1037 2575 1268
3410 1268 -1670 -1410 1186 2406 299 -2399 -1398 1207 2217 -409 -2372 -695 2240 2212 -634 -1616
3426 -1616 134 2586 2210 -521 -1302 752 2882 1723 -975 -1704 1060 2528 1364 -1043 -1442 1455
3442 1455 2495 846 -1418 -694 1463 2405 331 -1544 -613 1582 1987 -705 -2192 -873 1372 1546
3458 1546 -1078 -2255 -345 2052 1521 -1047 -1875 939 2836 1665 -915 -1423 1385 3160 1177 -1460
3474 -1460 -854 1877 2881 635 -1725 -308 2450 2903 -9 -1633 386 2682 2604 -305 -1462 275
$$ packed form
3361A901k735j426J342K743m2k387j417K030K119q55k648l89K133J645j273k581
3377a840J22K523J363j727k397R01K608J030k033j596R27K212O70k106j799J100
3393d2K562R5k453j393J259K538m23k453j292K089K209r09k681p11K642J538j307
3410A268k938K60K596J220k107k698J001K605J010k626j963J677K935k8k846r82
3426a616J750K452l76k731p81K054K130j159k698p29K764J468j164k407l99K897
3442A455J040j649k264P24K157R42k074j875R31K195M05k692j487J319K245J74
3458A546k624j177J910K397n31k568q28K814J897j171k580n08K808J775j983k637
3474a460O06K731J004k246k360J417K758M53k912j624K019K296p8k909j157J737
$$ plain form
3490 275 2202 1263 -1355 -1818 -32 1906 235 -1672 -1875 149 1594 315 -1647 -1597 869 1822 206
3507 206 -1628 -1038 1256 1719 -205 -1506 -601 1122 1807 -454 -1624 -252 2057 2077 -213 -1207 339
3524 339 2649 1971 -437 -956 1060 2778 1150 -1181 -1280 1006 1933 25 -2053 -1307 1071 1200 -495
3541 -495 -2094 -1019 1382 1011 -902 -1803 -466 1166 678 -1175 -2026 -446 993 333 -1615 -1352 -85
3558 -85 1053 395 -972 -1006 856 1698 486 -568 -789 1136 1812 510 -1189 -639 1083 1393 46
3575 46 -1495 -431 1105 1302 -428 -1403 -233 1271 815 -834 -1214 -36 1391 203 -1461 -1601 -148
3592 -148 818 -521 -1903 -1445 215 468 -715 -1647 -799 654 571 -733 -892 -397 794 363 -485 -1056
3610 -1056 -265 361 270 -776 -790 -205 260 -86 -925 -729 -63 439 353 -607 -639 -185 623 224 -1035 -1034 247
$$ packed form
3490B75J927r39k618m63J786J938j671j907k03K024J445j279j962N0K466R53j616
3507B06j834N90K294M63j924j301R05J723O85k261j170J372K309K0k290r94J546
3524C39K310o78k408n19K016J718j628k331r9K286R27j908k078P46K378J29j695
3541d95j599J075K401l71j913r01J337J632m88j853q51J580J439o60j948K63J267
3558h5J138o58j367l4J862Q42j212j054k21J925O76j302j699N50J722L10j347
3575D6j541J064J536J97j730r75J170J504m56j649l80J178J427j188j664j40J453
3592a48R66j339j382M58J660K53j183r32Q48J453q3j304j59M95J191m31q48n71
3610a056P91O26r1j046j4N85M65l46q39J96O66N02q6r60l2M54Q08l99j259JJ281
$$ plain form
3631 247 314 -289 -836 -572 378 405 -336 -949 -230 811 716 -506 -698 248 692 393 -579 -607 62 358 21
3652 21 -945 -446 5 135 -277 -654 -247 50 -83 -740 -693 -335 -46 -363 -608 -648 -239 -433 -430 -688 -432 -675
3674 -675 -725 -461 -488 -301 -370 -387 -240 -234 -96 -281 -298 -107 220 -162 -19 4 76 18 104 -87 223 -14 295 17
3698 17 96 176 -27 233 24 40 -159 -2 -191 221 -395 -436 -484 -57 -344 -781 -600 -54 -132 -737 -1023 -351
3720 -351 -121 -192 -658 -873 -507 163 282 -615 -517 -60 436 -93 -578 -336 517 756 -229 -568 -468 685
3740 685 676 -113 -621 -17 475 600 -186 -653 -46 667 320 -568 -666 -126 493 77 -726 -843 -94 334 52
3761 52 -1081 -946 -76 520 -44 -1013 -620 597 989 102 -1004 -496 824 1128 87 -936 -75 1077
3779 1077 920 -575 -1220 307 1254 913 -513 -623 510 1372 209 -1083 -703 464 1230 -54 -1192
$$ packed form
3631B47O7o03n47K64R50K7p41o13P19J041r5j222j92R46M44k99r72k8O69K96l37
3652B1r66M99M51J30m12l77M07K97j33o57M7L58K89l17k45m0M09j94Lk58K56k43
3674f75n0K64k7J87o9j7J47OJ38j85j7J91L27l82J43K3P2n8Q6j91L10k37L09k78
3698A7P9Q0k03K60k09J6j99J57j89M12o16m1m8M27k87m37J81N46p8o05k86O72
3720c51K30p1m66k15L66O70J19q97R8M57M96n29m85K42Q53K39r85l39J00J153
3740F85rp89n08O04M92J25p86m67O07P13l47q88r8N40O19m16q03j17P49M28k82
3761E2j133J35Q70N96n64r69L93J217L92q87j106N08J320L04j041j023Q61J152
3779A077j57j495o45J527R47l41j426j10J133Q62j163j292L80J167P66j284j138
$$ plain form
3796 -1192 -720 729 1035 -518 -1402 -599 629 556 -478 -1213 -208 1162 555 -435 -867 195 1239
3813 1239 863 -862 -885 581 1125 587 -992 -763 411 1525 459 -1126 -759 833 1668 317 -854
3830 -854 -555 1373 1552 -296 -1500 -533 1463 951 -978 -1646 -342 1437 585 -1048 -1455 357 1369
3847 1369 455 -1191 -973 1074 1695 206 -1406 -598 1266 1659 -41 -1175 -450 1306 1288 -296 -912
3864 -912 109 1772 1830 32 -669 477 2067 1432 -449 -1004 405 1666 963 -1184 -1538 516 1107
3881 1107 252 -1828 -1177 506 1436 21 -1668 -905 1132 1497 -442 -2004 -803 1237 1002 -892
3897 -892 -2069 -605 1642 813 -1338 -1464 701 2187 1045 -562 -1053 1350 2394 1024 -1018 -572
3913 -572 1563 1982 426 -1241 -585 936 1514 -383 -1347 -405 1357 1456 -406 -1215 -258 1727 1024 -997
$$ packed form
3796a192M72J449L06j553q84Q03J228p3j034p35J005J370o07r90m32J062J044
3813A239l76j725k3J466N44n38j579K29J174J114j066j585L67J592Q35j351j171
3830h54K99J928J79j848j204R67J996n12j929o68J304J779q52j633m07J812J012
3847A369r14j646K18K047O21j489j612Q08J864L93j700j134P25J756j8j584o16
3864i12J021J663N8j798p01J146J590o35j881n55J409J261p03k147l54K054N91
3881A107q55k080O51J683R30j415j689P63K037L65j939j562J201K040k35j894
3897h92j177J464K247q29k151j26K165J486j142j607m91K403J044j370k042M46
3913e72K135M19j556j667O56J521N78j897r64R42J762R9j862q09R57J985p03k021
$$ plain form
3931 -997 -1365 -392 1292 215 -1701 -1740 -110 1189 79 -1747 -1561 610 1680 457 -1449 -846 1339
3948 1339 2086 155 -1385 -188 1587 1773 -277 -1601 -78 1755 1315 -1067 -1494 1 1883 688
3964 688 -1416 -1162 525 1669 131 -1295 -1045 363 964 -561 -2108 -1497 305 454 -1096 -1944 -1231
3981 -1231 368 533 -719 -1828 -943 1021 1049 -479 -1309 -409 1227 858 -893 -1328 2 1460 508
3998 508 -1025 -955 480 1739 565 -1129 -808 1228 1300 11 -1218 -639 1187 1274 -581 -1854 -610
4015 -610 401 669 -1147 -2057 -455 610 155 -1327 -1698 -28 991 144 -1158 -1187 -376 959 -172
4032 -172 -1344 -1173 227 427 -536 -1378 -750 691 819 -277 -1159 -334 678 731 -38 -933 -152 857
4050 857 699 -566 -1141 -391 691 253 -1109 -1263 -174 806 -150 -1391 -890 248 824 -71 -1377 -1047
$$ packed form
3931i97l68R73J684j077j916l9J630J299j110j826J86K171J070j223j906O03K185
3948A339P47j931j540J197J775J86k050j324J523J833m40k382m27J495J882j195
3964F88k104K54J687J144j538j426K50J408O01j525j547O11J802J49j550q48P13
3981a231J599J65j252j109Q85J964K8j528q30R00J636l69j751m35J330J458r52
3998E08j533P0J435J259j174j694L21K036P2j289j229N79J826Q7j855j273J244
4015f10J011K68j816r10J602J065m55j482l71J670J019q47j302k9Q11J335j131
4032a72j172J71J400K00r63q42O28J441J28j096q82Q25J012N3p69q95P81J009
4050H57j58j265n75P50J082m38j362j54J089R80r56j241N01J138N76q95j306L30
$$ plain form
4068 -1047 565 473 -658 -1458 -679 616 186 -851 -1334 -411 467 -41 -869 -734 -117 430 199 -811
4086 -811 -480 314 666 -60 -1000 -759 9 444 -154 -870 -792 -272 301 -400 -925 -514 27 355 -337 -819
4106 -819 -421 363 196 -676 -956 -445 300 -140 -691 -922 -222 258 14 -605 -431 -73 514 -352 -933 -259
4126 -259 272 517 -269 -724 -273 -109 17 -476 -793 -589 16 -259 -518 -509 -295 -115 -486 -415 -475 -288 -127
4147 -127 -372 -320 -420 -214 -546 -443 -350 -259 -324 2 -218 -436 -17 63 244 86 177 -79 350 236 389 55
4169 55 17 188 186 -25 -73 -34 48 155 39 62 5 -92 -176 -75 37 -18 -227 -292 -335 -65 -489 -771 -505 -237 -158
4194 -158 -759 -879 -502 -82 -120 -490 -885 53 212 -108 -587 -403 158 254 -275 -450 -286 544 398 62 -369
4215 -369 368 598 482 51 -230 310 564 593 -114 -21 230 590 551 -138 6 454 763 48 47 -295 498 530
$$ packed form
4068a047J612r2j131q00P79J295m30j037m83R23Q78n08q28J35O17N47k31j010
4086h11L31P94L52p26r40K41P68M35n98p16P8N20N73p01n25M11N41L28o92m82
4106h19L98P84j67q72k80N11P45m40n51k31P00M80k44o19J74L58N87q66n81O74
4126b59N31K45p86m55M51J64J26m93l17K04O05k75k59RK14J80l71P1o0J87J61
4147a27k45N2j00K06l32J03R3R1o5L26k20k18M19Q0J81j58R1k56M29j14J53l34
4169E5l8J71kk11m8L9Q2J07j16K3n7r7q4J01J12n5k09o5m3K70m24k82K66K68P9
4194a58o01j20L77M20l8l70l95R38J59l20m79J84N61R6n29j75J64Q30j46l36m31
4215c69P37K30j16m31k81N40K54K9p07R3K51L60l9o89J44M48L09p15jl42P93L2
$$ plain form
4237 530 66 -369 -494 643 464 -183 -383 -405 670 797 77 -697 -23 876 661 -526 -612 173 792 666
4257 666 -668 -817 360 1039 71 -941 -459 572 996 -113 -747 -111 909 728 -165 -651 -138 658
4275 658 544 -390 -947 337 943 430 -700 -714 591 1056 511 -509 -463 653 1195 592 -556 256 976
4294 976 1181 665 -355 -182 816 1352 -61 -819 -319 1266 937 -309 -748 298 1392 1004 -355 -1054
4312 -1054 309 1474 715 -736 -971 254 1067 -3 -1289 -777 264 986 5 -1475 -573 1192 1078
4329 1078 -340 -1093 -30 1487 1162 -609 -583 451 1260 642 -765 -777 559 1422 857 -196 -547 575
4347 575 1489 799 -313 -497 829 1396 309 -1089 -574 611 986 -432 -1280 -824 479 1059 -762
4364 -762 -1336 -621 1104 767 -1069 -1413 -250 1091 243 -1229 -1332 108 1168 273 -1296 -1171 669
$$ packed form
4237E30m64m35j25J137j79o47k00k2J075J27p20p74O74Q99k15j187q6P85O19j26
4257F66j334j49J177O79r68j012M82J031M24j109o34O36J020j81q93m86N13P96
4275F58j14r34n57J284O06n13j130j4J305M65n45j020M6J116N42o03j148Q12P20
4294I76K05n16j020J73R98N36j413p58N00J585l29j246m39J046J094l88j359o99
4312a054J363J165p59j451k35J225Q13j070j286N12J041P22r81j480R02J765j14
4329A078j418p53J063J517l25j771K6J034Q09o18j407j2J336Q63n65j053l51J122
4347E75R14o90j112j84J326N67j087j398N15J185L75j418q48M56J303N80j821
4364g62n74P15J725l37j836l44J163J341q48j472j03J440J060q95j569J25J840
$$ plain form
4381 669 1101 79 -1489 -375 1206 1743 47 -793 -84 1426 1290 -266 -856 -93 1229 756 -806
4398 -806 -1188 -169 1154 359 -1037 -1139 40 1000 128 -930 -1182 248 905 -97 -1510 -1232 296
4415 296 805 -440 -1652 -737 684 711 -535 -1364 -659 825 879 -502 -1223 45 1533 755 -803 -1124
4433 -1124 397 1518 399 -985 -1030 531 1268 -137 -1093 -832 847 1039 -175 -1428 -385 907
4449 907 840 -685 -1466 -459 705 410 -795 -1261 -412 663 174 -1132 -1329 -304 824 398 -867
4466 -867 -1148 253 1079 334 -879 -795 428 1077 232 -962 -866 676 1023 127 -1284 -512 1154 743
4484 743 -412 -1195 127 1098 666 -765 -931 15 924 279 -1123 -1263 253 613 -471 -1317 -1150 294
4502 294 374 -529 -1207 -613 678 614 -631 -1211 -418 469 137 -293 -956 -310 378 339 -564 -901 61 507
$$ packed form
4381F69M32j022j568J114J581N37j696q40P09J510j36j556n90P63J322m73j562
4398h06l82J019J323p95j396j02J179R60q72j058k52J430O57j002j413K78J528
4415B96N09j245j212R15J421K7j246q29P05J484N4j381p21J268J488p78j558l21
4433a124J521J121j119j384m5J561P37j405r56K61J679J92j214j253J043J292
4449I07o7j525p81J007J164k95j205m66Q49J075m89j306j97J025J128m26j265
4466h67k81J401Q26p45j213Q4J223O49q45j194R6J542L47q96j411P72J666m11
4484G43j155p83J322R71m32j431j66R46R09o45j402j40J516L60j084q46J67J444
4502B94Q0r03o78N94J291o4j245n80P93Q87l32m30o63O46O88l9r03l37R62M46
$$ plain form
4522 507 347 -327 -509 370 672 245 -525 -528 174 758 295 -742 -573 550 584 21 -967 -420 491 612
4542 612 -88 -878 -256 769 771 -590 -776 76 699 135 -589 -785 -1 518 72 -860 -662 229 262 -375
4562 -375 -922 -297 53 348 -142 -897 -459 38 331 -456 -545 -152 123 25 -435 -689 -321 153 13 -370 -384
4583 -384 -114 102 228 -301 -357 146 544 367 -270 -257 183 592 180 -373 85 493 485 -6 -123 78 527
4604 527 297 41 -143 53 545 318 -270 -69 496 194 27 -190 219 47 100 -14 -176 183 47 59 -369
4625 -369 -174 85 -169 -48 -176 -106 -98 72 -201 -58 -7 -312 -235 261 72 67 -82 185 236 -35 -84 149 159
4648 159 139 65 76 -173 170 393 310 9 362 334 35 68 199 76 103 107 248 430 152 12 -179 99 296
4671 296 -42 -177 403 361 -1 11 -21 470 517 -278 -30 -58 526 391 -43 -93 154 639 189 -46 92 257
$$ packed form
4522E07j60o74j82Q79L02m27p70lP02N84m63j037J69J123L4n63r88N47R11J21
4542F12p00p90O22J025Kj361j86Q52O23n64p24j96P84N19m46r32J98Q91L3o37
4562c75n47O25L50K95m90p55M38M97K93p87q9L93K75r8m60k54L68M74j40l83j4
4583c84K70K16J26n29n6N03L98j77o37J3M40M09m12n53M58M08qm91j17K01M49
4604E27k30k56j84J96M92k27n88K01N65l02j67k17M09j72N3j14j62L59j36J2m28
4625c69J95K59k54J21j28P0QJ70k73J43N1l05P7M96j89nj49K67N1k71m9K33J0
4648A59k0p4J1k49L43K23q3l01L53k8k99L3J31j23K7MJ41J82k78j40j91K78J97
4671B96l38j35N80m2l62J2l2M91M7p95K48k8N84j35m34n0K47M85m50k35J38J65
$$ plain form
4693 257 448 356 -148 -211 455 425 200 -47 67 373 523 -84 -268 -53 430 309 22 -68 174 458 604
4714 604 169 28 165 979 598 -109 -182 334 501 311 -42 -121 327 515 168 -404 11 454 736 402 -231
4735 -231 -132 663 686 36 -753 -177 688 561 -203 -629 179 773 230 -211 -631 226 861 363 -229 -222 337
4756 337 628 252 -613 -125 412 738 406 -651 -95 843 855 544 -392 -12 1001 1031 51 -262 51 970
4776 970 866 3 -588 105 1028 545 -468 -565 272 912 537 -587 -503 536 1014 64 -828 -461 834
4795 834 725 -100 -1026 -478 719 574 -520 -1012 -53 870 715 -622 -677 205 911 275 -436 -684 447
4814 447 1051 68 -284 -544 569 914 247 -591 -183 734 1091 157 -500 -110 867 916 170 -784 -292 869
4834 869 714 -371 -926 144 647 585 -505 -960 -4 1014 110 -712 -814 236 583 -23 -1026 -1042 422
$$ packed form
4693B57J91r2n04o3O66l0k25k47J14L06J50o07j84K15M83j21k87r0K42K84J46
4714F04m35j41J37Q14l81p07p3N16J67j90l53p9M48J88l47n72M15M43K82l34o33
4735b31R9P95K3o50p89N76Q65j27p64m26Q08N94n43m41m20Q57O35m98n92PN59
4756C37K91l76q65M88N37L26l32j057N56R38J2l11r36L80J013L0r80l13L13R19
4776I70j04q63n91O93R23m83j013r7Q37O40l75j124Q4J039M78r50q92L67J295
4795H34j09q25r26N48J197j45j094m92R59R23j55j337n5Q82P06o36p11k48J131
4814D47O04r83l52k60J113L45o67q38M08R17L57r34o57L90R77M9p46r54M92J161
4834H69j55j085n55J070N03o2j090m55R56J018r04q22j02J050L47o06j003j6J464
$$ plain form
4853 422 888 -97 -1139 -387 943 557 -491 -1190 -199 961 534 -323 -999 86 1142 365 -552 -658
4871 -658 192 904 325 -604 -835 440 685 -61 -666 -520 482 644 -164 -1106 -471 341 610 -306 -921
4890 -921 -416 400 440 -461 -1088 -470 598 456 -722 -1096 245 790 678 -747 -584 585 1306 228
4908 228 -826 -508 746 1362 71 -662 -410 948 896 -69 -570 -243 1110 905 -460 -675 -67 662
4926 662 587 -630 -924 -183 456 178 -735 -823 -67 384 351 -770 -658 -8 620 -205 -942 -760 163 820
4946 820 -351 -968 -345 419 626 -127 -1055 -458 499 522 -139 -990 -313 935 489 -520 -816 322 895
4965 895 252 -656 -707 89 742 11 -838 -396 545 684 -184 -841 -331 627 556 -348 -454 -298 645 350 -436
4986 -436 -750 29 329 80 -538 -804 262 229 163 -458 -321 -48 662 73 -569 -552 197 430 -159 -628 -419
$$ packed form
4853D22M66r85j042P52J330l86j048o99R91J160m27q57o76J085J056p77r17j06
4871f58Q50P12n79r29k31J275K45p46o05J46J002J62q08r42O35Q12K69r16o15
4890i21N05Q16M0r01o27O18J068j42j178l74J341N45j12j425J63J169P21j078
4908B28j054L18J254O16j291p33K52J358n2r65n01L27J353k05j365k15O08P29
4926F62p5j217k94P41O39k78r13q8P56M51l3j121J12O50O28q25p37J82R23O57
4946H20j171o17O23P64K07p53r28N97R57K3o61q51O77J248m46j009k96J138N73
4965H95o43r08n1P96O53p31q49M42R41J39q68o57N10R58p1r04j06J56R43k95p86
4986d36l14P79L00k49o18k66J066l3o6o21J37K73P10n89o42J7P49K33n89m69K09
$$ plain form
5007 -419 384 505 -184 -807 -472 425 485 -410 -704 -11 545 529 -511 -883 72 243 124 -627 -737 154
5027 154 552 -23 -720 -405 86 492 -257 -690 -78 323 246 132 -546 -54 364 234 -305 -273 10 543 -62
5048 -62 -250 -588 32 499 -66 -136 -433 179 401 425 -186 -31 201 157 -16 -365 -225 296 293 -173 -362 -237
5070 -237 287 449 -254 -339 -52 521 466 -216 -317 35 47 98 -175 37 313 158 -219 -57 -117 206 449 -113
5092 -113 89 174 472 182 52 -199 77 381 290 -17 179 62 195 120 -18 75 -229 64 147 -148 172 -136
5114 -136 -127 4 -20 -95 104 160 52 -128 -82 92 109 132 -141 -88 53 16 95 57 83 23 62 26 -163 139 269
5139 269 -21 -58 169 238 116 -92 186 168 190 -129 -56 110 415 255 270 31 315 309 12 -67 177 369 -57
5162 -57 -90 -199 58 429 42 -275 -155 203 134 87 -162 -206 96 224 -103 -345 -14 321 110 -222 -403 -10
$$ packed form
5007d19Q03J21o89o23L35Q97O0q95k94O93N56j6j040l72R55J71j19p51j10Q91
5027A54L98n75o97L15M91M06p49m33O12M01p7j14o78M92M18j30n39L2K83N33o05
5048f2j88l38O20M67n65p0k97O12K22K4o11J55K32m4j73l49J40N21lm66j89J25
5070b37N24J62p03q5K87N73n5o82j01L52J2N1k73K12K76j55l77J62o0L23K43n62
5092a13K02Q5K98k90j30k51K76L04r1l07J96j17J33p5j38R3l04K93Q3k95L20l08
5114a36RJ31k4p5J99N6j08j80M6J74J7K3k73N3J41l7P9l8K6o0L9l6j89L02J30
5139B69k90l7K27O9j22k08K78j8K2l19P3J66L05j60J5k39K84ok97p9K44J92m26
5162e7l3j09K57L71l87l17J20L58o9m7k49m4L02J28l27k42L31L35k11l32j81L93
$$ plain form
5184 -10 125 78 -154 -227 279 214 229 -189 -298 384 414 265 -53 -4 234 522 463 -413 172 300 597 113 -152
5207 -152 -3 654 531 -246 -255 -180 533 527 58 -550 4 560 361 -101 -248 490 748 304 -134 -318 503 551
5229 551 36 -144 205 542 311 -227 -657 -84 514 369 -107 -421 169 644 228 -169 -451 -172 414 145
5249 145 -259 -531 29 403 168 -321 -556 -34 490 527 -455 -272 494 653 238 -793 -137 668 577 12
5269 12 -560 -85 637 432 -423 -461 -93 663 94 -461 -512 340 723 251 -804 -23 457 543 215 -619 -153
5290 -153 588 688 -183 -791 -214 768 498 -129 -488 196 574 654 -191 -346 -99 769 239 -326 -440 -204
5310 -204 412 184 -547 -537 24 803 425 -847 -694 305 522 -192 -534 -412 273 436 14 -762 -266 743
5330 743 429 -73 -988 -450 688 330 -592 -689 145 783 206 -550 -521 371 866 233 -566 -369 363 795
$$ packed form
5184a0J35m7k32p3N06o5J5m18j09O82L0j49l18M9K38K88n9q76N85J28K97m84k65
5207a52J49O57j23p77rP5P13om69o08N54N56j99m62j47P38K58m44m38j84Q21M8
5229E51n15j80L49L37k31n38m30N73N98j45m76l14N90M75m16l97k82K79N86k69
5249A45m04k72N60L74k35m89k35N22N24L7r82J83P66J59m15j031O56Q05r1n65
5269A2n72M75P22k05q55l8L68P56n69n55n1Q52L83m72j055P81M80Q6l28q34M66
5290a53P41J00q71o08N77R82k70o27l59O84L78Q0q45j55K47Q68n30n65j14K36
5310b04O16k28p31J0N61P79l78j272J53R99K17p14l42J22O85J63m22p76M96J009
5330G43l14n02r15N38J138l58r22r7Q34O38n77p56K9Q92M95o33p99J97P32M32
$$ plain form
5350 795 32 -514 -231 446 670 -134 -678 -338 400 591 -247 -652 -349 417 430 -258 -519 -199 465 219
5370 219 -882 -559 -97 488 134 -825 -633 190 701 236 -751 -539 661 851 60 -611 -179 643 697 -483
5390 -483 -933 37 729 261 -496 -747 137 809 336 -430 -544 278 530 187 -514 -533 249 125 -253 -820
5410 -820 -507 332 416 -213 -907 -579 219 674 -377 -627 -228 321 358 -423 -860 -168 560 264 -444 -770
5430 -770 115 430 359 -546 -691 217 570 359 -526 -332 342 946 14 -387 -359 443 660 -85 -773 -380 488
5451 488 379 -408 -990 159 392 167 -448 -572 2 60 -179 -571 -653 5 348 -72 -631 -671 -79 319 -247
5472 -247 -397 -322 388 162 90 -558 -196 260 544 27 -396 -272 264 483 -324 -478 -72 523 244 -210 -472
5493 -472 -61 478 121 -380 -626 162 458 233 -162 -285 170 564 -223 -758 -229 293 78 -256 -460 -184
$$ packed form
5350G95p63n46K83O77K24q04n44L40P38J91q38m05L03P66J3o88k61L20O64k46
5370B19j101L23M62N85l54r59J92Q23N11m65r87K12J200J90p91o71M32Q22N4j180
5390d83m50R70O92m68p57k51Q84O72m73p66j14Q22K52l43p01j9P82j24l78n67
5410h20L13Q39Q4o29o94L28P98M55j051k50L99N49L7p81m37O92P28k96p08l26
5430g70Q85L15p1r05j45R08L53k11q85J94O74O04r32m01K8Q02K17p45o88L93Q68
5451D88j09p87n82J149K33k25o15j24N74N8k39l92q2O58L43m20n59m0N92L98n66
5472b47j50P5P10k26p2o48L62M56K84n17m23J24N36K19q07j54M06N95k79m54k62
5493d72M11N39l57n01k46P88K96k25l95j23M55L94p87n35N29N22k15l34k04K76
$$ plain form
5513 -184 180 257 -241 -72 86 642 67 -206 -353 160 357 171 -241 -121 236 330 4 -352 111 82 385
5534 385 77 -341 -220 -16 345 14 -81 -140 34 -18 -212 -207 -209 312 -35 -304 -398 -75 254 -102 -354 -515 208
5557 208 298 86 -249 -257 261 127 35 -144 -222 19 7 -135 -205 56 386 315 117 -71 25 351 189 152 115 242
5581 242 210 145 -104 -30 -39 -202 -1 282 9 288 -30 165 65 -194 226 166 64 -75 -106 90 -67 -71 -72 -56
5605 -56 -46 132 -180 -109 100 206 271 -115 -45 204 158 22 124 160 469 96 -45 128 218 4 -118 -50 -16
5628 -16 309 115 -201 10 124 -5 -83 -193 2 -11 -15 -259 -30 38 269 121 -51 -173 109 331 27 159
5650 159 -68 381 277 -141 -18 510 179 235 -4 58 235 91 245 -125 -80 32 248 250 0 -117 -107 218
5672 218 -79 68 -28 143 253 -162 -26 -20 104 430 7 -293 178 173 82 -186 -220 17 191 -50 -185 -129 -19
$$ packed form
5513a84L64P7m98J69J58N56n75k73j47N13J97j86m12J20L57R4l26l56M63k9L03
5534C85l08m18J21K04L61l31r5n9J74n2j94NkN21l47k69r4L23L29l56k52j61P23
5557B08R0k12l35qN18j34r2j79p8K41j2j42p0K61L30p1j98j88R6L26j62l7l7J27
5581B42l2o5k49P4rj63K01K83k73K79l18J95j00k59M20o0j02j39l1J96j57mjJ6
5605e6J0J78l12P1K09J06O5l86P0K49m6j36J02L6L09l73j41J73R0k14j22O8L4
5628a6L25j94l16K11J14j29p8j10J95j3mk44K29O8K31j48j72j22K82K22l04J32
5650A59k27M49j04m18J23N28l31N6k39O2J77j44J54l70M5J12K16Kk50j17J0L25
5672B18k97J47r6J71J10m15J36OJ24L26m23l00M71nr1k68l4K37J74k41j35N6J10
$$ plain form
5695 -19 224 77 -349 33 335 208 45 -492 -126 302 360 -133 -496 -89 272 293 -129 -260 20 633 164
5716 164 -220 -208 55 345 -79 -30 -217 354 605 242 -295 -107 -102 379 225 -435 -247 203 419 21 -483
5737 -483 -203 367 338 -81 -137 -216 260 425 -148 -80 53 515 254 -192 -424 151 591 112 -437 -448 274 488
5759 488 203 -240 -397 449 498 -170 -567 -136 298 302 -101 -593 -32 297 209 -302 -318 -164 390 115 -439 -251
5781 -251 356 600 332 -369 -408 128 519 -6 -566 -547 31 539 169 -563 -121 244 213 156 -590 -128 388
5802 388 263 -176 -313 55 627 256 -546 -823 -143 263 247 -485 -339 313 393 93 -257 -322 443 535 -103
5823 -103 -635 -139 550 620 -61 -599 -324 207 487 -343 -537 204 776 475 -320 -658 -206 269 341 -295 -489
5844 -489 57 534 -170 -563 -663 73 429 -80 -760 -746 -17 365 -134 -677 -191 399 603 -46 -814 -305
$$ packed form
5695a9K43j47m26L82L02j27j63n37L66M28N8m93l63M07L61K1m22j31K80O13m69
5716A64l84J2K63K90m24M9j87N71K51l63n37J88NM81j54o60J88M50K16l98n04
5737d83K80N70k9m19n6p9M76J65n73O8J33M62k61m46k32N75M40m79n49j1P22K14
5759D88k85m43j57Q46M9o68l97M31M34Mm03m92N61L29q8n11j6J54N54k75n54J88
5781b51O07K44k68p01l9N36L91n25n60J9N78N08l70p32M42L65l1n7p46M62N16
5802C88j25m39j37L68N72l71q02k77O80M06j6p32J46O52Q0l00l50o5P65R2o38
5823a03n32M96O89P0o81n38K75N31K80q30j94P41N72l01p95l38M52M75P2o36j94
5844d89N46M77p04l93j00P36L56n09o80J4P29L82m99n43M86N90K04o49p68N09
$$ plain form
5864 -305 460 175 -378 -829 84 517 396 -538 -503 110 464 -80 -367 -110 471 550 -11 -541 -133 517 389
5885 389 -212 -554 -315 328 452 -294 -524 -136 296 218 -344 -428 -127 578 209 -265 -637 -186 481 321 -532
5906 -532 -439 203 280 -5 -643 -385 35 610 -141 -460 -318 440 461 -179 -601 -432 506 350 -240 -582 -11
5927 -11 286 123 -461 -505 -82 319 -84 -602 -297 34 159 -100 -552 -315 103 411 103 -219 -461 189 153
5948 153 -190 -283 -256 318 150 -283 -141 -32 441 385 -109 -133 251 464 377 -221 -234 -53 445 393 -183 -464
5970 -464 59 326 -20 -361 -252 11 242 -162 -547 -350 308 160 -200 -465 -107 181 0 -245 -335 74
5990 74 356 85 -352 -325 -97 218 242 -268 -42 322 215 29 1 194 94 279 -83 -36 -192 193 93 95
6012 95 -47 89 67 209 68 -307 -70 385 378 53 -403 17 350 -56 -464 -235 240 385 -99 -335 -245 361
$$ packed form
5864c05P65k85n53m51R13M33j21r34L5O13L54n44k87K57N81P9n61n30M08O50j28
5885C89o01l42K39O43J24p46k30L88M32p8n62q4L01P05l69m74l72M51O67j60q53
5906e32R3O42P7k85o38K58M20N75p51l19J42P58K1o40m22J69R38j56n90l42N71
5927a1K97j63n84m4M23M01m03n18L05L31J25k59m52K37M18L08l08l22k42O50l6
5948A53l43r3K7N74j68m33J42J09M73n6m94k4L84K13q7n98j3J81M98n2n76k81
5970d64N23K67l46l41J09K63K31m04l85J97O58j48l60k65L58K88j81k45r0M09
5990G4K82k71m37K7K28L15K4n10K26L64j07j86k8J93j00J85l62M7j56L85j00K
6012I5j42J36k2J42j41l75K37M55pl25m56M20L33m06m08K29M75J45m84k36R0O06
$$ plain form
6034 361 168 113 -295 37 166 209 -24 -417 -35 263 225 -307 -114 67 148 88 152 102 65 423 77 -153 -122
6057 -122 -26 -79 77 -70 203 107 -145 315 -216 -39 -227 -20 154 -165 -101 55 208 97 -185 -63 302
6078 302 211 122 -367 111 102 214 -82 71 -92 217 -55 -196 101 165 2 -121 -94 83 62 -3 116 -81 188
6101 188 74 87 158 -23 32 -74 -49 -109 342 186 111 60 135 -9 179 -149 -276 -166 107 149 -279 128 142
6124 142 234 -158 -146 -26 7 26 -17 -129 28 183 154 111 -66 91 312 16 91 -64 -155 -50 56 -46 -11
6147 -11 -242 214 -135 -391 -82 -50 265 307 -113 36 -163 300 -223 -267 88 261 393 68 -235 -52 302
6168 302 213 92 -170 174 357 29 -450 92 208 375 -138 -318 29 306 -306 -249 -265 -73 477 209 -29
6189 -29 -216 28 256 125 -76 -150 139 394 -64 -251 -141 71 69 -134 -159 -27 26 237 69 -129 168 -57
$$ packed form
6034C61j93n5m08L32J29M3k33l93L82K98l8n32J93J81Q1o0O4n0l7L58l46k30L1
6057a22R6n3J56j47K73r6k52M60n31J77j88K07J74l19O4J56J53j11k82J22L65
6078C02r1q9m89M78rJ12k96J53j63L09k72j41K97O4j63j23K7J77k1o5J19j97K69
6101A88j14J3P1j81N5j06K5o0M51j56p5n1P5j44J88l28j27J10K73M2m28M07J4
6124A42R2l92J2J20L3J9m3j12J57J55k9m3j77J57K21k96P5j55r1J05J06j02L5
6147a1k31M56l49k56L09L2L15M2m20J49j99M63n23m4L55J73J32l25l03J83L54
6168C02q9j21k62L44J83l28m79N42J16J67n13j80L47K77o12N7j6J92N50k68k38
6189b9j87K44K28j31k01p4K89K55m58j87J10K12kk03k5J32N3K11j68j98K97k25
$$ plain form
6211 -57 252 95 -233 -191 88 180 -383 -140 -162 227 153 -402 -394 -134 462 -117 -329 -257 117 85 -187 -229 -77
6234 -77 109 133 -175 -528 113 276 287 12 -387 -21 25 331 -325 -263 149 359 178 -382 -45 -45 330 -32
6256 -32 -162 -243 26 244 -209 -221 -135 82 147 -85 -106 -133 187 105 -122 -448 -203 192 22 -316 -638 95 233
6279 233 318 -298 -428 58 583 105 -173 8 84 357 -68 -245 -83 298 431 23 -639 -251 330 477 -93
6300 -93 -247 -304 387 -40 -248 -284 34 259 -34 155 -388 -275 106 51 -300 -158 -107 227 -47 -364 -169 43
6322 43 379 132 -544 -95 266 157 9 -398 -210 -31 398 -65 -607 -196 514 312 -307 -304 -10 444 373
6343 373 -36 -358 246 439 72 -338 -156 108 304 -96 -309 -300 242 405 -287 -307 -157 139 40 7 -375 -88
6365 -88 355 202 -364 -508 -263 88 113 -221 -408 22 456 256 -182 -213 45 421 43 -195 23 159 347
$$ packed form
6211e7L09j57l28M2K79R2n63K43k2L89p4n55QK60N96n79k12P2L74l2k72m2J52
6234g7J86K4l08l53O41J63J1k75l99L66M6L06o56O2M12K10j81n60L37%L75l62
6256c2j30q1K69K18m53j2Q6K17O5k32k1k7L20q2k27l26K45L95j70l38l22P33J38
6279B33Q5o16j30M86N25m78k78J81P6K73m25j77J62L81J33m08o62L88N81J47n70
6300i3j54n7O91m27k08l6L18K25k93J89n43J13L81n5l51J42N1L34k74l17J95K12
6322D3L36k47o76M49L61j09j48m07J88J79M29m63n42M11P10k02o19LK94M54p1
6343C73m09l22O04J93l67m10J82K64J96m00k13RN42J63o92k0J50K96r9l3l82K87
6365h8M43j53n66j44K45L51K5l34j87M30M34k00m38l1K58L76l78k38K18J36J88
$$ plain form
6386 347 58 112 -12 166 432 19 -238 -46 261 393 -100 -270 252 499 308 -111 -324 184 443 58
6406 58 -126 -211 313 457 126 -172 -97 313 77 -7 -283 -35 399 433 -53 -378 58 270 51 -168 -285 27
6428 27 185 200 -236 -108 0 555 26 -344 -158 86 506 234 -86 -185 190 200 14 -200 -195 159 258 -157
6450 -157 -315 -342 278 105 -117 -224 61 102 51 -532 -286 -299 278 4 45 -76 255 225 -38 -118 8 220
6472 220 438 268 -271 -27 175 276 53 -61 -38 150 221 12 -53 -254 210 157 -95 -202 189 -76 29
6493 29 18 -203 175 192 14 -213 -14 126 270 290 -185 -148 212 146 97 -281 -18 -21 344 39 -32 9 283 113
6517 113 -259 -18 76 -53 88 -51 -180 121 364 -70 -52 23 311 203 -5 -94 134 97 10 -330 -28 164
6539 164 -78 95 90 173 -156 -10 203 -109 -47 78 181 -135 52 126 -32 -82 88 147 117 265 -2 279 205
$$ packed form
6386C47k89N4j24J78K66m13k57J92L07J32m93j70N22K47j91m19k13N08K59l85
6406E8j84q5N24J44l31k98P5M10k36q4k76K48M34L4m86l25M36K12k19k19j17L12
6428B7J58J5m36J28J08N55n29l70J86K44M20k72l20r9L75J0j86k14NL54R9m15
6450a57j58k7O20j73k22j07K85M1n1n83K46j3N77k74M1j21L31l0k63q0J26K12
6472B20K18j70n39K44K02J01k23j14K3J88P1k09o5k01M64n3k52j07L91k65J05
6493B9j1k21L78J7j78k27J99J40J44K0m75L7L60o6m9l78K63lL65l05p1M1K74j70
6517A13l72K41R4j29J41j39j29L01K43m34J8P5K88j08k08q9K28l7q7l40L02J92
6539A64k42J73nQ3l29J46K13l12O2J25J03l16J87P4j58n0J70N9l0J48k67K81p4
$$ plain form
6562 205 -15 197 -22 51 -168 5 339 101 147 389 223 7 149 60 -109 -19 158 -32 -4 114 78 144
6584 144 -36 209 -42 89 -125 -78 198 147 -15 -174 28 -2 -64 -39 -312 -71 -20 -94 -58 -402 163 213 84
6607 84 140 -38 165 33 -28 -202 -52 92 -49 -61 -208 -102 39 2 -134 -199 282 148 -86 139 -197 -2
6629 -2 -34 -303 -259 12 -1 142 74 -183 -116 -148 69 -123 -82 -348 -20 138 407 -47 54 115 190 -171 -182 132
6653 132 229 230 -227 -78 -145 246 -97 125 -390 -49 148 167 37 -268 -188 197 105 124 107 183 -62 -60 -240 170
6677 170 197 178 -224 -194 -236 8 49 79 35 -188 313 120 -234 -195 -140 157 78 -151 -231 -126 272 -282 -162 -168
6701 -168 89 513 223 -119 6 -2 245 -47 -269 -130 246 142 -112 -288 -77 142 13 -247 56 -267 255
6722 255 -191 -138 -120 79 201 56 6 -16 12 385 32 -276 -179 144 160 -265 -34 71 -37 -105 13 -36 -318
$$ packed form
6562B05k20K12k19P3k19J73L34k38M6K42j66k16J42q9j69R0J77j90K8J18l6O6
6584A44j80K45k51J31k14M7K76n1j62j59K02l0o2K5k73K41N1p4L6l44N65N0j29
6607H4N6j78K03j32o1j74J50J44j41j2j47J06J41l7j36o5M81j34k34K25l36J95
6629bl2k69M4K71j3J43o8k57O7l2K17j92M1k66L28J58K69m54J01O1P5l61j1L14
6653A32R7Jm57J49o7L91l43K22n15L41J97J9j30l05Q0L85r2J9j7P6k45Kj80M10
6677A70K7j9m02L0m2K44M1L0m4k23N01j93l54L9N5K97p9k29q0J05L98n54J20o
6701a68K57M24k90l42J25qK47k92k22J39L76j04k54j76K11K19j29k60L03l23N22
6722B55m46N3J8J99J22j45n0k2K8L73l53l08R7L23J6m25K31J05j08o8J18m9k82
$$ plain form
6745 -318 186 159 -189 -271 -106 103 29 -60 -163 -351 107 82 -87 -383 110 312 57 -352 -264 34 189 -19
6767 -19 -237 106 215 290 -41 -200 -97 401 172 -42 -232 218 303 87 -163 -7 363 419 109 -159 -205 13
6789 13 355 21 -235 -209 43 171 -202 -292 -211 -10 27 -19 -188 -60 292 59 -249 -208 -47 142 98 5 -508
6812 -508 34 144 54 -323 -478 1 326 0 -182 61 403 189 91 -34 -87 314 337 -120 -170 113 168 46
6834 46 -199 -212 -444 320 191 -161 -145 -286 133 150 -57 -36 89 205 241 -266 -255 -94 150 137 -71 -229 -6
6857 -6 104 101 55 -33 69 255 -9 -163 -98 244 234 -130 -311 20 200 190 -111 -150 46 240 -44 -183 -241 50
6881 50 212 282 -335 -235 347 328 -19 -93 -284 178 70 -71 -158 -6 29 260 -39 -210 -47 129 59 -232
6903 -232 -295 153 268 97 -123 -67 -28 219 79 -191 -95 213 188 -3 -105 -191 60 159 29 -267 -58 122
$$ packed form
6745c18N04k7l48q2J65K09p4q9j03j88M58k5j69k96M93K02k55m09Q8K98J55k08
6767a9k18L43J09P5l31j59J03M98k29k14j90M50Q5k16k50J56L70N6l10k68m6K18
6789A3L42l34k56K6K52J28l73r0Q1K01L7m6j69J28L52k33l08M1J61J89m4r3n13
6812e08N42J10r0l77j55M79L25l26j82K43L42k14r8j25n3M01K3m57n0K83N5j22
6834D6k45j3k32P64j29l52J6j41M19J7k07K1J25J16L6n07J1J61K44j3k08j58K23
6857fJ10lm6q8J02J86k64j54O5L42j0l64j81L31J80j0l01l9J96J94k84j39n8K91
6881E0J62P0o17J00N82j9l47p4j91M62j08j41q7J52L5K31k99j71J63J76p0k91
6903b32o3M48J15j71k20N6L9K47j40k70R6L08k5j91j02q6K51R9j30k96K09J80
$$ plain form
6925 122 365 16 -241 -124 160 91 -46 -209 -126 -6 125 -23 -136 32 207 -43 -337 -129 196 196 268 -244
6947 -244 5 -78 -100 6 -65 12 91 139 -193 26 10 116 293 94 -170 1 -30 146 -99 -41 -17 178 -139
6970 -139 -69 -417 158 64 41 -75 -223 29 106 -46 -98 200 -55 206 46 -41 -44 164 263 26 -81 20 312
6993 312 -8 -91 -116 129 -51 150 -65 -193 -188 -284 74 -226 -9 38 234 -42 231 93 85 -151 -32 66 70 77
7017 77 -5 148 28 -71 -21 -217 26 152 -80 296 -79 -81 115 18 98 4 148 12 233 286 188 77 194 8
7041 8 242 -71 36 67 26 162 107 -80 -67 68 -223 131 118 -29 -152 26 -79 -312 -62 134 -180 -148 -59
7064 -59 116 21 -163 -24 -40 -53 -102 -140 67 18 28 182 22 -68 73 7 -48 -51 74 153 -220 100 95 195 -232
7089 -232 59 -32 41 -92 101 30 -45 146 -135 57 16 175 113 -30 80 -3 -152 130 -100 -180 42 -67 308
$$ packed form
6925A22K43l49k57J17K84o9j37j63Q3J20J31j48j13J68J75k50k94K08L25%P2n12
6947b44K49q3k2J06p1P7P9M8l32K19j6J06J77j99k64J71l1J76k45N8K4J95l17
6970a39P0l48N75r4k3j16j48K52P7j52n2K98k55K61j60q7lK08R9k37j07J01K92
6993C12l20q3k5K45j80K01k15j28Nr6L58l00K17M7J96k76K73j38qk36J19R8MP
7017G7q2J53j20r9N0j96K43J26k32L76l75kJ96r7Q0r4J44j36K21N3r8j11J17j86
7041HK34l13J07L1m1J36n5j87J3J35k91L54j3j47j23J78j05k33K50J96l14L2Q9
7064e9J75r5j84J39j6j3m9l8K07m9J0J54j60r0J41o6n5lJ25P9l73L20nJ00m27
7089b32K91r1P3j33J93p1p5J91k81J92m1J59o2j43J10q3j49K82k30q0K22j09L75
$$ plain form
7112 308 -113 -98 187 98 78 -186 -104 -37 -156 125 142 -92 -180 78 199 -251 -300 137 69 -74 14 -450 -81
7135 -81 117 -64 -252 -170 70 44 -91 -194 99 95 43 135 -101 -70 268 35 -30 -176 -158 281 55 -95 -56 168
7159 168 -163 -113 25 -302 36 25 -71 -124 -103 175 -1 -34 -29 -162 -283 189 65 -142 -17 -115 188 -18 -382
7182 -382 137 188 56 -226 -38 -86 136 197 -55 62 -78 87 -14 -262 -114 254 73 141 -283 71 -141
7203 -141 72 -257 -244 -310 -55 -5 70 -41 26 -23 70 50 -81 -92 129 60 -195 -159 -44 138 152 -228 -277 -175
7227 -175 76 2 -146 -8 40 8 -73 86 -249 245 166 139 -158 -33 257 187 -178 -451 27 -20 154 -92 -300
7250 -300 99 135 10 103 21 139 267 73 -196 -108 -62 36 -80 -50 139 -22 79 49 -185 90 95 85 97 -57
7274 -57 -22 109 62 -111 -554 -37 -246 8 -114 -391 141 189 -37 -231 29 166 -4 -83 43 27 -163 64
$$ packed form
7112C08m21J5K85q9k0k64Q2O7j19K81J7k34q8K58J21m50m9M37o8j43Q8m64L69
7135h1J98j81j88Q2K40k6j35j03K93mn2R2k36L1L38k33o5j46J8M39k26j50L9K24
7159A68l31N0J38l27L38j1r6n3K1K78j76l3Nj33j21M72j24k07J25r8L03k06l64
7182c82N19N1j32k82J88m8K22O1k52J17j40J65j01k48J48L68j81O8m24L54k12
7203a41K13l29J3o6K55N0P5j11O7m9R3k0j31j1K21o9k55L6J15J82J4l80m9J02
7227a75K51p4j48J38M8l2q1J59l35M94p9k7k97J25K90p0l65k73M78m7J74k46k08
7250c00L99L6j25R3q2J18J28j94k69Q8M6R8j16L0J89j61J01l0k34K75Nj0J2j54
7274e7L5J31m7j73m43N17k09K54j22k77N32M8k26j94K60J37j70p9J26j6j90K27
$$ plain form
7296 64 -10 -361 36 213 291 -81 -135 -128 234 254 -42 -115 -206 -3 201 -79 -339 -138 70 325 -281 96 59
7319 59 144 -64 -239 -48 167 192 -33 -95 -54 162 167 46 -62 -95 394 110 114 -174 -14 74 245 -39 84 -55
7343 -55 126 347 -50 -156 -146 -71 214 -402 -114 124 -37 -126 -199 -309 345 -67 55 -289 -180 -31 21 69
7365 69 -244 110 208 -3 -93 64 -16 131 148 -123 -30 11 -16 100 194 40 69 227 204 -163 63 243 -64 100
7389 100 -302 79 -68 33 234 -167 -64 -73 61 185 -22 16 69 -23 220 -6 -132 197 212 -13 -106 -58 30
7412 30 -93 -155 17 25 107 -66 -350 15 319 147 53 -285 250 87 16 -349 -77 -39 -30 145 81 19 6 196
7436 196 169 88 -117 115 201 28 -187 7 368 -59 129 -144 170 37 -48 -107 -48 -70 -77 162 -77 -240 -246 -88
7460 -88 -34 -133 -230 185 -8 -14 -84 61 92 23 77 140 17 320 230 173 -158 -67 269 180 -71 14 -19 -4 223 -17
$$ packed form
7296F4p4l51L97J77P8l72n4PL62K0k96p3r1K03K04k80k60K01K08K55o06L77l7
7319E9Q5k08j75J91K15K5k25o2M1K16Nj21j08l3M89k84Mk88J60Q8J71k84J23j39
7343e5J81K21l97j06J0P5K85o16K88K38j61q9p3j10O54m12J22l44J09J49N2M8
7365F9l13L54R8k11r0J57q0J47J7k71R3M1k7J16R4j54K9J58k3l67K26J80l07J64
7389A00m02L81j47J01K01m01J03rJ34J24k07L8N3r2K43k26j26L29J5k25r3M8Q8
7412C0j23o2J72QQ2j73k84L65L04j72r4l38N35j63p1l65K72L8RJ75o4o2j3J90
7436A96k7q1k05K32Q6j73k15J94L61m27J88k73L14j33q5n9N9k2pK39k39j63oJ58
7460h8N4r9r7M15j93op0J45L1o9N4O3j23L03r0n7l31R1L36q9k51Q5l3J5K27k40
$$ plain form
7486 -17 -7 -45 128 38 -160 -10 -36 104 -27 -9 -224 33 45 -114 -125 -227 -184 9 -61 -104 -116 76 203 214
7510 214 -44 -88 195 124 -12 108 39 132 -95 178 -122 -37 192 -92 -210 -108 -62 -39 -46 -74 -254 83 -110
7533 -110 -160 89 165 -101 -2 9 56 296 102 -5 -42 -99 -105 -78 117 119 104 -175 26 182 109 164 97 289 -148
7558 -148 -157 -66 -22 -66 101 38 79 102 -145 36 85 53 -147 -68 84 -264 148 64 -286 -81 192 169 -132 41
7582 41 112 263 18 -42 83 64 91 -12 -136 -45 -45 63 -39 -169 -156 87 6 37 63 -174 -155 -215 -79 21 2
7607 2 159 -82 42 -168 199 54 32 -191 94 7 105 123 68 121 253 -69 -96 -244 -59 192 87 -198 -95
7630 -95 51 -47 -12 57 46 -154 291 -133 54 -108 140 216 207 12 -217 -82 -32 -24 -99 -60 61 92 -92 -233 -212
7655 -212 164 69 -46 -169 -43 -66 152 -206 112 62 190 -122 -117 -139 55 357 -208 -270 -303 271 124 -116 -114
$$ packed form
7486a7J0l8J73r0j98J50k6J40j31J8k15K57J2j59j1j02M3J93p0m3j2J92J27J1
7510B14k58m4K83p1j36J20o9R3k27K73l00Q5K29k84j18J02M6K3pk8j80L37j93
7533a10n0K49P6k66R9J1M7K40j94j07l7n7oK7J95Kj5k79K01J56p3N5o7J92m37
7558a48rR1M4m4J67o3M1K3k47J81M9l2k00P9J52l48M12q4l50K05K73k3l01J73
7582D1P1J51k45o0J25j9K7j03j24R1%J08j02j30J3K43q1L1K6k37J9o0J36J00j9
7607BJ57k41J24k10L67j45k2k23K85q7R8J8n5N3J32l22k7j48J85K51j05k85J03
7630i5J46r8L5O9j1k00M45m24J87j62K48P6rj95k29J35N0Qp5L9J21L1j84j41K1
7655b12L76r5j15j23J26k3K18l58L18n0J28l12Nk2J94L02n65o2l3N74j47k40K
$$ plain form
7678 -114 -169 -115 63 0 115 -74 68 288 -49 -121 218 114 51 -76 -282 167 35 22 -308 -82 44 406
7700 406 -105 -122 -323 163 45 76 -102 -172 -108 127 -201 -27 -42 98 206 -76 -38 298 330 64 -97 -419
7722 -419 16 77 0 -193 -310 10 116 -155 -153 -223 -160 190 -48 -181 -93 20 -60 -130 -155 62 -2 265 -49 -22
7746 -22 -184 117 204 58 -222 15 171 246 -34 -48 196 105 29 -212 2 -13 102 3 -200 46 -96 -79 -47
7769 -47 -238 -73 273 200 94 -243 -31 255 147 -231 -14 -10 145 -12 -107 -142 140 -218 96 -129 -236 67
7791 67 125 -16 -173 -338 -26 225 -219 -166 -295 112 250 40 -336 -90 43 73 111 -181 -41 124 230 40
7813 40 25 -11 167 209 -151 -167 -83 406 -114 -76 18 -91 63 -128 -116 -81 177 242 12 -72 39 -6 247 26
7837 26 -217 -154 170 150 115 -229 -210 226 217 -165 -115 47 106 114 -243 -113 231 225 -6 -391 -136 44 146 13
$$ packed form
7678a14n5N4J78o3J15j89J42K20l37p2L39j04o3j27k06M49j32j3l30K26J26L62
7700D06n11j7k01M86j18L1j78p0O4K35l28J74j5J40J08k82L8L36L2k66j61l22
7722d19M35O1p7j93j17L20J06k71Kp0O3L50k38j33Q8J13q0p0k5K17o4K67l14K7
7746b2j62L01Q7j46k80K37J56P5k80j4K44r1p6k41K14j5J15r9k03K46j42J7L2
7769d7j91J65L46p3j06l37K12K86j08l78K17MJ55j57r5l5K82l58L14k25j07L03
7791F7N8j41j57j65L12K51m44N3j29M07J38k10l76K46J33L0L8k92J40J65J06j90
7813D0j5l6J78M2l60j6Q4M89n20L8R4j09J54j91J2L5K58O5k30q4J11m5K53k21
7837B6k43O3L24k0l5l44J9M36rl82N0J62N9Ql57J30L44ok31l85K55J80J02j33
$$ plain form
7861 13 -167 50 124 50 193 -219 -86 83 -74 -72 -71 169 14 242 -35 -247 -85 156 155 186 -219 88 179 -61
7885 -61 -80 -312 120 -33 -93 -363 78 65 89 8 172 72 -45 162 -123 22 -88 105 -166 -16 -15 184 50
7908 50 220 45 -224 186 164 -151 -40 153 256 78 -116 -10 108 167 127 -16 1 -67 -13 227 -30 -92 51
7931 51 162 -76 -50 48 -142 148 -125 -337 -188 203 10 111 71 -58 -86 139 224 -106 -32 173 192 274 -42
7954 -42 -376 2 9 121 280 -49 46 131 -61 -155 195 -20 64 33 -130 264 -94 -141 9 90 -159 341 62
7977 62 -23 -28 -5 222 139 -199 118 85 171 -18 -26 251 -90 -130 128 -28 -54 58 81 136 -33 94 89 96 115 99 55
8004 55 -132 -22 50 -147 -104 121 -106 116 180 95 -53 -214 106 -31 -148 -208 34 -64 -151 -338 -40 -70 117
8027 117 32 -362 -47 -295 -77 124 -67 25 248 189 -220 12 -294 53 -125 167 103 35 -159 44 205 -96
$$ packed form
7861A3j80K17P4p4J43m12J33J69j57KJK40j55K28k77k12J62K41jL1m05L07R1k40
7885f1j9k32M32j53o0k70M41j3K4q1J64j00j17K07k85J45j10J93k71J50JJ99j34
7908E0J70j75k69M10k2l15J11J93J03j78j94J06J18N9m0j43J7o8N4K40k57o2J43
7931E1J11k38K6R8j90K90k73k12J49L91j93J01m0j29k8K25Q5l30P4K05J9Q2l16
7954d2l34L78PJ12J59l29R5Q5j92r4L50k15Q4l1j63L94l58m7J50Q1k49N00k79
7977F2q5nK3K27q3l38L17l3Q6j89qK77l41m0K58j56k6J12K3N5j69J27nPJ9j6m4
8004E5j87J10P2j97M3K25k27K22O4q5j48j61L20j37j17o0K42r8q7j87K98l0J87
8027A17q5l94L15k48K18K01j91R2K23n9m09K32l06L47j78K92o4o8j94K03J61l01
$$ plain form
8049 -96 -19 -96 -173 91 39 57 33 -225 69 -32 102 22 16 -36 315 -140 -3 126 -26 52 -162 -24 151 -154
8073 -154 5 -38 -138 -136 97 -110 -53 -174 -68 -211 -10 45 -36 -155 -202 -301 54 35 29 165 127 2 -105 155
8097 155 -244 -105 341 -15 114 -23 -51 123 -260 -144 -57 77 53 -53 37 -96 -8 -156 -313 -207 44 251
8119 251 96 125 92 62 144 -13 -160 -177 -181 32 -19 -220 6 329 37 -84 -55 -203 -25 -65 -172 -3 91 26
8143 26 -99 -103 49 223 -21 -29 -283 -64 207 87 175 80 -116 143 78 -208 -122 105 165 70 8 -20 144 204 9
8168 9 -69 100 121 117 134 -222 -142 -64 30 -118 -56 -154 -18 -71 3 -140 88 31 182 4 -32 -53 122
$$ packed form
8049i6P7p7p7K64n2J8k4k58K94j01J34q0on2L51m55J37J29j52P8k14J38J75l05
8073a54J59m3j00KK33k07N7j21J06j43K01N5q1j19m7r9L55j9oJ36l8j25j07K60
8097A55l99J39M46l56J29j37k8J74l83J16Q7J34k4j06R0j33Q8j48j57J06K51K07
8119B51j55K9l3l0Q2j57j47j7mK13n1k01K26L23k92j21K9j48J78m0j07J69R4o5
8143B6j25mJ52J74k44qk54K19K71j20Q8r5j96K59o5k86Q6K27O0r5o2k8J64O0j95
8168Ip8J69K1mJ7l56Q0P8R4j48O2r8J36n3P4j43K28n7J51j78l6k1J75
8191A22
$$ Imaginary data points
##PAGE= N=2
##DATA TABLE= (X++(I..I)), XYDATA
$$ plain form
0 0 0 0 0 0 0 0 0 0 0 0 -8 8 -8 10 -16 16 -24 32 -32 40 -48 58 -72 83 -96 112 -132 152 -176 202 -231 261
32 261 -298 338 -380 427 -480 537 -600 669 -746 827 -918 1016 -1125 1240 -1369 1510 -1665
49 -1665 1831 -2018 2223 -2451 2706 -2990 3311 -3676 4099 -4589 5169 -5868 6729 -7817 9245
64 9245 -11211 14096 -18760 27571 -50150 237368 440034 76014 54917 124125 340074 255852
76 255852 -21109 -71431 121720 219207 136696 -95498 -76046 121180 187529 72466 -100182
87 -100182 -72219 133751 161197 6282 -119480 -71614 94707 144648 -40801 -131042 -32940
98 -32940 120255 159852 4806 -75413 69928 219628 214861 75351 -2843 159311 287650
109 287650 215665 80357 11255 167866 281715 159944 18941 10011 153330 256061 122855
$$ packed form
0@%%%%%%%%%%qJ6j6J8k6L2m0N6o4P2q8J06j30J55j79K08k44K84l28L78m33M92
32B61n59O36p18Q07r07J017j137J269j415J573j745J934k141K365k609K879l175
49a665L496l849M241m674N157n696O301o987P775q688R758j1037J2597j4546J7062
64I245k0456K5307l2856M6331p7721K87518K02666l64020k1097O9208K15949q4222
76B55852k76961n0322J93151R7487q2511k32194J9452J97226O6349j15063j72648
87a00182K7963K05970K7446j54915j25762M7866J66321M9941j85449r0241R8102
98c2940J53195L9597j55046q0219J45341J49700m767j39510p8194J62154J28339
109B87650p1985j35308o9102J56611J13849j21771j41003q930J43319J02731j33206
$$ plain form
120 122855 -22859 31547 172300 238355 95067 -39733 45292 176582 186031 33898 -78362
131 -78362 17655 150264 102559 -40107 -101779 970 134830 69504 -64671 -71886 47272
142 47272 149197 83983 -46077 -26281 97758 150542 77284 -51017 -16310 108721 120002
153 120002 35269 -68041 -25022 109130 109666 2722 -55481 -3598 121680 120943 -4120 -38318
165 -38318 25906 123232 104559 -23625 -51541 33056 99792 60056 -50797 -71070 42397
176 42397 93963 33790 -52052 -47429 73772 118361 35893 -37030 -1956 99131 126726 23610
188 23610 -39965 20795 93189 96263 -6486 -55117 22559 82706 55863 -24130 -50862 25349
200 25349 82476 32134 -30526 -42057 24376 69396 7272 -49966 -50918 4465 38555 -19348
$$ packed form
120A22855j45714N4406J40753O6055j43288j34800Q5025J31290R449j52133j12260
131g8362R6017J32609m7705j42666o1672J02749J33860o5326j34175p215J19158
142D7272J01925o5214j30060J9796J24039N2784p3258j28301L4707J25031J1281
153A20002q4733j03310M3019J34152N36j06944n8203N1883J25278p37j25063l4198
165c8318O4224R7326j8673j28184k7916Q4597O6736l9736j10853k0273J13467
176D2397N1566o0173q5842M623J21201M4589q2468p2923L5074J01087K7595j03116
188B3610o3575O0760P2394L074j02749m8631P7676O0147k6843p9993k6732P6211
200B5349N7127n0342o2660j1531O6433M5020o2124n7238r52N5383L4090n7903
$$ plain form
212 -19348 -81477 -59572 -5057 17554 -25751 -86332 -46829 17980 27638 -17320 -61515 -18130
224 -18130 49426 43407 -14455 -38102 1978 65748 42200 -21956 -23626 18077 67793 39487
236 39487 -22800 -11345 44803 66263 35263 -16525 -4449 58465 55659 13849 -25346 -10485
248 -10485 41752 28213 -22259 -44890 -22442 12647 2411 -50564 -53252 -22486 -5426 -10960
260 -10960 -52819 -49419 -14997 -6482 -20263 -42006 -42968 -13167 -3162 -24317 -33389 -36082 -9850
273 -9850 2462 -17816 -23709 -21985 -689 12586 -4966 -18432 -3771 6849 14645 1263 -19735
286 -19735 -174 8983 4298 -10463 -22973 -9329 1821 -9493 -23700 -26629 -18755 -4477 -21570
299 -21570 -29439 -23650 -22987 -12451 -23393 -30484 -19471 -16730 -21953 -19608 -22500 -15231 -10743 -22270
$$ packed form
212a9348o2129K1905N4515K2611m3305o0581L9503O4809R658m4958m4195M3385
224a8130O7556o019n7862k3647M0080O3770k3548o4156j670M1703M9716k8306
236C9487o2287J1455N6148K1460l1000n1788J2076O2914k806m1810l9195J4861
248a0485N2237j3539n0472k2631K2448L5089j0236n2975k688L0766J7060n534
260a0960m1859L400L4422Q515j3781k1743r62K9801J0005k1155r072k693K6232
273i850J2312k0278n893J724K1296J3275j7552j3466J4661J0620P796j3382k0998
286a9735J9561R157m685j4761j2510J3644J1150j1314j4207k929P874J4278j7093
299b1570p869N789O63J0536j0942p091J1013K741n223K345k892P269M488j1527
$$ plain form
313 -22270 -12799 -10531 -8792 -9400 -16285 -5097 2552 -6170 -10871 -6790 -1348 9594 -8046 -17010
327 -17010 -2294 731 2198 -14315 -24050 -8784 -955 -14941 -26525 -32614 -21653 -10106 -30045
340 -30045 -39213 -40811 -29438 -17814 -34531 -46104 -39440 -27051 -17185 -25943 -47715 -33715 -15439
353 -15439 -11883 -20087 -42726 -29573 -3297 -1204 -20423 -34512 -19724 11363 9664 -17034 -22340
366 -22340 -4785 28464 19320 -15615 -15894 9626 32337 16290 -22422 -24990 13949 24149 -2310
379 -2310 -38047 -32847 10774 14497 -19689 -48756 -30060 13142 11844 -32937 -49795 -21019 13341
392 13341 7332 -44472 -52821 -15874 8678 -6715 -51195 -54067 -12531 10351 -14175 -45738 -44280
405 -44280 1487 22607 -9438 -36007 -28973 15566 31440 -8067 -40014 -22965 16830 25581
$$ packed form
313b2270R471K268J739o08o885J1188P649q722m701M081N442J0942j7640q964
327a7010J4716L025J467j6513r735J5266P829j3986j1584o089J0961J1547j9939
340c0045r168j598J1373J1624j6717j1573O664J2389R866q758k1772J4000J8276
353a5439L556q204k2639J3153K6276K093j9219j4089J4788L1087j699k6698n306
366b2340J7555L3249r144l4935k79K5520K2711j6047l8712k568L8939J0200k6459
379b310l5737N200M3621L723l4186k9067J8696M3202j298m4781j6858K8776L4360
392A3341o009n1804q349L6947K4552j5393m4480k872M1536K2882k4526l1563J458
405d4280M5767K1120l2045k6569P034M4539J5874l9507l1947J7049L9795Q751
$$ plain form
417 25581 -18283 -55374 -22373 17520 16750 -28488 -58361 -14407 31150 16154 -33270 -46860
429 -46860 95 44727 12484 -40777 -39532 9080 45031 -199 -52165 -35011 20265 40523
441 40523 -5247 -50532 -19633 42828 44683 -1714 -36472 2374 59554 46201 -7437 -32233
453 -32233 8967 54051 30795 -31214 -41392 2844 38005 10960 -50788 -48187 3974 33623
465 33623 -123 -54628 -45071 13912 34193 -11249 -58419 -45221 19409 27854 -29523 -67352
477 -67352 -40050 25127 26147 -35763 -62325 -12584 47543 40166 -23428 -37578 26540 73854
489 73854 51869 -12939 -17359 49230 82384 39907 -19328 -12483 50402 75930 18246 -30487
501 -30487 -7913 52665 66652 3741 -35793 -783 55495 51056 -12683 -48138 -4186 43449
$$ packed form
417B5581m3864l7091L3001L9893p70m5238k9873M3954M5557j4996m9424j3590
429d6860M6955M4632l2243n3261J245M8612L5951m5230n1966J7154N5276K0258
441D0523m5770m5285L0899O2461J855m6397l4758L8846N7180j3353n3638k4796
453c2233M1200M5084k3256o2009j0178M4236L5161k7045o1748K601N2161K9649
465C3623l3746n4505R557N8983K0281m5442m7170J3198O4630Q445n7377l7829
477f7352K7302O5177J020o1910k6562M9741O0127p377o3594j4150O4118M7314
489G3854k1985o4808m420O6589L3154m2477n9235O845O2885K5528n7684m8733
501c0487K2574O0578J3987o2911l9534L5010N6278m439o3739l5455M3952M7635
$$ plain form
513 43449 20700 -39455 -66648 -15793 27891 -3631 -59923 -67434 -11626 30406 -3131 -57829
525 -57829 -46016 12196 47327 6814 -46491 -24373 34657 57001 6785 -42311 -12138 51569
537 51569 56925 1544 -35777 3416 70710 59513 -790 -23148 26108 82085 56941 -9015
549 -9015 -20714 34682 71188 33405 -33083 -32218 25846 47517 3380 -54734 -39056 22383 35273
562 35273 -15374 -56733 -31433 29103 34985 -25101 -53196 -19469 34004 27976 -33747 -54644
574 -54644 -11124 35780 18931 -38581 -50283 5417 43647 19997 -30411 -34753 27114 57322
586 57322 20988 -25768 -18952 35887 58352 10609 -36544 -16210 34237 45191 -8935 -47479
598 -47479 -14699 35103 34834 -20765 -47254 -4239 44333 26133 -25558 -41134 4833 47657
$$ packed form
513D3449k2749o0155k7193N0855M3684l1522n6292p511N5808M2032l3537n4698
525e7829J1813N8212L5131m0513n3305K2118N9030K2344n0216m9096L0173O3707
537E1569N356n5381l7321L9193O7294j1197o0303k2358M9256N5977k5144o5956
549i015j1699N5396L6506l7783o6488Q65N8064K1671m4137n8114J5678O1439J2890
562C5273n0647m1359K5300O0536N882o0086k8095L3727N3473o028o1723k0897
574e4644M3520M6904j6849n7512j1702N5700L8230k3650n0408m342O1867L0208
586E7322l6334m6756O816N4839K2465m7743m7153K0334N0447J0954n4126l8544
598d7479L2780M9802k69n5599k6489M3015M8572j8200n1691j5576M5967M2824
$$ plain form
610 47657 14668 -36031 -37928 10593 39839 3326 -43016 -30846 19472 37613 1205 -38948
622 -38948 -14928 32468 40283 1927 -31926 -4067 39122 35453 -8797 -32444 -5641 33968
634 33968 23037 -24714 -38202 -7615 29181 12095 -32676 -38788 -1165 28941 6019 -36011
646 -36011 -36289 7902 26071 -1927 -41466 -34544 13414 23144 -13352 -44096 -24650 20062 25175
659 25175 -17080 -37372 -5922 32584 28701 -15348 -24550 11125 39695 24787 -15330 -19299 17441
672 17441 37088 11579 -18373 -17680 16395 30511 1729 -21643 -14414 16180 24094 -2586 -24962
685 -24962 -11947 13877 17037 -9203 -31688 -12463 10465 7649 -18498 -35136 -13608 10973
697 10973 3443 -23916 -29818 -7317 16708 3538 -22255 -21389 2115 21460 3114 -21090 -15683
$$ packed form
610D7657l2989n0699j897M8521K9246l6513m6342J2170N0318J8141l6408m0153
622c8948K4020M7396P815l8356l3853K7859M3189l669m4250k3647K6803L9609
634C3968j0931m7751j3488L0587L6796j7086m4771o112L7623L0106k2922m2030
646c6011k78M4191J8169k7998l9539O922M7958R730l6496l0744J9446M4712N113
659B5175m2255k0292L1450L8506l883m4049r202L5675K8570j4908m0117l969L6740
672A7441J9647k5509k9952O93L4075J4116k8782k3372P229L0594P914k6680k2376
685b4962J3015K5824L160k6240k2485J9225K2928k816k6147j6638K1528K4581
697A0973p530k7359n902K2501K4025j3170k5793Q66K3504J9345j8346k4204N407
$$ plain form
710 -15683 9853 19109 -212 -22308 -12054 14749 15821 -4682 -21412 -6777 17810 13249 -8400
723 -8400 -18817 -1483 16298 8458 -14643 -16624 -765 10439 591 -19872 -16477 -1291 5073
736 5073 -5593 -18960 -14609 950 3697 -7005 -13608 -11112 3758 4490 -5414 -10620 -7610 4558
750 4558 5274 -5017 -10452 -4249 3665 6046 -5333 -11470 -1092 4462 4093 -6379 -10695 -976 5642
765 5642 284 -9693 -10526 -2315 3679 -6842 -12992 -11015 -4681 -1107 -11061 -15062 -9298 -4369 -7201
780 -7201 -11286 -13843 -7265 -4059 -10204 -10370 -9360 -3956 -5296 -9311 -7097 -3841 -3260 -5999 -6742 -3849
796 -3849 1062 -5439 -7163 -2758 -35 745 -6184 -7012 -1347 2352 -2506 -7449 -6473 -884 1073 -5962
812 -5962 -8147 -7727 -1614 -1699 -8486 -10322 -8124 -4192 -3870 -8435 -13524 -8349 -4521 -3548 -7866 -13715
$$ packed form
710a5683K5536R256j9321k2096J0254K6803J072k0503j6730J4635K4587m561k1649
723h400j0417J7334J7781p840k3101j981J5859J1204r848k0463L395J5186O364
736E073j0666j3367M351J5559K747j0702o603K496J4870P32r904n206L010J2168
750D558P16j0291n435O203P914K381j1379o137J0378N554l69j0472m316R719O618
765E642n358r977q33Q211N994j0521o150J977O334L574r954m001N764M929k832
780g201m085k557O578L206o145j66J010N404j340m015K214L256N81k739p43K893
796c849M911o501j724M405K723P80o929q28N665L699m858m943R76N589J957p035
812e962k185M20O113q5o787j836K198L932L22m565n089N175L828R73m318n849
$$ plain form
828 -13715 -7775 -1899 -813 -8164 -12782 -6071 2608 135 -9089 -11684 -5434 6571 331 -10973
842 -10973 -11518 -2259 7326 39 -12943 -11832 3461 8226 -1731 -15229 -10419 6748 7653 -5798
856 -5798 -19131 -9131 8586 5662 -12420 -19270 -5966 9029 4654 -16744 -16924 276 11376
869 11376 2155 -15738 -13196 4965 13549 -365 -14470 -10756 8651 12655 -2746 -14040 -9047
882 -9047 10650 12297 -4414 -14765 -5046 12165 12993 -5516 -17251 -2186 13969 11548 -10645
895 -10645 -19932 -1894 14265 7495 -16800 -21837 -15 16543 1894 -20257 -19634 4712 19431
908 19431 -912 -21370 -13827 13030 20636 -2821 -21384 -6793 19827 18937 -5382 -20444 1021
921 1021 25094 17183 -7376 -15536 8631 28458 15542 -9894 -10318 12678 28101 11554 -13841
$$ packed form
828a3715N940N876J086p351m618O711Q679k473r224k595O250J2005o240j1304
842a0973n45R259R585p287j2982J111J5293M765r957j3498M810J7167R05j3451
856e798j3333J0000J7717k924j8082o850J3304J4995m375k1398j80J7200J1100
869A1376r221j7893K542J8161Q584j3914j4105L714J9407M004j5401j1294M993
882i047J9697J647j6711j0351R719J7211Q28j8509j1735J5065J6155k421k2193
895a0645r287J8038J6159o770k4295n037K1822J6558j4649k2151O23K4346J4719
908A9431k0343k0458P543K6857P606k3457j8563J4591K6620q90k4319j5062K1465
921A021K4073p911k4559q160K4167J9827j2916k5436m24K2996J5423j6547k5395
$$ plain form
934 -13841 -8733 12777 23356 3983 -19024 -11364 11980 17797 -3523 -22454 -13245 13692 14599
947 14599 -8812 -24914 -11033 16139 13200 -13617 -26420 -5719 18677 12014 -17989 -24885 2212
960 2212 22158 11288 -18719 -19067 11583 28489 9614 -17131 -11002 20546 32625 5472 -16392
973 -16392 -4183 26571 30749 -977 -18315 16 29281 24134 -7929 -20396 4636 28250
985 28250 16640 -13772 -21247 7840 25355 8701 -19223 -19531 8638 21754 1805 -23585 -17111
998 -17111 9474 20001 -3079 -24807 -13262 13009 20790 -4855 -23601 -8293 19788 20647 -6093
1011 -6093 -21630 -2285 26775 19409 -9206 -20559 4343 29687 15788 -14421 -18285 10637
1023 10637 29356 10434 -20308 -15232 15071 25852 2949 -24564 -12219 17706 21687 -5654
$$ packed form
934a3841N108K1510J0579j9373k3007P660K3344N817k1320j8931R209K6937R07
947A4599k3411j6102J3881K7172k939k6817j2803K0701K4396o663l0003o896K7097
960B212J9946j0870l0007l48L0650J6906j8875k6745O129L1548J2079k7153k1864
973a6392J2209L0754M178l1726j7338J8331K9265n147l2063j2467K5032K3614
985B8250j1610l0412p475K9087J7515j6654k7924l08K8169J3116j9949k5390O474
998a7111K6585J0527k3080k1728J1545K6271P781k5645j8746J5308K8081Q59k6740
1011f093j5537J9345K9060p366k8615j1353K4902K5344j3899l0209l864K8922
1023A0637J8719j8922l0742N076L0303J0781k2903k7513J2345K9925L981k7341
$$ plain form
1035 -5654 -25673 -9249 19093 17055 -12228 -24602 -5806 20749 13644 -15426 -22263 246 22233
1048 22233 10987 -15026 -18161 7617 24011 10078 -14254 -13852 13949 25422 7900 -14965
1060 -14965 -9510 16710 25999 3806 -17316 -6115 19271 24142 -2706 -19723 -4277 21253
1072 21253 19810 -9452 -22021 -1032 22014 12664 -14933 -22891 2282 21779 4908 -20563
1084 -20563 -21087 6317 19758 -93 -23085 -15996 11249 18933 -2921 -21881 -8246 15567 18119
1097 18119 -4382 -19533 -1586 19608 16080 -6947 -15330 2460 21519 12864 -9386 -12149 6059
1110 6059 21990 9540 -10312 -10165 8982 20684 6708 -12287 -9389 10660 16936 2517 -15504
1123 -15504 -10267 11396 14675 -2826 -18134 -8003 12474 13832 -6798 -18207 -3764 15612
$$ packed form
1035e654k0019J6424K8342k038k9283j2374J8796K6555p105k9070o837K2509K1987
1048B2233j1246k6013l135K5778J6394j3933k4332M02K7801J1473j7522k2865
1060a4965N455K6220R289k2193k1122J1201K5386M871k6848j7017J5446K5530
1072B1253j443k9262j2569K0989K3046r350k7597p958K5173J9497j6871k5471
1084b0563n24K7404J3441j9851k2992P089K7245P684k1854j8960J3635K3813K552
1097A8119k2501j5151J7947K1194l528k3027q383J7790J9059q655k2250k763J8208
1110F059J5931j2450j9852J47J9147J1702j3976j8995K898K0049O276j4419j8021
1123a5504N237K1663L279j7501j5308J0131K0477J358k0630j1409J4443J9376
$$ plain form
1135 15612 12448 -10753 -16442 684 17198 8724 -13290 -14598 5367 16593 2929 -13774 -11709
1148 -11709 8870 15387 -718 -13956 -7191 11763 13082 -2503 -13275 -3234 12088 10558 -6138
1161 -6138 -13850 -1343 9816 6924 -8684 -13837 -339 10004 4023 -10447 -11565 1322 10743
1174 10743 1834 -10875 -9951 3094 10513 -755 -11607 -8754 4544 8720 -2788 -13175 -6848
1187 -6848 6396 6892 -3900 -12638 -3881 8413 5683 -6055 -10998 -283 8904 3829 -8371 -9325
1201 -9325 978 7891 890 -10603 -7110 1952 5930 -1535 -9521 -5785 3462 4512 -3532 -7654
1215 -7654 -4313 3972 2448 -4244 -7782 -3538 2902 848 -5506 -8131 -3018 1416 473 -5656 -7893
1230 -7893 -2043 1163 107 -6022 -6632 -1536 1908 -859 -6164 -5983 -1027 2187 -2396 -5888 -5197 372
$$ packed form
1135A5612l164k3201n689J7126J6514q474k2014j308J9965J1226j3664j6703K065
1148a1709K0579O517j6105j3238O765J8954J319j5585j0772J0041J5322j530j6696
1161f138p712J2507J1159k892j5608n153J3498J0343n981j4470j118J2887R421
1174A0743q909j2709R24J3045P419j1268j0852K853J3298M176j1508j0387O327
1187f848J3244M96j0792q738Q757J2294k730j1738m943J0715R187n075j2200r54
1201i325J0303O913p001j1493L493R062L978p465p986L736R247J050q044m122
1215g654L341Q285j524o692l538M244O440k054o354k625N113M434r43o129k237
1230g893N850L206j056o129o10N096L444k767n305J81M956L214m583l492O91N569
$$ plain form
1246 372 2287 -3293 -5729 -3403 1764 1529 -3193 -5216 -814 2480 -94 -3034 -3697 1035 1482 -1392
1262 -1392 -3624 -2014 1074 -144 -3016 -3032 -79 -672 -1724 -3167 -1947 104 -2150 -2999 -2476 -527
1278 -527 -776 -2695 -3744 -1268 510 -1191 -2860 -3233 332 577 -1697 -3042 -1814 1013 1238 -1119
1294 -1119 -3061 198 1800 1962 -945 -2318 1163 3284 2843 -1046 -1423 1777 4111 2142 -1447 -1530
1310 -1530 853 4462 1314 -2198 -2285 1218 4044 687 -3449 -3264 2763 4137 34 -5399 -3020 3284
1326 3284 4116 -1643 -7627 -2495 4225 4026 -3894 -7298 -805 6369 4090 -5069 -5296 2057 8320 3276
1342 3276 -4998 -3335 5227 9432 1895 -5046 -1895 7320 8445 1194 -5071 -1082 8730 8266 105
1357 105 -4695 1186 9476 8466 -556 -4739 3234 9865 7659 -2807 -5537 3108 9933 5871 -5713
$$ packed form
1246C72J915n580k436K326N167k35m722k023M402L294k574k940o63M732M47k874
1262a392k232J610L088j218k872j6K953n93j052j443J220K051k254q49N23J949
1278e27k49j919j049K476J778j701j669l73L565K45k274j345J228K827K25k357
1294a119j942L259J602J62k907j373L481K121m41l889l77L200K334j969l589q3
1310a530K383L609l148l512q7L503K826l357m136J85O027J374m103n433K379O304
1326C284Q32n759n984N132O720j99p920l404O493P174k279r159k27P353O263n044
1342C276q274J663Q562M205p537o941L151R215J125p251o265L989R812m64q161
1357A05m800N881Q290j010r022m183P973O631k206j0466k730Q645O825m062j1584
$$ plain form
1372 -5713 -6120 4366 11016 3595 -6148 -5225 6501 12874 1896 -7256 -3319 9203 11463 -602
1386 -602 -9444 -1972 10887 9151 -4359 -10779 991 11517 6987 -6070 -9440 4093 13015 5687
1400 5687 -7059 -5799 7082 13659 3582 -8413 -4194 7941 11995 572 -9139 -3274 9320
1413 9320 11146 -896 -8492 -766 12095 11280 -641 -7168 1632 14365 10845 -2581 -7793 3248
1427 3248 13619 7883 -6249 -8358 4782 13642 6053 -8248 -6509 8315 15343 4751 -8779
1440 -8779 -3990 11725 15329 1259 -9959 -3278 13154 12915 -3580 -11603 -1322 13450 10074
1453 10074 -6636 -11239 2828 15382 8715 -7496 -8998 7397 15668 5656 -9542 -7555 8217
1466 8217 13566 1243 -11754 -6455 8067 11696 -1785 -11219 -3430 10644 12386 -1964 -9304
$$ packed form
1372e713m07J0486O650p421r743R23J1726O373j0978r152L937J2522K260j2065
1386f02q842P472J2859j736j3510o420J1770J0526m530j3057l370J3533Q922p328
1400E687j2746J260J2881O577j0077j1995M219J2135M054j1423r711N865J2594
1413I320J826j2042p596P726J2861q15j1921o527Q800J2733l520j3426n212J1041
1427C248J0371n736j4132k109J3140Q860p589j4301J739J4824P028j0592j3530
1440h779M789J5715L604j4070j1218O681J6432k39j6495q023J0281J4772l376
1453A0074j6710m603J4067J2554o667j6211j502J6395Q271j0012j5198J987J5772
1466H217N349j2323j2997N299J4522L629j3481r434P789J4074J742j4350p340
$$ plain form
1479 -9304 293 13763 12264 -3020 -9350 2293 15018 8881 -6081 -10216 4161 15000 6483
1492 6483 -8142 -8159 8444 16768 5780 -8546 -3939 12410 17504 3277 -9647 -1830 13027
1505 13027 14067 -2345 -11905 -1863 12754 9750 -6184 -11203 740 14157 8113 -6405 -8404
1518 -8404 5068 15719 6861 -7448 -6973 7331 13374 3224 -10224 -7164 7698 11288 430
1531 430 -10600 -4480 10299 12820 543 -8333 -157 13545 13915 -1045 -7712 1651 14182 10692
1545 10692 -5372 -9930 2038 13295 6414 -8301 -9830 4852 14086 4363 -8862 -7119 8929
1558 8929 14436 2512 -9767 -4713 9548 11872 -2310 -12161 -3422 9024 8037 -5800 -12493 -697
1572 -697 11053 7882 -5751 -8095 4043 14043 7608 -5159 -4899 6529 13527 4027 -6279 -5091
$$ packed form
1479i304R597J3470j499j5284o330J1643J2725o137j4962m135J4377J0839q517
1492F483j4625j7J6603Q324j0988j4326M607J6349N094j4227j2924P817J4857
1505A3027J040j6412r560J0042J4617l004j5934n019J1943J3417o044j4518j999
1518h404J3472J0651q858j4309M75J4304O043j0150j3448L060J4862L590j0858
1531D30j1030O120J4779K521j2277q876Q176J3702L70j4960o667R363J2531l490
1545A0692j6064m558J1968J1257o881j4715j529J4682R234r723j3225J743J6048
1558H929N507j1924j2279N054J4261K324j4182r851Q739J2446r87j3837o693J1796
1572f97J1750l171j3633k344J2138J0000o435j2767K60J1428O998r500j0306J188
$$ plain form
1586 -5091 6556 10869 1241 -7812 -3985 7838 10346 1127 -6735 -1357 9849 10513 76 -7488
1600 -7488 -468 9469 8003 -3819 -9824 -1556 8169 3660 -9116 -10358 -662 8048 1757 -9678
1614 -9678 -8259 3746 9449 377 -9343 -5814 6027 7859 -2256 -10030 -4432 6415 5300 -4717
1628 -4717 -9444 -2077 6935 4883 -4343 -6453 2282 8931 5982 -3125 -4165 4259 9161 3932 -4550
1643 -4550 -4296 3135 7021 746 -6148 -5095 2739 5983 -910 -6326 -3854 3885 5304 -1650 -7118
1658 -7118 -2927 4234 2924 -4295 -9070 -3352 2941 745 -7436 -9695 -2445 3088 -586 -7962 -7323
1673 -7323 201 4425 -786 -6700 -4149 2194 4563 -1866 -6300 -2913 2934 2727 -3167 -5418 -1881
1688 -1881 3381 1870 -2619 -4404 164 3673 1261 -1961 -2964 367 2489 567 -3754 -3442 -928
$$ packed form
1586e091J1647M313r628r053L827J1823K508r219p862N378J1206O64j0437p564
1600g488P020R937j466j1822o005Q268R725m509j2776j242R696Q710o291j1435
1614i678J419J2005N703r072r720L529J1841J832j0115p774N598J0847j115j0017
1628d717m727P367R012k052r226k110Q735O649k949r107j040Q424M902n229q482
1643d550K54P431L886o275o894J053P834L244o893n416K472P739J419o954n468
1658g118M191P161j310p219m775N718O293k196q181k259P250N533l674p376O39
1673g323P524M224n211n914K551O343K369o429m434L387N847k07n894k251L537
1688a881N262j511m489j785M568L509k412l222j003L331K122j922m321L12K514
$$ plain form
1703 -928 247 -1487 -5298 -4657 -2175 -780 -2821 -5520 -4784 -1910 -344 -3109 -4972 -4444 -766 45
1719 45 -3246 -5070 -3926 -357 -383 -3451 -5288 -2040 562 -967 -3301 -3444 36 1290 -406 -2647
1735 -2647 -1719 1085 1340 -1049 -2084 -164 331 -312 -2410 -1884 -476 -970 -1786 -2381 -987 -973 -1779 -2404
1753 -2404 -1564 -766 -1161 -1968 -2556 -560 -361 -1661 -2344 -1944 -558 -574 -1894 -2419 -873 -286 -572 -1903
1771 -1903 -1782 -436 26 66 -2163 -1614 -163 428 -610 -1899 -1651 -632 845 -1076 -1744 -2221 -545
1788 -545 436 -1155 -2749 -2736 -177 511 -1278 -3585 -2248 647 1374 -1185 -3877 -761 2592 2399 -1397
1805 -1397 -2799 640 4608 2862 -2081 -1838 1940 5618 2338 -2614 -1176 3939 5998 1137 -2156
1820 -2156 -149 5587 5221 344 -2553 507 5612 3641 -1344 -3632 767 3928 1819 -3269 -4154
$$ packed form
1703i28J175j734l811O41K482J395k041k699P36K874J566k765j863N28L678Q11
1719D5l291j824J144L569k6l068j837L248K602j529k334j43L480J254j696k241
1735b647R28K804K55k389j035J920M95o43k098N26J408m94q16n95J394J4q06o25
1753b404Q40P98l95q07n88J996J99j300o83M00J386j6j320n25J546N87k86j331
1771a903J21J346M62M0k229N49J451N91j038j289K48J019J477j921o68m77J676
1788e45R81j591j594J3K559O88j789k307J337K895P27k559k692L116L353j93l796
1805a397j402L439L968j746m943K43L778L678l280m952J438N115K059m861l293
1820b156K007N736l66m877k897L060N105j971m985k288M399L161k109n088q85
$$ plain form
1835 -4154 377 3272 1009 -3952 -3626 1107 4038 923 -3990 -2827 1967 4640 469 -4089 -3137
1850 -3137 2850 4633 -256 -4562 -1889 4763 5578 -268 -4035 273 7478 6727 57 -3311 3272
1865 3272 8752 6062 -2085 -3208 4251 8286 3751 -4107 -2852 5046 8573 1726 -4255 -1122 6794
1880 6794 8136 713 -3727 783 7997 7127 -850 -4500 845 7068 5038 -2199 -4907 1662 7530
1895 7530 4381 -2789 -3537 3719 8628 4859 -2466 -2073 5470 8988 3491 -3851 -2022 5119 7737
1910 7737 1193 -5223 -2131 6056 7504 -271 -5091 -458 8307 8492 -104 -4341 2072 10363 7332
1925 7332 -2259 -4781 3083 9932 4729 -4585 -4739 5003 9478 3404 -4993 -1969 7994 10466 3020
1940 3020 -3709 1296 9392 10080 1361 -3758 1130 9097 7540 -1957 -4732 1144 8003 6047 -2674
$$ packed form
1835d154M531K895k263m961L26M733K931l115m913J163M794K673m171m558R52
1850c137N987J783m889m306K673O652Q15n846l767M308P205p51o670l368O583
1865C272N480k690q147j123P459M035m535p858J255P898L527o847n981L133P916
1880F794J342p423m440M510P214q70p977l650N345O223k030p237k708O569N868
1895G530l149p170p48P256M909l769p325L93P543L518n497p342J829P141K618
1910G737o544o416L092Q187J448p775m820M633Q765J85q596m237O413Q291l031
1925G332r591k522P864O849n203r314j54R742M475o074q397L024R963K472p446
1940C020o729N005Q096O88q719n119M888P967j557r497k775N876O859j956q721
$$ plain form
1955 -2674 -4497 3067 10110 6075 -1919 -3201 5360 10392 4879 -3173 -3440 5580 9168 2476 -6040
1970 -6040 -3316 5939 8726 623 -6422 -1049 8169 9556 406 -5098 1418 10548 8555 -1974 -5229
1985 -5229 2034 9843 4832 -5066 -6245 2622 8673 2084 -6049 -4582 5197 8848 1862 -5417 -1506
2000 -1506 7353 8253 824 -5393 -792 6612 6531 -1771 -6558 -954 6519 5339 -2843 -5829 820 8273
2016 8273 6112 -2239 -3657 3402 9803 5151 -3191 -3854 4001 7964 2138 -6073 -5134 3835 6560
2031 6560 -560 -7664 -3772 5155 6191 -1350 -6847 -1425 6407 5873 -3181 -6999 -414 6085 3079
2046 3079 -6009 -7872 -681 5333 552 -6665 -6408 1639 6164 545 -5391 -3694 4692 6860 515
2061 515 -4849 -1844 5060 5530 -937 -6127 -1833 4061 3757 -2468 -6275 -1107 4710 3878 -2968 -5222
$$ packed form
1955b674j823P564P043m035p994j282Q561N032n513q052k67R020L588o692q516
1970f040K724R255K787q103p045N373R218J387r150n504O516R130j993j0529l255
1985e229P263P809n011r898j179Q867O051o589q133J467R779L651o986p279L911
2000a506Q859R00p429o217M601P404q1q302m787N604P473j180q182k986O649P453
2016H273k161q351j418P059O401m652q342o63P855L963n826q211R39Q969K725
2031F560p120p104L892Q927J036p541n497N422P832n34r054l818O585O499l006
2046C079r088j863P191O014m781p217K57Q047M525n619n936J697Q386K168o345
2061E15n364L005O904M70o467n190M294N894l04o225l807N168N817q32o846k254
$$ plain form
2077 -5222 462 5682 3073 -4211 -5218 256 4948 -10 -6867 -6736 -119 2868 -2721 -8651 -6345
2092 -6345 993 2564 -3439 -7702 -3885 3092 2457 -3592 -6846 -2152 3427 1459 -4825 -6892 -1558
2107 -1558 2842 421 -5457 -5179 417 4070 771 -4366 -2819 2532 4887 564 -3172 -1907 3050
2122 3050 3979 -962 -4274 -2622 1803 2064 -2777 -5395 -2854 1381 1029 -3338 -5689 -1956 1845 644
2138 644 -3997 -5573 -1505 1557 -792 -5452 -6113 -1948 589 -2635 -6683 -5520 -904 981 -2757
2153 -2757 -5588 -3771 1079 1155 -2768 -4735 -1985 1862 643 -2885 -4350 -1224 1392 -352 -3532
2168 -3532 -3632 -539 1338 -262 -3112 -2545 518 1466 -412 -2730 -1678 293 827 -962 -2757 -1749
2184 -1749 -272 319 -1824 -3118 -2152 -63 253 -1466 -2388 -1442 404 267 -1322 -2422 -938 807
$$ packed form
2077e222N684N220k609p284j007N474M692m958o857J31O617K987n589n930K306
2092f345P338J571o003m263L817O977o35o049l254M694N579j968o284k067N334
2107a558M400k421n878K78N596L653l299n137J547N351K355m323l736J265M957
2122C050R29m941l312J652M425K61m841k618K541M235l52m367k351L733L801j201
2138F44m641j576M068L062k349m660o61M165K537l224m048J163M616J885l738
2153b757k831J817M850P6l923j967K750L847j219l528j465L126K616j744l180
2168c532j00L093J877j600k850N67L063R48j878k318J052J971N34j789j795J008
2184a749J477N91k143j294R66K089L16j719r22R46J846j37j589j100J484J745
$$ plain form
2200 807 248 -1885 -2498 -900 134 -460 -2490 -2237 -486 -156 -1200 -2411 -1733 -290 -237 -2028 -1916
2217 -1916 -1128 -777 -965 -2253 -1864 -1327 -1274 -1681 -2168 -1787 -1452 -1267 -1726 -984 -1208 -419 -560 -684 112 -127
2237 -127 -105 -251 555 591 732 180 499 1171 1261 1138 153 784 1264 1536 929 346 686 1237 1438 596 226
2258 226 263 758 831 123 -761 -711 329 35 -344 -1639 -1065 -46 -3 -1367 -2436 -1316 -74 188 -1423
2277 -1423 -1935 -898 1388 801 -1453 -1349 377 2537 736 -1315 -1091 1600 3009 603 -1394 -103
2293 -103 2706 3105 397 -1430 677 3482 2822 186 -1232 1681 3760 2235 -681 -840 2005 3252
2309 3252 1462 -1698 -1122 1648 2718 400 -1790 -909 1825 2793 364 -1804 -592 2225 2997 224
2325 224 -1704 -207 3112 2881 -289 -2153 -136 3429 2659 -1184 -2623 948 3909 2676 -1712 -2339
$$ packed form
2200H07n59k133o13J598J034n94k030K53J751L30j044j211O78J443N3j791J12
2217a916P88L51j88j288L89N37N3m07m87L81L35J85m59P42k24P89j41j24P96k39
2237a27K2j46Q06L6J41n52L19O72R0j23r85O31M80K72o07n83L40N51K01q42l70
2258B26L7M95P3p08q84N0J040k94l79j295N74J019M3j364j069J120J242K62j611
2277a423n12J037K286n87k254J04J726K160j801k051K24K691J409k406j997J291
2293a03K809L99k708j827K107K805o60k636j418K913K079j525k916j59K845J247
2309C252j790l160N76K770J070k318k190Q81K734R68k429k168J212K817P72k773
2325B24j928J497L319k31l170j864K017L565p70l843j439L571K961j233m388o27
$$ plain form
2341 -2339 2249 4670 2286 -2168 -1419 2951 4762 848 -3038 -1048 3152 4021 -473 -3089 -369
2356 -369 3822 3712 -683 -2418 1033 5046 3350 -395 -1944 2089 5081 2885 -1413 -2255 2096 4487
2372 4487 2033 -2648 -1867 2460 4619 1548 -2740 -1343 3596 4879 748 -2959 -749 3928 4440
2387 4440 -556 -3934 -1008 3912 3213 -2240 -4576 -456 4633 2622 -2593 -3767 1708 5363 2449
2402 2449 -2928 -2845 3087 5381 1520 -3781 -1889 3763 4508 -203 -3999 -839 4069 4362 -997 -3522
2418 -3522 445 5285 4234 -936 -2735 1108 5341 3198 -1820 -3067 1247 4466 1582 -3137 -3462
2433 -3462 1229 3904 983 -3473 -2877 2689 4476 670 -3642 -2000 3216 4642 -467 -4787 -1887
2448 -1887 3462 3696 -2521 -5314 -1674 4058 2864 -3249 -5099 133 4984 2221 -3736 -4302 1665
$$ packed form
2341b339M588K421k384m454P49M370J811l914l886J990M200Q69m494k616K720
2356c69M191j10m395j735L451M013j696l745j549M033K992k196m298q42M351K391
2372D487k454m681P81M327K159l071m288J397M939J283m131l707K210M677N12
2387D440m996l378K926M920o99n453k336M120N089k011n215j174N475L655k914
2402B449n377Q3N932K294l861n301J892N652P45m711l796L160M908K93n359k525
2418c522L967M840j051n170j799L843M233k143n018j247M314L219k884m719l25
2433c462M691K675k921m456N96N566J787l806m312J642N216J426n109m320K900
2448a887N349K34o217k793L640N732j194o113j850N232M851k763n957n66N967
$$ plain form
2463 1665 4794 622 -4701 -4220 2087 3729 -1050 -5959 -3457 2417 2853 -2305 -5786 -1710 3204
2478 3204 3157 -2112 -4212 -56 4189 2950 -2332 -3786 513 4128 1779 -3127 -3582 563 4175 1190
2494 1190 -3429 -3039 2281 4670 1174 -3176 -2372 3150 4171 -192 -4543 -2353 2641 2848 -2291 -5795
2510 -5795 -2358 2167 1368 -4397 -6214 -1567 3023 843 -4828 -5281 -455 3307 5 -5278 -4652 213
2526 213 2608 -1260 -5575 -4257 1456 2331 -2159 -5083 -2638 2687 2666 -1396 -3857 -650 3512 2729
2542 2729 -1519 -3303 316 3096 2328 -2059 -3729 68 3198 1257 -3110 -3460 665 3680 883
2557 883 -3298 -2963 1320 3334 -653 -4254 -2910 1741 2117 -2211 -5352 -2667 1723 1389 -3171 -5470
2573 -5470 -1530 2125 923 -3569 -4316 -151 2602 496 -3825 -3354 645 2284 -444 -3780 -2972 717
$$ packed form
2463A665L129m172n323M81O307J642m779m909K502N874M36n158l481M076M914
2478C204m7n269k100M156M245j239n282j454M299L615k349m906m55M145L612k985
2494A190m619L90N320K389l496m350Q04N522J021m363m351K190M994K07n139l504
2510e795L437M525p99n765j817M647M590k180n671m53M826L762l302n283O26M865
2526B13K395l868m315J318N713Q75m490k924K445N325k1m062k461L207M162p83
2542B729m248j784L619K780p68m387j670L797L130j941m367l50M125L015k797
2557H83m181L35M283K014l987l601J344M651L76m328l141K685M390l34m560k299
2573e470L940L655j202m492p47M165K753k106m321M71L999J639k728l336Q08L689
$$ plain form
2589 717 1837 -1299 -3490 -1879 1453 1774 -1216 -3192 -1249 1997 1281 -1196 -2989 -999 1548 819
2605 819 -2005 -3528 -1106 1264 581 -2700 -3285 -553 1570 466 -2683 -2691 191 2308 30 -2779
2621 -2779 -2225 866 2250 -806 -3041 -1708 1459 1827 -1277 -3004 -1102 1782 1109 -1647 -2897 96
2637 96 1915 854 -1959 -2465 387 1423 -262 -2702 -2061 136 740 -1090 -2577 -1635 -68 538 -1130
2654 -1130 -1890 -1136 407 409 -1181 -1550 -887 585 580 -886 -1706 -683 801 576 -542 -1146 -224 951
2672 951 803 -415 -924 366 1253 659 -811 -454 496 1350 160 -1286 -514 597 1052 -464 -1325 -606
2690 -606 568 316 -924 -1229 -183 541 -449 -942 -848 -331 117 -827 -965 -575 11 -421 -798 -504 -215
2709 -215 -51 -420 -449 63 370 -260 -68 45 347 174 -238 247 518 683 178 -82 162 648 476 -185
$$ packed form
2589G17J120l136k191J611L332L21k990j976J943L246p16k477j793J990K547p29
2605H19k824j523K422K370o83l281n85K732K123j104l149qK882K117k278k809
2621b779N54L091J384l056k235J333L167L68l104j727J902K884o73k756j250K993
2637I6J819j061k813n06K852J036j685k440O41K197O04j830j487R42J567O06j668
2654a130p60P54J543Kj590l69O63J472nj466q20J023J484k25j118o04R22J175
2672I51j48j218n09J290Q87n94j470L57R50Q54j190j446P72J111M55j516q61P19
2690f06J174k52j240l05J046P24r90m93R4N17M48r44j38L90N86m32l77K94K89
2709b15J64l69k9N12L07o30J92J13L02j73m12M85K71J65n05k60K44M86j72o61
$$ plain form
2729 -185 329 338 685 199 -78 182 350 333 0 60 -144 0 301 -59 -403 -570 -11 -67 152 -399 -622 -360
2751 -360 488 443 -708 -919 -290 671 294 -991 -921 376 1054 -61 -1024 -647 938 1050 -158 -1175
2769 -1175 -471 1473 1036 -612 -1744 311 1409 707 -1070 -1300 945 1603 421 -1361 -666 1133
2785 1133 1820 162 -1483 -346 1550 1748 -21 -1285 -219 1750 1758 -237 -1069 465 2024 1710 -96
2802 -96 -901 408 2377 1611 -358 -1373 513 2237 1092 -1159 -1373 900 2253 804 -1635 -1251
2818 -1251 1221 2364 25 -2072 -1139 1786 2044 -441 -2331 -597 2264 1878 -1129 -2236 -306 2412
2834 2412 1302 -1264 -2006 1031 2612 1147 -1538 -1759 1581 2979 887 -1868 -1072 1921 2648 445
2850 445 -1859 -592 2070 2546 -88 -2193 -458 2279 2401 -465 -1873 1 2748 1905 -740 -2079
$$ packed form
2729a85N14RL47m86k77K60J68j7l33O0k04J44L01l60l44j67N59n6K19n51k23K62
2751c60Q48m5j151k11O29R61l77j285P0J297O78j115r63L77J585J12j208j017
2769a175P04J944m37j648j132K055J098p02j777k30K245O58j182j782O95J799
2785A133O87j658j645J137J896J98j769j264J066J969Qj995q32J534J559l14j806
2802i6q05J309J969p66j969j015J886J724j145k251k14K273J353j449k439L84
2818a251K472J143k339k097R33K925K58k485j890J734K861l86l007j107J930K718
2834B412j110k566p42L037J581j465k685k21L340J398k092k755P96K993P27k203
2850D45k304J267K662M76k634k105J735K737J22k866j408J874K747q43k645j339
$$ plain form
2866 -2079 393 3071 1700 -1647 -1930 1113 3107 1554 -2054 -2073 1708 3314 993 -2532 -1257 2399
2882 2399 3124 114 -2992 -721 2646 2709 -1253 -2783 -521 2790 1853 -1940 -3119 -206 2850 992
2898 992 -2709 -2922 527 2351 321 -2992 -2522 1069 2240 -282 -2919 -1972 1471 2111 -210 -3088
2914 -3088 -1220 2112 2707 -561 -2320 -240 2689 2788 -771 -2308 170 3649 2446 -1161 -2289 1041
2930 1041 3905 1775 -2050 -2435 1479 3274 729 -2994 -2549 1786 2992 -318 -3765 -2001 1923
2945 1923 2183 -1613 -4038 -1487 1855 1572 -2483 -3564 -744 2239 1045 -2849 -3193 -85 2550 697
2961 697 -2506 -2563 725 2735 376 -2439 -1875 1470 2974 292 -2398 -1520 1956 2639 -283 -2844
2977 -2844 -970 2301 2377 -1096 -3261 -658 2274 1723 -2069 -3452 -364 2443 952 -3037 -3267 -148
$$ packed form
2866b079K472K678j371l347k83L043J994j553l608j9L781J606k321l525J275L656
2882B399P25l010l106K271L367O3l962j530K262L311r37l793j179K913L056j858
2898I92l701k13L449J824k030l313M70L591J171k522k637R47L443O40k321k878
2914c088J868L332N95l268j759K080K929R9l559j537K478L479j203l607j128L330
2930A041K864k130l825l85L914J795k545l723M45M335J206l310l447J764L924
2945A923K60l796k425K551L342k83m055j081K820K983j194l894l44L108K635j853
2961F97l203n7L288K010k359k815N64L345J504k682k690Q78L476O83k922k561
2977b844J874L271P6l473k165K603K932n51l792j383L088K807j491l989k30L119
$$ plain form
2993 -148 2490 14 -3470 -3112 771 2339 -687 -3551 -2415 1377 2071 -1164 -3502 -1527 2087 1684
3009 1684 -1374 -3041 -302 2513 1463 -1398 -2617 -68 2313 1090 -2252 -2584 355 2282 240
3024 240 -2458 -2563 107 2117 -476 -2968 -2573 538 1557 -936 -3250 -2331 793 1223 -1626 -3752
3040 -3752 -1598 1074 948 -2126 -3604 -881 1528 914 -2616 -3071 -37 2165 694 -2459 -2084 494
3056 494 1989 -151 -2676 -1832 924 1887 -520 -2709 -1328 1300 1217 -1258 -2864 -1112 1335 587
3072 587 -1774 -2666 -841 1098 -364 -2292 -2944 -913 691 -360 -2453 -2507 -440 741 -295 -2288
3088 -2288 -2165 81 1092 -551 -2262 -1447 622 1246 -821 -2032 -1072 1148 1258 -870 -1678 -415
3104 -415 1567 1021 -776 -1945 251 1747 673 -1286 -1890 145 1700 -32 -2108 -1446 362 834
$$ packed form
2993a48K638k476l484L58L883J568l026k864J136L792O94l235k338J975L614m03
3009A684l058j667K739K815j050k861j219K549K381j223l342l32K939J927k042
3024B40k698j05K670K010k593k492L95L111J019k493k314R19L124M30k849k126
3040c752K154K672j26l074j478K723K409o14l530m55L034K202j471l153L75K578
3056D94J495k140k525Q44K756R63k407k189J381K628q3k475j606J752K447p48
3072E87k361q92J825J939j462j928o52K031J604j051k093n4K067J181j036j993
3088b288J23K246J011j643j711Q15K069O24k067j211R60K220J10k128q08J263
3104d15J982n46j797j169K196J496j074j959o04K035J555j732k076O62J808M72
$$ plain form
3120 834 -853 -2255 -1668 36 598 -1010 -1912 -1223 386 -10 -1260 -1800 -712 315 -538 -1071 -1679
3137 -1679 -600 332 -133 -993 -1377 37 614 317 -818 -1347 254 767 454 -1027 -461 361 1032 152
3155 152 -882 -475 436 675 -266 -758 -475 804 501 -387 -547 -21 633 107 -379 -386 258 612 -130 -500
3175 -500 -669 619 353 17 -495 -48 27 251 -157 -276 348 82 180 -87 45 67 -139 313 -107 19 -231
3196 -231 -248 -98 24 -144 -274 -249 -273 141 -140 -510 -283 -30 28 121 -104 -196 -13 185 -89 -78 57 284
3218 284 139 129 143 353 282 659 612 212 164 621 957 534 252 -100 951 1194 466 142 7 894 1000
3239 1000 132 -259 278 906 897 -49 -757 323 892 566 -648 -560 512 1052 367 -1214 -416 754 1293
3258 1293 -150 -959 -48 926 934 -204 -1003 80 1160 673 -501 -715 548 1146 733 -89 -429 640
$$ packed form
3120H34j687j402N87J704N62j608r02O89J609l96j250n40J088J027q53n33o08
3137a679J079R32m65q60l84J414N77k97j135n29J601N13l13j481N66Q22O71q80
3155A52j034M07R11K39r41m92K83J279l03q88j60N26O54n26m86pO44L54p42l70
3175e00j69J288k66l36n12M47P5K24m08j19O24k66R8k67J32K2k06M52m20J26k50
3196b31j7J50J22j68j30K5k4M14k81l70K27K53N8R3k25r2J83J98k74J1J35K27
3218B84j45j0J4K10p1L77m7m00m8M57L36m23k82l52J051K43p28l24j35Q87J06
3239A000q68l91N37O28rr46p08J080N69l26j214Q8J072N40o85j581P98J170N39
3258A293j443q09R11R74Qj138p99J083J080m87j174k14J263N98m13q22l40J069
$$ plain form
3276 640 1447 910 -266 -611 622 1574 797 -588 -619 548 1544 575 -911 -573 995 1767 178 -1213
3294 -1213 -403 1323 1550 -197 -1318 111 1840 1230 -427 -1202 516 1908 1109 -826 -1043 1049
3310 1049 2128 1001 -946 -487 1718 2408 587 -984 -217 1543 1789 60 -1427 -377 1595 1633
3326 1633 -558 -1491 -39 1716 1370 -505 -1092 -91 1940 628 -1204 -1499 450 1888 627 -1435
3342 -1435 -1746 477 1770 423 -1591 -1192 1383 2100 360 -1968 -587 2106 2414 419 -1663 -168
3358 -168 2154 2083 -966 -1712 257 2727 1644 -1019 -1631 723 2530 1121 -1611 -1251 1211 2431
3374 2431 141 -1859 -1023 1407 1684 -306 -2201 -1159 1152 1280 -634 -2397 -696 1485 1433 -609
3390 -609 -1902 -58 2229 1829 -820 -1501 627 2739 1447 -915 -1667 673 2924 1138 -1589 -1524
$$ packed form
3276F40Q07n37j176l45J233R52p77j385l1J167R96r69j486L38J568P72j589j391
3294a213Q10J726K27j747j121J429J729o10j657p75J718J392p99j935k17K092
3310A049J079j127j947M59K205O90j821j571P67J760K46j729j487J050J972L8
3326A633k191r33J452J755l46j875n87J001K031j312j832k95J949J438j261k062
3342a435l11K223J293j347k014L99K575P17j740k328J381K693L08j995k082J495
3358a68K322p1l049p46J969K470j083k663o12K354J807j409k732L60K462J220
3374B431k290k000Q36K430K77j990j895J042K311J28j914j763J701K181n2k042
3390f09j293J844K287m00k649o81K128K112j292k362p52K340K251j786k727O5
$$ plain form
3406 -1524 1744 2490 657 -1944 -1057 2117 2480 45 -2478 -880 1795 1693 -1049 -2840 -646 1696
3422 1696 1098 -2094 -2702 -295 1904 508 -2346 -2019 411 1887 524 -1881 -1459 908 2122 213
3438 213 -2229 -1150 1452 1780 -319 -1922 -711 1809 1964 -182 -1773 -41 2255 1991 -422 -1749
3454 -1749 154 2350 1425 -1514 -1960 1 2043 554 -2282 -2166 394 1745 105 -2445 -2073 1015
3470 1015 2010 -422 -2742 -1218 1629 1678 -993 -2880 -637 1923 1482 -1625 -2235 165 2099 1398
3486 1398 -1263 -1370 1031 2576 1217 -1057 -781 1030 2305 580 -1518 -1093 847 1551 -628 -2238
3502 -2238 -1781 671 1104 -845 -2394 -1212 610 814 -1184 -2365 -891 1025 752 -1392 -2732 -746
3518 -746 1133 444 -2040 -2239 -316 1399 421 -1712 -1385 908 2491 638 -1340 -699 1970 2520 189
$$ packed form
3406a524L268P46j833k601Q87L174L63k435k523J598K675j02k742j791K194K342
3422A696n98l192o08K407K199j396k854L27K430J476j363k405M22K367J214j909
3438B13k442J079K602L28k099j603J211K520J55k146j591J732K296k64k413j327
3454a749J903K196r25k939m46J961K042j489k836J16K560J351j640k550L72L088
3470A015R95k432k320J524K847M9k671j887K243K560m41l107o10K400J934p01
3486A398k661j07K401J545j359k274K76J811J275j725k098M25J940P04k179j610
3502b238M57K452M33j949j549J182J822K04j998j181J474J916k73k144j340J986
3518g46J879o89k484j99J923J715r78k133L27K293J583j853j978O41K669N50k331
$$ plain form
3535 189 -1466 -366 1919 1683 -561 -1280 74 2037 1065 -724 -1692 277 1602 833 -1269 -1372 435
3552 435 1328 90 -1703 -1676 -195 693 -632 -2152 -1479 -158 514 -747 -1962 -998 590 970 -671
3569 -671 -1388 -719 1164 1092 -745 -1178 -36 1138 839 -873 -1297 8 1215 683 -902 -1044 709
3586 709 1593 428 -939 -499 1219 1684 -138 -1261 -433 983 961 -513 -1397 -301 887 429 -879
3603 -879 -1039 38 940 427 -483 -576 229 1177 79 -195 -494 408 708 390 -456 -411 406 648 370 -395
3623 -395 -267 572 948 173 -719 -334 630 918 -94 -749 -421 542 720 -547 -932 -379 472 358 -623
3642 -623 -737 217 864 62 -590 -317 696 885 84 -371 -137 725 575 -199 -343 563 558 452 -96 109
3662 109 628 505 381 285 367 238 311 131 23 303 123 -305 108 69 64 -162 -113 50 33 -44 80 -40 33
$$ packed form
3535A89j655J100K285k36k244p19J354J963r72j789r68J969J325p69k102j03J807
3552D35Q93j238j793K7J481Q88j325j520O73J321O72j261j215R64J588L80j641
3569f71p17O69J883p2j837m33J142J174k99j712m24J305J207n32j585j42J753
3586G09Q84j165j367M40J718M65j822j123Q28J416k2j474q84J096J188m58j308
3603h79j60J077R02n13r10r3Q05R48j098k74k99R02L00l18q46M5Q17K42k78p65
3623c95J28Q39L76p75q92L85R64K88j012o55L28R63J78j267l85N53Q51j14r81
3642f23j14R54O47q02o52K73J013J89q01m55K34Q62j50p74j44R06nj06n48K05
3662A09N19j23j24r6Q2j29P3j80j08K80j80m28M13l9nk26M9J63j7p7J24j20P3
$$ plain form
3685 33 169 78 -122 42 324 51 344 141 519 415 462 459 587 413 330 722 391 529 430 705 724 599 478
3708 478 228 826 776 446 -13 168 306 629 85 -309 63 581 419 -324 -274 64 635 38 -955 -461 470
3729 470 669 -251 -594 -463 636 386 -488 -524 -69 1101 741 -26 -536 405 977 627 8 -47 805 1244
3749 1244 600 94 26 561 1048 1018 -138 -144 591 1284 593 -352 -221 913 1303 202 -754 -170 799 956
3769 956 -313 -912 -190 1283 1052 -147 -665 359 1565 815 -557 -561 520 1480 472 -1101 -652 886
3787 886 1530 0 -814 -411 1214 1342 180 -803 99 1410 1186 -316 -744 206 1311 936 -793 -917
3805 -917 61 1086 203 -779 -957 315 1370 322 -993 -628 759 1094 244 -872 -586 1084 1346
3822 1346 172 -1144 -307 1058 1010 106 -1370 -16 1589 1387 -284 -815 630 2087 1432 -476 -593
$$ packed form
3685C3J36r1k00J64K82k73K93k03L78j04M7lJ28j74q3L92l31J38r9K75J9j25j21
3708D78k50N98n0l30m59J81J38L23n44l94L72N18j62p43N0L38N71n97r93M94R31
3729D70J99r20l43J31J099k50q74l6M55J170l60p67n10R41N72l50o19n5Q52M39
3749A244o44n06o8N35M87l0j156oP35O93o91r45J31J134L90j101r56N84R69J57
3769I56j269n99P22J473k31j199n18J024J206p50j372mJ081R60j008j573M49J538
3787H86O44j530q14M03J625J28j162r83R02J311k24j502m28R50J105l75j729j24
3805i17R78J025q83r82j78J272J055j048j315L65J387L35q50j116K86J670K62
3822A346j174j316Q37J365m8r04j476J354J605k02j671n31J445J457o55j908j17
$$ plain form
3839 -593 784 2106 740 -1108 -1129 882 1677 84 -1558 -1018 1132 1129 -229 -1513 -546 1353 1005
3856 1005 -739 -1656 -302 1217 683 -982 -1894 -362 989 598 -1364 -1476 111 1602 637 -1064
3872 -1064 -843 1023 2250 498 -880 -714 1391 1795 169 -1508 -789 1191 1466 -516 -1819 -531
3888 -531 1305 1297 -805 -1919 -113 1556 1080 -1423 -2073 -150 1387 189 -1891 -1888 62 1344 -359
3905 -359 -2186 -1511 572 1421 -311 -1615 -802 1750 1508 -250 -1272 -251 1599 1389 -524 -1249 86
3922 86 1404 1010 -942 -1467 174 1440 983 -868 -1217 423 1695 374 -1371 -1409 216 1240 -216
3939 -216 -2171 -2020 191 753 -1083 -2675 -1583 483 589 -1441 -2552 -645 1104 821 -1374 -1869
3955 -1869 64 1429 428 -1484 -1845 169 1531 152 -1717 -1200 929 1569 48 -1329 -379 1269
$$ packed form
3839e93J377J322j366j848k1K011P95j593j642N40K150lj358j284R67J899l48
3856A005j744r17J354J519n34j665r12J532J351l91j962j12J587J491r65j701
3872a064K21J866J227j752j378J66K105M04j626j677P19J980K75j982j303J288
3888e31J836qk102j114J806J669m76k503o50J923J537j198k080LJ950J282j703
3905c59j827O75K083Q49j732j304Q13K552k42j758j022J021J850k10j913p25J335
3922H6J318l94j952n25J641J266m57j851l49J640J272j321j745l8J625J024j456
3939b16j955J51K211N62j836j592J092K066J06k030j111J907J749k83k195m95
3955a869J933J365j001j912l61K014J362j379j869N17K129O40j521j377R50J648
$$ plain form
3971 1269 1682 19 -1223 -205 1302 1132 -763 -1758 -767 548 218 -1071 -1907 -770 729 472 -1522
3988 -1522 -1796 -112 1000 277 -1561 -1679 78 983 -4 -1745 -1274 801 1006 -515 -1950 -1058 1124
4005 1124 1133 -656 -1116 -229 1725 1094 -431 -1038 302 1664 844 -742 -1116 432 1106 32 -1239
4022 -1239 -1257 235 1018 -402 -1417 -808 516 606 -324 -1231 -796 645 588 -817 -1578 -926 408 13
4040 13 -1039 -1555 -528 619 399 -684 -1225 -17 1035 735 -511 -794 813 978 468 -802 -656
4057 -656 883 1039 -85 -1299 -396 607 1063 -39 -1116 -185 949 1016 -291 -731 140 1165 552
4074 552 -806 -747 221 746 -129 -763 -838 136 587 -157 -841 -430 612 546 -150 -432 -276 443 404 288 -578
4095 -578 -247 195 399 -254 -614 -354 449 506 -295 -860 -280 616 578 -274 -508 73 806 273 -481 -314 206
$$ packed form
3971A269M13j663j242J018J507j70j895r95R91J315l30j289q36J137J499k57j994
3988a522k74J684J112p23j838j18J757R05r87j741M71K075K05j521j435Q92K182
4005A124Rj789m60Q87J954o31j525o07J340J362q20j586l74J548O74j074j271
4022a239j8J492P83j420j015O09J324R0r30r07M35J441n7j405p61O52J334l95
4040A3j052n16J027J147k20j083n41J208J052l00j246k83J607J65n10j270J46
4057f56J539J56j124j214R03J003M56j102j077R31J134O7j307m40Q71J025o13
4074E52j358N9R68N25q75o34p5R74M51p44o84M11J042o6o96k82J56P19l9j16q66
4095e78L31M42K04o53l60K60Q03N7q01n65N80Q96l8q52k34N81P33n33p54J67N20
$$ plain form
4116 206 841 -20 -789 -442 283 603 242 -701 87 551 639 213 -74 91 679 756 59 -79 536 815 380
4137 380 -92 189 447 837 52 -61 212 233 391 -117 18 199 99 195 209 -148 119 -47 -60 61 -249
4158 -249 -313 -79 -200 -29 -155 -177 -287 146 -91 173 397 242 14 291 165 400 528 274 279 283 478 360
4180 360 350 346 590 375 101 471 483 314 333 243 193 423 445 -120 60 334 480 234 -160 -164 134 485 -45
4203 -45 -586 -272 380 213 -229 -566 -344 345 -10 -193 -455 169 598 230 -184 -317 269 673 164 -208
4223 -208 -79 449 231 251 -64 108 691 542 251 -97 -89 601 570 -3 -275 13 778 684 -373 -361 38 667
4245 667 336 -358 -638 -145 918 122 -1069 -784 356 819 205 -800 -730 336 667 -146 -1073 -528 575
4264 575 531 -436 -1154 -280 648 396 -936 -646 179 876 -24 -881 -821 119 550 -21 -805 -821 372 479
$$ packed form
4116B06O35q61p69L47P25L20l61r43P88M64Q8m26k87J65N88P7o97j38O15K79m35
4137C80m72K81K58L90p85j13K73K1J58n08J35J81j00R6J4l57K67j66j3J21l10
4158b49o4K34j21J71j26k2j10M33k37K64K24j55k28K77j26K35J28k54NMJ95j18
4180C60j0mK44k15k74L70J2j69J9r0n0K30K2n65J80K74J46k46l94mK98L51n30
4203d5n41L14O52j67m42l37K22O89l55j83k62O24M29l68m14j33N86M04n09l72
4223b08J29N28k18K0l15J72N83j49k91l48QO90l1n73k72K88P65r4j057J2L99O29
4245F67l31o94k80M93J063p96j191K85J140M63o14j005P0J066L31q13r27N45J103
4264E75m4r67p18Q74R28k52j332K90Q25O97r00q57O0R40M31n71p84j6J193J07
$$ plain form
4284 479 -445 -1078 -771 141 89 -296 -1193 -773 494 519 -294 -744 -39 553 474 -466 -1037 -223 756 619 -524
4305 -524 -1109 -46 1028 295 -975 -1107 230 1344 346 -1142 -959 606 993 -199 -1402 -972 582
4322 582 483 -828 -1958 -867 539 31 -1512 -1751 -515 264 44 -1551 -1581 -238 484 22 -1522 -1280
4340 -1280 -116 403 -363 -1546 -1053 22 604 -200 -1384 -885 776 781 -314 -826 -241 1033 1117 -172
4358 -172 -1123 -152 1066 675 -1032 -1330 -161 963 533 -1445 -1470 -118 1114 68 -1439 -1330 38
4375 38 745 -297 -1752 -1504 115 739 -1188 -1977 -1088 676 416 -1048 -1673 -579 972 406 -1097
4392 -1097 -1410 110 1229 228 -819 -749 367 1094 89 -1036 -1056 365 800 -186 -1444 -843 676
4409 676 909 -250 -1371 -632 700 568 -543 -1466 -748 778 394 -1084 -1685 -552 760 403 -1131
$$ packed form
4284D79r24o33L07R12n2l85q97M20J267K5q13m50P05N92p9r40n71Q14R79j37j143
4305e24n85J063J074p33j270j32J337J114r98j488J83J565L87j192j203M30J554
4322E82r9j311j130J091J406n08j543k39J236P79k20j595l0J343P22m62j544K42
4340a280J164N19p66j183M93J075N82q04j184M99J661Nj095n12N85J274Q4j289
4358a72r51R71J218l91j707k98J169J124m30j978k5J352J232j046j507J09J368
4375C8P07j042j455K48J619O24j927p89Q89J764k60j464o25J094J551n66j503
4392a097l13J520J119j001j047P0J116P27j005j125k0J421M35r86j258O01J519
4409F76K33j159j121P39J332j32j111r23P18J526l84j478o01J133J312l57j534
$$ plain form
4426 -1131 -1631 -16 1044 421 -1251 -1048 538 1473 90 -1135 -613 898 1308 -429 -1001 -474 935
4443 935 1081 -345 -977 -266 1328 795 -550 -867 68 1099 708 -685 -1180 254 1016 208 -915 -1127
4461 -1127 208 843 -124 -1124 -1158 -94 668 -247 -1437 -868 433 1035 -525 -1300 -583 997 767 -736
4479 -736 -1262 -333 1007 647 -850 -1282 268 1119 382 -773 -837 795 1235 255 -765 -336 1050 1117
4497 1117 85 -1125 -268 1055 965 -395 -975 -163 814 694 -591 -964 -57 768 596 -614 -675 22
4515 22 813 172 -628 -589 80 479 87 -752 -860 97 729 315 -636 -381 628 916 140 -645 -467 720
4535 720 1022 -179 -901 -176 827 757 -356 -824 21 954 318 -429 -459 476 1042 380 -403 -231 660 810
4555 810 12 -463 -369 505 697 -20 -390 -5 764 515 -325 -792 75 563 610 -71 -254 127 616 238 -209
$$ packed form
4426a131n00J615J060o23j672K03J586R35j383j225N22J511M10j737n72N27J409
4443I35J46j426o32P11J594n33j345l17R35J031l91j393m95J434P62q08j123k12
4461a127J335O35r67j000l4J064P62r15j190N69J301O02j560p75P17J580k30j503
4479g36n26R29J340l60j497m32J550Q51p37j155o4J632M40r80j020M29J386O7
4497A117j032j210Q57J323r0j360n80Q12R77j20j285l73R07Q25j72j210o1O97
4515B2P91o41q00L9O69L99l92q39j08R57O32m14r51K55J009K88p76p85J78J187
4535G20L02j201p22P25J003p0j113m68Q45R33o36p47l0R35N66o62p83J72Q91J50
4555H10p98m75R4Q74J92p17l70L85P69k49q40m67Q67M88M7o81j83L81M89l78m47
$$ plain form
4576 -209 -470 56 619 110 -261 -332 -186 380 -23 -506 -314 122 592 371 -211 -72 650 472 97 -481
$$ packed form
4576b09k61N26N63n09l71p1J46N66m03m83J92M36M70k21n82J39P22j78l75n78
$$ [...]
8191A46
##END NTUPLES=NMR FID
##END=
