##TITLE=1H_SA_Sl.Me.4
 CDCl3, 8 sc, 
 26.8.2020
##JCAMPDX= 6.0         $$ Bruker NMR JCAMP-DX V2.0
##DATA TYPE= NMR FID
##DATA CLASS= NTUPLES
##ORIGIN= UXNMR, Bruker Analytische Messtechnik GmbH
##OWNER= root
$$ XWIN-NMR		Version 3.5
$$ Thu Aug 27 10:42:18 2020 Russian Standard Time (UT+4h)  she@DPX200
##.OBSERVE FREQUENCY= 200.1315066352
##.OBSERVE NUCLEUS= ^1H
##.DELAY= (6, 6)
##.ACQUISITION MODE= SIMULTANEOUS
##.ACQUISITION SCHEME= undefined
##.AVERAGES= 8
##.DIGITISER RES= 18
##SPECTROMETER/DATA SYSTEM= spect
##.PULSE SEQUENCE= zg30
##.SOLVENT NAME= CDCl3
##.SHIFT REFERENCE= (INTERNAL, CDCl3, 0, 15.7039)
##AUDIT TRAIL= $$ (NUMBER, WHEN, WHO, WHERE, WHAT)
$$ ##TITLE= Audit trail, XWIN-NMR		Version 3.5
$$ ##JCAMPDX= 5.01
$$ ##ORIGIN= Bruker BioSpin GmbH
$$ ##OWNER= she
$$ F:/spectra/data/she/nmr/H-F/1/audita.txt
$$ ##AUDIT TRAIL=  $$ (NUMBER, WHEN, WHO, WHERE, WHAT)
(   1,<2020-08-27 10:41:04.57 +0400>,<she>,<DPX200>,
      <created by zg, POWCHK disabled, PULCHK disabled
       configuration hash MD5:
       00 E9 B6 7A A2 85 ED C7 34 08 36 98 17 FE 4E 26
       data hash MD5: 16K
       76 67 06 79 9F 12 EA AB 70 43 52 13 E0 AC 06 EA>)
$$ ##END=
$$ 
$$ hash MD5
$$ 98 8F 6F D7 71 47 00 C6 E9 F1 B2 D1 61 78 79 84
##$RELAX= 
##$RELAX= 
##$RELAX= 
##$RELAX= 
##$RELAX= 
##$RELAX= 
$$ Bruker specific parameters
$$ --------------------------
##$DU= <F:/spectra>
##$EXPNO= 1
##$NAME= <H-F>
##$PROCNO= 1
##$TYPE= <nmr>
##$USER= <she>
##$AMP= (0..31)
100 100 100 100 100 100 100 100 100 100 100 100 100 100 100 100 100 100 
100 100 100 100 100 100 100 100 100 100 100 100 100 100 
##$AQSEQ= 0
##$AQ_mod= 1
##$AUNM= <au_zg>
##$AUTOPOS= <>
##$BF1= 200.13
##$BF2= 200.13
##$BF3= 200.13
##$BF4= 200.13
##$BF5= 200.13
##$BF6= 200.13
##$BF7= 200.13
##$BF8= 200.13
##$BYTORDA= 1
##$CFDGTYP= 0
##$CFRGTYP= 5
##$CHEMSTR= <none>
##$CNST= (0..31)
1 1 145 1 1 1 1 1 1 1 1 1 1 1 1 1 1 1 1 1 1 1 1 1 1 1 1 1 1 1 1 1 
##$CPDPRG= <>
##$CPDPRG1= <>
##$CPDPRG2= <>
##$CPDPRG3= <>
##$CPDPRG4= <mlev>
##$CPDPRG5= <mlev>
##$CPDPRG6= <mlev>
##$CPDPRG7= <mlev>
##$CPDPRG8= <mlev>
##$CPDPRGB= <>
##$CPDPRGT= <>
##$D= (0..31)
0 1.2 0 0 0 0 0 0 0 0.06 0 0.03 0 0 0 0 0.0002 0 0 0 0 0 0 0 0 0 0 0 0 
0 0 0 
##$DATE= 1598510464
##$DBL= (0..7)
120 120 120 120 120 120 120 120 
##$DBP= (0..7)
150 150 150 150 150 150 150 150 
##$DBP07= 0
##$DBPNAM0= <>
##$DBPNAM1= <>
##$DBPNAM2= <>
##$DBPNAM3= <>
##$DBPNAM4= <>
##$DBPNAM5= <>
##$DBPNAM6= <>
##$DBPNAM7= <>
##$DBPOAL= (0..7)
0.5 0.5 0.5 0.5 0.5 0.5 0.5 0.5 
##$DBPOFFS= (0..7)
0 0 0 0 0 0 0 0 
##$DE= 6
##$DECBNUC= <off>
##$DECIM= 32
##$DECNUC= <off>
##$DECSTAT= 4
##$DIGMOD= 1
##$DIGTYP= 9
##$DL= (0..7)
0 120 120 120 120 120 120 120 
##$DP= (0..7)
150 150 150 150 150 150 150 150 
##$DP07= 0
##$DPNAME0= <>
##$DPNAME1= <>
##$DPNAME2= <>
##$DPNAME3= <>
##$DPNAME4= <>
##$DPNAME5= <>
##$DPNAME6= <>
##$DPNAME7= <>
##$DPOAL= (0..7)
0.5 0.5 0.5 0.5 0.5 0.5 0.5 0.5 
##$DPOFFS= (0..7)
0 0 0 0 0 0 0 0 
##$DQDMODE= 0
##$DR= 18
##$DS= 0
##$DSLIST= <SSSSSSSSSSSSSSS>
$$ [...]
##$SUBNAM2= <"">
##$SUBNAM3= <"">
##$SUBNAM4= <"">
##$SUBNAM5= <"">
##$SUBNAM6= <"">
##$SUBNAM7= <"">
##$SUBNAM8= <"">
##$SUBNAM9= <"">
##$SW= 16.880792210976
##$SWIBOX= (0..15)
0 0 2 0 0 0 0 0 0 0 0 0 0 0 0 0 
##$SW_h= 3378.37837837838
##$TD= 16384
##$TD0= 1
##$TE= 0
##$TE2= 300
##$TE3= 300
##$TEG= 300
##$TL= (0..7)
0 120 120 120 120 120 120 120 
##$TP= (0..7)
150 150 150 150 150 150 150 150 
##$TP07= 0
##$TPNAME0= <>
##$TPNAME1= <>
##$TPNAME2= <>
##$TPNAME3= <>
##$TPNAME4= <>
##$TPNAME5= <>
##$TPNAME6= <>
##$TPNAME7= <>
##$TPOAL= (0..7)
0.5 0.5 0.5 0.5 0.5 0.5 0.5 0.5 
##$TPOFFS= (0..7)
0 0 0 0 0 0 0 0 
##$TUNHIN= 0
##$TUNHOUT= 0
##$TUNXOUT= 0
##$USERA1= <user>
##$USERA2= <user>
##$USERA3= <user>
##$USERA4= <user>
##$USERA5= <user>
##$V9= 5
##$VALIST= <valist>
##$VCLIST= <CCCCCCCCCCCCCCC>
##$VD= 0
##$VDLIST= <DDDDDDDDDDDDDDD>
##$VPLIST= <PPPPPPPPPPPPPPP>
##$VTLIST= <TTTTTTTTTTTTTTT>
##$WBST= 1024
##$WBSW= 4
##$XGAIN= (0..3)
0 0 0 0 
##$XL= 0
##$YL= 0
##$YMAX_a= 539012
##$YMIN_a= -501553
##$ZGOPTNS= <>
##$ZL1= 120
##$ZL2= 120
##$ZL3= 120
##$ZL4= 120
##$ABSF1= 10
##$ABSF2= 0
##$ABSG= 5
##$ABSL= 3
##$ALPHA= 0
##$AQORDER= 0
##$ASSFAC= 0
##$ASSFACI= 0
##$ASSFACX= 0
##$ASSWID= 0
##$AUNMP= <proc_1d>
##$AZFE= 0.1
##$AZFW= 0.1
##$BCFW= 1
##$BC_mod= 2
##$BYTORDP= 1
##$COROFFS= 0
##$CY= 11.3945322036743
##$DATMOD= 1
##$DC= 2
##$DFILT= <>
##$DTYPP= 0
##$F1P= 16.9975609425685
##$F2P= -3.02152046262296
##$FCOR= 0.5
##$FTSIZE= 0
##$FT_mod= 4
##$GAMMA= 1
##$GB= 0.15
##$INTBC= 1
##$INTSCL= 1
##$ISEN= 128
##$LB= 0.24
##$LEV0= 0
##$LPBIN= 0
##$MAXI= 10000
##$MC2= 0
##$MEAN= 0
##$ME_mod= 0
##$MI= 1.114404
##$NCOEF= 0
##$NC_proc= 0
##$NLEV= 6
##$NOISF1= 3.799351
##$NOISF2= 2.8
##$NSP= 1
##$NTH_PI= 0
##$NZP= 0
##$OFFSET= 15.70392
##$PC= 1
##$PHC0= -9969.712
##$PHC1= 8.600921
##$PH_mod= 1
##$PKNL= yes
##$PPARMOD= 0
##$PSCAL= 0
##$PSIGN= 0
##$REVERSE= no
##$SF= 200.130013532006
##$SI= 16384
##$SIGF1= 3
##$SIGF2= 2
##$SINO= 400
##$SIOLD= 16384
##$SREGLST= <1H.CDCl3>
##$SSB= 0
##$STSI= 0
##$STSR= 0
##$SW_p= 3612.71676300578
##$SYMM= 0
##$S_DEV= 0
##$TDeff= 0
##$TDoff= 0
##$TI= <>
##$TILT= no
##$TM1= 0
##$TM2= 0
##$TOPLEV= 0
##$USERP1= <user>
##$USERP2= <user>
##$USERP3= <user>
##$USERP4= <user>
##$USERP5= <user>
##$WDW= 1
##$XDIM= 8192
##$YMAX_p= 0
##$YMIN_p= 0
$$ End of Bruker specific parameters
$$ ---------------------------------
##NTUPLES= NMR FID
##VAR_NAME=  TIME,          FID/REAL,        FID/IMAG
##SYMBOL=    X,             R,               I
##VAR_TYPE=  INDEPENDENT,   DEPENDENT,       DEPENDENT
##VAR_FORM=  AFFN,          ASDF,            ASDF
##VAR_DIM=   8192,          8192,            8192
##UNITS=     SECONDS,       ARBITRARY UNITS, ARBITRARY UNITS
##FACTOR=    0.000296,      1,               1
##FIRST=     0,             0,               0
##LAST=      2.424536,      0,               0
##MIN=       0,             -501553,         0
##MAX=       2.424536,      539012,          0
$$ Real data points
##PAGE= N=1
##DATA TABLE= (X++(R..R)), XYDATA
$$ [...]
$$ plain form
1954 -1054 -734 1935 -343 -387 510 -108 759 801 -550 56 1498 46 -743 419 1734 -976 -986 1285
1972 1285 713 103 -759 117 1451 204 -768 179 -52 1280 263 -1986 1759 522 -1871 1088 -79
1989 -79 -921 691 -913 -333 1305 -1508 -369 403 -867 1114 -1090 -897 1518 -368 -1230 995 -1016
2006 -1016 -923 1085 -685 -269 -167 -149 -136 38 -110 -699 -469 988 264 -1082 434 425 -102 -378 568 510
2026 510 -1303 1011 1080 -855 379 317 -594 1525 42 -1362 884 156 867 5 -1010 1325 602
2043 602 -1397 1681 641 -1432 1581 -609 -361 1778 -744 -653 1317 455 -636 -56 -303 1251 -164
2060 -164 -1226 755 253 -188 -62 -288 -279 723 -416 -873 844 -128 -1195 -372 627 -677 233 -608
2078 -608 -634 831 -240 -774 -401 133 387 -482 -1521 958 617 -1567 567 -144 -587 516 -274 -591
$$ packed form
1954a054L20K669k278m4Q97o18Q67M2j351O06J442j452p89J162J315k710j0K271
1972A285n72o10q62Q76J334j247r72R47k31J332j017k249L745j237k393K959j167
1989g9q42J612j604N80J638k813J139P72j270J981k204J93K415j886q62K225k011
2006a016R3K008j770M16J02J8J3J74j48n89K30J457p24j346J516rn27k76R46n8
2026E10j813K314O9j935J234o2r11K119j483j404K246p28P11q62j015K335p23
2043F02j999L078j040k073L013k190K48K139k522R1J970q62j091N80k47J554j415
2060a64j062J981n02m41J26k26RJ002j139m57J717r72j067Q23R99j304R10q41
2078f08k6J465j071n34L73N34K54q69j039K479l41k184K134p11m43J103p90l17
$$ plain form
2096 -591 1175 -83 -1241 477 132 541 -898 -573 1276 352 -1001 793 462 -271 1382 -899 -865
2113 -865 1633 557 -1196 60 1423 -12 -19 -228 879 699 -612 -36 454 207 194 -255 -859 1521
2131 1521 213 -1735 686 904 -498 -94 2 -322 831 -546 -556 120 -59 306 -758 -783 1047 -47
2149 -47 -1787 326 401 -596 203 -1127 -262 1264 -651 -1576 614 518 -409 -448 -689 750 41 -1156 55
2168 55 322 -481 798 -887 -1138 2160 -304 -1662 787 1152 -638 -76 105 216 1046 -726 -104 761
2186 761 178 123 -510 -212 1589 192 -1549 1489 759 -1223 718 184 -165 877 204 -1016 846
2203 846 210 -248 81 -256 787 112 -762 539 723 -1171 405 152 -1019 810 -191 -947 120
2220 120 -35 -558 638 -544 -783 600 -108 -254 -490 -168 528 -122 -1589 924 552 -1184 72 -180
$$ packed form
2096e91J766j258j158J718l45M09j439L25J849r24j353J794l31p33J653k281L4
2113h65K498j076j753J256J363j435pk09J107j80j311N76M90k47j3m49o04K380
2131A521j308j948K421K18j402M04R6l24J153j377j0O76j79L65j064k5J830j094
2149d7j740K113P5r97P99j330Q65J526j915r25K190r6r27l9k41J439p09j197J211
2168E5K67q03J279j685k51L298k464j358K449L65j790N62J81J11Q30j772O22Q65
2186G61n83n5o33K98J801j397j741L038p30j982J941n34l49J042o73j220J862
2203H46o36m58L29l37J043o75q74J301J84j894J576k53j171J829j001p56J067
2220A20j55n23J196j182k39J383p08j46k36L22O96o50j467K513l72j736J256k52
$$ plain form
2238 -180 63 652 -698 -859 1427 387 -1459 -49 346 508 -583 -981 557 1098 -820 -132 705
2255 705 -40 1248 -760 -1070 2144 703 -1832 470 1516 -63 -112 -713 1029 1044 -838 -114 726
2272 726 137 169 -29 -424 1511 114 -1691 862 1085 -342 -540 737 -204 239 -223 -616 526 -6
2290 -6 -304 -541 546 271 -195 -1204 347 796 -1343 -351 202 -252 -297 -233 -931 626 -84 -1213 713
2309 713 -2 -262 -465 -328 634 64 -1319 757 580 -960 601 -469 -469 1273 -695 -924 700 498
2327 498 -328 332 -17 809 -237 -351 769 264 -39 -206 225 -118 977 -456 -544 1247 923 -813
2345 -813 -171 1477 -549 116 314 -209 605 150 -261 627 -21 -308 645 -598 695 564 -1848 311
2363 311 972 -941 -169 46 -485 813 2 -1078 464 -218 -94 -447 -90 192 -302 -612 870 -388
$$ packed form
2238a80K43N89j350j61K286j040j846J410L95J62j091l98J538N41j918O88Q37
2255G05p45J288k008l10L214j441k535K302J046j579m9o01J742J5j882P24Q40
2272G26n89L2j98l95J935j397j805K553K23j427j98J277r41M43m62l93J142n32
2290fk98k37J087k75m66j009J551M49k139R92N53m54m5O4o98J557p10j129J926
2309G13p15k60k03J37R62n70j383K076j77j540J561j070%J742j968k29J624k02
2327D98q26O60l49Q26j046j14J120n05l03j67M31l43J095j433q8J791l24j736
2345h13O42J648k026O65J98n23Q14m55m11Q88o48k87R53j243J293j31k412K159
2363C11O61j913P72K15n31J298q11j080J542o82J24l53L57K82m94l10J482j258
$$ plain form
2381 -388 -1048 310 139 124 -519 -375 120 405 371 -510 -146 697 -192 -758 824 11 -612 220 -139 476
2401 476 -443 -213 344 156 323 108 -1138 729 1550 -1143 0 640 408 312 -197 386 138 -306 418
2420 418 550 -552 753 -332 -373 1313 -51 -795 448 360 -489 -158 -146 84 -195 172 590 -905 -36
2439 -36 755 -567 -664 84 -366 -97 38 -285 -275 -420 118 -244 -220 394 -816 -332 54 -111 -500 -191 -417
2460 -417 134 44 -295 -272 -578 827 33 -914 14 540 -499 209 333 -335 361 -238 -270 535 53 175
2480 175 -120 206 617 -438 -811 1352 251 -146 343 102 127 400 303 -492 119 488 500 -467 456 307
2500 307 -375 294 608 7 -313 175 248 -265 182 -24 -652 -39 640 -869 -32 262 -219 44 -202 -519
2520 -519 -126 249 -356 -6 -799 120 131 -1111 591 279 -1001 -154 440 -574 224 -226 -511 371 81
$$ packed form
2381c88o60J358j71j5o43J44M95K85l4q81L64Q43q89n66J582q13o23Q32l59O15
2401D76r19K30N57j88J67k15j246J867Q21k693J143O40k32r6n09N83k48m44P24
2420D18J32j102J305j085m1J686j364p44J243q8q49L31J2K30k79L67M18j495Q69
2439c6P91j322r7P48m50K69J35l23J0j45N38l62K4O14j210M84L86j65l89L09k26
2460d17N51r0l39K3l06J405p94r47R28N26j039P08J24o68O96n99l2Q05m82J22
2480A75k95L26M11j055l73K163j101l97M89k41K5K73r7p95O11L69J2r67R23j49
2500C07o82O69L14o01l20M88P3n13M47k06o28O13O79j509Q37K94m81K63k46l17
2520e19L93L75o05L50p93R19J1j242J702l12j280Q47N94j014P98m50k85Q82k90
$$ plain form
2539 81 -325 116 -71 23 -12 -255 15 51 -242 638 -308 -4 457 -68 -21 0 532 -142 258 151 203 -26
2561 -26 80 77 50 270 119 -20 -127 653 -155 -605 501 296 -487 390 375 -478 539 78 -530 648 199
2582 199 -314 -184 -31 514 142 -1214 752 903 -1208 256 184 -158 319 -288 -841 675 101 -908
2600 -908 230 266 -47 -547 -371 23 547 -547 -474 565 51 -321 -314 -400 376 301 -1362 -62 1297 -357
2620 -357 -494 46 -49 377 -288 -469 595 689 -556 160 -24 745 176 -934 873 542 -270 -74 637
2639 637 -271 485 225 -295 986 255 -210 -202 223 406 53 -759 850 297 -879 240 511 -488 260
2658 260 570 -880 444 510 -789 276 204 -547 -85 6 -353 343 -369 -277 470 -1021 311 529 -1107
2677 -1107 -202 820 -553 -468 347 -605 498 70 -548 -172 112 -210 -205 -192 29 709 -531 -176 142 -83
$$ packed form
2539H1m06M41j87R4l5k43K70L6k93Q80r46L04M61n25M7K1N32o74M00j07N2k29
2561b6J06lk7K20j51j39j07P80q08m50J106k05p83Q77j5q53J017m61o08J178m49
2582A99n13J30J53N45l72j356J966J51k111J464p2l42M77o07n53J516n74j009
2600i08J138L6l13n00J76L94N24j094P3J039n14l72Pq6P76p5j663J300J359j654
2620c57j37N40r5M26o65j81J064R4j245P16j84P69n69j110J807l31q12J96P11
2639F37r08P56k60n20J281p31m65QM25J83l53q12J609n53j176J119K71r99P48
2658B60L10j450J324O6j299J065p2p51M62R1l59O96p12R2P47j491J332K18j636
2677a107R05J022j373Q5Q15r52J103m28o18L76K84l22NJ3K21O80j240L55L18k25
$$ plain form
2697 -83 184 -372 -426 420 771 -834 139 819 52 -261 27 479 339 -86 -276 551 492 171 -250 -200 1135
2718 1135 144 -921 206 853 -146 -363 291 18 671 -190 -662 326 728 -65 -363 -278 1097 276 -1548
2737 -1548 301 919 -583 -439 446 -295 635 -12 -1353 560 284 -606 -245 -42 209 143 -750 -181 764
2756 764 -586 -395 -194 -414 302 -133 -929 151 839 -774 -309 282 -100 -91 225 22 320 -65 -670 463
2776 463 133 -173 0 -292 445 408 -421 192 732 -510 305 516 -579 216 467 -35 119 229 -284 510
2796 510 10 187 260 -509 338 146 -422 409 551 -553 64 578 -452 9 -78 -145 91 270 -320 -71
2816 -71 166 -119 -436 -595 398 294 -422 -228 310 -557 -408 438 -625 -116 228 -319 -199 117 -268 -22
2836 -22 137 -340 340 -318 -229 298 -374 -59 281 -693 -177 958 -862 -21 386 -596 484 205 -190 136
$$ packed form
2697h3K67n56n4Q46L51j605R73O80p67l13K88M52j40m25j90Q27n9l21m21N0J335
2718A135r91j065J127O47r99k17O54k73O53q61m72R88M02p93k98Q5J375q21j824
2737a548J849O18j502J44Q85p41R30o47j341J913k76q90L61K03K51o6q93N69R45
2756G64j350J91K01k20P16m35p96J080O88j613M65N91l82RL16k03K98l85o05J133
2776D63l30l06J73k92P37l7q29O13N40j242Q15K11j095P95K51n02J54J10n13P94
2796E10n00J77P3p69Q47j92n68Q31J42j104O17N14j030M61q7o7K36J79n90K49
2816g1K37k85l17j59R93j04p16J94N38q67J49Q46j063N09L44n47J20L16l85K46
2836b2J59m77O80o58Q9N27o72L15L40r74N16J135j820Q41M07r82J080k79l95L26
$$ plain form
2856 136 188 3 238 -231 138 171 -297 494 87 -365 239 158 143 472 12 -474 532 456 25 -624 517
2877 517 403 -344 301 -38 -231 41 203 81 103 -154 261 25 -12 91 -914 -37 700 -500 -545 162
2897 162 94 -54 76 -681 363 -558 -78 274 -498 -22 99 -528 136 539 -990 -164 416 -35 -502 -557
2917 -557 128 367 -124 -73 42 19 195 -343 0 166 -401 1 149 277 -289 -218 487 256 -216 249 93
2938 93 -48 849 -27 -247 308 -31 334 -40 -127 258 -51 -59 600 -336 -43 479 -804 390 254 -302 30
2959 30 315 -161 -29 -283 -42 175 -611 496 -199 -442 191 55 -616 10 -203 -525 37 -113 -161 -458
2979 -458 -174 252 -569 60 135 -277 -30 173 -94 -163 94 -97 -179 -62 235 -429 -244 434 -203 -274 104
3000 104 -60 336 303 -511 473 243 41 250 -284 385 291 -427 617 520 -466 81 477 -31 367 -335 -299
$$ packed form
2856A36N2j85K35m69L69L3m68P91m07m52O04q1j5L29m60m86J006p6m31o49J141
2877E17j14p47O45l39j93K72J62j22K2k57M15k36l7J03j005Q77P37j200m5P07
2897A62o8j48J30p57J044r21M80L52p72M76J21o27O64M03j529Q26N80m51m67n5
2917e57O85K39m91N1J15k3J76n38L43J66n67M02J48J28n66P1P05k31m72M65j56
2938I3j41Q97q76k20N55l39L65l74q7L85l09qO59r36K93N22j283J194j36n56L32
2959C0K85m76J32k54K41K17p86J107o95k43O33j36o71O26k13l22N62j50m8k97
2979d58K84M26q21O29P5m12K47K03k67o9K57j91q2J17K97o64J85O78o37p1L78
3000A04j64L96l3q14R84k30k02K09n34O69r4p18J044r7r86N47L96n08L98p02L6
$$ plain form
3021 -299 482 355 -86 -333 472 521 2 -560 531 518 -218 -227 290 305 -88 124 -184 198 303 -413 -623
3042 -623 427 -56 -534 54 -46 27 -328 -664 -23 -155 -108 19 -278 -62 495 -517 -271 483 -292 -375
3062 -375 13 195 -74 -250 -276 306 -193 -140 -110 -233 194 91 -164 67 397 -455 142 85 -115 113 268
3083 268 40 122 316 -44 -8 77 140 350 -154 300 135 245 -3 51 -92 -266 557 -128 -242 -4 20 -69
3105 -69 282 -64 108 187 -1 -199 140 206 -131 -239 -74 137 -80 -402 146 -388 -133 -101 -267 -277 266 -241
3127 -241 -559 238 -54 -296 -264 305 28 -309 128 -28 35 -225 64 -438 204 409 -757 -113 319 141
3147 141 -517 54 213 343 -134 -135 379 113 118 -168 -74 239 241 -510 218 512 252 -145 112 224 90 98 -370
3170 -370 305 842 -596 -241 41 225 139 -357 69 593 -175 -590 411 171 162 -177 -249 112 371 -551 -455
$$ packed form
3021b99P81j27m41k47Q05M9n19n62J091j3p36rN17J5l93K12l08L82J05p16k10
3042f23J050m83m78N88j00P3l55l36O41j32M7J27k97K16N57j012K46P54p75q3
3062c75L88J82k69j76k6N82m99N3L0j23M27j03k55K31L30q52N97n7k00K28J55
3083B68k28Q2J94l60L6Q5O3K10n04M54j65J10k48N4j43j74Q23o85j14K38K4q9
3105f9L51l46J72P9j88j98L39O6l37j08J65K11k17l22N48n34K55L2j66j0N43n07
3127b41l18P97k92k42L2N69k77l37M37j56O3k60K89n02O42K05j166O44M32j78
3147A41o58N71J59J30m77jN14k66Nk86R4L13Kp51P28K94k60l97K57J12j34Qm68
3170c70O75N37j438L55K82J84q6m96M26N24p68m15J001k40rl39p2L61K59r22R6
$$ plain form
3191 -455 260 90 -495 -366 201 -59 -235 -118 196 -137 -242 16 -624 244 265 -470 -314 528 158 -642
3211 -642 32 145 62 -319 48 349 -15 -105 119 -130 -263 392 -261 205 272 -321 90 310 -180 -170 376
3232 376 -52 -28 -34 247 492 -173 161 -3 228 241 -161 -211 346 467 -453 -50 190 567 -410 5 193 306
3254 306 -22 -116 -50 7 198 -654 24 329 -330 -493 -309 634 -134 -574 361 233 29 -145 -297 -99 529
3275 529 -398 -321 -21 308 30 -551 108 128 -320 -396 244 -200 122 66 -465 99 109 -189 -509 269 418 206
3297 206 -205 226 321 -74 108 -149 266 207 -93 23 87 354 14 -101 352 335 -693 428 184 270 585
3318 585 -243 131 226 -36 -45 221 -20 361 -101 -91 612 -416 -361 541 -41 -211 323 -175 203 233 -649 153
3340 153 228 112 -102 -227 214 -141 -229 -175 313 -495 200 -59 66 -69 -320 56 -243 459 -142 -877 109
$$ packed form
3191d55P15j70n85J29N67k60j76J17L14l33j05K58o40Q68K1p35J56Q42l70q00
3211f42O74J13q3l81L67L01l64r0K24k49j33O55o53M66O7n93M11K20m90J0N46
3232C76m28K4oK81K45o65L34j64K31J3m02n0N57J21r20M03K40L77r77M15J88J13
3254C06l28r4O6N7J91q52O78L05o59j63J84R43p68m40R35j28k04j74j52J98O28
3275E29r27P7L00L29k78n81O59K0m48p6O40m44L22n6n31N64J0k98l20P78J49k12
3297B06m11M31R5l95J82k57M15n9l00J16O4K67l40j15M53j7j028J121k44Q6L15
3318E85q28L74R5k62rK66k41L81m62J0P03j028N5R02n82j70N34m98L78L0q82Q02
3340A53P5j16k14j25M41l55q8N4M88q08O95k59J25j35k51L76k99P02o01p35R86
$$ plain form
3361 109 391 -400 -308 39 -39 301 -519 127 246 -429 294 169 10 501 -167 -492 715 14 -365 178
3381 178 345 209 -151 -109 645 51 143 336 31 258 511 -228 229 152 -369 -50 217 445 -214 -67 433
3402 433 -24 -66 115 -336 94 418 -72 195 -10 -130 163 115 122 -202 -512 201 284 -755 201 161 -83 34
3424 34 -51 -379 174 -92 -240 -7 -45 173 -351 -392 491 -385 -324 170 -230 -225 538 -441 -157 43 -45 -34 -430
3447 -430 113 -28 -37 -22 537 -62 135 498 163 46 93 144 -144 -68 -62 -179 137 165 163 -11 471 -49 171 100
3471 100 8 -9 -67 364 125 -349 51 63 -1 403 68 -294 127 -72 -196 -174 -161 -194 -119 9 69 59 71 401
3495 401 -387 -49 60 -599 -67 126 -15 -444 -230 -146 19 -162 -245 -52 -66 190 -464 15 -318 -99 -275
3516 -275 52 213 -237 33 0 397 -53 376 -127 -2 421 349 -251 19 247 -20 -5 -29 264 6 -157
$$ packed form
3361A09K82p91R2L47p8L40q20O46J19o75P23j25j59M91o68l25J207p01l79N43
3381A78J67j36l60M2P54n94R2J93l05K27K53p39M57p7n21L19K67K28o59J47N00
3402D33m57m2J81m51M30L24m90K67k05j20K93m8Pl24l10P13Q3j039R56m0k44J17
3424C4q5l28N53k66j48K33l8K18n24m1Q83q76O1M94m00NP63r79K84K00q8J1l96
3447d30N43j41rJ5N59n99J97L63l35j17M7N1k88P6Oj17L16K8kj74M82n20K20p1
3471A00r2j7n8M31k39m74M00J2o4M04l35l62M21j99j24K2J3l3P5J28O0j0J2L30
3495D01p88L38J09o59N32J93j41m29K14Q4J65j81q3J93j4K56o54M79l33K19j76
3516b75L27J61m50K70l3L97m50M29n03J25M23p2o00K70K28k67J5k4K93k58j63
$$ plain form
3537 -157 178 116 89 204 221 -123 105 9 93 294 32 197 -70 173 105 77 108 -174 -18 108 222 -138 -124
3560 -124 -102 -115 -14 -15 11 -254 119 -71 -241 -118 226 -362 -283 -72 -35 11 -67 35 -59 180 -194 -193 132 233
3584 233 -66 -295 447 143 -481 -202 106 -46 60 69 -147 137 100 -254 -32 51 250 -391 20 377 121
3605 121 -98 -80 428 8 -20 -135 240 85 91 -353 144 392 60 -122 79 597 -176 -61 384 50 -205
3626 -205 115 54 -273 338 -503 -8 165 294 -84 130 155 3 169 -130 -15 6 -131 -170 -139 -206 63 -179
3648 -179 -264 243 243 -633 -20 -39 -284 -314 111 -252 -108 -240 -178 18 -121 56 -251 35 115 -210 -16 309
3670 309 50 -103 81 -64 -45 148 537 -160 -23 -32 46 11 -42 -243 -138 150 234 144 -170 295 151 -25 52
3693 52 163 -113 -99 -16 32 118 -250 -43 430 85 116 -125 3 363 71 -368 66 135 -140 45 -88 -111 -18
$$ packed form
3537a57L35o2k7J15J7l44K28r6Q4K01k62J65k67K43o8k8L1k82J56J26J14l60J4
3560a24K2j3J01jK6k65L73j90j70J23L44n88P9K11L7M6p8J02r4K39l74JL25J01
3584B33k99k29P42l04o24K79L08j52J06Rk16K84l7l54K22Q3J99o41M11L57k56
3605A21k19J8N08m20k8j15L75j55Om44M97K48l32j82K01N18p73J15M45l34k55
3626b05L20o1l27O11q41M95J73J29l78K14K5j52J66k99J15K1j37l9L1o7K69k42
3648a79q5N07%q76O13j9k45l0M25l63J44j32O2J96j39J77l07K86Q0l25J94L25
3670C09k59j53J84j45J9J93L89o97J37rP8l5n3k01J05K88Q4r0l14M65j44j76P7
3693E2J11k76J4Q3M8Q6l68K07M73l45L1k41J28L60k92m39M34O9k75J85j33k3R3
$$ plain form
3716 -18 171 -357 46 75 -257 -395 -144 -158 -148 -120 -372 -54 26 -64 -112 -353 215 27 -294 89 301 -370 -333
3739 -333 -79 -72 -23 -186 29 -13 -135 -48 -235 128 278 69 -189 378 203 -141 228 -12 218 154 -236 111
3761 111 -3 -85 66 -242 30 294 -512 -136 447 50 -205 324 -47 -109 25 33 127 200 262 6 -59 -12 -114
3784 -114 44 -129 -21 -159 46 117 -139 -100 -203 96 -193 -38 27 -322 -59 -150 -364 186 -197 -455 -45
3805 -45 -153 -149 -52 -185 110 -106 57 20 -143 -176 162 -188 -44 57 -229 -176 217 212 -187 -320 201 7 -292
3828 -292 193 292 -40 -29 -3 30 4 171 205 -125 1 154 -167 -192 245 -36 -29 376 -184 13 -212 -152 -14
3851 -14 19 81 -178 55 227 185 -265 106 -212 38 -167 70 -384 -15 -176 -38 21 -272 -45 -66 -68 -86 -117
3874 -117 -371 -128 -276 -140 34 -338 -139 202 102 5 -55 157 -190 -48 -2 -171 -12 390 -114 -357 137
$$ packed form
3716a8J89n28M03K9l32j38K51j4J0K8k52L18Q0r0m8k41N68j88l21L83K12o71L7
3739c33K54PM9j63K15m2j22Q7j87L63J50k09k58N67j75l44L69k40K30o4l90L47
3761A11j14q2J51l08K72K64q06L76N83l97k55N29l71o2J34QR4P3O2k56o5M7j02
3784a14J58j73J08j38K05P1k56L9j03K99k89J55O5l49K63r1k14N50l83k58M10
3805d5j08MR7j33K95k16J63l7j63l3L38l50J44J01k86N3L93nl99j33N21j94k99
3828b92M85R9l32J1K6L3k6J67L4l30J26J53l21k5M37k81PM05n60J97k25O0J38
3851a4L3O2k59K33J72m2m50L71l18K50k05K37m54L69j61J38N9k93K27k1kj8l1
3874a17k54K43j48J36J74l72J99L41j00r7o0K12l47J42M6j69J59M02n04k43M94
$$ plain form
3895 137 44 185 -121 -21 367 -132 241 334 -117 -71 94 -97 249 291 -143 -6 22 397 -117 -221 330 269
3917 269 -195 100 -26 -414 448 -283 -134 318 -20 71 -283 135 -32 -165 -116 103 -29 177 228 -159 179
3938 179 138 31 -80 -10 249 -261 -15 190 -34 -260 124 -205 -162 13 -560 -100 -19 -360 -139 102 -71
3959 -71 -44 -367 163 81 -246 -153 -32 -234 241 -45 -244 340 46 -98 -102 -173 202 -203 -175 362 132 31 350
3982 350 127 -130 312 -122 -63 77 186 -3 371 261 -86 -60 194 224 -89 175 -59 64 -37 -154 88
4003 88 -267 136 51 29 -19 58 -66 -169 195 -5 -68 57 145 71 -227 -48 -43 120 -235 -82 69 189 -118
4026 -118 -295 42 -120 -115 -195 190 136 -359 -101 50 25 46 50 -272 232 172 -79 118 37 -35 -96 -67 -32 -73 -39
4051 -39 294 23 192 214 -132 257 362 123 -135 49 218 144 45 106 34 31 96 -195 -77 296 198 88 -103
$$ packed form
3895A37r3J41l06J00L88m99L73R3m51M6J65j91L46M2m34J37K8L75n14j04N51o1
3917B69m64K95j26l88Q62p31J49M52l38R1l54M18j67j33M9K19j32K06N1l87L38
3938A79m1j07j11P0K59n10K46K05k24k26L84l29M3J75n73M60Q1l41K21K41j73
3959g1K7l23N30q2l27R3J21k02M75k86j99N84k94j44mp1L75m05K8N37k30j01L19
3982C50k23k57M42m34N9J40J09j89L74j10l47K6K54L0l13K64k34J23j01j17K42
4003H8l55M03q5k2m8P7j24j03L64k00o3J25Q8p4k98J79NJ63l55J53J51J20l07
4026a18j77L37j62Nq0L85n4m95K58J51k5K1Ml22N04o0k51J97q1p2o1K9L5m1L4
4051c9L33k71J69K2l46L89J05k39k58J84J69p4r9O1p2lO5k91J18L73r8j10j91
$$ plain form
4074 -103 365 62 -109 8 167 -48 -190 51 10 -30 191 -102 -137 186 -59 -285 -96 -34 -236 -453 -40
4095 -40 -107 -163 -138 -92 -135 -115 36 -143 -141 -168 -21 157 81 18 20 -98 -141 185 -82 244 -220 -9 96 -31 97
4120 97 -26 249 -80 41 179 141 -189 90 198 -458 274 118 17 373 332 -86 -3 -150 -45 218 24
4141 24 234 -299 261 392 -95 -43 -36 15 -121 72 -7 125 172 -157 74 -89 41 -204 -69 124 34 -179 -25
4164 -25 -129 -112 -53 -62 269 -42 -83 -93 -113 131 -12 -227 89 125 -161 -314 89 201 -143 -145 70 95 -270 -22
4188 -22 -79 107 125 -78 -403 197 -243 122 -7 -238 42 -342 -49 -85 286 92 52 -253 254 101 -167 82
4210 82 66 122 -96 334 -120 -58 307 274 -178 -62 180 -124 285 -179 -15 3 215 -254 -191 96 62 90 -216
4233 -216 222 -11 -269 -127 96 -385 6 -71 -62 -25 -183 77 121 -26 -115 -114 -52 20 -81 -326 66 -116 -217
$$ packed form
4074a03M68l03j71J17J59k15j42K41m1m0K21k93l5L23k45k26J89O2k02k17M13
4095d0o7n6K5M6m3K0J51j79Kk7J47J78p6o3Kj18m3L26k67L26m64K11J05j27J28
4120I7j23K75l29J21J38l8l30K79J08o56P32j56j01L56m1m18Q3j47J05K63j94
4141B4K10n33N60J31m87N2PN1j36J93p9J32M7l29K31j63J30k45J35J93r0k13J54
4164b5j04J7N9rL31l11m1j0k0K44j43k15L16L6k86j53M03J12l44kK15K5l65K48
4188b2n7J86J8k03l25O00m40L65j29k31K80l84K93l6L71j94m0l05N07j53k68K49
4210H2j6N6k18M30m54O2L65l3m52J16K42l04M09m64J64J8K12m69O3K87l4K8l06
4233b16M38k33k58J42K23m81L91p7RL7j58K60M4j47q9JO2P2j01k45L92j82j01
$$ plain form
4256 -217 5 -279 85 94 -12 -131 9 319 -173 41 -46 161 61 138 -298 78 -55 133 229 -49 22 132
4278 132 -58 -205 102 -311 273 118 -120 93 -32 84 216 304 186 -266 28 147 169 -264 175 -84 -417
4299 -417 41 -137 -189 69 -15 108 -53 -140 -190 -137 81 43 -291 72 -5 29 -192 -66 -109 179 -19 52 -51
4322 -51 -394 58 -246 -84 -42 -221 -46 61 168 6 -143 -210 62 26 74 87 -244 157 -83 79 226 141
4344 141 -85 343 -46 -131 48 128 230 -93 -60 139 3 -161 73 -47 21 107 -112 117 88 -11 5 -47 51
4367 51 72 -185 4 164 -112 -57 130 93 235 -334 128 -194 69 215 -34 40 143 -142 -378 131 -185 -349
4389 -349 2 -25 -47 -257 -85 -82 144 -35 -223 -410 -22 19 59 57 26 -76 -133 123 -225 175 -92 -7 19 -110
4413 -110 61 -173 -29 222 -105 193 21 -8 149 212 240 47 -157 197 16 -122 -43 -89 45 82 -26 -163
$$ packed form
4256b17K22k84L64Rj06j19J40L10m92K14q7K07j00P7m36L76j33J88R6k78P1J10
4278A32j90j47L07m13N84j55k38K13j25J16J32Q8j18m52K94J19K2m33M39k59l33
4299d17M58j78n2K58q4J23j61q7n0N3K18l8l34L63p7L4k21J26m3K88j98P1j03
4322e1l43M52l04J62M2j79J75J07J07j62j49o7K72l6M8J3l31M01k40J62J47q5
4344A41k26M28l89q5J79Q0J02l23L3J99j36j64K34j20O8Q6k19K29k9r9J6n2R8
4367E1K1k57J89J60k76N5J87l7J42n69M62l22K63J46k49P4J03k85k36N09l16j64
4389c49L51k7k2k10J72LK26j79j88j87L88M1M0kl1j02n7K56l48M00k67Q5K6j29
4413a10J71k34J44K51l27K98j72k9J57O3K8j93k04L54j81j38P9m6J34L7j08j37
$$ plain form
4435 -163 283 -236 102 155 209 77 50 76 192 -59 156 27 -153 -7 177 -254 75 47 -241 -216 40 225
4457 225 -176 -71 92 -141 -270 6 -26 -121 136 -74 130 63 102 -117 -48 197 -187 -99 -41 -59 -216 65 2
4480 2 -93 84 -15 7 -375 128 -99 44 -178 -77 183 -105 243 7 136 20 98 105 -21 127 -82 199 182
4503 182 84 94 215 -275 103 100 27 -61 -128 165 -57 83 94 124 -65 -18 -23 206 198 25 -79 117 243 -11 -120
4528 -120 207 63 131 -275 -19 -41 -53 -52 63 38 -91 181 -27 -228 60 -110 -248 -18 -49 -47 3 -7 -62 -21
4552 -21 -305 53 25 -150 -132 23 13 72 -101 -85 355 154 -37 6 -178 -216 -38 -217 -109 183 45 289 -353
4575 -353 18 71 -45 150 408 186 76 139 -170 176 -6 -240 -61 296 -16 27 257 94 -23 -258 122
4596 122 0 207 -17 -173 109 1 140 -245 94 -51 -35 -31 -7 13 -21 -10 98 -80 -154 -41 -225 20 152
$$ packed form
4435a63M46n19L38N3N4j32k7K6J16k51K15j29j80J46J84m31L29k8k88K5K56J85
4457B25m01J05J63k33j29K76l2r5K57k10K04o7L9k19O9K45l84Q8N8j8j57K81o3
4480Br5J77r9K2l82N03k27J43k22J01K60k88L48k36J29j16P8Pj26J48k09K81j7
4503A82r8J0J21m90L78lp3q8o7K93k22J40J1L0j89M7nK29qj73j04J96J26k54j09
4528a20L27j44O8m06K56k2j2JJ15k5j29K72k08k01K88j70j38K30l1KN0j0n5M1
4552b1k84L58k8j75J8J55j0N9j73J6M40k01j91M3j84l8J78j79J08K92j38K44o42
4575c53L71N3j16J95K58k22j10O3l09L46j82k34J79L57l12M3K30j63j17k35L80
4596A22j22K07k24j56K82j08J39l85L39j45J6MK4K0l4J1J08j78p4J13j84K45J32
$$ plain form
4619 152 31 215 50 -46 122 -104 133 -130 -40 -63 17 0 82 51 -141 -13 152 -59 -190 -140 -118 -108 -78 -148
4643 -148 -105 79 -64 -18 76 177 96 -110 -78 63 -88 83 102 154 -155 70 -55 -60 0 245 32 -15 192 40
4667 40 49 -180 31 -69 53 -153 -88 274 -21 -127 -20 -255 -112 193 6 42 -120 -25 39 -482 131 270
4689 270 -381 -116 145 -354 -103 213 59 -291 -387 11 -242 -99 5 -232 -100 -29 155 -82 -80 -39 10 37
4711 37 -108 114 -138 -43 98 -17 138 -175 -115 -84 144 86 322 -147 -16 -60 -25 157 -41 -37 -49 129 -124
4734 -124 182 -204 -17 354 94 -3 52 138 215 -154 -75 70 -187 205 110 -272 318 -87 -188 20 -68 -158 -361
4757 -361 -227 -42 261 -152 65 94 -161 252 -255 -72 -46 20 -162 -38 -148 22 -127 -64 120 -187 -2
4778 -2 26 -154 38 144 -212 65 17 28 180 -174 209 15 82 190 -96 -25 60 14 -45 39 193 139 -27 90
$$ packed form
4619A52j21J84j65r6J68k26K37k63R0k3Q0j7Q2l1j92J28J65k11j31N0K2J0L0p0
4643a48M3J84j43M6R4J01q1k06L2J41j51J71J9N2l09K25j25nO0K45k13m7K07j52
4667D0Rk29K11j00J22k06O5L62k95j06J07k35J43L05j87L6j62R5O4n21O13J39
4689B70o51K65K61m99K51L16j54l50r6L98k53J43J04k37J32P1J84k37KM1M9K7
4711C7j45K22k52R5J41j15J55l13O0L1K28n8K36m69J31m4L5J82j98Mj2J78k53
4734a24L06l86J87L71k60r7N5Q6P7l69P9J45k57L92r5l82N90m05j01K08q8r0k03
4757c61J34J85L03m13K17K9k55M13n07J83K6O6j82J24j10J70j49O3J84l07J85
4778bK8j80J92J06l56K77m8J1J52l54L83j94O7J08k86P1Q5m6n9Q4J54n4j66J17
$$ plain form
4802 90 407 144 39 31 10 43 273 -216 233 98 46 216 -16 -24 -196 -164 39 127 193 -178 239 280 77 -346
4826 -346 55 171 8 153 33 10 21 -16 125 -237 -204 175 -39 -16 59 167 -204 22 63 -82 -125 -221 150
4849 150 112 -107 221 -284 -107 134 -24 123 173 -190 -58 181 -15 -149 153 -46 193 83 6 -114 -78
4870 -78 146 44 140 23 -172 -150 -148 -5 17 17 -143 311 37 151 -235 -61 75 147 127 -15 78 -67 70 -238
4894 -238 286 100 114 231 36 -14 49 291 -40 255 -57 -151 57 -90 -87 84 59 -282 -117 39 130 -7 187
4917 187 27 -111 -97 69 191 -38 -29 -194 -177 101 -136 209 -188 53 -181 -179 -271 74 -13 -86 89 -149 145
4940 145 -114 -15 -186 328 27 59 236 -63 27 -137 89 -129 -158 187 133 -93 18 138 201 -81 -7 -50 68
4963 68 223 53 -71 -101 -150 26 -85 -72 221 -54 88 -2 31 -64 86 -78 34 288 -65 96 -116 64
$$ packed form
4802I0L17k63j05qk1L3K30m89M49j35n2J70k32qj72L2K03Q8O6l71M17M1k03m23
4826c46M01J16j63J45j20k3J1l7J41l62L3L79k14K3P5J08l71K26M1j45m3r6L71
4849A50l8k19L28n05J77K41j58J47N0l63J32K39j96j34L02j99K39j10p7j20L6
4870g8K24j02R6j17j95K2KJ43K2%j60M54k74J14l86J74J36P2k0j42R3j45J37l08
4894b38N24j86J4J17j95n0O3K42l31K95l12r4K08j47LJ71k5l41J65J56R1j37J94
4917A87j60j38J4J66J22k29Rj65J7K78k37L45l97K41k34Kr2L45q7p3J75k38K94
4940A45k59R9j71N14l01L2J77k99R0j64K26k18k9L45n4k26J11J20O3k82P4m3J18
4963F8J55j70j24l0m9J76j11J3K93k75J42r0L3r5J50j64J12K54l53J61k12J80
$$ plain form
4985 64 -41 43 119 -294 -108 -56 -217 68 23 43 26 -85 220 22 62 38 -281 57 -33 23 -234 -112 -232 -1
5009 -1 42 274 261 63 190 172 249 195 47 32 -45 -135 -128 7 168 53 -5 94 62 -47 120 -222 155 -55 274
5034 274 -52 116 -75 -23 -104 79 230 -42 -127 -10 21 -139 88 -18 -193 -39 66 -20 -128 7 -119 -288
5056 -288 6 -12 125 89 9 -97 -219 5 -159 42 -44 -25 -1 296 -38 -185 24 -104 -212 -36 -72 -35 98
5079 98 -256 79 -27 151 36 -281 68 -166 125 -92 118 44 -61 73 185 -156 -95 264 -18 50 -116
5100 -116 -120 287 90 -115 -111 81 105 110 -132 10 182 -143 80 144 -111 -8 -28 -59 286 -110 -114 147 -134 55
5124 55 -256 136 -75 40 1 46 72 94 -44 -216 139 -50 31 -13 -363 -32 0 29 -20 -27 11 112 428 53
5148 53 -119 -359 131 -117 171 -304 234 -11 -318 -89 85 105 30 -144 -51 -74 -127 23 204 -159 -58 7
$$ packed form
4985F4j05Q4P6m13J86N2j61K85m5K0j7j11L05j98M0k4l19L38r0N6k57J22j20K31
5009aM3K32j3j98J27j8P7n4j48j5p7r0PJ35J61j15n8R9l2j09J67l42L77k10L29
5034B74l26J68j91N2q1J83J51k72q5J17L1j60K27j06j75J54J05q6j08J35j26j69
5056b88K94j8J37l6q0j06j22K24j64K01q6J9K4K97l34j47K09j28j08J76l6L7J33
5079I8l54L35j06J78j15l17L49k34K91k17K10p4j05J34J12l41O1L59k82O8j66
5100a16mM07j97k05MJ92K4Nk42J42J72l25K23O4k55J03k0l1L45l96mK61k81J89
5124E5l11L92k11J15l9M5K6K2j38j72L55j89Q1m4l50L31L2K9m9pL8J01L16l75
5148E3j72k40M90k48K88m75N38k45l07K29J74K0p5j74R3k3n3J50J81l63J01O5
$$ plain form
5170 7 -230 -102 309 -91 -148 262 162 -34 -116 11 64 32 185 100 -30 190 116 -194 213 20 215 129 303
5193 303 148 42 -104 50 -197 92 -50 100 99 61 -6 270 115 78 -316 -132 -304 -88 47 -214 191 -351
5215 -351 178 -135 -102 230 -203 -148 -311 -15 -213 -152 -262 92 102 -116 100 203 152 147 -52 -150 62 -99 -132
5238 -132 39 55 150 -13 121 -86 21 173 -81 -76 -88 144 -30 163 61 150 135 252 67 161 -69 -32 204
5261 204 193 141 -307 47 89 -37 90 -38 18 -119 -27 176 -55 -130 118 -18 26 268 42 23 108 176 44
5284 44 -196 -137 -132 -258 -99 -123 -159 236 -73 -16 158 13 43 -44 -69 67 53 86 -136 190 -60 22 -468 7
5308 7 -87 19 50 13 -144 -28 -36 14 87 103 69 111 75 256 131 -6 18 14 110 -105 -117 -131 -48 131 15 86 -234
5335 -234 142 -57 41 418 -51 -2 -161 138 72 62 -101 -435 81 -41 -388 -54 44 -6 -4 121 279 -38 -19
$$ packed form
5170Gk37J28M11m00n7M10j00j96q2J27N3l2J53q5j30K20p4l10M07j93J95q6J74
5193C03j55j06j46J54k47K89j42J50jl8o7K76j55l7l94J84j72K16J35k61M05n42
5215c51N29l13L3L32m33N5j63K96j98O1j10L54J0k18K16J03n1nj99r8K12j61l3
5238a32J71J6R5j63J34k07J07J52k54Nj2K32j74J93j02Q9j5J17j85R4k30L7K36
5261B04j1n2m48L54M2j26J27j28N6j37R2K03k31p5K48j36M4K42k26j9Q5O8j32
5284D4k40N9Nj26J59k4l6L95l09N7J74j45L0q7k5J36j4L3k22L26k50Q2m90M75
5308Gr4J06L1l7j57J16qN0P3J6l4M2l6J81j25j37K4mR6k15j2j4Q3J79j16P1l20
5335b34L76j99R8L77m69M9j59K99o6j0j63l34N16j22l47L34R8n0KJ25J58l17J9
$$ plain form
5358 -19 50 126 65 -34 -300 8 179 95 -245 -47 -20 -75 -88 238 -26 -23 -215 47 -33 36 -166 -265 52 -82 43
5383 43 160 336 100 -87 -34 -9 -130 220 -124 39 162 164 103 128 -12 -57 15 81 136 9 -116 -12 272 13
5407 13 -198 19 105 225 31 94 134 -89 -104 43 -24 264 -382 131 -126 -22 -223 -87 -12 -125 107 4
5429 4 -22 -17 233 -170 -18 -219 -149 82 -112 49 5 11 -62 -63 29 128 209 -96 141 -278 27 -126 -115 -84 -70 38
5455 38 11 -8 -74 31 -280 5 106 380 46 -112 57 135 -114 73 -47 -43 194 -189 194 130 -123 7 167
5478 167 239 97 -102 155 322 172 257 62 -139 19 133 47 -15 128 78 11 36 19 237 -16 162 -53 -3
5501 -3 54 -144 -91 -39 128 27 24 86 -100 -6 -244 -33 -81 152 -193 34 -163 -134 -193 -125 139 -198 232 -23
5525 -23 -88 61 -110 -62 225 21 -167 -240 85 -435 -326 3 151 -30 -195 47 -22 128 -10 116 -139 310
$$ packed form
5358a9O9P6o1r9k66L08J71q4l40J98K7n5j3L26k64Lj92K62q0O9k02r9L17j34J25
5383D3J17J76k36j87N3K5j21L50l44J63J23Ko1K5j40m5P2O6N5j27j25J04K84k59
5407A3k11K17Q6J20j94O3M0k23j5J47o7K88o46N13k57J04k01J36P5j13K32j03
5429Dk6NK50m03J52k01P0K31j94J61m4Op3jR2R9Q1l05K37m19L05j53J1L1J4J08
5455C8k7j9o6J05l11K85J01K74l34j58J69P8k49J87j20MK37l83L83o4k53J30J60
5478A67P2j42j99K57J67j50Q5j95k01J58J14q6o2J43n0o7K5j7K18k53J78k15N0
5501cN7j98N3N2J67j01lO2j86R4k38K11m8K33l45K27j97K9n9O8K64l37M30k55
5525b3o5J49j71M8K87k04j88p3L25n20J09L29J48j81j65K42o9J50j38J26k55M49
$$ plain form
5547 310 43 -238 18 22 -73 118 93 57 89 -60 155 108 107 56 -129 -4 -17 95 83 27 63 -65 23 27 -151 -252
5573 -252 -62 122 -138 352 51 -134 24 94 45 104 -102 -13 -167 -117 42 56 -33 -90 173 -35 31 47 124 -2
5597 -2 6 -292 -316 -274 -199 35 73 70 -89 -72 345 154 -189 -78 97 144 -102 148 119 1 -41 17 -172 74 49
5622 49 -148 -73 -81 -240 165 -71 -32 -84 -102 -13 -11 0 10 -30 1 42 -173 10 -18 44 48 28 0 -308 -141 111 11
5649 11 44 23 -181 -100 114 -172 91 -78 108 14 -57 -41 -165 -160 -185 -27 30 -113 107 -241 126 212 -128 -110
5673 -110 4 40 -114 77 -150 -87 -7 217 -160 207 117 -258 -138 69 -117 -107 172 133 -72 42 -188 67
5695 67 5 -81 -117 26 209 -21 84 173 252 -63 90 87 52 194 65 -175 112 -214 -131 -49 -56 195 -107 32
5719 32 171 186 -60 108 25 -68 75 3 -205 -104 34 77 -8 38 -136 102 -53 -79 160 -24 88 28 -51 -52
$$ packed form
5547C10k67k81K56Mr5J91k5l6L2j49K15m7jn1j85J25j3J12j2n6L6j28Q8Mj78j01
5573b52J90J84k60M90l01j85J58P0m9N9k06Q9j54N0J59J4q9n7K63k08O6J6P7j26
5597bQk98k4M2P5K34L8lj59J7M17j91l43J11J75M7k46K50k9j18m2N8j89K46k5
5622D9j97P5qj59M05k36L9n2j8Q9KJ1J0m0L1M1k15J83k8O2Mk0k8l08J67K52j00
5649A1L3k1k04Q1K14k86K63j69J86r4p1J6j24Nk5J58N7j43K20l48L67Q6l40J8
5673a10J14L6j54J91k27O3Q0K24l77L67r0l75J20K07j86J0K79l9k05J14k30K55
5695F7o2q6l6J43J83k30J05Q9P9l15J53ll5J42j29k40K87l26Q3Q2pK51l02J39
5719C2J39J5k46J68q3r3J43p2k08J01J38M3q5M6j74K38j55k6K39j84J12o0p9j
$$ plain form
5743 -52 53 71 -138 -135 -53 29 99 -45 -13 2 44 -75 76 60 95 -71 -42 216 -114 127 119 22 25 31 -101 -133 144
5770 144 143 -18 64 31 92 99 -17 -243 34 42 -126 71 -41 38 75 123 258 -117 -16 161 22 79 105 -1 -109
5795 -109 115 2 108 -65 -6 -2 45 111 -172 136 119 -65 64 2 114 -19 66 110 412 -290 -70 95 37
5818 37 -181 96 187 94 -155 199 340 11 -153 171 -69 151 70 86 117 -146 -25 -12 -141 -61 -28 186 60
5841 60 39 231 118 53 -87 18 40 -149 -184 64 -290 117 -267 -16 -240 101 91 123 -185 2 108 49 56
5864 56 -19 30 7 4 193 201 -117 212 -141 192 165 -18 -83 -92 9 188 10 -87 -194 -69 -58 -57 110 -140 -262
5889 -262 176 59 -117 73 -106 -45 110 44 136 110 -53 73 103 -100 -56 -54 36 149 -217 -6 108 -137 -135 152
5913 152 -84 -20 -128 242 191 182 -37 -102 3 -25 -50 -9 187 125 -15 -2 209 8 37 136 -114 6 33 -108
$$ packed form
5743e2J05J8k09LQ2Q2P0j44L2J5M2j19J51j6L5j66K9K58l30K41qr7LOj32l2K77
5770A44jj61Q2l3O1Pj16k26K77Qj68J97j12P9L7M8J35l75J01J77j39N7K6j06j08
5795a09K24j13J06j73N9MM7O6k83L08j7j84J29o2J12j33Q5M4L02p02K20J65n8
5818C7k18K77R1r3k49L54J41l29j64L24k40K20q1J6L1k63J21J3j29Q0L3K14j26
5841F0k1J92j13o5j40J05K2j89l5K48l54M07l84K51k24L41j0L2l08J87J06n9P
5864E6p5M9k3lJ89Ql18L29l53L33k7j83o5rJ01J79j78r7j07J25J1JJ67k50j22
5889b62M38j17j76J90j79O1J55o6R2k6j63J26L0k03M4KR0J13l66K11J14k45KK87
5913A52k36O4j08L70n1rk19o5J05k8k5M1J96o2j40J3K11k01K9R9k50J20K7j41
$$ plain form
5937 -108 -91 26 -43 -201 -2 -87 -73 -74 298 -210 -64 -71 21 -100 -9 78 -51 -30 -79 -221 72 14 -53 189 -7
5962 -7 -178 130 -339 -87 -143 -55 -300 -149 -165 -385 75 -51 104 -213 -193 169 7 -189 89 13 171 189 -7
5985 -7 -46 103 64 -228 156 213 144 -37 26 22 -69 -236 -64 -206 48 193 255 43 -60 143 -140 -31 -89 205
6009 205 -130 -63 76 -339 177 234 92 -70 271 -27 210 156 323 10 -188 -33 7 5 -96 64 -34 -26 -42
6032 -42 58 -31 82 99 -39 -65 -60 50 -86 136 -54 -211 304 -7 -218 40 48 -39 -203 132 156 28 14 8
6056 8 21 47 204 -132 3 -104 75 231 129 -142 -123 -74 -54 -11 303 86 2 -25 -59 130 -174 -123 168 89
6080 89 51 29 51 18 142 13 -103 174 179 -5 13 217 82 225 0 244 -119 -135 -81 93 -174 25 234
6103 234 207 -53 26 47 -107 79 -169 290 158 -15 -151 -161 -193 -146 -142 -83 -81 159 -293 -485 -28 25 220 111
$$ packed form
5937a08J7J17o9j58J99q5J4jL72n08J46pR2j21R1Q7j29K1m9j42K93n8o7K42j96
5962gj71L08m69K52n6Q8k45J51j6k20M60j26J55l17K0L62j62j96K78p6J58J8j96
5985gl9J49l9k92L84N7o9j81O3mr1j67J72j42K54J45O2k12j03K03k83J09n8K94
6009B05l35O7J39m15N16N7j42j62L41k98K37n4J67l13j98J55M0kj01J60r8Qj6
6032d2J00q9J13J7j38k6NJ10j36K22j90j57N15l11k11K58Qq7j64L35K4j28j4o
6056HJ3K6J57l36J35j07J79J56j02k71J9M9K0M3L14k17q4k7l4J89l04N1K91p9
6080H9l8k2K2l3J24j29j16K77Nj84J8K04j35J43k25K44l63j6N4J74k67J99K09
6103B34k7k60P9K1j54J86k48M59j32j73j36j0l2M7MN9KK40m52j92M57N3J95j09
$$ plain form
6127 111 44 81 63 108 -181 -82 -104 279 241 163 -235 -77 -4 92 188 -104 152 191 -34 106 53 -181 95 -47
6151 -47 27 9 -14 -266 163 59 2 -100 51 -170 -35 46 -77 48 -175 -84 175 220 203 161 188 34 -156 15
6175 15 19 90 -24 8 -82 -52 104 148 -50 -11 8 34 89 167 -85 230 -56 -37 93 5 51 -134 -155 -163 142 196 -107
6202 -107 -4 -9 194 58 -168 -148 184 -9 136 127 -84 52 -51 -64 55 187 -264 75 141 156 113 153 156 -80
6226 -80 -12 -185 126 -7 -33 43 72 184 -103 -189 96 -33 -79 117 70 -90 53 148 -125 179 2 -34 -63 160
6250 160 109 106 10 -152 40 -126 -68 -91 -40 -59 172 -272 -107 90 -100 -9 28 -46 -227 58 99 45 79 75 34 8
6276 8 85 -113 123 -237 307 198 267 7 150 154 232 36 -38 213 67 -95 -14 101 -9 -49 -23 50 -213 -156
6300 -156 201 -35 -157 126 -112 -83 120 -47 240 109 15 -81 59 53 -34 86 59 -181 -28 41 17 -110 37
$$ packed form
6127A11o7L7j8M5k89R9k2L83l8p8l98J58P3R6R6k92K56L9k25J40n3k34K76j42
6151d7P4j8k3k52M29j04n7j02J51k21J35Q1j23J25k23R1K59M5j7m2K7j54j90J71
6175A5MP1j14L2r0L0J56M4j98L9J9K6N5P8k52L15k86J9J30q8M6j85k1qL05N4l03
6202a07J03nK03j36k26K0L32j93J45rk11J36j03j3J19J32m51L39O6J5m3M0Lk36
6226h0O8j73L11j33k6P6K9J12k87q6K85j29m6J96m7j60J43R5k73L04j77l6k9K23
6250A60n1lr6j62J92j66N8k3N1j9K31m44J65J97j90R1L7p4j81K85M1n4L4mm1k6
6276HP7j98K36l60N44j09O9k60J43MP8j96p4K51j46j62Q1J15j10m0K6P3k63N7
6300a56L57k36j22K83k38K9K03j67K87j31r4r6J40oq7J20k7k40J53O9k4j27J47
$$ plain form
6323 37 -38 -61 83 94 45 248 -11 112 -57 43 -108 -300 171 165 1 -76 162 -47 -197 -22 -148 -36 135
6346 135 126 85 -231 -6 21 4 36 17 80 40 -95 -133 7 38 67 80 110 -21 145 157 247 -172 130 49 -43 -28
6372 -28 -174 161 -17 125 52 -83 -24 32 17 -23 265 -63 37 249 -30 -24 -116 -76 -52 57 63 -3 -88 51 -110
6397 -110 -128 -114 133 200 25 91 176 -78 -17 -70 -6 227 -34 147 -22 65 -27 -87 117 -62 24 -59 46 87 14
6422 14 34 -20 -250 119 -49 -169 136 -45 175 -9 -22 -225 95 83 29 -57 187 26 -201 -87 -27 -251 174
6445 174 -25 48 -38 145 69 -130 -68 -83 250 -78 151 74 -20 73 146 102 6 -111 -90 140 -229 56 -90 -50
6469 -50 -149 34 18 -65 90 -208 76 -69 337 1 -60 82 244 53 -51 -78 -200 93 129 13 160 -147
6491 -147 -6 66 -24 84 82 4 -44 -37 71 -5 121 -48 -40 -115 123 -176 291 -330 -45 -56 -30 -36 134 241 -57
$$ packed form
6323C7p5k3J44J1m9K03k59J23j69J00j51j92M71oj64p7K38k09j50J75j26J12J71
6346A35rm1l16K25K7j7L2j9O3m0j35l8J40L1K9J3L0j31J66J2R0m19L02q1r2J5
6372b8j46L35j78J42p3j35N9N6j5m0K88l28J00K12k79Or2M0K4J09Oo6q5J39j61
6397a10j8J4K47O7j75O6Q5k54O1n3O4K33k61J81j69Q7r2o0K04j79Q6q3J05M1p3
6422A4K0n4k30L69j68j20L05j81K20j84j3k03L20j2n4q6K44j61k27J14O0k24M25
6445A74j99P3q6J83p6j99O2j5L33l28K29p7r4R3P3m4r6j17K1K30l69K85j46M0
6469e0r9J83j6q3J55k98K84j45M06l36o1J42J62j91j04k7j22K93L6j16J47l07
6491a47J41P2r0J08kp8m8PJ08p6J26j69Qp5K38k99M67o21K85j1K6oJ70J07k98
$$ plain form
6516 -57 -97 -102 -37 64 -211 30 -36 69 9 65 -108 -6 -134 150 44 -15 -224 184 -150 -255 -61 -128 36
6539 36 -100 79 -71 71 -71 -26 23 114 -133 -150 -157 301 170 -204 -84 78 -116 -18 -146 26 -58 16 91 -81
6563 -81 -7 -54 33 -39 121 7 50 52 -210 -94 -121 204 -94 197 105 199 -216 -29 120 44 17 -10 68 -44 149
6588 149 -77 -106 -9 89 66 48 127 88 -32 85 53 47 -97 10 115 -64 24 -125 -65 200 79 -229 48 -190
6612 -190 1 -21 -76 46 -48 -203 -114 -85 73 149 -117 235 -17 -164 -5 88 12 -92 -57 356 -116 -137 -115 46
6636 46 -244 19 -34 74 -6 -70 6 -74 143 -70 80 -198 154 18 -18 21 123 -159 30 -96 108 200 -10
6659 -10 15 -53 -182 79 66 28 -220 -119 176 50 72 -98 179 101 95 2 -131 140 -92 6 -33 -44 32 92 -61
6684 -61 105 -194 -76 -13 142 115 174 20 -79 -124 90 2 -18 -101 45 79 13 31 207 -86 29 120 -371 -144
$$ packed form
6516e7m0nO5J01k75K41o6J05o0N6j73J02j28K84j06n9k09M08l34j05J94o7J64
6539C6j36J79j50J42j42M5M9R1k47j7pM58j31l74J20J62j94R8j28J72q4P4P5j72
6563h1P4m7Q7p2J60j14M3Kk62J16k7L25k98K91r2R4m15J87J49p6k7k7P8j12J93
6588A49k26k9R7R8k3j8P9l9j20J17l2oj44J07J05j79Q8j49O0K65j21l08K77k38
6612a90J91k2n5J22r4j55Q9K9J58P6k66L52k52j47J59R3p6j04L5M13m72k1K2J61
6636D6k90K63n3J08q0o4P6q0K17k13J50k78L52j36l6L9J02k82J89j26K04R2k10
6659a0K5o8j29K61j3l8k48J01K95j26K2j70K77p8or3j33K71k32R8l9j1P6O0j53
6684f1J66k99J18O3J55k7N9j54r9m5K14q8k0q3J46L4o6J8J76k93J15R1m91K27
$$ plain form
6708 -144 1 -114 52 -25 28 118 130 -215 81 -11 -69 54 90 51 129 71 73 -330 120 159 104 -167 11 -264 27
6733 27 -14 -79 129 107 73 -17 -144 -68 -150 -32 142 -2 83 -175 -101 -201 -39 14 -174 -93 -48 -97 -6 177 283
6758 283 -129 36 78 28 -169 -116 36 271 -90 128 47 -4 112 73 -17 -167 -161 -196 -110 130 -33 -6 -159 -36
6782 -36 -76 199 33 220 -45 72 144 158 47 165 110 -197 -94 -62 114 52 118 45 5 -73 -177 118 91 96 -29
6807 -29 263 -85 -115 91 -48 120 114 -21 -104 52 18 -64 -75 -70 -123 9 -91 36 -22 -67 -146 -150 -45 -110 150 -77
6833 -77 43 246 -48 -207 85 113 -3 41 -297 -105 -149 342 -186 256 19 -20 167 -28 13 -70 -9 117 83
6856 83 -279 -117 137 -172 186 -151 31 -163 125 -121 -56 4 105 23 -114 -69 -75 43 174 129 -2 -48 -16
6879 -16 66 208 -77 103 46 75 -27 71 104 168 -51 212 -157 -210 101 98 70 135 202 59 20 -99 -88 176 53
$$ packed form
6708a44J45j15J66p7N3R0J2l45K96r2n8J23L6l9P8n8Km03M50L9n5k71J78k75K91
6733B7m1o5K08k2l4r0j27P6q2J18J74j44Q5k58P4j00J62N3j88Q1M5m9R1J83J06
6758B83m12J65M2n0j97N3J52K35l61K18q1n1J16l9r0j50Ol5Q6K40j63K7j53J23
6782c6m0K75j66J87k65J17P2J4j11J18n5l07J03L2J76o2O6p3m0p8j04K95k7Nj25
6807b9K92l48l0K06j39J68oj35q3J56l4q2j1Nn3J32j00J27n8m5p9mJ05o5K60k27
6833g7J20K03k94j59K92K8j16M4l38J92m4M91n28M42k37l9J87j95M1q3O1J26l4
6856H3l62J62K54l09L58l37J82j94K88k46O5O0J01q2j37M5oJ18J31m5j31m6L2
6879a6Q2J42k85J80n7K9j02R8L3O4k19K63l69n3L11lk8O5O7j43l9j19J1K64j23
$$ plain form
6904 53 133 -202 -57 252 34 -33 35 307 -43 -63 65 320 52 -21 -29 19 -15 52 83 74 -90 0 243 -10 99
6929 99 123 -62 -26 66 39 -118 -199 309 -78 27 160 229 -94 4 -19 -8 197 -110 -159 60 52 221 37 -36 -130
6954 -130 -101 -154 -86 41 -85 118 222 -31 -120 -90 -305 85 -34 30 42 113 178 53 -107 -190 11 -125 7
6977 7 -67 -50 -187 -249 16 -18 -68 -179 44 104 -111 -47 31 71 -138 -79 25 -151 298 40 -35 -76 -15 82 -47
7002 -47 -147 -90 -4 -195 -270 29 -29 90 -180 118 -95 -75 65 319 -40 44 62 -3 35 75 -80 32 -69 -174
7026 -174 204 -53 76 -95 107 -151 62 298 -138 302 -61 -54 217 -161 4 -148 278 -107 -149 -135 189
7047 189 247 -127 68 -220 -49 127 -1 -103 -146 32 -196 53 80 -84 108 -37 135 53 -62 126 49 4
7069 4 91 2 -61 -38 14 22 -95 -48 -39 -72 -136 101 118 -124 41 73 -82 77 102 25 81 9 -91 46 13 -128 -341
$$ packed form
6904E3Q0l35J45L09k18o7O8K72l50k0J28K55k68p3qM8l4O7L1rj64R0K43k53J09
6929I9K4j85L6R2k7j57q1N08l87J05J33O9l23R8k3J1K05l07m9K19qJ69j84p3r4
6954a30K9n3O8J27j26K03J04k53q9L0k15L90j19O4J2P1O5j25j60q3K01j36J32
6977Gp4J7j37o2K65l4n0j11K23O0k15O4P8M0k09N9J04j76M49k58p5m1O1R7j29
7002d7j00N7Q6j91p5K99n8J19k70K98k13K0J40K54l59Q4J8o5L8M0j55J12j01j05
7026a74L78k57J29j71K02k58K13K36m36M40l63PK71l78J65j52M26l85m2J4L24
7047A89N8l74J95k88J71J76j28j02m3J78k28K49K7j64J92j45J72q2j15J88p7m5
7069DQ7q9o3K3N2Qj17M7Rl3o4K37J7k42J65L2j55J59K5p7N6p2j00J37l3j41k13
$$ plain form
7096 -341 0 -95 66 -218 -4 -326 64 -51 -279 19 -77 41 -30 218 -80 20 -169 -2 -36 429 148
7117 148 70 103 -32 219 170 -99 -31 114 116 -228 -66 -66 123 127 -9 32 -65 55 32 112 241 241 226 -73 53 20
7143 20 -94 -84 67 -110 56 -139 272 -189 -221 -40 9 -186 -259 106 64 76 48 33 73 -7 -148 70 87 -27
7167 -27 80 115 211 140 -79 32 -30 -113 63 15 5 -8 -31 -141 82 171 -154 -250 -170 60 18 32 12 -141 19
7192 19 232 -269 91 -67 -45 -319 49 35 -145 -244 -113 -49 89 -87 73 15 -67 113 -102 -65 -92 -3 129
7215 129 92 33 215 100 -109 -50 38 -10 140 118 -129 138 198 109 37 -91 182 -239 -49 -24 -93 -54 -85 62
7239 62 -138 -115 53 -46 3 147 -71 -90 129 100 -23 19 -106 96 33 -253 -48 -65 90 130 -141 -27 -11 -223
7263 -223 192 -137 68 -154 17 65 -203 125 -153 113 93 83 -106 -46 148 -170 41 297 -134 -93 58 148
$$ packed form
7096c41L41r5J61k84K14l22L90j15k28K98r6J18p1K48k98J00j89J67l4M65k81
7117A48p8L3j35K51m9k69O8J45Kl44J62%J89Mj36M1r7J20k3Q0J29%j5k99J26l3
7143B0j14J0J51j77J66j95M11m61l2J81M9j95p3L65m2J2k8j5M0q0j41K18J7j14
7167b7J07L5R6p1k19J11o2q3J76m8j0j3k3j10K23Q9l25r6Q0K30m2J4k0j53J60
7192A9K13n01L60j58K2k74L68j4j80r9J31O4J38j76J60n8q2J80k15L7k7Q9J32
7215A29l7n9J82j15k09N9Q8m8J50k2k47K67O0q9p2j28K73m21J90K5o9L9l1J47
7239F2k00K3J68r9M9J44k18j9K19k9j23M2j25K02o3k86K05j7J55M0k71J14J6k12
7263b23M15l29K05k22J71M8k68L28k78K66k0j0j89O0J94l18K11K56m31M1J51R0
$$ plain form
7285 148 43 -112 -193 -80 144 -67 255 109 69 -36 130 210 8 181 97 129 -166 27 -104 37 185 140
7307 140 7 253 199 -51 -109 191 -170 166 -71 -233 -115 -191 1 -357 46 172 111 21 -78 -52 -6 100 -100
7330 -100 -10 -27 -126 -204 109 -98 -154 -22 -206 100 -9 -153 43 4 112 82 -13 33 -30 -46 -124 33 -121 -25
7354 -25 36 -23 -201 297 -91 -53 -87 -62 69 88 45 -48 65 -195 -111 162 72 -148 -29 -87 193 -140 71 79 -47
7379 -47 12 172 101 104 27 -132 20 -251 51 -46 -56 89 -346 10 -37 104 -152 -169 -25 -5 55 161 -75 -67 168
7404 168 -84 -157 24 82 159 -13 -21 55 64 61 -35 56 -64 -207 180 -76 55 135 -95 65 -65 39 51 13 63
7429 63 -114 57 26 21 118 143 351 1 -259 -98 -52 -299 -127 -180 -133 -103 5 34 329 -107 -368 -8 50 -111
7453 -111 191 37 181 75 19 11 -172 -52 -175 -37 98 84 -79 170 -68 45 -362 46 -53 -183 37 -175
$$ packed form
7285A48j05j55q1J13K24k11L22j46m0j05J66Q0k02J73q4L2k95J93j31J41J48m5
7307A40j33K46n4k50n8L00l61L36k37j62J18p6J92l58M03J26o1r0r9K6M6J06k00
7330a00R0j7r9p8L13k07n6J32j84L06j09j44J96l9J08l0r5M6o3j6p8J57j54R6
7354b5O1n9j78M98l88L8l4K5J31J9m3r3J13k60Q4K73r0k20J19n8K80l33K11Qj26
7379d7N9J60p1Lp7j59J52k71L02r7j0J45m35L56m7J41k56j7J44K0O0J06k36QK35
7404A68k52p3J81N8P7j72qP6Rlr6R1j20j43L87k56J31Q0k30J60j30J04J2l8N0
7429F3j77J71l1nR7K5K08l50k60J61M6k47J72n3M7L0J08K9K95m36k61L60N8j61
7453a11L02j54J44j06n6qj83J20j23J38J35j4j63K49k38J13m07M08r9j30K20k12
$$ plain form
7475 -175 28 252 -112 -97 35 67 59 105 -74 187 102 -85 -81 71 135 42 44 5 51 302 103 168 26 232 -208
7500 -208 -208 -126 -202 -131 -21 146 -145 -85 -92 -201 46 -56 239 169 205 16 -122 -39 56 -188 55 248 -91 55
7524 55 -172 88 67 -15 0 -41 14 -18 102 -67 -175 -32 114 -259 -207 -140 -47 93 -177 92 -142 110 86 244
7548 244 -211 99 12 -120 -262 27 11 -27 99 62 50 -143 -157 21 86 -131 15 -120 -8 51 -11 106 -52
7571 -52 96 165 -86 -170 25 46 -93 35 -76 101 38 -166 -94 30 -68 -101 110 -77 92 -70 -144 -140 26 89
7595 89 -71 345 14 -189 -44 118 139 -118 -114 106 5 13 -121 6 -109 141 -136 -60 -158 26 55 -129 91
7618 91 57 98 149 19 -144 4 -222 109 -18 55 -250 -39 -139 -96 152 -56 21 27 -107 103 -6 27 -99
7641 -99 -78 202 75 -109 -138 27 -28 -118 47 42 -122 81 135 -151 -27 33 -71 53 2 30 63 -302 -65 53
$$ packed form
7475a75K03K24l64J5J32L2qM6j79K61q5j87MJ52O4r3Kl9M6K51j99O5j42K06m40
7500b08%Q2p6P1J10J67k91O0pj09K47j02K95p0L6j89j38Q3R5k44K43J93l39J46
7524E5k27K60k1q2J5m1N5l2J20j69j08J43J46l73N2O7R3J40k70K69k34K52k4J58
7548B44m55L10q7j32j42K89j6l8J26l7j2j93j4J78O5k17J46j35J12N9o2J17j58
7571e2J48O9k51q4J95K1j39J28j11J77o3k04P2J24r8l3K11j87J69j62p4MJ66O3
7595H9j60M16l31k03J45J62K1k57MK20j01Qj34J27j15K50k77P6r8J84K9j84K20
7618I1l4M1N1j30j63J48k26L31j27P3l05K11j00M3K48k08P7Oj34K10j09L3j26
7641i9K1K80j27j84k9J65n5r0J65nj64K03N4k86J24O0j04J24n1K8L3l65K37J18
$$ plain form
7665 53 -262 -19 151 17 1 56 73 0 13 93 72 -61 169 29 -70 284 -34 -133 290 167 48 205 -4
7688 -4 -205 114 -16 -116 -144 -39 46 -198 24 -252 -454 -112 166 -91 -57 2 -343 150 145 228 -100 -156 -44
7711 -44 -85 -80 -83 -61 19 -59 19 224 72 -19 -83 165 55 -32 -181 31 174 -71 -38 22 183 -100 -41 66 -166
7736 -166 -9 188 -74 -56 -53 -209 175 -205 -30 74 88 -13 224 111 -224 -33 327 -132 -155 136 135 231 220
7759 220 -76 146 -157 67 -35 -183 71 -110 24 -33 93 -55 40 198 -88 97 17 115 -26 -101 10 -38
7781 -38 -215 -5 -145 40 228 -33 73 -230 153 -168 -49 30 -218 48 122 -48 137 -29 -51 -42 195 43
7803 43 -233 89 103 -143 -86 250 -141 -15 65 132 -74 196 -50 6 -98 -2 -245 -150 159 -251 88 -195 42
7826 42 132 -11 -71 -59 -12 -204 191 35 52 -57 44 -71 11 -147 64 44 55 32 89 188 -130 -110 192 -182
$$ packed form
7665E3l15K43J70j34j6N5J7p3J3Q0k1j33K30j40r9L54l18r9M23j23j19J57k09
7688dk01L19j30j00k8J05Q5k44K22k76k02L42K78k57L4N9l45M93nQ3l28n6J12
7711d4m1NlK2Q0p8P8K05j52r1o4K48j10q7j49K12J43k45L3O0J61k83N9J07k32
7736a66J57J97k62J8Lj56L84l80J75J04J4j01K37j13l35J91L60m59k3K91jR6j1
7759B20k96K22l03K24j02j48K54j81J34n7J26j48R5J58k86J85q0R8j41p5J11m8
7781c8j77K10j40J85J88k61J06l03L83l21J19P9k48K66P4j70J85j66k2RK37j52
7803D3k76L22J4k46N7L36l91J26Q0O7k06K70k46N6j04R6k43R5L09m10L39k83K37
7826D2R0j43o0J2M7j92L95j56J7j09J01j15Q2j58K11k0J1k3N7R9l18K0L02l74
$$ plain form
7850 -182 58 -129 183 499 59 -151 173 14 88 70 89 8 -8 -58 -187 142 -175 180 -50 -97 -94 56 7
7873 7 12 81 -72 2 71 139 61 160 -24 -29 39 -67 -95 -42 35 -84 -123 -330 1 -197 88 169 118 -69 -290 35
7899 35 -44 289 134 5 -53 -255 46 -84 56 -60 -84 236 -63 -31 78 178 7 -78 52 66 384 -143
7921 -143 -52 -64 -155 -47 13 -204 -165 -149 48 241 228 -182 88 213 45 77 199 224 -193 116 233 -61 163
7944 163 28 141 44 -180 21 20 7 18 -2 -201 -179 -102 -11 -23 -6 174 -116 -27 192 -100 -186 199 -69 -61 -141
7969 -141 8 130 87 -115 -191 72 104 146 60 279 24 120 -76 -102 -77 81 -155 -132 -1 -192 30 133 91
7992 91 210 45 28 -182 -265 -22 43 48 24 -48 24 -14 -49 53 -65 128 183 -99 94 321 -34 -52 136 -147
8016 -147 -27 202 139 141 -95 -22 -113 43 -146 -118 -144 -18 -125 -24 -156 95 -184 258 8 52 -182 -18 78
$$ packed form
7850a82K40j87L12L16m40k10L24j59P4j8J9q1j6n0j29L29l17L55k30m7LJ50m9
7873GNO9j53P4O9O8p8R9j84nO8j06k8N3P7j19l9k07L31j98K85Q1n1j87k21L25
7899C5p9L33j55j29n8k02L01j30J40j16k4L20k99L2J09J00j71q5J30J4L18n27
7921a43R1j2r1J08O0k17L9J6J97J93j3m10K70J25j68L2J22K5m17L09J17k94K24
7944A63j35J13r7k24K01jj3J1k0j99K2P7R1j2J7J80k90Q9K19k92q6L85k68Qq0
7969a41J49J22m3k02p6K63L2M2q6K19k55R6j96k6K5J58k36K3J31j91K22J03m2
7992I1J19j65j7k10q3K43O5Nk4p2P2l8l5J02j18J93N5k82J93K27l55j8J88k83
8016a47J20K29o3Kk36P3r1J56j89K8k6J26j07J01j32K51k79M42k50M4k34J64R6
$$ plain form
8039 78 -108 299 119 174 -191 -73 165 -192 161 -166 36 98 49 21 -3 -157 -110 34 0 56 47 -98 0 159
8063 159 -205 -150 200 -28 -46 151 126 157 4 -62 -86 54 60 15 165 -204 88 -84 -107 -101 148 -77 -5 -5 188
8088 188 63 -83 55 -74 20 93 74 -68 -187 -168 -128 -180 56 -37 -106 -228 59 80 -259 232 -215 205 175
8111 175 -32 250 75 134 179 33 50 -77 59 58 169 -63 66 31 231 -32 -92 29 -135 110 -23 -119 -140
8134 -140 48 -24 118 -33 -212 120 -25 199 169 79 -50 -76 -14 -153 256 0 -31 13 115 -132 36 99 79
8157 79 -93 145 -250 209 40 135 -171 151 -182 82 -93 201 -21 -42 49 182 -56 262 -81 -121 -79 -17
8179 -17 21 -27 16 -222 -252 -218 98 48 12 27 45 -53
$$ packed form
8039G8j86M07j80N5l65J18K38l57L53l27K02O2m9k8k4j54M7J44l4N6rj45R8J59
8063A59l64N5L50k28j8J97k5L1j53o6k4J40Om5J50l69K92j72k3OK49k25P2%J93
8088A88j25j46J38j29R4P3j9j42j19J9M0n2K36r3o9j22K87K1l39M91m47M20l0
8111A75k07K82j75N9M5j46J7j27J36jJ11k32J29l5K00k63o0J21j64K45j33r6k1
8134a40J88p2J42j51j79L32j45K24l0r0j29k6O2j39M09k56l1M4J02k47J68O3k0
8157G9j72K38l95M59j69R5l06L22l33K64j75K94k22k1R1J33k38L18l43m0M2O2
8179a7L8m8M3k38l0L4L16n0l6J5J8r8
8191e3
$$ Imaginary data points
##PAGE= N=2
##DATA TABLE= (X++(I..I)), XYDATA
$$ plain form
0 0 0 0 0 0 0 0 0 8 -8 8 -8 16 -16 24 -32 32 -40 56 -64 80 -96 112 -135 152 -183 211 -248 283 -328 376
30 376 -427 488 -554 627 -707 795 -891 998 -1115 1244 -1382 1535 -1702 1882 -2081 2299
46 2299 -2537 2796 -3081 3393 -3737 4114 -4539 5010 -5535 6130 -6811 7592 -8504 9581
60 9581 -10882 12479 -14503 17155 -20795 26109 -34604 50296 -88634 371213 294230 -501553
72 -501553 171617 64134 15969 109026 -334306 30217 476291 -227027 -185311 224069 19566
83 19566 -20114 -86097 -161957 296585 103192 -357755 110167 257110 -138106 -72759 -65494
94 -65494 58186 213178 -190824 -148090 292363 -403 -166721 25752 -21300 114439 29107
105 29107 -261907 150146 232331 -273769 -36403 153416 -69509 62001 -106109 -101064 300767
$$ packed form
0@%%%%%%%Qj6J6j6K4l2M0n6O4p2R6j20J44j76K08k47K87l35L94m59N31o11P04
30C76q03R15j042J181j334J502j686J889k113K359k626K917l237L584l963M380
46B299m836N333n877O474p130P851q653R549j0545J1665j2941J4403j6096J8085
60I581k0463K3361k6982L1658l7950M6904o0713Q4900j38930M59847p6983p95783
72e01553O73170j07483m8165R3057m43332L64523M46074p03318M1716M09380k04503
83A9566l9680o5983p5860M58542j93393m60947M67922J46943l95216O5347P265
94f5494J23680J54992m04002M2734M40453k92766j66318J92473m7052J35739q5332
105B9107k91014M12053Q2185n06100K37366J89819k22925J31510j68110N045M01831
$$ plain form
116 300767 -80658 -261387 201208 38840 -98662 32116 -107342 111309 134073 -252265
126 -252265 4792 214033 -102768 -71501 18677 4569 138062 -98712 -160899 213100 48303
137 48303 -183006 34579 45518 30592 33786 -156207 51680 192495 -149505 -97504 132506
148 132506 15075 -4354 -48027 -81928 187035 32842 -239552 90034 144718 -100164 -9874
159 -9874 -17446 11725 142044 -120774 -107658 182917 4279 -105041 16284 9111 72764
170 72764 -3887 -148781 86396 117383 -125727 -30193 59873 13157 25313 -78907 -32553
181 -32553 136539 -33430 -105468 57656 28225 4866 -26082 -71136 89389 54870 -138090
192 -138090 12567 95676 -46738 -12548 -12021 -13921 85570 -40131 -98279 97635 35435 -85617
$$ packed form
116C00767l81425j80729M62595j62368j37502J30778j39458K18651K2764l86338
126b52265K57057K09241l16801L1267R0178j4108J33493k36774o2187L73999j64797
137D8303k31309K17585J0939j4926L194j89993K07887J40815l42000N2001K30010
148A32506j17431j9429m3673l3901K68963j54193k72394L29586N4684k44882R0290
159i874p572K9171J30319k62818J3116K90575j78638j09320J21325p173O3653
170G2764p6651j44894K35177L0987k43110R5534R0066m6716J2156j04220M6354
181c2553J69092j69969p2038J63124k9431k3359l0948m5054J60525l4519j92960
192a38090J50657Q3109j42414L4190N27j900R9491j25701n8148J95914o2200j21052
$$ plain form
204 -85617 15463 10463 17485 23286 -85135 16084 98536 -66750 -48604 55575 5078 11416
216 11416 -29860 -44030 83153 16030 -90436 24634 50019 -16500 -7919 -32539 27069 56874
228 56874 -66839 -23449 67284 -10242 -21106 1360 -14808 51907 -4789 -75186 52903 42289
240 42289 -59134 1719 18875 -6017 26485 -35353 -22807 64740 -16947 -43238 28346 6269
252 6269 -2745 -1051 -30442 30917 22171 -54064 9873 30929 -20478 -4820 -4277 -1952 26682
265 26682 -21918 -25250 36841 -811 -22296 1312 90 18328 -4761 -37037 28296 25228 -42439
278 -42439 7298 18702 -14411 12959 -8971 -17192 36549 -3382 -36233 27204 12996 -14887
290 -14887 670 -6259 15507 14314 -29948 3252 31695 -16360 -4990 7093 -4824 19251
$$ packed form
204h5617J01080n000P022N801j08421J01219Q2452j65286J8146J04179n0497O338
216A1416m1276j4170J27183o7123j06466J15070K5385o6519Q581k4620N9608K9805
228E6874j23713M3390R0733p7526j0864K2466j6168O6715n6696p0397J28089j0614
240D2289j01423O0853J7156k4892L2502o1838J2546Q7547q1687k6291P1584k2077
252F269r014J694k9391O1359q746p6235O3937K1056n1407J5658N43K325K8634
265B6682m8600l332O2091l7652k1485K3608j222J8238k3089l2276O5333l068o7667
278d2439M9737J1404l3113K7370k1930q221N3741l9931l2851O3437j4208k7883
290a4887J5557o929K1766j193m4262L3200K8443m8055J1370J2083j1917K4075
$$ plain form
302 19251 -6573 -22741 24345 13601 -22130 1229 7392 6921 249 -19400 13191 15337 -19794
315 -19794 -354 13387 -9418 5775 -2772 -15050 22574 -373 -26089 13430 11341 -16397
327 -16397 2642 -1641 -4778 12304 -14168 -8256 15553 -6106 -9940 5655 -5278 2636 2704 -17441
341 -17441 9517 7170 -17553 2218 8061 -6884 118 -2740 -2558 10849 -8406 -7078 7807
354 7807 2001 -15 -5919 -2284 13160 -798 -15756 12213 7003 -11282 4705 3406 -4013 8149
368 8149 819 -11349 12995 6928 -11495 2285 7003 2501 -947 -5343 4693 11017 -10488 -1420
382 -1420 10389 -3916 3136 663 -6821 9816 5906 -14795 3750 10717 -3631 -5521 -2564 10703
396 10703 -314 -11981 4330 5619 -5527 1935 -3683 -5260 11696 -5128 -10992 6571 4744
$$ packed form
302A9251k5824j6168M7086j0744l5731K3359O163m71o672j9649L2591K146l5131
315a9794J9440J3741k2805J5193q547j2278L7624k2947k5716L9519k089k7738
327a6397J9039m283l137J7082k6472N912K3809k1659l834J5595j0933P914O8k0145
341a7441K6958k347k4723J9771N843j4945P002k858J82J3407j9255J328J4885
354G807n806k016n904L635J5444j3958j4958K7969n210j8285J5987j299p419J2162
368H149p330j2168K4344o067j8423J3780M718m502l448m396J0036O324k1505R068
382a420J1809j4305P052k473p484J6637l910k0701J8545O967j4348j890K957J3267
396A0703j1017j1667J6311J289j1146P462n618j577J6956j6824n864J7563j827
$$ plain form
409 4744 -7984 -4110 3191 1410 -1726 -7305 -608 5656 -343 -9750 -1014 5860 -1103 -2327 -7803
424 -7803 2850 8448 -9771 -4359 10538 -4336 -4064 6536 -4344 3550 -237 -6102 7297 2484
438 2484 -4173 -876 877 7272 0 -11184 10264 4945 -8927 6914 -78 -3382 7647 -780
452 -780 -4030 7926 -629 -3972 4037 3353 1716 -5515 921 9040 -580 -8162 3633 6565 -3989
467 -3989 -1342 1601 366 85 1185 -5292 3751 6277 -11465 -1075 9207 -1057 -6296 -3728
481 -3728 3689 7613 -10960 -5144 11065 -7635 224 2444 -10762 9099 3758 -18123 8074
494 8074 11480 -14272 -1091 2390 2284 5694 -10985 -5138 14009 996 -10650 591 2501 6397
508 6397 -2438 -10383 7143 10044 -9923 -6867 13648 3407 -8014 -2208 5053 7592 304 -9527
$$ packed form
409D744j2728L874P301j781l136n579O697O264n999r407Q736O874o963j224n476
424g803J0653N598j8219N412J4897j4874K72J0600j0880P894l787n865J3399m813
438B484o657L297J753O395p272j1184K1448n319j3872J5841o992l304J1029q427
452g80l250J1956q555l343Q009o84j637p231O436Q119r620p582J1795K932j0554
467c989K647K943j235k81J100o477R043K526j7742J0390J0282j0264n239K568
481c728P417L924j8573N816J6209j8700P859K220j3206J9861n341k1881K6197
494H074L406k5752J3181L481j06L410j6679N847J9147j3013j1646J1241J910L896
508F397q835p945J7526K901j9967L056K0515j0241j1421N806P261K539p288r831
$$ plain form
522 -9527 -1127 15728 2363 -11486 -3973 12728 8158 -12103 -3045 9775 1664 -3192 -492 -1811
536 -1811 8633 -58 -13034 8871 9984 -8117 -7250 2724 10049 3349 -17996 -1167 18144 -6651
550 -6651 -6012 982 -4964 8436 1858 -15225 5316 7326 -11069 1339 1470 -1679 110 -6574
564 -6574 1732 6936 -7637 -5243 4857 -2955 3496 -947 -10215 5503 5994 -7891 321 3880
578 3880 -7237 4069 4881 -4789 -1735 155 4265 4525 -5347 -5646 8681 2978 -2636 -1389 -2126
593 -2126 8850 3088 -12474 5042 14254 -11442 -4311 9185 2186 3360 -9322 -3951 17739
606 17739 999 -13821 1649 4525 10575 -2391 -22004 14758 17643 -18344 -5791 10627 1527
619 1527 2685 -9720 -7400 19765 -1345 -18732 3158 11288 1364 -9856 -10942 12107 12895 -19912
$$ packed form
522i527Q400J6855j3365j3849P513J6701m570k0261R058J2820q111m856K700j319
536a811J0444q691j2976K1905J113j8101Q67R974P325o700k1345J6829J9311k4795
550f651O39O994n946J3400o578j7083K0541K010j8395J2408J31l149J789o684
564f574Q306N204j4573K394J0100p812O451m443r268J5718M91j3885Q212L559
578C880j1117J1306Q12r670L054J890M110K60r872k99J4327n703n614J247p37
593b126J0976n762j5562J7516R212k5696P131J3496o999J174j2682N371K1690
606A7739j6740j4820J5470K876O050j2966j9613L6762K885l5987J2553J6418r100
619A527J158j2405K320K7165k1110j7387K1890Q130r924j1220j086K3049P88l2807
$$ plain form
633 -19912 -8045 14701 1339 -7957 -4114 -2138 8738 2902 -18224 2956 13865 -8207 -8063
646 -8063 2622 3269 3744 -8350 -7289 14577 -1471 -9898 4821 -1145 3158 3476 -11693 4645
660 4645 12209 -13634 622 10604 -6729 590 1550 -1133 5939 -2844 -5019 9858 -370 -4363
674 -4363 4076 -1042 4144 1354 -6552 4955 7570 -8848 -1161 10368 -1345 -4921 1111 3789
688 3789 2082 -1163 -5576 3125 6636 -3680 -4824 -601 7424 1317 -11601 77 12116 -5265
702 -5265 -9110 4329 1464 1462 -4964 -5572 6685 3136 -8678 -2935 4300 2485 -2336 -10330 5349
717 5349 8709 -11105 -4095 7934 -1285 -2570 -318 -4299 6987 166 -9760 3405 5583 -2437
731 -2437 -3595 -655 3900 4085 -7816 -1364 9142 -2392 -3953 2229 1270 2753 1274 -7628 5842
$$ packed form
633a9912J1867K2746j3362r296L843J976J0876n836k1126K1180J0909k2072J44
646h063J0685O47M75j2094J061K1866j6048q427J4719n966M303L18j5169J6338
660D645P564k5843J4256R982j7333P319R60k683P072q783k175J4877j0228l993
674d363Q439n118N186k790p906J1507K615j6418P687J1529j1713l576O032K678
688C789j707l245m413Q701L511j0316j144M223Q025o107j2918J1678J2039j7381
702e265l845J3439k865ko426o08J2257l549j1814N743P235j815m821p994J5679
717E349L360j9814P010J2029r219j285K252l981J1286o821r926J3165K178q020
731b437j158K940M555J85j1901O452J0506j1534j561O182r59J483j479q902J3470
$$ plain form
746 5842 8979 -9417 -2139 8428 1393 -2916 -1428 1446 6858 -2855 -5584 6749 1552 -668
760 -668 -522 -3053 4636 5030 -9578 -317 10270 -4618 -3937 2301 1367 895 -2012 -3855 3415 2551
776 2551 -4354 -1292 -683 4040 -20 -8605 1886 7219 -6383 -5420 5752 -1430 -1829 -1100 -2566
791 -2566 2543 537 -4967 -370 2352 -1548 -712 -3122 2108 3484 -6620 -361 5995 -3348 -3149
806 -3149 4335 -1897 728 1743 -4363 2868 3640 -3739 -1460 3584 1174 31 -2773 2069 5386
821 5386 -4146 -944 4368 489 -703 643 -1432 4101 3308 -6485 1935 5970 -1288 -3757 2219
836 2219 2890 90 -2919 -489 4696 -1736 -1888 1203 -644 1381 688 -5360 924 6620 -5926 -3379
852 -3379 4426 -264 -3029 -754 -534 1066 -119 -3795 1155 -282 -385 -748 -3491 1937 2333 -5613
$$ packed form
746E842L137j8396P278J0567p035m309J488K874N412r713k729J2333n197k220
760f68J46k531P689L94j4608R261J0587j4888O81O238r34m72k907j843P270q64
776B551o905L062O09M723m060q585J0491N333j3602R63J1172p182l99P29j466
791b566N109k006n504M597K722l900Q36k410N230J376j0104O259O356r343J99
806c149P484o232K625J015o106P231P72p379K279N044k410j143k804M842L317
821E386r532L202N312l879j192J346k075N533p93r793Q420M035p258k469N976
836B219O71k800l009K430N185o432j52L091j847K025o93o048O284N696j2546K547
852c379P805m690k765K275K20J600j185l676M950j437j03l63k743N428L96p946
$$ plain form
868 -5613 -1761 5928 -3352 -3231 2171 -660 -450 -525 -724 620 565 -1682 1050 -678 -50 1140 -1798
885 -1798 2524 1124 -3088 471 4525 -1614 -1321 2435 -52 1035 953 -147 -375 2943 371 -1460
901 -1460 2093 1669 -918 -1228 2888 1750 -1913 -1641 3719 1276 -2127 1232 -1536 1588 3288 -3065
917 -3065 -2408 4744 -119 -3007 1419 -19 446 -2676 66 2700 -2786 -1831 1389 -1834 316 1985
933 1985 -5964 33 4057 -1867 -3497 -1220 2065 51 -2242 -881 1000 -1792 1094 -1038 -2451
948 -2451 2768 -1324 -2901 1624 2529 -2894 -2577 2698 2259 -1803 -1453 759 221 2799 -1631 -2146 2539
965 2539 1082 661 -1646 -4 4722 -1087 -3808 5855 -108 -2146 3371 -3131 3474 3834 -6742
980 -6742 568 6193 -1327 -1271 -905 1417 5186 -4667 -755 4441 -2535 72 1505 -2158 2400 138
$$ packed form
868e613L852P689r280J21N402k831K10p5j99J344n5k247K732j728O28J190k938
885a798M322j400m212L559M054o139K93L756k487J087q2j100k28L318k572j831
901a460L553m24k587l10M116j138l663K72N360k443l403L359k768L124J700o353
917c065O57P152m863k888M426j438M65l122K742K634n486R55L220l223K150J669
933A985p949N997M024n924j630K277L285k014k293J361J881k792K886k132j413
948b451N219m092j577M525R05n423L17N275m39m062L50K212n38K578m430n15M685
965B539j457m21k307J642M726n809k721R663n963k038N517o502O605L60j0576
980f742P310N625p520N6L66K322L769r853L912N196o976K607J433l663M558k262
$$ plain form
996 138 -5605 3690 2904 -3589 -2882 481 3701 -1788 -4095 299 1788 -1397 -882 -922 -600 589 -808
1013 -808 -1676 -20 3217 -5632 -2251 7689 -3288 -5537 2640 429 1169 -230 -6253 5120 1748
1028 1748 -5763 4251 -2061 -1350 4940 -5684 890 8267 -9410 -437 9552 -4805 -134 158
1042 158 -1840 7272 -513 -7189 5129 3078 -2058 844 -2648 3951 3413 -6290 581 8153 -3024
1057 -3024 -5447 4904 2401 171 -1951 -4773 4948 7718 -8569 -4963 8584 1232 -1893 -4607
1071 -4607 -488 8965 -4333 -8850 7759 1960 -5175 1593 -5133 4220 6699 -13842 -1244 11988
1085 11988 -3262 -5855 -1712 810 9233 -6924 -9650 9595 1865 -4727 -854 -3259 5047 4758
1099 4758 -12150 188 11336 -4976 -5972 2464 2948 2117 -3128 -5845 7423 4934 -8223 -456
$$ packed form
996A38n743R295p86o493P07L363L220n489k307M394J489l185N15m0L22J189j397
1013h08q68J656L237q849L381R940j0977k249Q177k211P40j399o023J1373l372
1028A748p511J0014o312P11O290j0624O574P377j7677Q973R989j4357M671K92
1042A58j998R112p785o676J2318k051n136K902l492O599n38r703O871P572j1177
1057c024k423J0351k503k230k122k822R721K770j6287L606J3547p352l125k714
1071d607M119R453j3298m517J6609n799p135O768o726R353K479k0541J2598J3232
1085A1988j5250k593M143K522Q423j6157k726J9245p730o592L873k405Q306k89
1099D758j6908J2338J1148j6312r96Q436M84q31n245k717J3268k489j3157P767
$$ plain form
1113 -456 2748 1725 2386 -6298 -1623 11206 -3632 -7153 7681 -329 -358 2608 -5233 3882 6452
1128 6452 -8210 603 6676 -3685 1761 -1165 -1744 7057 -3579 -4625 7756 -2204 -4067 6707
1142 6707 -4446 -218 5073 -6035 1281 4393 -6579 428 4778 -4774 827 -616 -1871 4341
1156 4341 -4479 -3693 6705 -2802 -5363 4746 -2675 -86 3689 -8029 1072 7851 -6458 -4362
1170 -4362 4924 -659 915 -3110 -4012 8942 -1231 -8056 4664 1904 -2151 2689 -5811 1655
1184 1655 9421 -8797 -3437 9194 -1335 -2583 1308 -2170 5770 1034 -8233 5325 3938 -3772
1198 -3772 1507 -934 135 6938 -5517 -4229 10165 -2299 -4104 4667 -1801 1375 3570 -6271
1212 -6271 2106 6185 -6159 832 2556 -2230 2890 -2133 -2668 5867 -2799 -4596 6705 -3186 -3077
$$ packed form
1113d56L204j023O61q684M675J2829j4838l521J4834q010k9K966p841R115K570
1128F452j4662Q813O073j0361N446k926n79Q801j0636j046J2381r960j863J0774
1142F707j1153M228N291j1108P316L112j0972P007M350r552N601j443j255O212
1156D341q820P86J0398r507k561J0109p421K589L775j1718R101O779j4309K096
1170d362R286n583J574m025r02J2954j0173o825J2720k760m055M840q500P466
1184A655P766j8218N360J2631j0529j248L891l478P940m736r267J3558j387p710
1198c772N279k441J069O803j2455J288J4394j2464j805Q771o468L176K195r841
1212f271Q377M079j2344O991J724m786N120n023n35Q535q666j797J1301r891J09
$$ plain form
1227 -3077 5338 -4025 -1528 4554 -4284 -1085 4156 -5010 254 2143 -3513 1808 -1296 -2751 3826
1242 3826 -2238 -4140 5688 -2621 -3732 5273 -3587 -1513 4312 -4130 -1504 5621 -3419 -1005 2790
1257 2790 -2099 2493 -668 -2754 4906 -434 -4482 4863 -175 -3167 4861 -2554 -860 5158 -2942
1272 -2942 -1100 5109 -2251 -1182 3874 -1869 1570 523 -2411 3663 449 -3773 3347 1078 -2850
1287 -2850 3208 -2242 -723 4825 -2942 -2673 4426 -741 -2451 1910 -1840 1664 994 -4173 1652
1302 1652 1918 -2109 -180 -945 -457 3511 -4471 -2693 5753 -1969 -3657 2283 -130 -795 953 -3381
1318 -3381 457 2281 -2421 -515 -401 290 905 -2250 -1225 4004 -1471 -3353 2918 -237 -871 1675
1334 1675 -1184 -747 3553 -1400 -1810 3416 -123 -216 34 -86 2672 -142 -2881 3600 1083 -2759
$$ packed form
1227c077Q415r363K497O082q838L199N241r166N264J889n656N321l104j455O577
1242C826o064j902R828q309j111R005q860K074N825q442K626P125r040K414L795
1257B790m889M592l161k086P660n340m048R345n038k992Q028p415J694O018q100
1272b942J842O209p360J069N056n743L439j047k934O074l214m222P120k269l928
1287b850O058n450J519N548p767K69P099n167j710M361l750L504o70n167N825
1302A652K66m027J929p65M88L968p982J778Q446p722j688N940k413o65J748m334
1318c381L838J824m702J906J14O91O15l155J025N229n475j882O271l155o34K546
1334A675k859M37M300m953m10N226l539r3K50j20K758k814k739O481k517l842
$$ plain form
1350 -2759 3131 -780 -284 3357 -2033 -937 3582 -1493 -1278 2828 -960 927 -164 -863 2278 -983
1366 -983 -1676 1748 155 -397 1027 -2905 683 2774 -3086 -1547 1809 447 -2454 -54 534 -12
1382 -12 -492 -1686 403 1117 -1285 -2210 889 595 960 -2826 -2305 4606 -831 -4134 1747 819 -1982
1399 -1982 1442 -1902 -447 2772 -2533 -488 1386 -73 500 -1926 -216 4519 -2105 -3370 3977
1414 3977 448 -489 324 -1433 1803 2361 -1748 -669 2052 408 -151 -731 1800 964 -1712 478
1430 478 2095 586 -1753 690 1042 230 433 -569 -775 1976 833 -2750 1677 265 -1314 1392
1446 1392 -617 -438 281 -1502 780 1287 -2872 644 -582 -960 2398 -3150 -1574 3293 -1553 -2304
1462 -2304 1676 -1111 -248 38 -1144 1418 -1351 -1529 1145 170 -454 159 -2079 699 2747 -2943
$$ packed form
1350b759N890l911M96L641n390J096M519n075K15M106l788J887j091o99L141l261
1366i83o93L424j593n52J424l932L588K091n860J539L356j362k901K400N88n46
1382a2m80j194K089P14k402r25L099k94L65l786N21O911n437l303N881r28k801
1399a982L424l344J455L219n305K045J874j459N73k426J710M735o624j265P347
1414C977l529r37Q13j757L236N58m109J079K721j644n59n80K531q36k676K190
1430D78J617j509k339K443L52q12K03j002k06K751j143l583M427j412j579K706
1446A392k009J79P19j783K282N07m159L516j226l78L358n548J576M867m846p51
1462b304L980k787Q63K86j182K562k769j78K674r75o24O13k238K778K048n690
$$ plain form
1478 -2943 -1695 2321 396 -1540 175 515 -424 735 -414 393 939 23 -1052 1178 1297 642 -1197
1495 -1197 -1598 4057 1116 -3280 944 2217 -364 1274 -221 -1276 3257 -1093 -1108 2157 170 -853
1511 -853 -143 84 2093 -692 -3060 2612 938 -1046 437 -1695 882 2648 -2250 -2101 1936 -41
1527 -41 -764 -615 -554 1451 -1440 -1266 1219 -78 -1662 -132 -443 677 1269 -3765 -1211 3462 -349
1544 -349 -3524 914 727 -491 749 -1676 9 1292 -717 -717 1170 -566 527 -349 -1680 3244
1560 3244 -299 -3132 2927 1429 -2338 1623 -370 -774 3298 -1449 -1192 2352 149 504 649 -765
1576 -765 1456 270 -1363 2957 -515 -1492 2592 83 -1109 1126 -8 -800 1134 -346 197 907
1592 907 -1428 -2 927 290 -542 -667 -333 2302 -1208 -2846 1841 484 -1611 -335 -631 -921 2356
$$ packed form
1478b943J248M016j925j936J715L40r39J159j149Q07N46r16j075K230J19o55j839
1495a197m01N655k941m396M224J273k581J638j495j055M533m350j5L265j987j023
1511h53P10K27K009k785k368N672j674j984J483k132K577J766m898J49M037j977
1527d1p23J49O1K005k891J74K485j297j584J530l11J120N92n034K554M673l811
1544c49l175M438j87j218J240k425J685J283k009%J887j736J093q76j331M924
1560C244l543k833O059j498l767L961j993m04M072m747K57L544k203L55J45j414
1576g65K221j186j633M320l472r77M084k509j192K235j134p92J934j480N43P10
1592I07k335J426R29o37q32j25L34K635l510j638M687j357k095J276k96k90L277
$$ plain form
1609 2356 -2253 -2642 3356 -318 -2996 1 738 568 -839 -3431 1918 2724 -3805 -428 933 219
1625 219 1390 -2456 -2447 4951 465 -4885 1727 2290 -385 -962 -669 1434 2157 -1469 -1281 2183 894
1642 894 231 -1374 -574 3555 646 -3145 717 3365 -1461 -706 666 722 1187 -592 -1296 1369 1583
1659 1583 -1261 -329 402 1628 -291 -1542 1122 683 -1226 283 387 -1633 1036 80 -1349 413
1675 413 -49 -397 203 -623 -662 766 -275 -512 -807 -593 1603 -779 -1701 910 923 -1524 -210 -105
1693 -105 -595 1170 -815 -1748 1204 1572 -2168 -1014 1596 1257 -1126 -1830 1171 1512 -723 -1400 848
1710 848 1482 805 -1251 -1563 2862 1686 -2380 -1200 2503 1169 -1685 -574 1305 1469 -606 -609 15
1727 15 1856 1233 -2229 -614 2704 985 -2360 134 1697 882 -1521 -1100 2117 851 -1295 -1133
$$ packed form
1609B356m609l89N998l674k678K997P37j70j407k592N349Q06o529L377J361p14
1625B19J171l846RP398m486n350O612N63k675n77K93K103P23l626J88L464j289
1642H94o63j605Q00M129k909l791L862K648m826P55J372N6M65j779p04K665K14
1659A583k844R32P31J226j919j251K664m39j909J509J04k020K669r56j429J762
1675D13m62l48O00q26l9J428j041k37k95K14K196k382r22K611J3k447J314J05
1693a05m90J765j985r33K952L68l740J154K610l39k383p04L001L41k235o77K248
1710H48O34o77k056l12M425j176m066J180L703j334k854J111J879J64k075lO24
1727A5J841o23l462J615L318j719l345K494J563q15k403M21L217j266k146J62
$$ plain form
1743 -1133 795 1178 309 -2105 -25 2785 -1428 -2041 1260 858 -1314 -466 -578 500 871 -2072 -545
1760 -545 1484 -208 -1431 -419 601 550 -1397 -1894 2266 -156 -2289 286 849 -375 428 -1106
1776 -1106 -535 2667 -1184 -1994 1496 1573 -1146 -1232 264 2041 -110 -2405 1558 1457 -944 -123 -8
1793 -8 522 1575 -954 -1547 2958 1141 -2065 -95 1851 905 -1327 -585 1158 1567 -1334 -562 1006
1810 1006 637 431 -1328 -709 2030 219 -2658 1137 1677 -1309 -801 124 1019 -143 -1381 -486 1783
1827 1783 -504 -1340 -394 -147 1317 -1273 -1620 1571 310 -2243 276 575 -951 206 -1244 27
1843 27 1235 -1069 -1526 634 865 -260 -1496 -351 1879 -851 -1900 943 1052 -906 -157 215 3
1860 3 683 -888 -523 1876 1125 -2015 -213 2090 554 -671 -917 1275 1338 -780 404 641 165 1033
$$ packed form
1743a133J928L83q69k414K080K810m213o13L301m02k172Q48j12J078L71k943J527
1760e45K029j692j223J012J020n1j947m97M160k422k133K575N63j224Q03j534
1776a106N71L202l851q10L490P7k719q6J496J777k151k295L963j01k401Q21J15
1793hN30J053k529n93M505j817l206J970J946r46k232P42J743M09k901P72J568
1810A006l69k06j759O19K739j811k877L795N40k986N08R25Q95j162j238Q95K269
1827A783k287q36R46K47J464k590l47L191j261k553K519K99j526J157j450J271
1843B7J208k304m57K160K31j125j236J145K230k730j049K843J09j958P49L72k12
1860CO80j571L65K399p51l140J802K303j536j225k46K192O3k118J184K37m76Q68
$$ plain form
1878 1033 448 -1473 2063 987 -2071 873 1073 -623 -259 -136 633 1350 -1697 22 969 -187 918
1895 918 -1177 -997 1855 -86 -1699 940 180 -966 580 -253 -234 -269 -401 126 330 -660 -524 -240
1913 -240 -281 664 -1019 -738 282 329 -983 7 629 -1349 397 594 -1209 396 323 -1347 1370 825
1931 825 -1924 442 305 840 582 -1722 1168 1580 -1708 374 1221 -1353 1834 548 -858 2096
1947 2096 63 -1023 807 1139 -128 -503 -477 2093 342 -1431 617 11 307 692 -439 -475 1276
1964 1276 234 -1064 -59 833 -600 -1243 1314 234 -654 -842 -208 912 -62 -1110 -188 235 204
1981 204 497 -2147 480 1643 -2153 542 607 -1507 350 134 -1140 996 -792 -1087 1361 -699
1997 -699 551 -356 -1213 1242 560 -1563 780 433 -939 1257 -104 -465 407 78 173 360 237 -343
$$ packed form
1878A033n85j921L536j076l058K944K00j696L64J23P69P17l047J719R47j156J105
1895I18k095J80K852j941j613K639p60j146J546q33J9l5j32N27K04r90J36K84
1913b40m1R45j683K81J020M7j312R90O22j978J746J97j803J605p3j670K717n45
1931H25k749K366j37N35k58k304K890M12l288K082Q47k574L187j286j406K954
1947B096k033j086J830L32j267l75K6K570j751j773K048o06K96L85j131l6J751
1964A276j042j298J005Q92j433o43K557j080q88j88O34J120r74j048R22M23l1
1981B04K93k644K627J163l796K695O5k114J857k16j274K136j788k95K448k060
1997f99J250r07q57K455o82k123K343l47j372K196j361l61Q72l29R5J87j23n80
$$ plain form
2015 -343 73 820 692 -1048 350 844 -180 -135 329 923 -1143 427 1587 -1028 -168 775 -320 460
2033 460 806 -1474 857 613 -491 406 -1120 624 631 -1678 388 1150 -1783 733 704 -1687 1146
2050 1146 -375 -1478 1029 434 -1286 -330 -52 574 -35 -1678 544 602 -715 -379 -241 -30 406 -243
2068 -243 -1097 623 160 -881 -350 984 -412 -530 202 -488 570 -67 -693 169 770 561 -81 -834
2086 -834 948 1488 -1394 331 1076 -571 666 51 -817 1284 691 -1034 886 842 155 -233 -781 1422
2104 1422 633 -1152 138 1318 -595 710 228 -1215 1439 548 -1263 -172 1617 -412 -376 -141
2120 -141 391 428 -1037 -137 484 -8 -368 -271 -563 384 270 -1815 484 1140 -600 -797 153 -382 318
2139 318 -565 -1123 381 -117 1 -565 -472 865 322 -1512 62 1226 -856 477 -81 -497 1201 -133
$$ packed form
2015c43M16P47j28j740J398M94j024M5M64N94k066J570J160k615Q60R43j095P80
2033D60L46k280K331k44j104Q97j526J744Pk309K066P62k933K516k9k391K833
2050A146j521j103K507n95j720R56K78O26o09j643K222N8j317L36J38K11M36o49
2068b43q54J720m63j041N31J334j396j18P32o90J058o37o26Q62O01k09o42p53
2086h34J782N40k882J725P45j647J237o15q68K101n93j725J920m4o87l88n48K203
2104A422p89j785J290J180j913J305m82j443K654q91j811J091J789k029L6K35
2120a41N32L7j465R00O21m92l60R7k92R47j14k085K299O56j740j97R50n35P00
2139C18q83n58J504m98J18n66R3J337n43j834J574J164k082J333n58m16J698j334
$$ plain form
2157 -133 -1077 774 1134 -836 122 -334 706 364 -852 253 949 1 90 349 -723 1562 569 -1889
2175 -1889 724 1539 -406 -339 403 1 865 -828 -465 1248 -9 -213 -355 93 940 408 -1516 679
2193 679 1251 -1322 -16 648 -574 -80 274 -1328 374 386 -943 -17 -395 230 -89 -1053 -223 312
2211 312 -1123 -301 710 -1168 199 285 -1020 173 148 -496 176 -39 -960 775 65 -521 -46 141
2229 141 749 12 -1201 731 1335 -1334 -162 540 54 635 -347 -854 1172 1167 -1317 191 1027 404
2247 404 -134 -867 1159 1081 -611 -691 964 59 631 115 -1504 1640 1046 -2161 -64 1968 -434 -568
2265 -568 -77 243 1068 -1076 -692 871 94 -706 -401 -853 911 301 -1920 481 1013 -859 -716 298
2283 298 -243 -330 -148 -966 297 -65 -661 -328 222 255 -490 -947 325 863 -934 -397 925 -10 -457
$$ packed form
2157a33r44J851L60j970R58m56J040l42j216J105O96r48Q9K59j072K285r93k458
2175a889K613Q15j945O7P42m02Q64j693L63J713j257k04j42M48Q47n32j924K195
2193F79N72k573J306O64j222M94L54j602J702J2j329R26l78O25l19r64Q30N35
2211C12j435Q22J011j878J367Q6j305J193k5o44O72k15r21J735p10n86M75J87
2229A41O08p37j213J932O04k669J172P02m86N81r82n07K026nk484J508Q36o23
2247D04n38p33K026p8j692q0J655r05N72n16j619L144n94l207K097K032k402j34
2265e68M91L20Q25k144L84J563p77q00L05m52J764o10k221K401N32j872J43J014
2283B98n41q7J82q18J263l62n96L33N50L3p45m57J272N38j797N37J322r35m47
$$ plain form
2302 -457 -219 -441 523 599 -1171 586 641 -439 -111 80 610 230 -921 307 1212 -1032 512 367
2320 367 -408 1273 5 -913 948 889 -707 -69 289 648 -21 -511 628 351 -274 -122 529 78 490
2339 490 -343 -921 989 917 -1069 -667 1326 -521 -972 336 -373 169 168 -521 -3 207 -885 97 -348
2358 -348 -185 812 -1472 -188 1403 -1008 -765 680 -437 79 347 -1122 530 139 -185 -12 -198
2375 -198 89 -107 -325 641 180 -933 293 489 63 -411 -433 460 237 210 -135 -56 813 32 -569 870
2395 870 616 -395 442 366 420 12 -88 656 602 -81 179 -478 193 1543 -705 -660 1241 68 -56 22
2415 22 -144 296 -160 -37 315 -514 -259 376 -836 815 -24 -1184 151 321 -423 -374 -395 -293 184 -347
2435 -347 254 -773 -351 760 -282 -417 -119 -83 -362 138 -189 -294 -381 20 -31 -355 779 -293 62
$$ packed form
2302d57K38k22R64P6j770J757N5j080L28J91N30l80j151J228R05k244J544j45
2320C67p75J681j268r18J861n9j596O38L58L59o69m90J139k77o25J52O51m51M12
2339D90q33n78J910p2j986M02J993j847m51J308p09N42jo89N18K10j092R82m45
2358c48J63R97k284J284J591k411K43J445j117N16K68j469J652l91l24J73j86
2375a98K87j96k18R66m61j113J226J96m26m74k2Q93k23k7l45P9Q69p81o01J439
2395H70k54j011Q37p6N4m08j00P44n4o83K60o57O71J350k248M5J901j173j24P8
2415B2j66M40m56J23L52q29K55O35j212J651q39j160J335J70p44M9k1J02M77n31
2435c47O01j027M22J111j042j35K98L6k79N00l27j05q7M01n1l24J134j072L55
$$ plain form
2454 62 375 85 -332 -135 -107 205 532 -179 116 143 542 588 -978 290 1038 -118 -214 511 -451 355 367
2475 367 -331 534 -201 104 63 252 559 -181 -704 778 569 -614 540 -234 -136 399 251 -559 31 634
2495 634 -267 -399 -137 484 -565 -291 553 -185 -618 -172 337 -422 -9 87 -463 -157 652 -702 -806 517
2515 517 -468 54 -56 -652 123 126 -268 -111 -235 -175 440 -830 114 826 -889 26 987 -172 -49 365
2535 365 -165 491 210 -553 215 246 179 -17 87 195 408 -62 383 72 -165 662 80 -56 90 566 -157
2556 -157 52 643 -21 -121 107 413 34 3 -34 -272 4 270 105 -1166 177 413 -840 -50 471 -668
2576 -668 113 14 -943 227 270 -940 -332 96 85 -266 -954 -67 990 -1059 -312 710 -425 337 140
2595 140 -670 388 727 -1312 -101 686 -157 -179 -236 464 457 -187 -850 689 375 -324 61 27 613 648 -842
$$ packed form
2454F2L13k90m17J97K8L12L27p11K95K7L99M6j566J268P48j156r6P25r62Q06J2
2475C67o98Q65p35L05m1J89L07p40n23J482k09j183J154p74R8N35j48q10N90O03
2495F34r01j32K62O21j049K74Q44p38m33M46N09p59M13R6n50L06Q09j354j04J323
2515E17r85N22j10n96P75Ll94J57j24O0O15j270R44P12j715R15R61j159J23M14
2535C65n30O56k81p63P68L1o7j96J04J08K13m70M45l11k37Q27n82j36J46M76p23
2556a57K09N91o64j00K28L06l79l1l7k38K76K66j65j271J343K36j253P90N21j139
2576f68P81r9r57J170M3j210O08M28j1l51o88Q87J057k049P47J022j135P62j97
2595A40q10J058L39k039J211P87q43k2n7P00po44o63J539l14o99L85l4N86L5j490
$$ plain form
2616 -842 -557 1641 -137 -652 253 325 551 -206 -456 533 529 -735 -61 344 670 431 -839 375 930
2635 930 -625 -86 737 -19 117 90 -696 337 254 -347 -397 -1 -122 -228 -523 -109 770 -1069 -309 643
2655 643 -811 -384 339 -784 -241 640 -888 -86 495 -439 -234 141 -272 -168 125 -508 448 -419 -348
2674 -348 678 -544 -405 779 -183 -793 626 -79 131 855 -557 24 547 -129 -4 102 95 586 -16
2693 -16 -400 729 -4 120 -151 -41 541 668 -886 -242 990 -125 -418 30 289 122 -254 -250 270 307
2713 307 -185 -315 -298 709 356 -883 95 985 -352 -443 384 -285 332 -279 -839 26 452 -310 -596 -24
2733 -24 172 486 -1267 -261 1094 -837 -776 520 -64 -43 256 -934 142 732 -865 -200 282 63
2751 63 75 -450 -1 1032 -502 -499 356 32 70 148 -395 60 1286 -417 -406 991 230 -259 161 267 124
$$ packed form
2616h42K85K198j778n15R05P2K26p57k50R89mj264O74M05L26k39j270J214N55
2635I30j555N39Q23p56J36k7p86J033q3o01n0L96j21j06k95M14Q79j839P60R52
2655F43j454M27P23j123N43Q81j528Q02N81r34K05L75m13J04K93o33R56q67P1
2674c48J026j222J39J184r62o10J419p05K10P24j412N81N23o76J25J06pM91o02
2693a6l84J129p33J24k71J10N82J27j554O44J232j115k93M48K59j67l76MN20L7
2713C07m92j30J7J007l53j239R78Q90j337r1Q27o69O17o11n60Q65M26p62k86N72
2733b4J96L14j753J006J355j931O1J296n84K1K99j190J076N90j597O65M82k19
2751F3J2n25M49J033j534LQ55l24L8P8n43M55J226j703J1J397p61m89M20J06j43
$$ plain form
2772 124 472 -334 451 441 -84 425 25 185 328 -394 -326 825 -401 -364 776 -645 34 394 -183 -150
2792 -150 396 -291 63 170 -342 207 -339 -213 215 -839 -92 459 -542 -292 340 -812 -151 350 -22
2811 -22 -20 -164 -358 -300 413 -185 -477 -453 271 497 -435 -355 185 75 -531 425 -37 -291 192 -181 -85 169
2833 169 59 -170 453 -176 206 371 -456 616 93 39 310 -65 -281 1032 -251 -562 903 -57 256
2852 256 249 -49 46 518 63 317 -8 89 525 -444 274 219 -343 -265 65 -198 -153 148 -413 120 359 -243
2874 -243 -583 294 418 -812 -180 280 -185 -124 108 -279 -264 -578 129 179 -797 176 -590 -290 829 -398
2894 -398 -627 125 125 -186 143 -335 167 -156 -324 403 -376 -168 507 26 89 651 -779 93 930 -27 -35
2915 -35 -402 481 424 66 -75 359 149 129 94 -141 435 73 14 325 287 -153 -488 371 232 -213 -22 90
$$ packed form
2772A24L48q06P85j0n25N09m00J60J43p22O8J151j226L7J140j421O79L60n77L3
2792a50N46o87L54J07n12N49n46J26M28j054P47N51j001K50O32j152O61N01l72
2811b2Kj44j94N8P13n98k92K4P24K26r32Q0N40j10o06R56m62k54M83l73R6K54
2833A69j10k29O23o29L82J65q27J072n23n4K71l75k16J313j283l11J465r60L13
2852B56pk98R5M72m55K54l25R7M36r69P18n5n62P8L30k63M5L01n61N33K39o02
2874b43l40Q77J24j230O32M60m65O1K32l87J5l14P07N0r76R73p66L00J119j227
2894c98k29P52%l11L29m78N02l23j68P27p79K08O75m81O3N62j430Q72Q37r57q
2915c5l67Q83n7l58j41M34k10k0l5k35N76l62n9L11l8m40l35Q59j39m45J91J12
$$ plain form
2937 90 -263 676 380 -600 414 -187 -46 -177 -234 91 -17 -439 235 91 -587 403 -786 -169 435 -763
2957 -763 -216 349 -369 -238 -170 -272 82 -526 -40 -211 -725 342 166 -487 -372 96 -208 -6 -330 -92
2977 -92 -151 -173 776 -210 -92 388 -24 -119 189 -105 -93 284 -119 51 15 310 69 -248 919 123 -429 122
2999 122 651 62 268 8 -31 375 -102 325 -56 246 627 -599 -16 267 -155 -272 528 -214 67 -180
3019 -180 -354 217 322 -429 -767 135 195 -93 -782 190 297 -535 -207 -95 97 -380 -53 52 -104 330
3039 330 -260 -636 456 43 -604 73 146 -81 -232 -279 276 -174 128 8 -105 -114 236 -404 -266 665 -81
3060 -81 -189 377 645 -350 -22 142 182 -90 -88 525 -65 205 67 -203 71 597 64 -67 602 -24 239
3081 239 76 95 -364 193 31 -122 137 -235 53 -215 59 36 -59 96 36 -51 -389 239 -457 -321 121 -54
$$ packed form
2937I0l53R39k96r80J014o01J41j31n7L25j08m22O74j44o78R90j189O17O04j198
2957g63N47N65p18J31O8j02L54o08M86j71n14J067j76o53J15M68l04K02l24K38
2977i2n9k2R49r86J18M80m12r5L08k94J2L77m03J70l6K95k41l17J167p96n52N51
2999A22N29n89K06k60l9M06m77M27l81L02L81j226N83K83m22j17Q00p42K81k47
3019a80j74N71J05p51l38R02O0k88o89R72J07q32L28J12J92m77L27J05j56M34
3039C30n90l76J092m13o47O77P3k27j51m7N55m50L02j20j13rL50o40J38R31p46
3060h1j08N66K68r95L28J64M0k72KO13n90K70j38k70K74N26n33j31O69o26K63
3081B39j63J9m59N57j62j53K59l72K88k68K74k3r5J55o0q7l38O28o96J36M42j75
$$ plain form
3103 -54 -281 34 -78 -508 328 3 -63 -46 66 -409 -478 149 -132 -279 -62 513 -25 -298 -38 65 -170
3124 -170 142 66 -300 260 171 -132 -39 44 106 -199 -57 192 -82 -232 40 -82 192 811 -378 134 571
3145 571 415 -125 -97 502 332 147 -325 743 -17 53 -214 140 325 318 -230 -443 667 -110 -347 354 316
3166 316 249 -53 -90 -13 513 -177 -342 268 313 -48 -538 34 428 -165 -594 429 -154 -368 -12 -203 -126
3187 -126 200 -393 -385 212 -42 -575 -317 315 248 -401 -379 3 142 39 10 -125 -30 211 -278 -334 265 386
3209 386 -548 114 266 -213 139 -101 455 154 105 282 232 154 285 60 17 306 -127 11 508 53 -148
3230 -148 262 97 -128 0 164 310 -241 -143 356 -120 -125 -317 -34 243 422 -363 12 467 182 -423 -208
3251 -208 442 -69 185 -252 -115 133 -254 -524 -277 404 -179 -79 -361 406 -241 -826 79 150 86 -104 -109
$$ packed form
3103e4k27L15j12m30Q36l25o6J7J12m75o9O27k81j47K17N75n38k73K60J03k35
3124a70L12p6l66N60q9l03R3Q3O2l05J42K49k74j50K72j22K74O19j189N12M37
3145E71j56n40K8N99j70j85m72J068p60P0k67L54J85pn48k13J110p77k37P01l8
3166C16o7l02l7P7N26o90j65O10M5l61m90N72L94n93m29J023n83k14L56j91P7
3187a26L26n93QN97k54n33K58O32o7o49K2L82J39j03k9j35R5K41m89n6N99J21
3209C86r34O62J52m79L52k40N56l01m9J77n0p8J31k25m3K89m33J38M97m55k01
3230a48M10j65k25J28J64J46n51R8M99m76nj92K83K77J79p85L75M55k85o05K15
3251b08O50n11K54m37J37K48l87k70K47O81n83J00k82P67o47n85R05P1o4j90n
$$ plain form
3272 -109 -92 407 -527 -503 334 211 255 -241 -73 537 -214 -519 414 20 150 88 -501 367 367 -207 -44 320
3294 320 581 -122 -261 173 566 -61 -153 359 130 133 1 44 252 235 -151 -268 445 29 -530 247 257 -384
3316 -384 157 -214 -333 290 -111 -187 -31 -298 16 35 -443 354 -68 -636 248 -40 -547 154 -123 -78 183
3337 183 -583 1 95 -409 -44 -185 298 71 -489 -6 192 -186 -113 501 122 -62 -109 103 11 283 115
3358 115 -535 232 496 -205 -290 303 67 149 -128 107 228 -391 454 299 -118 388 191 -317 721 508
3378 508 -506 153 297 169 -195 -206 282 303 -176 255 -65 -28 201 -292 7 187 -665 58 40 -30 -330
3399 -330 -149 -161 94 -237 -58 -194 -45 102 -325 -254 53 -296 -343 -152 -13 218 -360 57 517 -576 12
3420 12 404 -72 170 -191 -348 81 124 -219 110 -193 37 68 -331 564 40 -232 245 191 -247 -75 125
$$ packed form
3272a09J7M99r34K4Q37j23M4m96J68O10p51l05R33l94J30o2n89Q68%n74J63L64
3294C20K61p03j39M34L93o27r2N12k29Lj32M3K08j7l86j17P13m16n59P77J0o41
3316c84N41l71j19O23m01p6J56k67L14J9m78P97m22n68Q84k88n07P01k77M5K61
3337A83p66N84R4n04L65j41M83k27n60M83J98l78P3O14l79j84m7K12r2K72j68
3358A15o50P67K64p01q5N93k36Q2k77K35J21o19Q45j55m17N06j97n08J038k13
3378E08j014O59J44j28l64j1M88K1m79M31l20L7K29m93K99J80q52P23j8p0l00
3399c30J81j2K55l31J79j36J49J47m27P1L07l49m7J91J39K31n78M17M60j093N88
3420A2L92m76K42l61j57M29M3l43L29l03K30L1l99Q95n24k72M77n4m38J72K00
$$ plain form
3441 125 45 202 30 108 46 309 435 -284 7 401 -10 -103 466 -159 -47 188 351 150 -96 -14 -263 4
3463 4 80 -231 -118 450 -355 -289 290 -177 -179 -247 8 133 -192 -192 52 -120 142 50 -685 212 92 -194 -246 -118
3487 -118 -143 -240 112 -520 -29 50 117 -185 -86 139 -579 -184 223 95 -352 -59 63 17 217 123 102 -65 94
3510 94 -36 124 290 55 104 -68 154 104 26 82 322 64 280 266 -23 144 253 13 -137 650 26 -357
3532 -357 106 247 81 -290 -36 41 6 187 194 -11 -267 -139 -350 254 -120 -4 58 -261 155 -525 173 -40
3554 -40 -143 -290 56 -27 -365 24 -372 66 10 -114 -107 -146 -29 -77 13 152 65 -383 184 -61 -29 -139 -119 281
3578 281 164 259 -187 59 173 123 -216 20 460 -423 86 517 -63 -56 35 116 125 162 -16 57 257 568 -260
3601 -260 -297 335 161 -383 -199 210 -21 36 -33 155 120 182 13 -56 -155 108 -190 -155 373 -174 -467 237 -79
$$ packed form
3441A25q0J57j72P8o2K63J26p19K91L94m11r3N69o25J12K35J63k01k46Q2k49K67
3463DP6l11J13N68q05O6N79m67ko8K55J25l25%K44j72K62r2p35Q97j20k86n2J28
3487a18k5r7L52o32M91P9O7l02R9K25p18L95M07j28m47K93J22m6K00r4k1j67J59
3510I4j30J60J66k35M9j72K22n0p8N6K40k58K16j4k89J67J09k40j50P87o24l83
3532c57M63J41j66l71K54P7l5J81Pk05k56J28k11O04l74J16O2l19M16o80O98k13
3554d0j03j47L46q3l38L89l96M38n6j24Pl9J17m8R0J39q7m48N67k45L2j10K0M00
3578B81j17R5m46K46J14n0l39K36M40q83N09M31n80PR1Q1RL7j78P3K00L11q28
3601b60l7O32j74n44J84M09k31N7o9J88l5O2j69o9r9K63k98L5N28n47k93P04l16
$$ plain form
3624 -79 -25 -234 -90 -266 39 -104 -129 270 75 239 -215 -17 -187 133 -46 -148 97 -177 -68 -285 -92
3645 -92 -47 53 -174 188 66 -314 116 30 -169 -40 339 -77 -63 176 118 15 -63 249 37 -57 216 137 -16
3668 -16 124 168 -176 137 51 -39 -74 335 9 -260 162 211 -11 -87 -30 63 -284 -6 -145 72 -15 109 -386
3691 -386 -214 22 -43 -205 -137 116 -81 55 -351 99 -164 -89 -96 -1 304 18 -225 -16 76 -251 -43 70
3713 70 -100 161 -23 -215 -249 101 90 -3 -15 200 -203 -364 211 -78 21 -261 -127 -26 396 37 -500 -123
3735 -123 367 -128 -14 263 267 31 130 -67 254 54 -207 -49 276 394 -251 -332 434 208 -472 104 157 -174
3757 -174 80 -185 197 77 125 -197 -136 -101 159 -54 -193 453 -421 -67 -188 167 -313 -113 -140 -240 -182 71
3779 71 108 -72 -173 -145 67 -96 -328 -153 56 58 -104 -34 -134 38 -34 -229 417 -472 47 -1 -3 -74 213 -356
$$ packed form
3624g9N4k09J44j76L05j43k5L99j95J64m54J98j70L20j79j02K45k74J09k17J93
3645i2M5J00k27L62j22l80M30q6j99J29L79m16J4K39n8j03p8L12k12r4K73p9j53
3668a6J40M4l44L13q6r0l5M09l26k69M22M9k22p6N7R3l47K78j39K17q7J24m95
3691c86J72K36o5j62O8K53j97J36m06M50k63P5pR5L05k86k43K09R2l27K08J13
3713G0j70K61j84j92l4L50j1r3j2K15m03j61N75k89R9k82J34J01M22l59n37L77
3735a23M90m95J14K77Mk36R9j97L21k00k61J58L25J18o45q1P66k26o80N76N3l31
3757a74K54k65L82j20M8l22O1L5K60k13j39O46q74L54j21L55m80K00k7j00N8K53
3779G1L7j80j01K8K12j63k32J75K09Kj62P0j00J72p2j95O46q89N19m8kp1K87n69
$$ plain form
3803 -356 231 255 -86 166 -148 412 140 -53 193 264 -86 354 -96 -31 141 -147 -108 48 216 -109 -204 485
3825 485 94 -166 36 353 -64 -189 135 -200 134 171 -1 19 -10 -64 -63 -145 82 -17 -74 206 83 182 -155
3848 -155 -164 -26 102 -175 -126 -299 31 258 -472 -124 346 -376 11 145 -417 73 -122 102 174 -353 -5
3869 -5 16 -316 233 -156 69 81 -32 -170 217 52 5 211 74 -65 -113 270 70 -10 315 84 192 365
3891 365 289 -116 -135 195 235 75 -201 275 -77 25 223 -60 -47 504 -35 384 314 -292 -73 -29 -189 235
3913 235 -280 -67 107 -187 82 -98 -277 -25 254 -65 200 -112 -33 -43 -100 126 -214 -277 119 -53 -255
3934 -255 -32 -474 -95 43 -242 -17 73 96 -147 293 -101 104 -365 99 -49 -228 69 77 70 214 -159 -48
3956 -48 93 193 -44 -15 -97 164 -165 260 146 -79 171 134 6 185 195 -119 20 -137 435 -282 -36 175
$$ packed form
3803c56N87K4l41K52l14N60k72j93K46P1l50M40m50O5J72k88L9J56J68l25r5O89
3825D85l91k60K02L17m17j25L24l35L34L7j72K0k9n4Jq2K27r9n7K80j23R9l37
3848a55rJ38J28k77M9j73L30K27p30L48M70p22L87J34n62M90j95K24P2n27L48
3869eK1l32N49l89K25J2j13j38L87j65m7K06j37j39m8L83k00q0L25k31J08J73
3891C65p6m05j9L30M0j60k76M76l52J02J98k83J3N51n39M19p0o06K19M4j60M24
3913B35n15K13J74k94K69j80j79K52K79l19K65l12P9j0n7K26l40o3L96j72k02
3934b55K23m42L79J38k85K25R0K3k43M40l94K05m69M64j48j79K97QpJ44l73J11
3956d8J41J00k37K9q2K61l29M25j14k25K50l7j28J79J0l14J39j57N72p17K46K11
$$ plain form
3978 175 65 -41 45 337 -201 48 -126 98 264 -102 218 -313 103 35 -287 -3 267 -235 28 196 -239
3999 -239 176 -73 -30 -19 45 -16 -307 0 -99 -3 -300 343 -171 -150 -85 -110 176 -284 66 -77 -43 -70 -172 -39
4023 -39 250 -36 -212 19 358 -185 -137 -87 -42 -256 -214 59 139 116 286 -234 225 224 -43 99 73 270 -374
4046 -374 262 202 138 -212 97 -21 -32 75 -160 -81 124 77 -404 -175 287 -266 51 -180 115 -162 161 221
4068 221 -241 150 336 -132 -105 298 -188 -188 -17 154 -134 -69 40 -100 -46 145 37 -181 135 58 -388 50
4090 50 144 174 -209 203 56 -263 -65 -87 -18 -228 3 -59 151 123 -99 15 -173 169 -192 272 -111 252
4112 252 59 -137 225 -66 171 -132 100 232 16 -92 70 107 -308 -89 152 138 -358 121 -84 -257 -212
4133 -212 77 268 -136 131 -133 104 34 -121 -142 52 98 -367 -47 401 -126 -79 -100 15 9 257 229 -33 -46
$$ packed form
3978A75j10j06Q6K92n38K49j74K24J66l66L20n31M16o8l22K84K70n02K63J68m35
3999b39M15k49M3J1O4o1k91L07r9R6k97O43n14K1O5k5K86m60L50j43L4k7j02J33
4023c9K89k86j76K31L39n43M8N0M5k14M2K73Q0k3J70n20M59jk67J42k6J97o44
4046c74O36o0o4l50L09j18j1J07k35P9K05m7m81K29M62n53L17k31K95k77L23O0
4068B21m62L91J86m68K7M03m86%J71J71k88O5J09j40N4J91j08k18L16p7m46M38
4090E0R4L0l83M12j47l19J98k2O9k10K31o2K10k8k22J14j88L42l61M64l83L63
4112B52j93j96L62k91K37l03K32J32k16j08J62L7m15K19K41j4m96M79k05j73M5
4133b12K89J91m04K67k64K37p0j55k1J94M6m65L20M48n27M7k1J15oK48k8k62j3
$$ plain form
4156 -46 -127 -74 -48 190 39 -22 -294 169 -1 -241 -128 229 0 -310 21 -88 56 -88 -248 -47 215 -98
4178 -98 -107 101 -163 103 -139 163 2 93 166 57 -22 52 144 -263 3 88 84 94 12 151 -229 98 -64 321
4202 321 -24 -131 -116 78 285 -406 120 -35 57 -225 234 249 46 -121 -17 -19 -371 90 149 -252 -107 -100 -187
4225 -187 189 -128 -361 63 29 39 -68 121 -105 23 40 117 -44 -45 -136 -65 -102 -6 72 28 -49 184 -134 -87 73
4250 73 -15 -92 46 56 -61 12 -136 118 53 -343 118 71 -101 46 -194 100 -42 -34 125 247 -287 325 -54
4273 -54 161 -29 136 252 -211 85 38 112 -241 239 24 51 48 -109 -114 134 199 -26 -8 6 64 -281 211 115
4297 115 -130 141 69 -261 135 81 -16 -146 53 184 -314 11 135 -128 -150 -165 -88 116 -82 -81 -83 -124 -66 -214
4321 -214 -134 62 -67 33 302 42 -66 264 134 -358 -86 284 102 298 -92 -48 10 253 167 -86 -50 -9
$$ packed form
4156d6q1N3K6K38j51o1k72M63j70k40J13L57k29l10L31j09J44j44j60K01K62l13
4178i8rK08k64K66k42L02j61R1P3j09p9P4R2m07K66Q5mJ0q2J39l80L27j62L85
4202C21l45j07J5J94K07o91N26j55R2k82M59J5k03j67J04kl52M61N9m01J45Pq7
4225a87L76l17k33M24l4J0j07J89k26J28J7P7j61jr1P1l7R6P8m4p7K33l18M7J60
4250G3q8p7J38J0j17P3j48K54o5l96M61m7j72J47k40K94j42QJ59J22n34O12l79
4273e4K15j90J65J16m63K96m7P4l53M80k15K7lj57nK48O5k25J8J4N8l45M92r6
4297A15k45K71p2l30L96n4r7j30J99J31m98L25J24k63k2j5P7K04j98Jkm1N8j48
4321b14Q0J96j29J00K69k60j08L30j30m92K72L70j82J96l90M4N8K43q6k53L6M1
$$ plain form
4343 -9 -85 -54 94 -224 22 166 165 26 -338 58 -24 -101 172 52 -69 197 37 130 312 -52 149 29 132
4366 132 -121 -260 164 53 -73 16 -15 -247 156 18 -164 -201 22 264 -368 9 6 76 48 77 -120 -124 265
4389 265 -112 -148 -166 -173 -9 -14 284 111 -164 70 267 -292 102 13 -101 103 51 -21 39 25 -145 183 80 110
4413 110 -145 26 269 30 106 -77 122 -133 80 -11 -55 -93 -80 97 -116 63 13 -123 163 -12 114 355
4435 355 -227 -184 74 -6 -117 62 -103 -73 -131 43 35 -174 -88 124 0 -192 106 55 -134 -142 -64 -63 -341 -69
4459 -69 -115 54 89 177 -132 -13 -183 6 -162 -98 -136 -132 125 -141 -319 -69 63 93 79 306 -167 -46 81
4482 81 -69 104 10 147 134 63 189 280 -57 7 33 220 211 -21 -60 -15 134 -79 -29 82 10 104 -60 51 -68
4507 -68 37 237 -196 -97 225 -47 -75 -115 111 -4 56 150 -177 -18 -189 -62 -62 127 -33 -139 -52 -469 88
$$ packed form
4343ip6L1J48l18K46J44jj39l64L96q2p7K73j20j21K66j60R3J82l64K01j20J03
4366A32k53j39M24j11j26Q9l1k32M03j38j82l7K23K42o32L77lP0k8K9j97mL89
4389B65l77l6j8pJ64nK98j73k75K34J97n59L94q9j14K04n2p2O0j4j70L28j03L0
4413A10k55J71K43k39P6j83J99k55K13r1m4l8J3J77k13J79n0j36K86j75J26K41
4435C55n82M3K58q0j11J79j65L0n8J74qk09Q6K12j24j92K98n1j89qP8Jk78K72
4459f9m6J69L5Q8l09J19j70J89j68O4l8MK57k66j78K50J32L0j4K27m73J21J27
4482H1j50J73r4J37j3p1J26R1l37O4K6J87rk32l9M5J49k13N0J11p2R4j64J11j19
4507f8J05K00m33R9L22k72k8m0K26j15O0R4l27J59j71J27%J89j60j06Q7m17N57
$$ plain form
4530 88 194 317 -120 -147 106 -117 -372 35 46 -189 -185 223 -143 1 -46 34 -46 -37 -115 -5 71 19 -1 -45 64
4555 64 18 -111 -57 175 151 -95 273 -108 -142 -89 54 23 -167 198 10 215 278 -4 30 -55 -105 -58 -203 -32
4579 -32 8 94 -181 -37 78 87 -46 -107 206 -120 -57 -56 -67 -190 -166 -43 -18 -56 90 28 -120 -3 -94 -99 -108 -28 -63
4606 -63 54 -41 -158 -121 53 -95 -100 71 -104 -116 -61 145 188 -141 -84 -142 51 -87 326 -10 -53 -34 -129 -159 25
4631 25 263 7 82 62 117 63 242 206 -52 38 95 -247 9 178 35 49 191 -51 -129 204 141 117 -47 -96
4655 -96 -82 -157 8 -183 -146 233 76 41 18 -92 -111 -35 29 -42 19 19 -85 -392 40 -31 100 91 -102 -146 -19 67
4681 67 -54 -341 -281 170 -193 -120 46 -5 -10 -40 14 -473 -100 222 52 -142 229 115 -119 116 179 -178 186
4704 186 76 -46 -166 117 13 30 -70 177 -68 211 335 4 198 -110 -3 24 375 83 -4 -221 65
$$ packed form
4530H8J06J23m37k7K53k23k55M07J1k35MM08l66J44m7Q0q0Rp8J10P6n2k0m4J09
4555F4m6j29N4K32k4k46L68l81l4N3J43l1j90L65j88K05O3k82L4q5n0M7j45J71
4579c2M0Q6k75J44J15Rj33o1L13l26O3Jj1j23K4J23K5l8J46o2j48J17r1nrQ0l5
4606f3J17r5j17L7J74j48nJ71j75j2N5K06M3l29N7n8J93j38M13l36m3J9r5l0J84
4631B5K38k56P5k0N5n4J79l6k58R0N7l42K56J69j43J4J42k42p8L33o3k4j64m9
4655i6J4p5J65j91L7L79j57l5k3j10j9P6O4p1O1%j04l07M32p1J31rj93m4J27Q6
4681F7j21k87O0M51l63P3J66n1nl0N4m87L73L22j70j94L71j14k34K35O3l57L64
4704A86j10j22j20K83j04J7j00K47k45K79J24l31J94l08J07K7L51k92q7k17K86
$$ plain form
4725 65 143 -159 98 74 112 184 -153 -115 58 -170 -164 -43 -175 171 179 66 -234 -21 23 98 -26 -55 -34 89 -199
4750 -199 -41 -267 45 136 43 -144 -44 198 -6 -68 82 206 54 22 162 -245 -16 112 -58 23 31 -147
4772 -147 260 53 101 -218 -49 235 -148 141 -37 -63 84 243 -200 144 52 155 99 46 0 -186 -141 349
4794 349 -41 135 45 265 -165 -68 33 131 122 189 83 26 86 -70 -110 -81 220 -309 -133 -53 -244 70 -352 35
4818 35 78 43 40 -49 245 23 -177 -434 150 38 -127 43 -115 102 -225 45 209 262 -32 -22 -116 169 41
4841 41 -148 147 101 167 -179 130 -56 12 -108 162 272 -67 158 -29 -35 91 -220 -19 76 3 -9 252 -3
4864 -3 101 -99 43 22 -94 294 176 -85 194 155 195 -283 -17 -149 102 0 344 92 -70 76 1 -10
4886 -10 -112 41 -279 218 -63 -34 -82 99 85 -20 -80 -94 -14 34 -52 25 -33 -175 20 28 -150 -208 90 -45 -128
$$ packed form
4725F5P8l02K57k4L8P2l37L8J73k28OJ21j32L46Qj13l00K13M4P5j24k9K1J23k88
4750a99J58k26L12R1r3j87J00K42k04o2J50J24j52l2J40m07K29J28j70Q1Qj78
4772a47M07k07M8l19J69K84l83K89j78k6J47J59m43L44r2J03n6n3m6j86M5M90
4794C49l90J76r0K20m30R7J01R8rO7j06n7O0j56m0K9L01n29J76Q0j91L14m22L87
4818C5M3l5lq9K94k22k00k57N84j12j65J70j58K17l27K70J64N3k94J0r4K85j28
4841D1j89K95m6O6l46L09j86O8j20K70J10l39K25j87oJ26l11K01R5p3j2K61k55
4864cJ04k00J42k1j16L88j18k61K79l9M0m78K66j32K51j02L44k52j62J46p5j1
4886a0j02J53l20M97k81K9m8J81j4j05o0j4Q0M8q6P7n8j42J95Qj78n8K98j35q3
$$ plain form
4911 -128 116 -158 139 13 -9 66 -258 39 -84 -213 -302 131 -25 -136 -6 -44 80 -148 96 -56 -182
4932 -182 1 185 332 275 60 -196 154 69 104 226 11 135 126 73 -32 178 -50 20 94 -3 -164 118 31
4955 31 23 243 -178 -137 26 -34 -9 11 -174 -154 -58 76 -106 -121 45 178 -113 -63 80 -82 -131 198 82 145
4979 145 8 -57 79 -41 -82 -40 -111 53 -59 29 120 40 -223 27 -249 63 -161 -203 94 14 333 66 52
5002 52 -96 66 -58 105 -153 48 35 -59 -15 161 117 -101 -203 380 165 55 -204 -106 51 -179 -53 -137
5024 -137 94 164 -190 -141 194 184 -52 1 136 -73 23 -1 -155 -82 -58 290 -131 -74 282 -36 140 -147 82
5047 82 -171 207 -202 154 -53 18 137 -129 69 -64 -163 -15 58 44 -219 -55 -4 -206 142 146 58 59 143 -99
5071 -99 130 -139 105 -200 -27 228 -124 88 -31 112 -58 354 1 -63 -182 -51 -301 21 82 -143 369
$$ packed form
4911a28K44k74K97j26k2P5l24K97j23j29q9M33j56j11J30l8J24k28K44j52j26
4932a82J83J84J47n7k15k56L50q5L5J22k15J24rn3j05K10k28P0P4r7j61K82q7
4955C1qK20m21M1J63o0K5K0j85K0R6J34j82j5J66J33k91N0J43j62m9L29j16O3
4979A45j37o5J36j20m1M2p1J64j12Q8R1q0k63K50k76L12k24m2K97q0L19k67j4
5002E2j48J62j24J63k58K01j3r4M4J76m4k18j02N83k15j10k59R8J57k30J26q4
5024a37K31P0l54M9L35j0k36N3J35k09R6k4j54P3K4L48m21N7L56l18J76k87K29
5047H2k53L78m09L56k07P1J19k66J98j33r9J48P3j4k63J64N1k02L48Mq8JQ4k42
5071i9K29k69K44l05J73K55l52K12j19J43j70M12l53o4j19J31k50L22O1k25N12
$$ plain form
5092 369 176 17 220 225 74 -88 -79 21 58 167 52 2 -28 306 -112 77 191 13 -336 143 122 -231 -147
5115 -147 -33 55 21 -39 -40 -225 -99 -324 -362 -41 -110 14 -37 33 -85 -133 214 172 205 58 -220 99 13 146
5139 146 52 -40 -62 -73 -40 38 -42 82 188 -99 335 37 -206 -113 125 -150 -94 -1 -143 2 30 -53 75 5
5163 5 24 -89 33 92 89 41 217 58 -65 146 84 54 129 -148 -115 40 -145 -30 -9 -59 -91 71 201 -74 5
5188 5 114 -346 -134 -114 261 -175 -159 -2 -252 256 196 79 -74 -184 -73 -124 -53 -167 -102 176 113 -169 8
5211 8 -295 -35 -9 -94 52 -175 -65 69 -179 -140 44 -231 11 -17 0 84 17 240 -23 -79 102 -211 222
5234 222 62 26 68 103 -56 30 -297 166 165 -24 209 140 48 26 21 -133 167 103 75 68 -111 -27 -238 -87 34
5259 34 103 -51 11 176 87 -76 -137 118 -106 -174 47 29 74 290 -114 -173 120 66 174 -188 -3 227 -162
$$ packed form
5092C69j93j59K03Nj51j62RJ00L7J09j15n0l0L34m18J89J14j78l49M79k1l53Q4
5115a47J14Q8l4o0jj85J26k25l8L21o9J24n1P0j18m8L47m2L3j47k78L19q6J33
5139A46r4r2k2j1L3P8q0J24J06k87M34k98k43R3K38k75N6R3j42J45K8q3J28p0
5163EJ9j13J22N9lm8J76j59j23K11o2l0P5k77L3J55j85J15K1n0l2J62J30k75P9
5188EJ09m60K12K0L75m36J6J57k50N08o0j17j53j10J11n1P1j14O5K78o3k82J77
5211Hl03K60K6q5J46k27J10J34k48L9J84k75K42k8J7Q4o7K23k63n6J81l13M33
5234B22j60l6M2L5j59Q6l27M63jj89K33o9r2k2nj54L00o4k8pj79Q4k11J51J21
5259C4O9j54O2J65q9j63o1K55k24o8K21j8M5K16m04n9K93n4J08l62J85K30l89
$$ plain form
5282 -162 -23 249 71 20 222 -19 -61 150 186 -20 -200 45 86 62 321 -5 244 5 128 119 -55 -82 -91
5305 -91 -70 171 270 -89 45 30 14 226 3 78 -192 -25 108 -94 -36 55 36 -77 58 57 71 16 34 -105 100
5330 100 307 195 -54 14 -3 -129 -43 -23 195 -49 -18 119 3 -129 17 -49 -141 244 159 -33 83 -46 57
5353 57 -86 145 -143 105 -26 110 -65 111 201 8 -9 45 -174 -41 245 74 243 -4 -30 -104 -195 25
$$ packed form
5282a62J39K72j78n1K02k41m2K11L6k06j80K45M1k4K59l26K49k39J23rj74k7r
5305i1K1K41R9l59J34j5j6K12k23P5k70J67J33k02N8R1j9j13J35jJ4n5J8j39K05
5330A00K07j12k49O8j7j26Q6K0K18k44L1J37j16j32J46o6r2L85q5j92J16j29J03
5353E7j43K31k88K48j31J36j75J76R0j93j7N4k19J33K86j71J69k47k6p4r1K20
$$ [...]
8191C8
##END NTUPLES=NMR FID
##END=
