##TITLE=1H_SA_Sl.Me.3
 CDCl3, 8 sc, 
 26.8.2020
##JCAMPDX= 6.0         $$ Bruker NMR JCAMP-DX V2.0
##DATA TYPE= NMR FID
##DATA CLASS= NTUPLES
##ORIGIN= UXNMR, Bruker Analytische Messtechnik GmbH
##OWNER= root
$$ XWIN-NMR		Version 3.5
$$ Thu Aug 27 11:20:40 2020 Russian Standard Time (UT+4h)  she@DPX200
##.OBSERVE FREQUENCY= 200.1315066352
##.OBSERVE NUCLEUS= ^1H
##.DELAY= (6, 6)
##.ACQUISITION MODE= SIMULTANEOUS
##.ACQUISITION SCHEME= undefined
##.AVERAGES= 8
##.DIGITISER RES= 18
##SPECTROMETER/DATA SYSTEM= spect
##.PULSE SEQUENCE= zg30
##.SOLVENT NAME= CDCl3
##.SHIFT REFERENCE= (INTERNAL, CDCl3, 0, 15.7039)
##AUDIT TRAIL= $$ (NUMBER, WHEN, WHO, WHERE, WHAT)
$$ ##TITLE= Audit trail, XWIN-NMR		Version 3.5
$$ ##JCAMPDX= 5.01
$$ ##ORIGIN= Bruker BioSpin GmbH
$$ ##OWNER= she
$$ F:/spectra/data/she/nmr/H-F/1/audita.txt
$$ ##AUDIT TRAIL=  $$ (NUMBER, WHEN, WHO, WHERE, WHAT)
(   1,<2020-08-27 11:19:16.53 +0400>,<she>,<DPX200>,
      <created by zg, POWCHK disabled, PULCHK disabled
       configuration hash MD5:
       00 E9 B6 7A A2 85 ED C7 34 08 36 98 17 FE 4E 26
       data hash MD5: 16K
       DD 86 29 E4 84 5C FC 79 A9 E3 DE D2 45 22 EE 28>)
$$ ##END=
$$ 
$$ hash MD5
$$ 70 9D 98 5A 8A C7 27 7D 71 F1 CE EB B7 EF 57 58
##$RELAX= 
##$RELAX= 
##$RELAX= 
##$RELAX= 
##$RELAX= 
##$RELAX= 
$$ Bruker specific parameters
$$ --------------------------
##$DU= <F:/spectra>
##$EXPNO= 1
##$NAME= <H-F>
##$PROCNO= 1
##$TYPE= <nmr>
##$USER= <she>
##$AMP= (0..31)
100 100 100 100 100 100 100 100 100 100 100 100 100 100 100 100 100 100 
100 100 100 100 100 100 100 100 100 100 100 100 100 100 
##$AQSEQ= 0
##$AQ_mod= 1
##$AUNM= <au_zg>
##$AUTOPOS= <>
##$BF1= 200.13
##$BF2= 200.13
##$BF3= 200.13
##$BF4= 200.13
##$BF5= 200.13
##$BF6= 200.13
##$BF7= 200.13
##$BF8= 200.13
##$BYTORDA= 1
##$CFDGTYP= 0
##$CFRGTYP= 5
##$CHEMSTR= <none>
##$CNST= (0..31)
1 1 145 1 1 1 1 1 1 1 1 1 1 1 1 1 1 1 1 1 1 1 1 1 1 1 1 1 1 1 1 1 
##$CPDPRG= <>
##$CPDPRG1= <>
##$CPDPRG2= <>
##$CPDPRG3= <>
##$CPDPRG4= <mlev>
##$CPDPRG5= <mlev>
##$CPDPRG6= <mlev>
##$CPDPRG7= <mlev>
##$CPDPRG8= <mlev>
##$CPDPRGB= <>
##$CPDPRGT= <>
##$D= (0..31)
0 1.2 0 0 0 0 0 0 0 0.06 0 0.03 0 0 0 0 0.0002 0 0 0 0 0 0 0 0 0 0 0 0 
0 0 0 
##$DATE= 1598512756
##$DBL= (0..7)
120 120 120 120 120 120 120 120 
##$DBP= (0..7)
150 150 150 150 150 150 150 150 
##$DBP07= 0
##$DBPNAM0= <>
##$DBPNAM1= <>
##$DBPNAM2= <>
##$DBPNAM3= <>
##$DBPNAM4= <>
##$DBPNAM5= <>
##$DBPNAM6= <>
##$DBPNAM7= <>
##$DBPOAL= (0..7)
0.5 0.5 0.5 0.5 0.5 0.5 0.5 0.5 
##$DBPOFFS= (0..7)
0 0 0 0 0 0 0 0 
##$DE= 6
##$DECBNUC= <off>
##$DECIM= 32
##$DECNUC= <off>
##$DECSTAT= 4
##$DIGMOD= 1
##$DIGTYP= 9
##$DL= (0..7)
0 120 120 120 120 120 120 120 
##$DP= (0..7)
150 150 150 150 150 150 150 150 
##$DP07= 0
##$DPNAME0= <>
##$DPNAME1= <>
##$DPNAME2= <>
##$DPNAME3= <>
##$DPNAME4= <>
##$DPNAME5= <>
##$DPNAME6= <>
##$DPNAME7= <>
##$DPOAL= (0..7)
0.5 0.5 0.5 0.5 0.5 0.5 0.5 0.5 
##$DPOFFS= (0..7)
0 0 0 0 0 0 0 0 
##$DQDMODE= 0
##$DR= 18
##$DS= 0
##$DSLIST= <SSSSSSSSSSSSSSS>
$$ [...]
##$SUBNAM2= <"">
##$SUBNAM3= <"">
##$SUBNAM4= <"">
##$SUBNAM5= <"">
##$SUBNAM6= <"">
##$SUBNAM7= <"">
##$SUBNAM8= <"">
##$SUBNAM9= <"">
##$SW= 16.880792210976
##$SWIBOX= (0..15)
0 0 2 0 0 0 0 0 0 0 0 0 0 0 0 0 
##$SW_h= 3378.37837837838
##$TD= 16384
##$TD0= 1
##$TE= 0
##$TE2= 300
##$TE3= 300
##$TEG= 300
##$TL= (0..7)
0 120 120 120 120 120 120 120 
##$TP= (0..7)
150 150 150 150 150 150 150 150 
##$TP07= 0
##$TPNAME0= <>
##$TPNAME1= <>
##$TPNAME2= <>
##$TPNAME3= <>
##$TPNAME4= <>
##$TPNAME5= <>
##$TPNAME6= <>
##$TPNAME7= <>
##$TPOAL= (0..7)
0.5 0.5 0.5 0.5 0.5 0.5 0.5 0.5 
##$TPOFFS= (0..7)
0 0 0 0 0 0 0 0 
##$TUNHIN= 0
##$TUNHOUT= 0
##$TUNXOUT= 0
##$USERA1= <user>
##$USERA2= <user>
##$USERA3= <user>
##$USERA4= <user>
##$USERA5= <user>
##$V9= 5
##$VALIST= <valist>
##$VCLIST= <CCCCCCCCCCCCCCC>
##$VD= 0
##$VDLIST= <DDDDDDDDDDDDDDD>
##$VPLIST= <PPPPPPPPPPPPPPP>
##$VTLIST= <TTTTTTTTTTTTTTT>
##$WBST= 1024
##$WBSW= 4
##$XGAIN= (0..3)
0 0 0 0 
##$XL= 0
##$YL= 0
##$YMAX_a= 629082
##$YMIN_a= -462845
##$ZGOPTNS= <>
##$ZL1= 120
##$ZL2= 120
##$ZL3= 120
##$ZL4= 120
##$ABSF1= 10
##$ABSF2= 0
##$ABSG= 5
##$ABSL= 3
##$ALPHA= 0
##$AQORDER= 0
##$ASSFAC= 0
##$ASSFACI= 0
##$ASSFACX= 0
##$ASSWID= 0
##$AUNMP= <proc_1d>
##$AZFE= 0.1
##$AZFW= 0.1
##$BCFW= 1
##$BC_mod= 2
##$BYTORDP= 1
##$COROFFS= 0
##$CY= 11.3945322036743
##$DATMOD= 1
##$DC= 2
##$DFILT= <>
##$DTYPP= 0
##$F1P= 16.9975609425685
##$F2P= -3.02152046262296
##$FCOR= 0.5
##$FTSIZE= 0
##$FT_mod= 4
##$GAMMA= 1
##$GB= 0.15
##$INTBC= 1
##$INTSCL= 1
##$ISEN= 128
##$LB= 0.24
##$LEV0= 0
##$LPBIN= 0
##$MAXI= 10000
##$MC2= 0
##$MEAN= 0
##$ME_mod= 0
##$MI= 1.114404
##$NCOEF= 0
##$NC_proc= 0
##$NLEV= 6
##$NOISF1= 3.799351
##$NOISF2= 2.8
##$NSP= 1
##$NTH_PI= 0
##$NZP= 0
##$OFFSET= 15.70392
##$PC= 1
##$PHC0= -9980.629
##$PHC1= 19.60092
##$PH_mod= 1
##$PKNL= yes
##$PPARMOD= 0
##$PSCAL= 0
##$PSIGN= 0
##$REVERSE= no
##$SF= 200.130013532006
##$SI= 16384
##$SIGF1= 3
##$SIGF2= 2
##$SINO= 400
##$SIOLD= 16384
##$SREGLST= <1H.CDCl3>
##$SSB= 0
##$STSI= 0
##$STSR= 0
##$SW_p= 3612.71676300578
##$SYMM= 0
##$S_DEV= 0
##$TDeff= 0
##$TDoff= 0
##$TI= <>
##$TILT= no
##$TM1= 0
##$TM2= 0
##$TOPLEV= 0
##$USERP1= <user>
##$USERP2= <user>
##$USERP3= <user>
##$USERP4= <user>
##$USERP5= <user>
##$WDW= 1
##$XDIM= 8192
##$YMAX_p= 0
##$YMIN_p= 0
$$ End of Bruker specific parameters
$$ ---------------------------------
##NTUPLES= NMR FID
##VAR_NAME=  TIME,          FID/REAL,        FID/IMAG
##SYMBOL=    X,             R,               I
##VAR_TYPE=  INDEPENDENT,   DEPENDENT,       DEPENDENT
##VAR_FORM=  AFFN,          ASDF,            ASDF
##VAR_DIM=   8192,          8192,            8192
##UNITS=     SECONDS,       ARBITRARY UNITS, ARBITRARY UNITS
##FACTOR=    0.000296,      1,               1
##FIRST=     0,             0,               0
##LAST=      2.424536,      0,               0
##MIN=       0,             -462845,         0
##MAX=       2.424536,      629082,          0
$$ Real data points
##PAGE= N=1
##DATA TABLE= (X++(R..R)), XYDATA
$$ [...]
2219a585L48L767j20m075L95J403J333j568m78n01J441O99o52j403J07K193k108
$$ -1585 -1237 2530 2410 -1665 -1270 133 1466 -102 -580 -1081 360 1059 407 -996 -889 1304 -804
2236h04M82J012j628k16K382p66k710K870l28q93Q25P89j992L79L396k789q15
$$ -804 -322 690 -938 -1154 1228 462 -2248 622 294 -599 226 1015 -977 -598 2798 9 -806
2253h06R17J337o19L29r87j249K925Q2j706j671L115l4j958P07n63J018R38l78
$$ -806 111 1448 829 1158 171 -1078 1847 1929 223 -1448 1667 1633 -325 382 -181 837 1775 1397
2271A397k518J133K446q72j816pK127j533O18o87r40L83J892q19k758J783K86
$$ 1397 -1121 12 2458 1586 -230 -237 1890 357 975 288 -652 -269 1623 804 -1954 -171 115
2288A15J64l3q70j345K221K088l131j630K546J369k052O87j345o58L407m81k951
$$ 115 279 246 -624 -1969 252 2340 -791 -2421 125 1494 -558 129 -1216 -1874 1533 1052 -1899
2305a899p8K790K1j609M70o67M40J616K30k591K55J869O2m79j012m47Q82K086
$$ -1899 -1977 813 834 -775 -305 -972 -532 1084 1314 -1277 -1022 847 909 430 -582 -1029 -147 1939
2323A939j405k478Q85K789n12l227J577J144o32R67j316j150K130J105j819j248
$$ 1939 534 -1944 -1059 1730 1218 -2009 -432 712 80 1047 -269 -1419 711 1816 -3 -1251
2339a251J986Q41k443J083P39j643J849k34k671K125Q40j661o64J276j89n08J047
$$ -1251 735 1576 -867 216 955 -688 1161 927 -1744 381 1221 -440 -1104 172 -17 -525 522
2356E22n95q57J523J425k555m22K252j10j122K28q49M27J612j797j99j040J432
$$ 522 -73 -930 593 2018 -537 -959 1293 1183 61 289 -560 -133 1479 -318 -517 -1557 -125
2373a25J525l062J734n16j135K878r37j687R66j66J182l24j339J400k651L078
$$ -125 1400 -1662 72 -444 -1579 1299 362 -1325 -359 -525 657 333 -1006 394 -2257 821
2389H21J393n392K266J429p11J082j411j789K025J722k49k630j482M679n11j198
$$ 821 2214 -3178 -912 517 -194 888 -523 -2312 -287 1435 1186 -1444 -2926 1753 1242 44
2405D4l60k439L476K705m020k674L949Q17j02k361q34K917l79M98k558p78M020
$$ 44 -316 -2755 721 3426 -594 -3268 681 1498 1396 -965 -1799 1118 739 1237 -1321 -2099 1921
2422A921q8l674J257J223J54J63l017L335j026l52J902m144K412K438l877J84
$$ 1921 1833 -1841 -584 639 793 956 -2061 1274 248 -104 1798 -2346 66 2504 -1373 -1189
2438a189K135k198J717k31j996J592l42K053k801p49L592j786o36J888k386m0
$$ -1189 946 -1252 465 234 -1762 -170 -512 1541 -1260 -2009 1583 -203 -839 1049 -1337 -1377
2454a377L571l256Q72J62j038K088k252J031J269k636J330J067j925K186j232
$$ -1377 2194 -1062 -190 -28 -1066 1022 -1230 -199 1070 -1566 -236 831 -1094 1092 -140
2469a40k051L646j342k55j232l6M334l565j026J855j373K799R30o199K584L248
$$ -140 -2191 1455 113 -142 -1374 -1410 2924 -641 -1667 188 -1185 1614 2544 -3655 -1071 2177
2485B177j281p40k940L416J746k690j86j245J834L518m616k668N557p91r68p00
$$ 2177 896 156 -2784 632 2378 -312 -498 -1743 91 3609 -1007 -3675 1882 1091 123 -577
2501e77j655L755O86k421j399Q52L560n61n666K768L303k086J73k665J294L875
$$ -577 -2232 1523 2209 -212 -1611 -759 2801 2240 -3426 -658 2645 559 732 -1933 -639 3236
2517C236k533j657m20J655L517l817k430L687p62P36l12l549K595J898j434j457
$$ 3236 703 -954 -1374 281 3798 -19 -2449 1238 476 1212 900 -2649 -54 1844 410 -1047
2533a047o14L319p24k905L020j165p02K927l418l33L758k273j301J117O74Q59
$$ -1047 -1661 1658 934 -1971 1049 -116 -818 2109 -1309 -1642 2116 -157 -1458 -341 333 1192
2549A192k380l05K050N84k96k159p10M699n7m109q2J825K864k166l035J490J858
$$ 1192 -1188 -1493 557 1141 845 -1314 -2024 2675 2618 -1491 -1573 252 3116 950 -2085 -595 1263
2566A263J093j766l639K488N021l205l385J052K714J840l774j790J725K986K09
$$ 1263 2356 590 -3049 -561 4460 1255 -2130 -1078 1636 3476 -298 -2088 -363 2623 2832
2581B832m057j652N269J329m776L16L47K408R94m342j142L475K651l777k915K542
$$ 2832 -1225 -2877 2392 3721 -1055 -739 -392 2016 3010 -1332 -2474 1001 3652 -125 -3040 -498
2597d98K943k015j723P8N23L130k651k349J654K273N1l201L19K442K31j737J2
$$ -498 2445 430 -1293 -1215 -692 2438 -213 -2562 -908 1365 1416 -1785 -1466 976 1207 -530 -518
2614e18o60K020K70k560N42J153J150k609k85K072K17j223K06k1oK891k751j970
$$ -518 -1178 842 1112 -1448 -906 247 1397 -1212 -1497 575 792 -431 -225 -246 -252 2639 -112 -2082
2632b082K857J637k140j792J880N79J059j763j674J473L005j264m319J787K684
$$ -2082 775 2412 272 -1520 360 939 1998 235 -1439 34 3039 1775 -2544 -757 1927
2647A927K24k931n14J362K193J9m335N26L193J699l916k068L110J962j325k982
$$ 1927 2151 -780 -1294 68 2261 2280 -2055 -1529 1664 3363 -553 -2621 489 2451 1126 -1856
2663a856N15J865J558k383k174J536K823n99l786J949J071J20j83j530J83J807
$$ -1856 -1341 524 2082 -301 -2475 -939 1884 1285 -2501 -552 519 639 456 -1074 -891 916
2679I16N30k645M08J871k35k297J432N81j187R86p54k08J147M07j716J15J889
$$ 916 1446 -1199 -791 1080 845 -1452 -20 561 -626 360 -394 -602 545 952 -764 -649 1240
2696A240q44j177Q87P86k83p1j147K25J653Q5j774j230K652P81k066n37P20J496
$$ 1240 396 -781 106 892 609 538 -609 -384 1269 1354 -420 -1650 1002 1783 -283 -820 -100 1396
2714A396m26p79r27K25K654n78l331J002K548p09j244r77P13J537J20j369k202
$$ 1396 970 191 -736 -511 2143 1565 -1766 -764 1784 1075 -169 -1146 -433 1104 1224 -145 -2347
2731b347L091J408k786j94R74J27P12m56j690O92K385j141k338J247J701j173
$$ -2347 744 2152 -634 -828 146 273 985 529 -1161 -469 1916 775 -1563 -316 1385 212
2747B12o33J78nO17m43l14k16J340p07j049R22P41m79j550J528P67o27o66k72
$$ 212 -421 -243 -248 369 -74 -388 -604 736 29 -1020 -98 643 164 -1386 142 909 282 -384 -656
2766f56K60J532p60k414J354K247m39l111L86L109p91o78r35M8K010P77l144o25
$$ -656 -396 1136 376 -2038 -684 1563 1124 -1987 -1601 1508 717 39 -896 -848 1162 1939 -1205 -1830
2784a830L332J03j660o02P82j88J341j461j389J823J098r13k175J908J010o81
$$ -1830 1502 1605 -55 -657 125 -63 1278 -183 -1572 251 1349 436 -1739 169 1179 498
2800D98j01q19L67N17J037j795k91R00J383j819n91J400q79Q05n78m63J80O01
$$ 498 397 -422 -55 462 1499 -296 -587 313 1696 -123 -714 686 -193 612 34 -429 -249 352
2818C52K7j144O20L84l13k01J481j814o38K287j314j77P95l37j298K433l08j763
$$ 352 379 -765 -145 239 -74 -275 1206 -608 -1246 1041 -273 -450 345 8 -1290 1143 835 -928
2836i28l36J240J262j707k25k9M88J676j217k116J134K010p97l55j719J297K090
$$ -928 -1264 -24 1238 -469 -694 -723 -235 1441 224 -1892 -758 1252 455 100 -1619 -322 1768
2853A768j257m21j909K316J736k310j207J689M28o81L84j085J222r53N87k81m55
$$ 1768 511 90 -1819 497 2233 -77 -1284 405 833 152 536 -549 673 -280 307 26 -429
2870d29K201j708j403K495J43k099J434j128O79J288j573j19j16J655k80k469
$$ -429 1772 64 -1339 1156 1299 -800 634 -494 185 1473 -100 -219 -335 1320 1040 -1429
2886a429J663R36j889J343n2k029K126k09k97K73j176J098o32P4J620j895n53
$$ -1429 234 1170 -719 624 572 -1457 669 460 163 436 -740 358 -274 -200 1420 -475 -1028
2903a028J907r22N97j06k017J835P10m64n81j749K608R99k539O07k88m22L507
$$ -1028 879 -43 554 448 -1569 266 976 512 -69 -1818 790 1789 -750 -143 -431 -853 2654
2920B654k280l131K638J033K15j574j603K626J99j42k13k467K858J412l425J093
$$ 2654 374 -2757 -119 914 1129 -445 -2048 578 777 635 422 -2045 813 2225 -1200 -107
2936a07rk31J919j911m2J077p82J405j646l41K392k138lK055j755L19M24r91J685
$$ -107 -116 -347 1572 -339 -381 696 -86 1319 -327 -668 1724 -414 -417 1638 -117 202 626 -365 1320
2955A320j466J33J103k011K476k73k746K328L6j448J565j862N20J325j497L85
$$ 1320 -146 -13 1090 -921 1555 1282 -1464 864 900 -548 1017 -845 -325 1000 -497 -112
2971a12q58J350J014l000J427J484j901N37M05j512K533m70j870O31J3J731j527
$$ -112 -970 380 1394 -1606 -179 1305 -596 -59 346 -1166 1367 897 -973 -342 -329 1402 -125
2988a25j202J459J88k22K34j987J163K517k823L60k62O74J586k084J12L20j44
$$ -125 -1327 132 320 98 332 -1655 -492 2025 -798 -438 -700 -26 1560 -524 -412 -92 -236
3005b36J433j99k910K708L62j151O28j689J601K07n41J63j187J360J273k788N79
$$ -236 1197 998 -1912 796 1158 7 635 -1054 547 754 213 376 -811 549 1822 -966 -387
3022c87J579j769J343n61j010J747m34k99q19P14P64j132o94J780q88k49P63j442
$$ -387 1192 -577 766 205 -805 942 508 209 -610 104 868 -264 -958 822 -66 -315 448 -994
3040i94J322k6p72J88J49J89r3n79M84O91j383N49K17k81R75j362l11R00R12j066
$$ -994 328 302 -470 -282 -133 56 -37 -616 -132 559 -824 -275 -58 -339 636 -726 -1037 -137 775 -291
3060b91r81O78J261q03m90Q93j133J403N69j917K15J335J26r42l98L93O60L41
$$ -291 -1272 -594 667 -136 -626 267 -866 537 1106 -811 -596 739 865 -77 -475 -82 578 919
3078I19m64j955J402J925j889p12P53K00O05m41j158J8J740O8j046j270J879P92
$$ 919 455 -1500 -98 1827 -62 -774 -21 179 784 343 -815 -797 943 1011 -35 -1305 574 1366
3096A366j581m14J35R42J86l84j174N35J541l25j824N52J556j079k44J01J8N92
$$ 1366 -215 -629 -494 448 634 250 -924 -389 1152 827 -997 -445 1111 32 -212 -111 -93 499
3114D99N7j008l47J788l44j573O96J257r70l57M49l54N54K68j119L4J370M5j905
$$ 499 556 -452 -799 989 645 -928 -232 1025 55 -302 147 -207 347 615 -504 -470 900 945 -960
3133i60N34R56K65o37r35N69O73M88j361o33J223J149j664q99Q61R25L49j383
$$ -960 -426 530 795 158 -777 -208 465 953 -408 -1041 182 1331 -333 -1232 -371 554 903 -480
3151d80l68M62J344P8k298M90J975M3j683k02R22O00L85j742q85J688J686j822
$$ -480 -848 -386 958 1036 -1262 -772 1203 1246 -437 -639 283 883 1268 -474 -1359 329 2015 193
3169A93j817J686R45J15r41r81M02K233r76k494J029J997j38j761l29J253N65
$$ 193 -1624 62 1007 1122 181 -800 -398 1835 859 -1635 -606 1391 1253 -508 -837 416 981
3186I81n65j165K23J024P42j803m75J654J90q74p80J094L65l00q84J19Q37O05
$$ 981 416 -749 -526 498 1240 -563 -1038 616 806 -68 -848 246 611 311 -573 -454 383 988
3204I88j469p41K320j60j090q35R79P18o31m5j465J303J479j419j794J709J833
$$ 988 -481 -1222 1098 938 -152 -987 -8 710 79 34 -1431 -128 1351 -68 -1862 -153 1680
3221A680j447o84q30J747J067j019k158N96K715m34j883q61K065M49l88j558O1
$$ 1680 233 -451 -1281 466 1533 514 -1644 -1048 1667 1233 -650 -1511 554 1003 615 -943 -882
3238h82J431R13j521j809J926J503q26k130O85J356O3n88j080N69J488Nj953l71
$$ -882 549 1462 -59 -1868 58 1561 735 -1395 -710 646 709 121 -959 -390 1098 1103 -850 -1221
3256a221J942K49j120p04O48L24R77j244j735K417N60j461q73J411L05l82l78
$$ -1221 721 970 -150 -854 -206 118 1095 -149 -1884 533 1093 -368 -1241 170 475 93 -285
3273b85j47M41L75l09j062R48J173j630p80J262Q38o97r99k74J693M17j494p12
$$ -285 -432 9 384 75 -987 -39 1134 -496 -1276 -14 824 127 -872 -1146 547 964 -530 -1242
3291a242P21K263r74k487R12J997m6j499j124J098J600m47j436j384K618J650
$$ -1242 -521 1742 768 -1719 -807 1190 1144 -355 -1479 -381 1219 772 -664 -2048 570 2220
3307B220k820o48J220P06M06j332j297J885J085r99j386N23J811n99j175J22R
$$ 2220 -600 -1248 -28 678 1084 -248 -1545 340 1425 426 -960 -437 1374 775 -400 -278 -269
3324b69R04L11j922K47K121n00q88o06R09Q61j077k34K88N3P91p41j424J706j0
$$ -269 635 946 -976 -729 1392 892 4 -602 307 1168 91 -143 145 198 989 248 -1176 530 520
3343E20n57L04m18M63l23m10J009r10L86K40j427J989K67k205K68J467K2k93j088
$$ 520 -37 267 -151 312 -11 -421 588 -322 64 304 -1123 866 1133 -1072 -804 663 685 392 -696
3362f96%J336j40J98j912K99K607j051j685L26N66J454j13k748Q87J330O15o72
$$ -696 -696 640 500 698 -1214 -915 1692 641 -1044 -718 -152 1302 1189 -1559 -672 658 1273 601
3380F01k340J915J253j106q5n34o4K049j384j022J223m20J163j669k88K148j564
$$ 601 -1739 176 1429 323 238 -296 -360 1689 305 -717 506 86 1249 -420 -708 1440 -124
3397a24k81Q74l32K64M50j915J096R76q36n7q18J339n51m65P86n96k8J322j313
$$ -124 -405 469 137 401 851 -1064 32 1008 172 115 -703 636 85 -380 406 -190 -218 1104 -209
3416b09p65K241j776L07M86m93N84j045Q78O00j056Q3J72j000K103o90j482J134
$$ -209 -974 1267 -509 -202 284 -209 375 -670 208 808 -248 -165 7 -993 1110 420 -1062 72
3434G2o24J366m00j492Q19M47J47J5j794R14K239j724k66L6j69J709q18p18l80
$$ 72 -552 814 414 -1078 -259 188 335 350 -1444 -530 1709 -15 -281 -245 -414 1295 477 -241 -621
3453f21N18J274n90j811J600K19n17P89j508K52J421j022J13o37P18j2m28L70
$$ -621 -103 1171 581 -1230 370 589 72 861 -647 -395 1026 4 117 -520 198 186 -242 128
3471A28M07j005J051L64j709J372n88l84R18l58j93j05j84J137o55r38J252k31
$$ 128 535 -470 581 945 -764 608 20 -364 554 196 3 -102 -286 851 196 -742 510 279
3489B79o6j12p27R52M53r04m46N81O69l71j269J229k7k37O99j161l76K035q09
$$ 279 213 101 -626 326 779 -125 -571 10 679 308 -961 268 241 4 703 -458 -834 1201 392
3508C92j031L17N48M40m71q14K67J63Q86p64j226J487L10p33J3n35R06K71n49
$$ 392 -639 -322 226 666 195 -619 -352 -189 697 -67 -1293 194 504 -229 -216 -751 155 426 -123
3527a23n74jP73O94j333M8R58m88p4J47j98J55P6K07m65K72M09m54l96O12lj025
$$ -123 -697 -698 75 769 -564 -516 442 -46 -120 27 -171 -16 60 267 -198 74 483 29 -367 245 242 -783
3549g83J047l25l9K10k68l01Q47L44j309m4R93N02j130j37N12l2N88o61q39O79
$$ -783 264 -61 -100 110 -158 -459 388 732 -577 -621 372 874 -256 -393 119 87 675 14 -825 -146
3569a46R47l46j365K65J320j92q83j92K17J155M4k028K18J231N22j219p15P13
$$ -146 801 455 -910 -645 675 483 -400 -592 -375 780 824 -1204 -986 245 767 -452 -1167 -454
3587d54J014m98p74j66M30J546j115j153N55J197l20j073N88l13Q87j79k76n03
$$ -454 560 62 -712 -878 -448 1098 -17 -1170 -615 582 262 -811 -223 -536 351 172 -104 -607
3605f07Q28K60j139L33R1L17Lk13k37K69O36p57n9K77M08q71L44M35l58N9k62
$$ -607 221 481 -658 -325 -234 83 86 -127 -364 -95 541 -216 -275 2 410 -461 -117 318 -40 19 -243
3626b43M19n75P62n06l15L23N37j33j091J113R1l42l70j18N37M72m15j144P76
$$ -243 176 -399 363 -143 -458 -135 402 269 -822 291 382 40 -330 -448 89 561 146 -998 -222
3645b22P05O7j055k22J200k61N6o17k16Q53O37j290m57R06N06l33o69j98O68O75
$$ -222 483 550 -505 -727 473 212 268 -349 -565 288 925 -365 -822 84 590 257 -412 -610 58 733
3665G33l36j143L61J045p2j068K8J86P98M4j040k53R74O27r28o21L30J051p24
$$ 733 397 -746 -385 660 588 -480 -452 -266 532 576 -464 -717 257 884 -44 -665 -335 716 -8
3684hk33L11k93N36K48p15j95O91J92o21j71M97j93M13j12p52M14O26m17m22M64
$$ -8 -241 70 -223 313 561 -154 -349 342 534 -87 -258 239 46 459 347 -405 9 635 218 -204 260
3705B60Q0j41P7l8l26J64M37k58m73O06l14j51O18j13o75L4K88J41j3k38l8J00
$$ 260 340 199 276 238 -88 76 513 255 -218 388 74 -77 541 428 -247 -213 75 216 203 -35 -73 27
3727B7N57l23j195Q00O27k11o01l33O50L54n5o73o02J003R96j326n91R80L45l78
$$ 27 584 261 -934 -134 493 282 -319 -652 -2 352 297 -376 -978 25 1021 -305 -896 84 429 51
3747E1P8q62M54Q30j90r08k26Q30N52n01m34j04N59N03n31j160J324L51n33l52
$$ 51 129 -733 -279 551 361 -547 -773 57 609 108 -326 -430 129 632 101 -1059 265 616 83 -269
3767b69J46L48K20o86K4O4L56O27j506N67M84j83m32j74M72J42j58r7k02k5O83
$$ -269 -123 225 445 -241 -217 -153 203 830 -676 -109 375 192 -240 -414 58 200 42 -55 -257 -282 401
3788D01n00m40O45j17k83M95m48n08M98L73l60O0j53J20m67R49k61q95P99K29
$$ 401 -99 -539 106 -11 -294 201 -247 -755 -257 116 -244 -184 -337 -217 -684 265 4 -891 -92 137
3808A37j8k36k00n0O67J17n96k04l05J249n05l45Q0k70J123k42j189K9J021M23
$$ 137 119 -117 -317 -367 300 417 -179 -383 -688 561 56 -289 -209 -479 644 402 -787 -758 263 686
3828F86p94q58R15O79n33k56l77L35Q46k32j191M72N24m1m67k44N06J32O8l18
$$ 686 -108 -966 -51 628 95 -161 -538 -203 643 411 -780 -308 216 175 -292 -536 -30 102 170 -148
3848a48k86O86L97j147M23M11o18P69n21l09O89j27L12m78k44P27o53j63L43m84
$$ -148 -434 252 649 -498 -75 336 -282 487 -34 -343 346 219 531 53 -191 536 -117 -280 63 -421
3868d21O21M08q60K14j5P4O37r31M01k61j58O29n8j160Q56j79k25P78q33q1N41
$$ -421 200 608 -252 -38 -53 21 658 -273 128 -133 -291 338 280 -880 -24 -203 -428 350 -483 -564 -23
3889b3M75j27j383M94J315o53n33L24o46J402n9j308P2M75K83L13j012J09N54
$$ -23 452 325 -1058 -564 751 98 -435 -111 -757 645 586 -722 -650 -175 108 421 -591 -482 72
3908G2M7L12j146J49J302n71k33o8j36O38m41M6L38l49K55J05p54O55K15r51O76
$$ 72 119 431 -715 -566 736 165 -68 -136 -272 366 -75 -29 309 -40 215 320 -434 221 436 -515 161
3929A61k30p5N97n44M01k30N2Mk45L19K23o28K89N84j252N96L08k90P9l28K49
$$ 161 -69 -144 453 -91 310 80 132 136 -109 210 433 -195 94 678 -574 22 330 40 119 -209 40
3950D0K53j09K55p10l48J176m56n35M65m58P20r2n64j56O45R4k23n90L58Q70o01
$$ 40 293 184 439 -271 -619 557 101 -434 31 -427 293 201 -363 -519 126 220 -3 -593 -235 635 34
3971C4J1l22m84J148k24m67r3Q0R53n80m28M41k13O4N92j326P87O05n32mm3J69
$$ 34 45 -277 -761 387 163 -304 -397 -317 636 56 -372 69 -144 -80 512 -814 -27 578 46 42 -1 168
3993A68J31j36l54k9M86M53r61J8R51p43L3K65k33P8J75m17j28M83k50L04l09
$$ 168 299 163 -191 -220 266 719 -242 -224 727 -16 17 282 49 127 302 -115 -243 240 -10 294 -15
4014a5J71K22o60K81K40k84nJ65j06L38P8o01j86N51L57j122K13O49q9j36l71
$$ -15 156 378 -282 -1 239 -45 -50 115 9 347 425 -176 -362 189 546 -576 -363 286 197 61 -310
4035c10j12K12O87n29n15J04J052l36o88K76M9P40n90m89l29J518m67n25M9J47
$$ -310 -422 -210 477 -52 -567 -463 589 253 -435 -159 -110 630 40 -449 -778 740 273 -252 -203 -56
4055e6O50m41j93n08L24O68m30n85L74N36n44k51J49N53L28o92l6J20j73M64o04
$$ -56 594 153 -40 -548 -224 444 14 -571 -197 339 -205 -456 -307 246 574 -118 -154 -34 -207 257 -347
4076c47q4L47K70k85J14P5pr2K66o76L83K64n71K97M73m5o96K09j2j12J35J03
$$ -347 -431 -84 186 -99 15 90 83 -9 257 -419 -36 228 -343 -46 427 382 -314 -105 -117 -229 -94 9
4098Im01N71J14o13k45N1R98l44n36J34ON78o45l06J97P72J7q33k16J105j35o40
$$ 9 -392 179 293 -320 -565 -514 484 140 -396 -262 -256 322 -323 -629 -432 340 357 -476 -692 413 278 -362
4120c62k83J50O92J44o75o65J027M36n90n86M53M35P7l79n08J91Q61k79n91Q4
$$ -362 -645 -495 197 341 -334 -999 28 464 -126 -712 -259 176 253 -126 -634 -443 418 139 -452 -368
4140c68N89k51qm99L96K75K89m97o07P83L35p08N5J59O6J20qq3k8o0L18n95N9
$$ -368 221 -30 -38 -537 -141 134 423 -74 -681 102 437 -271 -216 -57 9 129 121 38 10 -50 268 -327 -268
4163b68L84k54j13L48k61j12J52k1O1L42l46l34K07R36p84n06M37N50m79r9k47
$$ -268 116 -138 -251 97 -164 -276 -124 -145 -84 258 -88 -422 -215 721 -63 -569 -132 418 -61 -160 -407
4184d07J42P10k79n28k35Q28J43p41l21M35O40j19o24m70R83N97r14l21K67N73
$$ -407 -265 445 166 -362 -597 231 374 -367 -688 -253 387 268 -356 -826 157 754 -160 -481 -214 359
4204C59q3p08J12J83M16k67n80J84J017k24n79k57M91M88o02k45L70L10J8k38
$$ 359 276 -432 -320 -137 279 12 -568 -384 633 409 -170 -427 64 552 -50 -295 75 385 403 165
4224A65n78M70M53l81j13k34L03L9J11l77J01J70p4jP1M59r75L56M10k92o1m4
$$ 165 -413 57 510 129 16 -218 85 124 235 -142 -41 129 55 54 125 584 -391 -35 375 83 22 -22
4246b2J37K05k9m14J05o8L02j46l67K2K73L64r9q72L73N89K68p82l24M53M17m60
$$ -22 115 320 291 -123 -18 -86 216 70 -297 -275 -2 362 263 -609 -236 353 621 -161 -485 -32 385 -75
4268g5k85o6K21N28j35j010L35J063p54J11j77K71L17k61k84qL36L55q03O8P80
$$ -75 -360 -426 -205 323 188 -822 -487 576 -178 -67 -244 27 344 83 -201 -209 127 482 -321 -253 527
4289E27o31P8k14M28o0P8l87J73O0L60m33m64O43L43m61p9m5J35M32l55k23K48
$$ 527 -104 -26 -240 188 128 206 -181 -8 52 412 -21 -485 158 501 40 -39 -84 51 483 128 -95 153
4311A53l4j00j3k8K89p24J85O10m74J9J26k23L99l9j16n15M26R06j037l70M15
$$ 153 119 19 6 -22 267 -457 -272 338 -136 -117 9 -214 185 146 30 -485 -59 847 -190 -560 -145
4332a45J01J28j15m21k07J175l66p27JJ63Q27m00l39K07J29L13J01r85M41M28
$$ -145 -44 84 -31 -452 -659 516 150 -577 -576 -413 414 14 -325 -118 11 324 425 -560 -119 309
4352C09m80K60n95M27M54l15j32k44L13L15l03m43Q23p52J08L38k96N44m94J85
$$ 309 -171 89 -506 -79 375 60 -72 -316 -3 312 9 -434 389 -363 -255 83 -213 331 -163 22
4372B2m4j94M71n7p82N74Ml10M15k46J39N2M4j70J84J83k18l96M29K15n29P4M52
$$ 22 -22 -216 255 198 -584 -10 -6 -316 99 -147 -8 44 88 -82 102 285 67 -329 100 315 -214 -140 312
4395C12o10N97o25j17Q51k56k51k58k2O82j58o82N10l59N83n3o63k64Q98L74n18
$$ 312 -298 299 -326 -443 408 152 -99 -357 -379 303 145 -537 -27 -386 197 144 -519 -783 115 489 -29
4416b9k81M24p3j37K73l72m16J229m76n16L03j75N35r2l26k82N95k00R7k00l2
$$ -29 -310 114 41 -96 177 -195 -611 618 142 -374 -71 -246 289 197 -129 -411 184 -16 81 -119 -151
4437a51J47k87M39j56j31P3j08K46P6l03J40K6n5N02p96o8N87m1Kj18m7J48M6
$$ -151 -4 -291 148 -8 -139 -66 -174 72 148 -155 -15 11 -44 458 -338 -406 181 140 142 24 -23 125 171
4460A71n05K33J67L49l08n34O12K16k40j17j65O2J20m6n90M82L06J35q37J26N06
$$ 171 -334 -101 66 415 107 -427 185 401 161 44 -121 -59 61 15 -575 -93 213 348 -489 -363 143
4481A43j62o2j39l3M84L1n72j83M28J98N6o37L02O2jJ02m10K41M07k89m62N86
$$ 143 -19 -81 -220 -253 231 262 -310 -493 -65 133 189 -448 -146 -84 -85 17 -393 -152 255 -34 -496 90
4503I0P3j32k05k99L98K18k08q4j55N22%l06R1L31m14J27K84j39r4O1k16j14M32
$$ 90 163 31 -174 -473 -75 143 -65 -149 -304 218 218 -88 3 334 -80 47 331 192 98 159 -57 -171 261
4526B61J44m55LL33J52k58k14k36M41L57p02J74J12L82m73q2K01K36l05m62J58
$$ 261 405 -50 -47 286 438 180 -34 -270 171 528 -174 0 112 494 21 -61 140 376 71 -391 -233
4547b33J62K47j25m04L82R0k2k64r0R0L07R5m4p10L92N99m48o35K67O07k28K8
$$ -233 -71 176 51 -353 29 119 97 -167 -257 -167 140 235 191 -519 -127 472 24 -611 -344 263 35 63
4569F3j16r7O14m06j85q9L21o5l80M31L6R4j21j8k54J65O34j012J38N28J0m54
$$ 63 -53 -150 464 58 -127 -216 105 40 -340 91 127 221 100 82 -172 -7 627 -385 -247 281 291 -163
4591a63J79J35R2k9o6l1p8j91K02j10L9K68n9l25K61j71L18l01j44o1M39k18k72
$$ -163 16 151 243 214 148 117 39 -152 50 -60 -21 247 188 -137 124 -47 271 -30 -174 -235 204 -14 -286
4614b86L23L1j60l8J41q1K76j11m08NN49p1k81j58K39K4O7l25k28K71M09r6o49
$$ -286 37 68 -92 -130 11 -70 206 95 -313 -308 241 170 -111 -269 -30 -6 61 -264 -492 -221 188 92 -557
4637e57L06J86L56o81K21j18N56j77j59j37M54J51p13J58L39o2l53q3L40l2j06
$$ -557 -251 -65 291 -390 -169 -287 269 92 -67 -204 250 401 -312 -154 185 123 -230 -313 27 -5 -111
4658a11j21m3Q5M31m14l9M78j02q3P2n5l21M97j70k39J30K55m50KL27rj41o5j7
$$ -111 -232 -275 -190 241 -173 -212 266 164 81 153 98 -223 274 104 -135 -5 250 -200 -198 129 120 -21 -86 -103
4682a03P7M0J23o2M1j27J86k65o1M39n73K19l8j39M05j27p2k63J08L24j97j54
$$ -103 -26 14 137 75 116 -11 175 -90 -151 288 -285 -66 -104 -243 162 35 -37 -300 -192 132 -65 -219
4704b19J85j1Q5J97o90K48N87m32m20J97K96J05k25j19k1K25P7k95j82K39L44
$$ -219 -34 -45 40 237 -453 -205 382 -50 -470 -273 23 128 -97 -216 -237 -12 65 -230 -412 -173 171
4725A71n38K28L8K16q3o5Nj6k2Q2l88K53L49j44k4N3QO7j47j57J46r9P4r5q7L80
$$ 171 -367 -139 -101 115 32 -33 -28 -44 -66 16 -372 -119 230 86 62 115 123 190 43 -114 32 -67 7 -88 -175 205
4751B05Q9l62N6J64j92J89k34RK92j65k96K14J88j2m70M65j0oM0k97k32N93l9
$$ 205 294 -68 -12 152 -40 149 -85 -76 216 51 -245 -31 157 145 -325 140 130 124 164 -133 -365 228 189
4774A89o28L97J35J00j45l95J97J58J72m7m34l9M03J76l31M4j69K54j73j15J16
$$ 189 -439 -42 93 193 48 -347 -150 8 180 133 -301 -340 63 239 -92 -48 -217 37 -136 -251 -135
4795a35R6L33k56k12K33P7j64J70p3j25J46ml9K91n65L52l39L62L23m02j15L90
$$ -135 -39 294 38 -174 59 136 -28 142 69 -56 90 86 47 338 -227 125 -214 148 471 69 -46 344
4817C44n03M52m02k00N80L8k09m15K77N18j57o19N69j02j12R0m38K60P7J3k00
$$ 344 -159 293 -109 -309 271 309 100 -315 -38 480 323 -296 273 171 59 149 -289 -29 48 61 -139
4838a39k82N75J61m20K9O9J33L37m68l33N35M07n13m98L61L79k94m13J21r9K97
$$ -139 -421 154 315 -105 -76 -7 126 463 -5 -338 197 604 91 -407 -46 333 39 -374 -253 -352 -55
4859e5M75r36K51O83m32k9l37K13J83p1Q3j66Q6L42m21j91L89j08n5K9k51L44
$$ -55 420 -516 -265 418 -14 -43 -380 -167 16 -55 28 -138 -52 290 -131 -322 67 -41 -96 -67 -318 26
4881B6m5j68L87j81J46K75p62N22R4m93J58K16j84K04j46Ml06P28j01o57K65K08
$$ 26 -19 -187 200 19 165 440 -322 200 294 -199 -41 175 -9 195 49 53 -253 475 374 -283 -18 190
4903A90j99k08K16r5L40Q8n52J7L32J23m34r6K79L52m08J9j55K23N18o71j69J90
$$ 190 -9 -217 -1 -96 244 332 -220 -203 129 252 -182 -278 1 353 -55 -36 -191 32 550 -121 -290 -100
4925a00J33K87m79k04M94p3L6j98q7M72l54j70K67j38J37l01L38r8j40K00Pl12
$$ -100 33 320 -159 -363 131 58 94 -104 -191 281 -73 -243 24 -114 23 -278 60 -38 -178 22 29 -283
4947b83j01N86k73n0K25k01J26q5m5k6K05K3k66K27J66k29l31O11k42m6pJ54l31
$$ -283 -384 202 -71 -121 104 -97 29 -56 -101 -127 78 101 -165 62 228 -1 -332 279 37 -9 -16 138 -193
4970a93K26J3k91J52L91k28r4n2J88J3K57n46J25R9K17n29K20j66M30l07n56M18
$$ -193 33 46 -245 -93 298 70 -24 -76 112 125 382 -164 -39 60 277 -252 -32 -198 232 -75 -631 -213
4992b13Q6L03j50j53J9L62m9n30K44K03J23j41k62O2J35j3r7m07L63M07l77K8
$$ -213 -127 176 26 -127 -108 254 205 -325 -81 122 245 104 -158 -96 39 26 -71 -478 -115 292 -85 -57
5014e7k10N5L34k69L3K24o7k36R0N5J32l1j28J42k1k70M9K55k26J23p2K44j33
$$ -57 -267 -212 122 -147 -114 110 43 -193 -103 -48 84 53 -75 67 46 -224 -175 80 -146 -23 -95 149 16
5037A6pN2l82M83n3N0k55K29j13k24L05q0m5L06m69K24j33R9jJ34L1k78L22p0
$$ 16 9 61 -321 162 109 159 -96 133 20 -204 101 21 -24 282 -187 37 -96 3 2 136 167 -111 211 141
5061A41j43k11J07L56p6j92J84k57J78J37l18q3J05J29K09j56J01l8Lj03k81J13
$$ 141 -2 -213 -106 250 174 -18 166 -91 87 224 -94 -177 -72 57 266 110 211 173 176 73 -208 -95
5083i5L30l44j69L54M7j3j33N9k11K60j23j8j71N34l37j24L35n9l51J73j6L2r3
$$ -95 235 -109 -278 76 123 110 -23 36 -175 85 -38 -56 -227 307 -30 -154 181 122 -229 -56 -72 -40 -133
5106a33Q9j35K26J41j24J11k53L97m95J08J64j29J88j92Q7j97L47o2j68L2J92
$$ -133 -44 -179 47 188 64 175 -78 319 -176 -68 96 -33 155 -37 50 -147 200 138 -30 2 194
5127A94k5r8k60K32l1K35m31O9M15k6k39q8J0R2q5o8k9j27J69L32m57J26O0P8
$$ 194 169 71 -189 43 12 247 -184 -115 300 274 35 -53 -43 49 -36 -104 -133 -260 -91 241 -216 -90 -30 48
5151D8k3k29K99k69K06j43n6N6L74j64kP9k52M45l82j85M7J45K90j95l18K33K78
$$ 48 25 -204 95 -174 32 -111 -167 -111 263 99 97 176 -76 369 -13 -198 -151 -6 284 89 -229 4 282
5174B82k84Q6l00J32J83J77n77M43j00J07k42M7M21o15L47k4l14M99l50K1K80
$$ 282 -2 84 -216 -84 99 276 -301 142 42 149 -93 -46 375 -240 107 83 -231 268 -82 -61 219
5195B19L7k77O0J53M9j57r9L48l02L21l42k14L66J58k84j78J87K56j00n49R0K79
$$ 219 256 -21 39 192 241 84 -15 333 31 352 10 -204 162 320 36 -142 45 301 201 -348 -258 21
5217B1rm3q4q7K46k2j60J88j84N94k57l71N0RQ6J68k72K76n3K1K47j36m95L74
$$ 21 12 -31 -115 -202 44 22 -138 50 -134 460 203 -168 -118 -109 -23 145 -127 149 96 117 364 228 -267 107
5241A07q6j04O7l6M28l07l26J46J8J28M9m63M13n1j10p6K14J07l49R3K80j39q9
$$ 107 21 -83 -16 -52 376 69 -257 -111 -93 35 84 -379 34 -17 -127 -203 11 118 -231 -138 142 3 -86
5264h6J86L7l53J68rj06L45k91J36p5j08K33J57k31P2P7j88J06M0JJ13k68j95
$$ -86 100 137 -216 -48 -57 -163 182 -109 27 -48 -156 77 234 3 75 152 -36 70 110 111 224 -44 -239
5287b39L44J8j65n9m5N3L06m7j23m48N71j78qj25N8J92K0j53j29j11N18o0k21
$$ -239 105 123 -42 -101 -146 -93 213 166 43 -405 166 -12 -20 -145 -87 105 125 -28 -157 -268 250 190 -31
5310c1j38L27qr1l20Q6K55j10N1r9j5J87k18K5L1j29L99Pn22L04J36k87L13j33
$$ -31 -169 158 150 59 -261 -175 80 -30 21 -78 -93 94 -124 -99 -68 -197 202 209 -313 -9 127 -160 153 20
5334B0N2J8m33N49j26j40j06L45k9N7m32J85K35j64q7j93J74K90k72P2M8k09J59
$$ 20 72 90 -343 206 80 -60 -166 179 150 207 -225 -40 195 31 -56 -249 -75 215 -57 15 63 -146 13
5357A3l3q7J92R1k30p6l1J69L33j90l68J29R9J09p3q6J15J62p1m32L39p7J49j16
$$ 13 -20 -107 85 176 -54 -130 -161 8 341 151 -217 -88 11 120 47 -39 76 238 167 -265 74 -3 146 30
5381C0j79J72Rn5k6r7p0K53J31q5j98m7M51l53kj2J46j01k6K46n57L32MK3M7Q
$$ 30 -149 23 32 -23 -49 -146 -216 37 168 83 -115 -162 289 -64 -66 -78 68 -33 -59 187 -370 -38 -34 -11 36 44
5407D4j53K97j44r6J04k45L39p1k43J71k8K48J3l52N8J05k31R8R4l54M34k11K02
$$ 44 -109 188 44 -52 52 -193 146 75 -168 3 -25 223 236 -116 -58 47 -184 -86 8 -346 88 -123 79
5430G9J52k48J47k61M1J85j23q7J12j26K23J19j07q5k09K86K0r8q2R2rJ11j19
$$ 79 231 -17 130 -131 -90 95 -28 -115 -3 -129 94 213 106 21 -188 98 118 20 -62 30 21 132 13
5453A3P2j66K42L09l79j7j30J27j72K01Pj27J48r1j10J35O9r5k89N50k90j52K26
$$ 13 85 -81 161 470 91 74 -56 71 -101 100 107 -20 128 37 -73 62 131 36 -253 297 7 -145 81
5476H1O2j48M2pn3N0j40Q7P3N8j58Pj68M96k13O0k22J43K77n2n82L12J5O9q3j01
$$ 81 143 -5 37 30 -23 27 -113 -26 47 105 -53 -46 -214 282 69 129 -93 50 327 275 -307 5 20 89 6 -95
5502i5J51NN5l6j35j28M05j54j60K25j13n4P5o8q7K14L40m26j61PM07l77J8k72
$$ -95 56 61 116 80 -55 -183 222 68 -92 133 20 -34 41 -27 -114 100 440 14 -147 -140 267 -110 -92 -364
5526c64K02L51j29j73k5M51k41L7j93K24j51rj75J46K31P3l67O1L16m27J99KJ50
$$ -364 -162 189 60 -113 -138 313 72 109 -84 140 -11 -20 -195 -49 182 255 -112 -51 265 -162 37 39 189
5549A89o2k25J74O3n1j4m4N3Oj3M4k53K53J27k45k96K51O7K11j90o5Q5k8l8K3
$$ 189 127 -98 76 139 88 74 30 83 89 76 120 -133 120 247 2 -294 -43 24 235 45 -20 65 37 -1 22
5574B2J12j31J17k8J19j83K30q8l83K1L90p5l5k36J6J66k39K28Pp0J43O7k84n2
$$ 22 134 3 120 92 211 28 258 170 -213 -192 198 123 88 -148 -132 34 -205 23 30 -40 103 170 -114 -166
5598a66J14o4k00LK86L3J24m20R6K50j76O1L4kj15L03l11O8K71k74j28J50K4j48
$$ -166 -52 -116 -316 -313 -27 6 130 -290 -194 56 -120 -59 -25 -27 -142 161 -150 -82 189 -85 -213 -63 -39 -187
5622a87J32j46L97l5j94o7p7L13k27O9k65J31K29n1k80J42K88q5j27k21L17J97
$$ -187 -55 -201 196 161 -33 -100 -177 136 -91 -22 -287 -156 73 22 -258 -116 172 87 -40 -261 56 253
5644B53l02J79l80L24J1r2K82j79N6j98J1k60N79q8o15J63N90l39J27k29R0K81
$$ 253 -49 130 -250 74 85 -7 275 96 152 -46 -35 -295 284 196 -419 -256 334 -5 122 -107 -17 264
5666B64p7o8l05o8N10k25j20M0J4K9J16ok81J61K60j58k21K55K01k38K1j66K21
$$ 264 187 119 -186 -254 256 31 -89 -49 -35 -6 110 104 -177 -16 244 86 -135 120 321 83 104 -62 159
5689A59J42m61L3L79n1q8k11j05M05lo3k26K30j96J15k83j5O44n76N4mJ88j31
$$ 159 301 -160 -127 252 201 113 -98 -203 202 199 136 -90 140 -56 59 -224 -239 405 -171 -117 -121 67 -64
5712f4R1k92L22n5L31n06j32J70R8J58k30K61j38M5j36k2M0J81j41j49J47J47
$$ -64 27 -265 57 2 333 -173 -305 -135 -37 121 -109 152 14 59 -77 -99 -59 122 -19 -168 -21 126
5734A26j09k01J78J09J67k07j25j21M15p9j67q0K04Nl80L15r8N3L45l24k24J54
$$ 126 17 -184 -6 103 270 63 -62 -183 232 153 -14 -94 110 115 -265 50 -48 5 350 26 -198 -44
5756d4N1o8M3l8O3J48j12k29J33p2K11j72j44Q3L68j69k33J16J7j09K56j04j1
$$ -44 7 -61 -18 -56 7 155 43 -186 -53 -125 86 -86 -230 -147 221 52 -181 -65 -48 -157 99 -5 -16
5779a6O3j16K20j46l1o4R2o3j68K07J70l68J62J54K7m0k04M07k69J22L5j48J78
$$ -16 47 -69 151 5 -26 -90 2 -61 -229 -22 148 -220 -58 96 123 83 -121 286 17 139 174 26 204
5802B04%l67J89p4J66l29J45R8O6j9J42j19O0L3n64L18O9L85o84N1L74j12J13
$$ 204 204 -163 26 -48 118 -211 -66 32 98 79 221 102 162 195 -369 -51 18 403 -281 -230 144 32 145
5825A45j49l5J7N1P1l42Q5K68M5p0l79M21q5J3j23j67J44J52n3p0j83L78j53j68
$$ 145 -4 -39 -22 29 100 -242 -157 111 156 86 -293 128 43 56 -67 -234 -90 62 9 -61 -244 134 -19 -187
5849a87k1K44r0n0RK19o9j38J14r0Oo1Q5m2J29m4j68O7K16j33J61k41L27k14M9
$$ -187 -208 36 -54 -104 -95 124 55 -83 31 -59 -53 -114 -29 -71 58 14 -154 -87 129 -4 157 -84 243 29 78
5874G8J23n55M74j94K41n62K10L70j36J12N3k91J94k2j29j51K02k8Qk71J85M51
$$ 78 201 -354 120 -74 167 -395 -185 185 49 161 214 -77 117 95 -34 -185 17 -11 -3 -274 -89 362
5896C62l54n8p4L71q6j97KJ8P3m1j58mL80l43J75N0k73K79Po3P5o6j29j29Q3M6
$$ 362 8 -50 -124 247 161 -36 -34 -16 57 16 -142 -146 234 -109 66 116 -157 122 129 66 141 75 -54 -183 -100 -54
5922e4o9J83j46J87j79K9J22k7J36k50j60J22M16n40M48k59k16N24k05l3k43M23
$$ -54 -123 60 -86 101 -78 -49 73 46 182 -68 -228 -106 310 -230 218 -41 -257 267 62 29 -214 209
5944B09k32J75r8L9N2j2no1k5L9n3Jj82J90Qn3K40j76M6o2j08L1J86j14k1m0K36
$$ 209 -23 152 54 93 145 133 128 67 42 81 28 29 -153 37 45 -8 232 56 102 40 -68 -37 149 35 14 -26 210
5971B10q0k1l08K88L3k00o0P5j32R9K36nk8j97K15Qj91J32j43J37l42J00L05l33
$$ 210 130 109 -199 89 122 -78 -138 -63 -195 -96 140 135 107 -90 125 133 -58 74 -69 68 -274 -174 131 -202
5995b02M0j63L63k88J48N5J88k31K7J03Jp8r3l8L56l59J31o0j3P2N2M7Q2q9J19
$$ -202 -162 -325 38 -250 -102 -47 141 -90 -63 40 41 -37 -130 -168 188 -171 -40 -100 -113 -41 11 58 140 51 170
6020A70J15k65j09m0K66l16N2J33J78j06k20J79r1K16j08k21K68j44J59o7M4L0
$$ 170 285 20 -89 -129 137 -179 -127 6 184 78 -142 37 -54 162 54 -167 101 -43 116 49 93 123
6042A23k39J90j83O6J67k8l33J45o0J69j8N3O7j66J97m00J65O7k1j51J25R8J50
$$ 123 -116 74 -109 -43 124 96 -237 -92 -152 17 -1 52 119 -47 150 -250 -85 -18 -39 -190 -65 33 183
6065A83k27l2j88N03l04j96O3J44K48O2k10K31k42J19j93J4J78L13n27J35k13
$$ 183 -44 -76 -264 239 -65 -261 -198 -54 194 256 46 277 35 154 -39 -25 153 466 -61 74 -139
6086a39K77k16Q3jM1J19k47j42PL30Qlk06j86N32J57k37l54o0L10k49j5J52K14
$$ -139 138 -78 5 4 45 164 -83 -225 -218 112 120 117 -89 -275 257 414 177 -177 -237 73 -176 -191 -39 175
6110A75j77J21k09R1K20K9k85r4q5K27R1k05k9J77k85L34k80J03k9J68j02Q6k0
$$ 175 -2 119 -90 1 221 250 -35 -129 -214 13 104 -101 -130 47 -238 96 -184 -81 -110 58 -44 42 22
6133B2L1j96j05L4O6K06j85O9K85r2m8j05K40k13k06n0K35K03l10j5J4K31j63
$$ 22 53 -143 -248 -214 -148 58 -127 -58 227 135 87 -18 222 9 -197 -247 -12 191 -119 -134 -120 111 -52
6156e2K72j82n5L32q4k45M9l3lj16K2%L06l01Q1K90j10q2q9J7P7p8k17k27N21
$$ -52 220 38 -17 315 231 -14 35 2 -1 -117 -95 -95 211 -90 -9 281 171 89 0 17 94 16 -201 -428 93
6181I3k5j99K70l73K94J47l78mJ64J11k33K22j12k1K41k11R5o9m0j99K92k82O3
$$ 93 68 -131 139 -234 60 207 -171 -175 -11 100 -133 89 -23 -44 197 -14 81 12 -28 -227 65 -217 -154
6204a54K52J1M2j20J94l54j23K36K31k29J59J35o2j84j3j98n1L28r7J45k23K86
$$ -154 98 109 151 31 225 -129 -252 -16 215 -14 145 280 218 34 21 -177 -228 100 3 148 -75 211
6226B11Q7j61n64J81K91k54k22L14j0L36j64j52k37L07J09p0l2N2J44k16r0N7
$$ 211 298 137 -427 -246 45 -209 -431 -117 -127 209 45 -107 -344 -37 72 2 -30 22 166 -50 -140 -83
6248h3N7O7M10l73j5Pk68J12l1M12n01J52j1J05j12k9J29k73K09p9J84j93j32
$$ -83 -26 41 451 78 63 70 -198 -86 -117 295 -206 -54 -65 40 -72 -101 28 -245 -36 -115 69 -124 -256
6271b56L21o6j02k6J86P3j77k50L05Nr3j08J12m2q8J45j9K28j25j16J50K15n28
$$ -256 65 -1 -103 -129 57 130 -47 -297 8 13 -80 -188 -76 -118 -206 -61 -80 148 23 -93 57 272 -256
6294b56n2J01K07oQ0k28K09K2j64L31l75R9L8n1K8J74j64K0J30J91l92J8L04l16
$$ -256 -308 -207 0 -6 74 -154 55 77 -87 244 -131 -32 6 -45 -17 157 -7 13 143 334 -58 -40 264 -52
6318e2K24q6Q9j44j30K92m0j78K08k15j54J40J2j81K44J02o0l31J29R7j57N00
$$ -52 172 86 175 31 -99 193 153 -25 183 -32 -186 -46 -34 -215 29 131 71 -260 -131 -34 -191 309
6340C09n64L86J19l48J25j26p2K5L17k64J56j39J52j63Q1N9k71J91k08M02k1j45
$$ 309 -255 131 250 -98 27 -99 -171 -146 171 -93 63 -76 76 -87 -6 53 -218 -27 -235 167 146 1
6362Aj65J10L2r4K17j85J95j4l56J74J68p1j68L3K42L2j47Qq3J75k49k9K2mK01
$$ 1 -164 -54 -22 -116 101 -84 111 97 -259 -85 83 12 -156 -123 119 151 4 12 -71 104 -145 -174 -152 -156 45
6387D5J38l5k02Q6o9k7K42j29j28K10o2J14j99r4M20m22J28o6O0j15L21l62K54
$$ 45 183 148 -54 32 -37 -64 178 49 -79 131 69 183 -16 -110 310 -112 16 -50 10 -105 216 -146 108
6410A08J25j31j44NJ05j53Q4l6j08K96K08m88L7O5k49J95j57J00R4o3K88k76j03
$$ 108 233 102 -42 -37 68 -85 -1 -37 -145 151 359 -129 -92 -27 -276 -81 -238 -138 -44 -107 181 -95 -198
6433a98J49J92j70L0r4K06j62N1j28j1L0j5K48o2Q9j86K0qm1N2k6J59m1j38k3
$$ -198 -49 143 -27 3 -91 115 -47 4 -124 -135 -105 -120 128 66 155 -31 -11 -19 -60 -8 -34 125 84 -54 -77
6458g7J07j64K04k79J00J72l4R6j92n9J74mj59N3j1n4K70j44j96OJ67Q4J84k75
$$ -77 30 -134 70 -209 -109 63 29 125 -67 -126 48 44 -115 -62 -73 -127 143 -1 -197 -191 -24 60 244 -31
6482c1J31q9J86n15L11j33N3o1j30K71M6M3j35j48R2J77j81j11j24M59L4J15k41
$$ -31 100 11 197 -318 -7 -140 -87 -148 -278 -7 39 82 -53 -201 -109 68 -113 -224 -348 111 145 260 19
6505A9Q8o8j7m6j05K10N1j98j91K68o5P6J24k18O1J92k60J48K9r9q5J41j32J5
$$ 19 107 39 22 -24 -129 81 132 -66 -257 11 -54 22 146 -72 -11 181 -79 69 98 -1 -86 55 -77 -62
6529f2J02j63K30Q7k41j17K38J06l41j7J50J2K51l25j0J20J41l25K91m2l68J49
$$ -62 40 -123 107 194 -47 -164 74 180 -161 -178 -28 -16 235 -90 -100 20 161 -164 127 85 -283 -134
6551a34J2mL01O6k47L9k36L16k81K49j43L4j89K70K4j20q2K08j47J37l4j13J27
$$ -134 -122 -126 175 241 -6 33 -203 113 -168 81 -62 -28 -217 53 77 -43 -125 83 -64 73 39 -74 53
6574E3j73k3K80r9J39k95P9r0R3NJ50k33o6M96l20j56K47m4o5K00K0q1m07J82
$$ 53 -120 -143 137 38 177 -118 -39 -129 -36 -31 119 -114 -180 316 -4 -160 87 43 -22 178 198 117 -290 -108
6598a08J35m6O0K42k22j88j99L60k6Q1k45J42k40K48L9j20K62m8j82J70j04o0
$$ -108 27 -19 41 283 61 -127 -326 34 8 89 -156 -14 -254 -6 33 -87 175 127 -55 115 11 -49
6620d9om9K38j10J54k30o5L9P3O0J17j79K12l29K2P5P4P4m31M03j6j9O0j10K65
$$ -49 -55 -104 134 24 178 -52 -117 -78 -5 55 172 -7 205 -124 -102 -27 47 121 -310 93 77 58 118 8 273
6645B73k75M3m3KN9j01j00K85Q7Jj90O6J36l06j53K55m3k03J07J58k2p4J64j68
$$ 273 -2 41 -2 0 59 -42 -142 143 230 231 41 107 243 -63 -216 39 -4 -207 -100 58 36 -38 126 -42
6669d2j52K32J73j83j28n4Q7J51l34N01p9O7k35Q2M0m3j81Q0k75J39L33l57L86
$$ -42 -194 38 211 28 -100 -154 -67 84 -250 251 172 239 4 86 126 83 -98 -18 -293 -154 179 -178 208
6692B08l05P8N6J13J61k3k5k35p3L52l22O3R3l55K88O7o1k18L5K47J9k92Q6RJ76
$$ 208 -97 -19 37 150 311 288 263 28 -45 307 -15 48 141 -214 74 141 80 -138 -103 144 163 -129 -43 -34 142
6717A42j48Q3o3j08J63q3k59l1K93o8r8K70p2k70K71k6K20j43J36J1k99N0N8k43
$$ 142 -6 77 14 -94 69 -14 -273 -304 -11 -79 -177 93 21 -249 22 -4 216 73 209 220 -79 -29 29 -214
6741b14L15k00l2l1J81M0ll14L22P0k23k3K0L7J08N0m2m4J74k3k8k57j16K09P3
$$ -214 101 -99 -131 -162 19 59 56 -258 64 134 -89 -112 -92 -55 53 103 61 17 191 168 140 -117 -233 -24 49
6766D9j16J2J83Q5m09J80J67Pk20j10J34p8K01k52K46l45L01O5k03L0m8k4K16
$$ 49 -67 -55 128 213 -196 -16 151 158 -62 -172 -38 -116 85 -167 79 -266 35 100 -103 -73 -121 -145 71
6789G1j98Q2J58n2J53l04J29j71l6m5M70l19J46l8j08M1m7k84K91J28q1p9J3K56
$$ 71 -127 -45 113 61 214 -90 39 -132 -168 -213 257 -62 84 46 -62 -21 -68 -352 -61 67 -14 -93 -80 176
6813A76j92K4j48l5J26o4J40j53J5K32j2k13J4J63Q1k26J34L9j25R5k47K82j15
$$ 176 -16 8 -140 -175 -49 -113 27 -126 -111 121 109 -104 -90 73 154 -72 62 101 -24 71 -176 106 -9
6836ip6L29k24K38j34m0l01J55Lj09J96j35J36r9J94j77J5o9O8J06m1m8o2L25
$$ -9 -85 244 20 258 124 84 -217 -62 -59 -168 28 -107 29 -70 124 -53 -38 -107 -39 67 26 -22 -84 241
6860B41j97l49L74j07j80N16l14k81J98J36N8l2j17L02k15M8p4K7p4j13K59j70
$$ 241 44 -305 69 -38 -218 298 -16 -297 -99 37 95 63 -54 248 33 81 7 34 -40 -153 106 -64
6882f4K27l8k26k06K69j36P3j42L11j11k5j95L35N2j65K3K9m9j5Pr4O8J23q4o5
$$ -64 163 125 -101 -307 -38 -174 -101 -243 68 -43 -68 -263 72 124 -41 -18 11 -38 -53 -46 -140 -72 51 -33 -98
6907i8m4L67l77J67J48k90LK1pkK9J16M9j84J48j80Q4P8k98J83J73J8n2q4O6N3
$$ -98 -142 225 -152 15 163 -127 -124 -103 -110 -112 -83 33 82 -102 46 -134 -50 28 -270 -87 86 104 52 -32 34 87
6933H7K5j18j49L73k69J26l4l9m1m5J26l46L98k60Q8J51m4l80L89J3N1l05K10
$$ 87 112 -6 -155 218 -51 75 41 2 -39 -84 42 -304 94 -166 -78 73 29 -351 38 51 102 -203 7
6956Gn1r6K07k43q5R0j58J13k0J83K75m34K24J25n2j5j95J48o8M7N2j44K16j14
$$ 7 -44 -140 67 -176 -261 -171 -329 -216 -236 -53 222 -212 12 137 85 70 -125 23 -45 2 54 -90 126 12
6980A2R4Nj20j63J2K69k40L35j52k30J20Q8k9j25K32k41L7L7K02j47J54k68K84
$$ 12 106 111 -9 -172 -160 109 -131 204 52 -178 -58 30 1 -124 108 -133 -96 -59 143 -4 150 -118 166
7003A66j83n6J04j8jR1j05j94L0p4K77j29LQ1J69j86L3j41O8O6l8O9n13M90k5
$$ 166 -17 -73 31 13 12 103 -2 -196 -166 -240 37 -92 -89 -8 161 -25 8 -133 -65 1 -37 32 -481 9 -16
7028a6K00l34L17j30M4j20j60L02j60R2j20K14j35J04j43o6n8M17j99j4k44j5
$$ -16 184 -150 167 37 81 -39 -199 103 -57 35 -85 129 -6 98 -45 -111 -169 248 49 35 -209 -224
7050b24rr7M89k71O1J36L1j12j44R3P5m6j18J22j09K79k62J90o3J4j14K80m7k46
$$ -224 -233 -330 159 -112 -51 85 116 4 -140 -47 28 -18 -136 -14 -123 156 -106 84 21 35 -79 201 154 -92
7074i2O2M9P0j73Q8J55n8k76J31l8p0K02k9l2j39L26m5j93J04J17k07o3j38K95
$$ -92 -30 19 89 -84 4 159 101 -175 -44 -82 -152 50 21 -11 -150 176 131 -62 42 159 -48 -111 -249 46
7098D6j8M2j59m1K05j47J83k70p9L06j47J79QJ19l33QJ54%LK4j80K44m2p9K5p7
$$ 46 28 70 -89 -130 75 -72 111 -159 -238 68 -79 100 108 227 -106 -98 56 56 59 83 -97 147 105 26 51 -26
7124b6M0J47j22J37n0J2j3k01J49j21O4M3r0O7k1M2J93k21o4O5j3N1q6J62j61
$$ -26 14 161 39 176 126 138 125 -76 73 -48 16 59 -31 36 15 57 250 29 -35 30 17 68 -18 144 -17
7149a7Q9j3j5j24rn9R9K43oj49L48l55k93L85J60k94J22O3k17m2L7m0J67r7p3
$$ -17 72 59 44 -80 -89 -148 -49 194 188 39 387 32 -261 124 284 -10 112 175 -42 -84 -47 -87 80 -17 -90
7174i0K92j47k71L58k30M9j28J12j23K59j20j6k6O5q9J64O8rj07j93J08O7K02
$$ -90 202 55 -216 142 -88 -39 -167 -55 -178 81 -39 -55 -81 -16 -105 59 127 118 11 -182 -74 -7 195
7197A95n7j68K0o1P0J3j27J90j82O0m9k7J11N9Q0j98K37m6j59m4M9q9K14R3j99
$$ 195 138 -30 -10 -71 -1 12 -115 75 -107 -47 -96 -123 -12 47 127 -71 166 120 -39 -83 -34 -123 91 184 -15
7222a5n4l9j4K44m7m7j2J72k4j72O2j92J82k7K60j39l23M03j65q1n5k03K63j75
$$ -15 -69 -108 -122 122 75 28 16 188 164 -8 54 -138 44 17 277 138 -185 218 53 -28 -83 -286 -23 -198
7246a98J84k84K17l2k42L18J20p9L07m17K16N2l31K40R1k16P0J81k83L8n9K08
$$ -198 -14 -298 -81 -113 -355 -37 83 4 311 -106 110 162 -169 71 162 -54 16 197 -86 -48 -107 101
7268A01k42L4R5k8m7J97o6r4J41p5j71QL07k45j31L30j89K1o8p2L01L6r0J02k9
$$ 101 -141 -107 -12 -40 -87 110 44 -50 91 16 -155 -147 160 -85 -216 114 -75 -54 -122 -194 107 143 53 155 126
7293A26k42K79j99P5pm3k47J18J84j28N9J28J59l02Q2J23k04L9K16l18P4R3q8
$$ 126 -116 163 -36 39 32 -11 -258 -140 44 -84 -25 103 262 -40 42 165 -39 0 216 -102 -28 65 -23
7316b3p2l3J18j9O0K31l93J64q9L89l82P1jo0J28k22k4n8k0K93k64M1j2J88j25
$$ -23 -95 -128 -10 -29 31 262 -131 33 -56 333 -49 22 21 -39 89 -133 -157 -215 -235 58 -206 -165 -177 11 -114
7341a14J94k05ko2K92k56J70J32n76L74N1O7j9n7J41J3o4j55K5P1K9J18J54m08
$$ -114 80 -125 -127 -189 103 -153 17 149 -427 -53 -2 65 46 -11 130 143 79 -76 -51 20 49 167 321 -87
7365h7l4K23l6L8j51J76l11Q1J85k07J67K38k02l63K92q1P9j65R8k2J88k12K96
$$ -87 -121 102 66 104 -47 129 -182 -101 84 -123 44 282 80 -283 9 -72 7 -158 -60 -82 106 -106 190
7388A90j14q6J76o9k21R1k8L51k32o2nq0J10m3K46k75N6j52K46k6j67n9J80J08
$$ 190 76 -10 166 97 -124 -33 -61 290 58 -4 -9 -89 21 -22 224 -51 5 -147 99 73 -94 -153 27 135
7412A35j54q5p9J74p4J15K54m56K32j4m5J2o1MMm7J43M4q4PK3J08j30j06L8l3
$$ 135 -19 -104 -183 -9 -83 32 286 -170 62 48 3 15 -46 -42 -38 -85 58 102 18 25 48 156 26 -80 -42 -75
7438g5K50J02l20j0j0Q8j04O0m8R4O1j18L1J22J15m1n0k49R3J88j21o5J73l78
$$ -75 175 277 -43 -53 -63 25 -79 -19 -67 27 88 -30 1 123 238 197 147 -102 -9 179 58 -7 166 -212
7462b12R7K72j86L4O7Jp8L7r5K49r2n4j48J98k79J93L9n4n6R0j3q2J68j4q0k5
$$ -212 -115 157 -29 5 72 73 -5 32 -63 186 94 40 -108 90 -189 4 43 -11 -67 23 10 -72 96 82 2 -23
7488b3l4M0Q5L3j10N1k09m0L81j80m3j89K25J82j50j02J69k04pL72m83L6K09L8
$$ -23 -57 -17 68 101 -9 42 -167 -207 174 -6 -49 -238 -13 169 19 -83 86 -118 -125 247 -236 -200 9 47
7512D7lp2R6k8J01or9k91L11j16j67R3L45k51Q2L4J3m5o3k21O1K16j34K78l68
$$ 47 44 -28 68 40 141 135 36 -255 56 -60 -227 -134 211 -40 42 76 89 44 -19 -240 -179 37 -97 181 -187
7537a87K84m54L18M7j27K28k32N8L8q2J35o5J60Jj65L6L8J9Q2k0Q3m50K46j18
$$ -187 97 -357 -39 8 -119 109 -123 -65 -27 -109 26 -39 121 122 -43 -7 31 50 132 112 195 -255 -9 -127
7561a27M74l81J00j38M4P5K7q9k4p0O0J18K2j57k66L73l36M39k00J30j74J25r1
$$ -127 347 -34 66 -72 -28 47 74 -15 -39 -109 -49 69 91 -66 -332 41 -295 144 -56 74 -100 25 -66
7584f6j01K52l9N1j75k6l3Q1j31J60N3N9j3P1o8J01k73j2J91N2m4J7l08J10j02
$$ -66 -167 85 46 97 -78 -104 -137 -56 -187 -27 26 85 72 143 75 176 -97 -109 82 134 90 107 -201 -91 -193
7609a93J98l8q6J80j60J3J82kr1J09k34R6J51o8l39L65j7j37j07jk2L40O8l85
$$ -193 5 -33 -119 61 -99 -86 96 94 3 112 -122 -26 125 57 -282 83 66 -71 -178 -179 -201 139 207 -178
7633a78J74J59L7l33j8L24j25L7Pk29K83j39R5k0J91k43Q0q7L0j40R8l6k9J14
$$ -178 -4 155 192 -141 -159 165 40 77 84 -145 138 -1 94 74 265 22 102 15 45 -95 3 -33 -62 52
7657E2Rj10l5J11q4J09M9l1L4j52L22j97J47q7j51l9K40j13o7j0L0j96Q7L17k19
$$ 52 61 -49 -84 27 -57 52 101 70 104 -48 274 77 224 137 -14 -53 187 74 7 -3 27 -169 -82 235 16
7682A6K34l03L2M2J32Kj87q2N7j41J20m2k0j15L52K7k81J25M6l3l0j08J56P4k50
$$ 16 250 -53 -21 21 153 155 -32 -114 -57 -198 -78 -120 -140 -255 97 124 -157 -32 14 -19 -49 -157 -1 73 -177
7707a77K32j13L30k48L1j53J5O4O1k88K82r9J26n7J90k14j11J92q4J23K8j03Q5
$$ -177 55 -58 272 24 55 -98 -83 -19 42 -246 36 -63 63 6 196 -18 -129 63 -21 102 130 27 112
7730A12k42J40J04j56PJ62j66K4K42q1k85Q4l0j73J82m6K65j12j09K9j36J93R0
$$ 112 -130 10 114 -42 -35 127 -39 -15 227 146 -139 -55 -85 -258 -76 -122 143 31 -78 -49 -185 8 98
7753I8r7n6j1q1L8rq7Q8L2J07n9J79j11J9m3j29P1j81J84Q8L6J18k00J96k9l13
$$ 98 1 -55 -66 -147 -109 -118 -205 -117 -85 22 -37 142 31 50 7 -122 -51 -232 -48 40 76 194 -6 190 161 -152
7779a52K27j88J60j00R7j56K84j21J2J85j08j35kJ52k4k64k5L72k48O6o0j40K85
$$ -152 75 -113 47 -53 44 -112 172 51 63 248 140 5 3 155 131 -133 -158 214 -34 32 -28 -168 117
7802A17K63n48L32p9q0k80R6J07KJ86j95J93L1L9m45M96k51J70k10J52k48J60
$$ 117 380 -168 164 85 5 -275 -179 -72 -70 116 -79 114 145 184 -261 235 -16 154 -56 96 -152 8
7824HJ29R8m27J98ql9J41j74J1J03j3j19N6j0R0r6K3j4j68M35k55K54p8l07L26
$$ 8 137 235 -192 6 -2 -41 100 -74 -63 40 27 -92 -36 -46 44 -52 -29 -43 -211 224 -31 223 145 -162 164
7849A64k44j9Q2L10m36L7j25L24k1j00J72j00j22R5j36J50j25m5L30m41J82J00
$$ 164 -80 -99 -17 293 -143 -106 -231 93 72 -28 144 44 -78 17 -119 31 -94 -139 191 -250 -68 32
7871C2Q1R8m14Q2pJ45j39M5L47j50j5k21J33N7j28J32J31r6O8k84j26J29j07K76
$$ 32 113 211 -203 -121 -128 17 -122 -77 270 120 105 -116 17 74 -54 78 209 113 181 -103 -229 -100 -207 69
7895F9k00J08j40J27K38j26lN2j72j14J22k1J10m3K4O0P6pJr9j36J27q9p7K71
$$ 69 -131 -23 -163 -36 202 76 73 125 -47 -161 -39 -60 50 7 31 91 167 160 161 62 -74 53 -36 -113 158
7920A58j60j08J05k90M19j70K47j79q8J73j87K02k17j9N1R5j30%J3M52n71M54
$$ 158 -2 -110 -5 -295 124 -46 201 22 -66 107 -80 122 -95 -114 -63 32 -98 -98 -85 367 -204 250
7942B50l01J47O5j78N0j14K14O0j61R3j4q1J9m2l9j56L76j18k80o6Q9L75j71P7
$$ 250 -51 96 161 -17 33 -81 133 193 32 125 111 30 49 7 -32 -188 188 70 -210 -276 -187 188 17 94
7966I4p1j00Q3l2n9R6l02M05r6j90L12q2L35n12j6K19q0J8J40k27r6J24K08m54
$$ 94 23 -77 6 -26 -85 11 -291 114 18 -172 140 58 393 -119 -135 84 4 22 162 -65 -161 -37 171 -283
7990b83J05K11lj61j4K41j79J72j23Q8j19J36o1N4j03J73j68L62m30J15K13l44
$$ -283 -178 33 30 -131 -145 96 -83 89 -34 54 -65 71 10 64 -39 134 -34 328 -102 13 226 -118
8012a18L05k31k2R8j51RM4J8J21j65L12k66p0L8k6J72jj55j31J59J52k73L92m
$$ -118 187 -44 -66 32 -119 -110 -66 -48 73 -92 220 -46 -116 -78 -104 68 67 -88 -219 -60 92 -181 211 207
8036B07j36k17J37k8J87j08o2R9O7j82r0J50j21J02P1j3J6k2j78K39o5J6j02J48
$$ 207 71 -146 -9 -37 150 42 -20 79 146 -36 -126 24 -97 5 76 63 79 57 -121 118 53 69 -33 115
8060A15j45k1k5J90k8j23j57J42L2J57j74m0kJ14n4j60R2J44j95M17m59n9K09
$$ 115 -30 -51 -76 114 86 -37 -194 -52 -20 137 -37 -77 -79 35 -19 -179 -87 57 -138 279 -180 -239 -30
8083c0o7J07J02k9j03P5j97J56N7k21j1K62j53r5J95j63L12j08j94J5J08Kp5K08
$$ -30 -97 10 112 83 -20 55 -142 14 71 -150 -161 101 -52 -147 48 -115 197 89 -105 -90 18 20 -55 153
8107A53m5k81J07K43l51R9qk77N19Jl2l49K66k66K76j89K51r1K1Pj44J61J40j83
$$ 153 108 -173 -66 177 -174 -75 -83 -360 159 160 128 -221 45 -221 55 -134 117 26 47 54 -90 71 211 28
8131B8k73M64l38P2J3K82l02q0j79K30k0O6K32k8k77L97m10J08m9m0j80K45J46
$$ 28 -245 219 -119 -47 -34 248 -54 -134 -313 -83 -103 -37 195 167 -110 287 -123 -15 -64 -104 -284 -39 107
8154A07n3L2j20l9q4L45j05J4q8Q1O7j15J30j21k07J68kk33K56j78K1J89j1j17
$$ 107 54 86 -34 -73 -157 188 83 97 9 90 157 42 172 51 -156 12 10 -223 33 -145 -124 65 54 -63
8178f3p2J54q6K40l81L69l09L53k68J14m0K8M2
$$ -63 -135 19 -67 173 -208 161 -148 205 -63 51 11 39 81
8191H1
$$ Imaginary data points
##PAGE= N=2
##DATA TABLE= (X++(I..I)), XYDATA
0@%%%%%%qJ6j6J6k4L2m0N6p2Q8j12J44j76K08k48L01l57M21m98N81o76P84r04
$$ 0 0 0 0 0 0 0 -8 8 -8 8 -16 16 -24 32 -40 48 -64 80 -96 112 -136 165 -192 229 -269 312 -364 420 -484
29d84J037j186J353j537J742j968K217k491K793l123L485l879M309m783N298n859
$$ -484 553 -633 720 -817 925 -1043 1174 -1317 1476 -1647 1838 -2041 2268 -2515 2783 -3076
45c076O473p144P876q679R560j0528J1598j2782J4098j5569J7224j9103K1257
$$ -3076 3397 -3747 4129 -4550 5010 -5518 6080 -6702 7396 -8173 9051 -10052 11205
58A1205k3750K6674l0169L4424l9731M6571n5750O8767q8757J23573k00839O52352
$$ 11205 -12545 14129 -16040 18384 -21347 25224 -30526 38241 -50516 73057 -127782 524570
70E24570j9064r68351P10638k08931L79515j71104o13945M58414J53582j54184
$$ 524570 505506 -462845 247793 38862 418377 247273 -366672 91742 245324 91140
80I1140o772l84505L75741K05037k62321n4970K0354J95882q7745j21463J62696
$$ 91140 84368 -300137 75604 280641 18320 -36650 -16296 179586 91841 -29622 133074
91A33074j00252M5048J9863r4831K3174L4061o8810J0440Q2568o6660j0408M9845
$$ 133074 32822 77870 97733 2902 26076 60137 -8673 1767 84335 17675 7267 57112
103E7112j28949J09898N9634j39396J34554j56440M4545K32605l51397J32603
$$ 57112 -71837 38061 97695 -41701 92853 -63587 -19042 213563 -137834 -5231
113e231P8075j34319K71948k85527o5975L34328j87401L4867k5422j08565L19274
$$ -5231 72844 -61475 210473 -75054 -141029 193299 5898 40765 15343 -93222 226052
124B26052j74863j69524J74245k7871J11286j12613j44047J97548K7013q7177
$$ 226052 51189 -118335 55910 28039 139325 26712 -117335 80213 107226 20049
134B0049o5477L214J37557J168j27293m0667L9522J38204m1221k00117Q8450J10923
$$ 20049 -45428 -42214 95343 96511 -30782 -71449 -31927 106277 65056 -135061 -46611 64312
146F4312l7443l565j16805n485K33363n8889j34708J7299j2421K07945p1176k53948
$$ 64312 26869 23304 -93501 -98986 134377 75488 -59220 -41921 -54342 153603 82427 -171521
158a71521J90965N7825m3852J5155j72208P4750J69124j05689q1290r970R6316
$$ -171521 19444 77269 33417 48572 -123636 -48886 120238 14549 -66741 -76711 19605
169A9605N1592j43190K0761N7073j5874L0396l7829j5783L6160L686k6730J7638
$$ 19605 71197 -71993 -51232 5841 -10033 20363 -17466 -33249 2911 6597 -20133 -2495
181b495K4152l1126k7445K5155N4321o4647m4854P9186j449k1181m362n1158O7732
$$ -2495 21657 -9469 -36914 -11759 42562 -22085 -66939 12247 10798 -10383 -14745 -65903 1829
194A829M0033o8108J5275m5543P0155N5286j44925O9097J0923m1746J01291r1584
$$ 1829 41862 -26246 -10971 -56514 13641 68927 -75998 -6901 4022 -37724 63567 -28017
206b8017m2193Q7364j9038K2238m4696n0198J08393j7464j4645k2447n4998J26787
$$ -28017 -70210 17154 -1884 20354 -24342 -74540 33853 16389 1744 -20703 -75701 51086
218E1086Q713r8079j1328N1401N2672l4078n5763N310M6716K8396m2506o6734
$$ 51086 59799 -38280 -49608 1793 54465 20387 -35376 -30066 16650 45046 2540 -64194
230f4194N7984L9089l7437j6308j1820K2064J6022j737l3622R635J7773L529J7692
$$ -64194 -6210 32879 -4558 -20866 -32686 -10622 5400 3663 -29959 -20324 -2551 978 18670
243A8670l7947J9118J0900j4074L7254k3965n2471N6079K3965m3251P83k7538
$$ 18670 -19277 -159 10741 -3333 33921 9956 -42515 13564 37529 -5722 -4939 -32477
255c2477L6953J7983l2024o816k5364N6811K3767o6703m571M6866j587J2247k0311
$$ -32477 4476 22459 -9565 -16381 -41745 15066 38833 -27870 -32441 14425 12838 25085 4774
268D774m4532N0003L2247j8015n7401J2539N6537j3784k2243k2893l51L8038K1403
$$ 4774 -39758 10245 42492 24477 -32924 -20385 36152 22368 125 -22768 -23119 14919 36322
281C6322n8077j2312L7130K1974o896n0132K4259K7727j003l995k5099k226M1943
$$ 36322 -21755 -34067 3063 25037 18141 -31991 -7732 19995 18992 14997 -10102 -12328 29615
294B9615M362m3773J1436K223N305m90p177m816j7377L1911M997l2075L1K2089
$$ 29615 33977 -9796 1640 3863 9168 8678 1501 -3315 -20692 11219 16216 -15859 -15828 6261
308F261j0393J1119P466l5408K0275K9920m664l4537L678K9196j556k896k1256
$$ 6261 -4132 6987 14453 -20955 -680 29240 24576 -9961 -6283 22913 21357 18461 -2795
321b795j4472K6558L0853m3915k5568K8926J2203K173k5510j0362J5496K7795
$$ -2795 -17267 9291 40144 -3771 -29339 -413 11790 13963 -11547 -21909 -6413 21382
333B1382J107l7763j2943M4878K5281m3199j5166J0834K5175J1139l0325k2818
$$ 21382 22489 -15274 -28217 16661 41942 -1257 -16423 -5589 19586 30725 400 -22418
345b2418J0552M5830q977n4165M075M3396L773j6777j6714o993M3694J3824m0053
$$ -22418 -11866 33964 24987 -29178 -25103 18293 22066 5289 -11425 -18418 25276 39100 -953
358i53k0573L7122K9590l6026j2457J2395K602J0105k722l0759M034L2908j6084
$$ -953 -21526 15596 45186 9160 -3297 9098 11700 21805 19083 -11676 -7642 25266 9182
371I182j5622P460N586m284O119R817j3766l93Q171P890J372n219r914L78K2399
$$ 9182 -6440 1020 6606 2322 8441 18258 4492 4099 12270 20160 21532 16313 6399 6777 29176
386B9176l422k6926j1282L3845N064l3430m838M590J6516M052j5924k2374J6049
$$ 29176 25754 -1172 -12454 21391 26455 -6975 -11813 -7223 9293 13345 -2579 -24953 -8904
399h904L6110j6029l3035J5291K7445j5018O449j4335j1883L7282l805k8034m915
$$ -8904 27206 11177 -21858 -6567 20878 5860 12309 -2026 -13909 23373 19568 -8466 -13381
412a3381K4168L633j2515p659j090O204K1898n13m6211K4479K9017r807j1757
$$ -13381 10787 14420 1905 -5754 -6844 -640 21258 20745 -25466 -987 28030 18223 6466
425F466j5928J6346J6921o661j9627j4471J0950M3087l1583l9934L4486N476J6115
$$ 6466 -9462 6884 23805 17144 -2483 -16954 -6004 37083 5500 -34434 52 5528 21643
438B1643j2349k7971J8592K3357J0766k5936k5795L5530K1109l5881J2141j5349
$$ 21643 9294 -18677 -85 23272 34038 8102 -17693 17837 38946 3065 15206 -143
450a43q866L6179j8094j6580j1507J9937J4085k5307j12M053j3296K3729J1975
$$ -143 -9009 27170 9076 -7504 -19011 926 15011 -10296 -10408 -6355 -19651 4078 16053
463A6053m7834J5689K2943m870R46j3256M54J8732J3382k0104r620P32K8843n467
$$ 16053 -31781 -16092 6851 1981 2927 -10329 -9875 8857 22239 2135 -7485 -6753 22090 16623
477A6623l6554K0107q668L467R916l1386O058J3730q091J7840k4989J3M8074m1167
$$ 16623 -19931 176 -8492 -5025 4891 -26495 -20437 -6707 -14798 3042 -21947 -21934 26140 -15027
491a5027K2586Q062m1157N4955j1619k0677J2545k3241K8960K404l4248J7058
$$ -15027 7559 15621 -25536 29419 17800 -2877 9668 -13573 15387 17791 -16457 601
503F01k0347K9593K1915p5683M6246J6830k6421L4970m5834O986M4347k8750o459
$$ 601 -19746 9847 31762 -43921 2325 19155 -7266 27704 -18130 -11144 33203 4453 -2006
516b006q470N03L7093l3170j7016K4844j5065J3434j688j9990J0204J5174o679
$$ -2006 -10476 -9973 27120 -6050 -23066 1778 -13287 147 -1541 -21531 -11327 3847 -2832
529b832j4503J3626L929j377l208O314L639j5644K6007q2l4770L1083M119k5911
$$ -2832 -17335 -3709 220 -1157 -4365 1949 5588 -10056 15951 15869 -18901 12182 16301 -9610
543i610K0507k1362N936J2993k7779L0701l4997K390N9153o7150J4014L9162l9940
$$ -9610 10897 -10465 -4529 8464 -19315 11386 -23611 -21221 37932 -29218 -15204 23958 -15982
556a5982L7210o482k2725K8848j8727K8551j4431l7259N5194l7933Q94L9525o5366
$$ -15982 21228 14746 -7979 20869 2142 30693 16262 -20997 34197 -3736 -2842 36683 -28683
569b8683J8266K3734r342J2314m7442J4906M5936k4734K502k1958j0311O2203
$$ -28683 -10417 13317 3975 16289 -31153 -16247 29689 4955 7457 -14501 -24812 37391
581C7391j3145m2524p684K3841L7627l0570l2209O439K4253K2161k0024l9205
$$ 37391 24246 -18278 -25962 -2121 35506 4936 -27273 -20834 3419 25580 5556 -33649
593c3649J5554N1519j5086k9298M220M128K6934N488m5314J1373K2294j1034Q413
$$ -33649 -18095 33424 18338 -10960 -6740 -2612 24322 29810 -15504 -4131 18163 7129 15542
606A5542l0724J6390J7569l3188K1884j3096M74K4142l7522J8357K6463l6093
$$ 15542 -15182 1208 18777 -14411 7473 -5623 -5149 18993 -18529 -172 26291 -9802
618i802J3234k12L965K5275m6973J7314J5453j6157K6723l9240o158M7256j8792
$$ -9802 3432 3220 7185 32460 -14513 2801 18254 2097 28820 -10420 -16578 30678 11886
631A1886j9034L173o73K5552k0914j5938K5438j5737J7298n715k8879K7825J4912
$$ 11886 -7148 -3975 -4648 20904 -10 -15948 9490 -6247 11051 5336 -23543 4282 19194
644A9194j9301r497R879P656K749q970m39q963J7436K0307m4604m265L2946L402
$$ 19194 -107 -9604 275 7931 10680 1710 1271 -7692 9744 30051 -14553 -18818 14128 17530
658A7530j8351r103j678J8724J8664k8107j8469J4248L8497r450m4785O490L4850
$$ 17530 -821 -9924 -11602 7122 25786 -2321 -20790 -6542 31955 22505 -22280 -15790 19060
671A9060N108k3396j6595k00L9472l027l9827r05K2503K4551k7855k1797K6734
$$ 19060 24168 772 -15823 -16023 23449 20422 -19405 -20310 2193 26744 -1111 -22908 3826
684C826J0505q545j666j5017J3018K4378k7991o272P804J4965p377k3389K3749
$$ 3826 14331 5786 4120 -10897 2121 26499 -1492 -7764 40 15005 7628 -15761 7988
697G988k271r144Q299j4345R225J9162k8199l153J8417Q4Q1k1809J2121J3724
$$ 7988 5717 -3427 4872 -9473 -248 18914 -9285 -12438 5979 6063 6144 -15665 -3544 10180
711A0180o983j95j7624J2998K1349j4466k0148P136K1670J920k4253o411J5537
$$ 10180 3197 3002 -14622 -1624 19725 5259 -14889 -7753 13917 15837 -8416 -14827 710
724G10R638K488k7833l933K5959P719j5689k2616K0862J7361r711q664j0225J1752
$$ 710 10348 12836 -14997 -18930 7029 14748 -941 -23557 -2695 14666 4955 -3709 -13934 -2182
738b182K2532j1448k5554O456K4531J114k5130K174Q207Q44J2854k0806j0712
$$ -2182 20350 8902 -16652 -10196 14335 15449 -9681 -7507 700 1544 14398 -6408 -17120
751a7120K2000P807j1207j5676J2857J2342r160j827k878j141J8241p774j7316
$$ -17120 4880 12687 1480 -14196 -1339 11003 1843 16 -2862 -4003 14238 6464 -10852
764a0852J2739N512k943q937J140Q913q243k56P0j638L325n32p823K550J2302
$$ -10852 1887 7399 4456 -4481 -3341 5572 -2671 -2927 -2857 -4495 -1170 -1702 -9525 -6975 5327
779E327o197j2782P790J7150r951j0203O761L763N637l050j2487r19K3565n471
$$ 5327 -870 -13652 -5862 11288 1337 -8866 -2105 1658 7295 4245 -8242 -9161 14404 8933
793H933k3475O729J2081L193j0181o351k91J2383R812j7664j2939J9804J5626
$$ 8933 -14542 -7813 4268 7461 -2720 -9071 -9362 3021 12833 -4831 -17770 2034 17660
806A7660j8485n630M163P866N816r370p704J543J8253n368j5396l80J3140N005
$$ 17660 -825 -6455 -2292 5574 11390 2020 -5684 -4141 14112 8744 -6652 -7032 6108 11113
820A1113j2141j967j432Q646N402q316r583R771R858j1257m875L992P066q965
$$ 11113 -1028 -2995 -4427 4219 9621 1305 -8278 1493 11351 94 -4781 -789 6277 -2688
834b688M095k796j0549J6447l343r657J640P887k976l939O002Q74m768M588N828
$$ -2688 1407 -1389 -11938 4509 1166 -8491 -6851 1036 -1940 -5879 123 997 -3771 817 6645
849F645j0249J1792l244r559J0387J928l423j1427R083M011p550j257l095K103
$$ 6645 -3604 8188 4944 -4615 5772 7700 4277 -7150 1933 5944 -1606 -2863 -5958 -3855
863c855R178q80j6016L355J3161Q667j8232o304J7038J407L126j4214m977J4240
$$ -3855 5323 4443 -11573 -8218 4943 13610 -4622 -10926 6112 7519 10645 -3569 -8546 5694
877E694R970j0518j8769R413J5976n382j3914K255N04J1153J514j9014Q24J4864
$$ 5694 15664 5146 -13623 -4210 11766 6384 -7530 -5275 -4771 6382 7896 -11118 -10294 4570
891D570O253j8521Q43J0160l826J842j642n979J304J1150r255n458P499j75l346
$$ 4570 10823 -7698 -6855 3305 -521 1321 -321 -6300 -4996 6154 -3101 -8559 -1060 -1235 -4581
906d581J026M203j997K023j233K942o59M464L415j3663R971M710r907R53J627
$$ -4581 -3555 648 -1349 674 -559 2383 1724 6188 9603 -4060 5911 10621 714 1667 3294
921C294k141R8j229j073j889j133J0876j1169l841J6348q360k836O404j938N9
$$ 3294 1153 1251 22 -1051 -2940 -4073 6803 -4366 -8207 8141 -219 -3055 3349 1411 1470
936A470L241l218j714N027K747r004p525J8719q58j3836L888m462O343J0057j6044
$$ 1470 4711 1493 -221 4806 7553 -1451 -8976 9743 8885 -4951 -1063 -5525 818 10875 -5169
951e169j0270J1251J0909j489k1901k76K4243m528l938q806o515K7815J743k1637
$$ -5169 -15439 -4188 6721 5232 -16669 -16945 7298 2770 -1168 -9974 -16489 11326 13069 -8568
965h568j549Q053J4591j935k1823N717Q841J010O335k2106J473K2788j0068m828
$$ -8568 -10117 -2064 12527 10592 -11231 -5514 3327 4337 10672 -11434 -9961 12827 2759 -2069
979b069J862j117O796j26l037K023q386R864K212j3755J4626r728p823J7329o654
$$ -2069 -207 -1324 5472 5346 2309 4332 -4054 5810 8022 -5733 8893 -835 -8658 8671 2017
994B017n339K864l372Q670P91p832M796p953J4890N384k5876J4061L975p316R356
$$ 2017 -3322 -458 -3830 4840 5631 -2201 2595 -5358 9532 14916 -10960 3101 7076 -240 9116
1009I116j1428n579J3211k891k388n862p157K2225q874j2113J1831m404O226L573
$$ 9116 -2312 -7891 5320 2429 41 -5821 -12978 9247 373 -11740 91 -4313 1913 5486
1023E486j4034K100J6126l418p501p117J1408J1334j9226M458n78j065J6432j5200
$$ 5486 -8548 -6448 9678 6260 -1241 -8358 3050 14384 -4842 -384 -962 -2027 14405 -795
1037g95j4072K0174N507r920n125m514J9557o791p587P900j6720J9647N687k4108
$$ -795 -14867 5307 10814 894 -4231 -8745 10812 4021 -3566 4334 -12386 7261 12948 -11160
1051a1160R835N994o406J0421j1504j617J3195j1677J0105r646o074K0561j2510
$$ -11160 -1325 4669 -1737 8684 -2820 -4437 8758 -2919 7186 -2460 -8534 12027 -483
1064d83m860P904m854L158L164q538N361j021J748K128j3320J4700k067j2411
$$ -483 -5343 2561 -2293 865 4029 -4509 852 -169 1579 3707 -9613 5087 3020 -9391
1078i391J0405j280n713M297j880j248O293p264K477K381L636Q03j4855J3387
$$ -9391 1014 -266 -5979 -1682 -3562 -4810 1483 -5781 -3304 -923 2713 3516 -11339 2048
1092B048Q331j3190J37J538l360J1973o846j4439J2145J628M529p446j0787J6233
$$ 2048 10379 -2811 -2674 -1136 -4496 7477 631 -13808 -1663 -35 4494 -2952 -13739 2494
1106B494J713n127L098r732K023J7697j2202o656L814QJ0515q501n251J904K242
$$ 2494 4207 -920 2178 -7554 -5531 12166 -36 -6692 -2878 -2870 7645 -856 -6107 -4203 -1961
1121a961J1573q218j4265J3707O905q196N07l908L443J581k49J550j2796R957
$$ -1961 9612 1394 -12871 836 7741 -455 52 -3856 -413 1168 919 2469 -10327 -370
1135c70N446j2209Q281p22q705J1182K153r166N87J899P322m231p254M481p60
$$ -370 5076 -7133 1148 426 -8279 2903 5056 -4110 -3523 -1624 5698 1467 -5787 -1306 -2066
1150b066N410l90j1395K439J1990k849j0198M076M613p88q86k495k29L349J805
$$ -2066 3344 2954 -8441 -6002 5988 3139 -7059 -2983 1630 842 -44 -2539 -2768 581 2386
1165B386k170n336J175R563n633k627K609n421P634L182p954n241Q290P216r693
$$ 2386 216 -5120 -3945 5618 -15 -2642 -33 -5454 2180 5362 -2592 -7833 457 7673 -2020
1180b020l279M671P22M764k566j2412J0560Q937p706m721j499J3108m149p615
$$ -2020 -5299 -628 94 4858 2292 -10120 440 9377 1671 -3050 -4549 8559 4410 -3205
1194c205N311k362K729K054p387J284O176n615j665L560J929n103j525Q395m231
$$ -3205 2106 -256 2473 4527 -2860 -1576 4600 -1015 -2680 880 2809 -2294 -3819 4576 345
1209C45J7j396p40N784k483J89n234J300Q947n110q920P182J331k242L656p196
$$ 345 362 -1034 -1774 4010 1527 1716 -3518 -2218 6729 1619 -7301 -119 1212 -1030 2626 -4570
1225d570p69O377P255r848p769J1285L299p0p381m371O996J0710p345j5101N659
$$ -4570 -5339 1038 8293 -1555 -9324 1961 5260 5190 -2191 -6562 434 11144 3799 -11302 -5643
1240e643J5855l116j7901M322P609N070l875j3005L682J2062M468j4968l506J1230
$$ -5643 10212 7096 -10805 -6483 1126 6196 2321 -10684 -7002 5060 9528 -5440 -8946 2284
1254B284N011n598o616M123L215J736m176l496l14Q079l146p960O368k098j08
$$ 2284 7295 1697 -4919 -796 2419 4155 -21 -3517 -3831 4248 1102 -6858 -490 -2588 -2696
1269b696K128j84m663J474P661n083k297L631K549m633K576J747k865J705P82
$$ -2696 -568 -752 -5415 -3941 3720 -1363 -3660 -29 2520 -2113 463 2210 -655 1050 1832
1284A832k632p09P001o958k699P656j189l460k182N264L46l51j929l980O662M983
$$ 1832 -800 -1509 5492 -1466 -4165 3491 2302 -1158 -3340 1924 2270 1919 -10 -3990 2672 7655
1300G655p500o393P568N546l836j0316M349O856k479L03r776L509J0925k330r193
$$ 7655 155 -6238 1330 6876 3040 -7276 -2927 3929 1450 1753 -8023 -4514 6411 4081 -5112
1315e112k819J1006M583p707l638J234M501P285r842r747R481P754m911j1317
$$ -5112 -7931 3075 7658 -49 -3687 -2453 2048 9333 -509 -10256 -775 6979 2068 -9249
1329i249M092M709M53J242r843Q99J1385m04q718o63R384J402n750J80Q62J935
$$ -9249 -5157 -448 5 1247 -8596 -7697 3688 3284 -5434 -6097 3287 4689 -1061 -881 -19 1916
1345A916L978o696q90M004J30p21n252O356p61o121O632k113p43K755l610J597
$$ 1916 5894 -802 -1692 2312 2442 1721 -3531 2825 2064 -4057 2575 462 -281 2474 -1136 461
1361D61Q24J038M13o386O696L322j0929N257K172k927K932l692r70J533M585k712
$$ 461 1285 2323 2736 -3650 3046 6368 -4561 696 2868 -59 2873 -819 -1789 -256 4329 1617
1377A617o973M275N627l212k820N15j531O503J8r165n43R848j57q075k413L250
$$ 1617 -5356 -1081 4546 1334 -1486 -971 -2502 4001 4019 -5146 -5689 4159 4002 -4073 -6486 -3236
1393c236P147n317l148k173J124J3444r065q472Q233L650K303n187n773Q402K441
$$ -3236 3911 -1406 -4554 -6727 -5603 7841 -1224 -9696 -1463 2187 4490 -697 -6470 1932 4373
1408D373j314l23j0612J2179L830j1333M235k087J241K655k311k045j103K774
$$ 4373 3059 2736 -7876 4303 8133 -3200 1035 -1052 189 2844 533 -1512 -2615 159
1422A59L825o266n86P403q735L763O005p059l71L632j941K159J056p248M074K13
$$ 159 3984 -2282 -2868 4535 -4200 -437 5568 -1491 -1862 1770 -171 1988 3044 -4204 -130 83
1438H3L898k465j0121J2134k134m215N887q210K056Q167r266J755j35j547R990
$$ 83 3981 1516 -8605 3529 1395 -2820 3067 -5143 -3087 5080 -4186 -2431 -2566 -4113 5877
1453E877j4519N150Q115j2583Q577k195l655Q887n745k705M979q82N141q512m281
$$ 5877 -8642 -3492 4623 -7960 617 -1578 -5233 3654 -2091 -4796 183 -699 4442 -4070 -8351
1468h351J4530o324M98p79q701J1096O535j1154m213O297L055K971q729k446O156
$$ -8351 6179 -145 353 -426 -9127 1969 8504 -2650 -6863 -566 2489 5460 -3269 -5715 441
1483D41r39O244r485p441J4252O69p097L516p065N940Q409j0192M735o055L285
$$ 441 -498 5746 -3739 -11180 3072 3741 -3356 160 -6905 -965 7444 -2748 1987 -4068 -783
1498g83J0058j3407N334J067r925J3544k197q976O887o804P518L645j1852P753
$$ -783 9275 -4132 1202 2269 -7656 5888 3691 -5285 1602 -5202 2316 5961 -5891 1862
1512A862n740M139J1878j7835j276J1335j856J240o598n391J2210J162m465n554
$$ 1862 -3878 261 12139 -5696 -6972 4363 2507 3747 -2851 -8242 3968 5130 665 -4889
1526d889j682J5919m517j1878O809O99K181L483j2601J511J2089o468l431k307
$$ -4889 -6571 9348 4831 -7047 -238 461 2642 6125 -6476 -4965 7124 656 -2775 -5082
1540e082L351R395j1807j708Q244l817N610l622r604J2958Q23o260J557n948R862
$$ -5082 -1731 7664 -4143 -5851 2393 -1424 4186 564 -9040 3918 4741 -1519 38 -5910 3952
1555C952Q66j0746P480m330K442Q559j3953R12J1478n814J37j623j904P115m561
$$ 3952 4818 -5928 1552 -2778 -336 8223 -5730 -4818 6660 846 983 -640 -2544 4571 10
1570A0J522j784m083J1165p027n032R802l188k858K161k108N000j071o183M437
$$ 10 1532 -252 -4335 6830 -197 -5229 4573 1385 -1473 688 -1420 3580 2509 -3674 763
1585G63j262N136l152j0290J0339N279q619k159J714L316N966q948n640P436M995
$$ 763 -499 4637 1485 -8805 1534 6813 -1806 -3965 -2251 1065 7031 -1917 -7557 -121 4874
1600D874O95j2329j715J4007J183j0548k184L329O599K320j3215q09R666O254
$$ 4874 5569 -6760 -8475 5532 6715 -3833 -6017 -2688 3911 6231 -6984 -7793 1873 8127
1614H127o968j2053R466P601l582m305n827M123J3093q772j0940O463O147K976
$$ 8127 1159 -10894 -1428 6173 2591 -1714 -7541 -3418 9675 903 -10037 -3574 2573 5549
1628E549j1178j403P481O52J759o812k749R804K000r189J564J975K520n43n301
$$ 5549 -5629 -7032 449 1101 2860 -3952 -6701 3103 5103 -4086 -2522 -547 1973 1430 -3871
1643c871L152m2J511j643l163K432K924k910l194O032k12k783J44K493l26Q00
$$ -3871 -719 -761 750 -893 -4056 -1624 1300 -1610 -4804 1228 1016 -1767 -1623 870 544 1344
1659A344O67n456L131N225k050p223L066N197k156j642m598L130N190m71q267
$$ 1344 2011 -3445 -314 4911 2861 -4362 -1296 3901 1745 103 -4495 -1365 3825 3354 -4913
1674d913k021J0908K466r634m129P427L106J130p762n030J0457N307p673r685
$$ -4913 -6934 3974 6440 -3194 -7323 104 3210 4340 -3422 -8452 2005 7312 -361 -10046
1688a0046P493Q996l970q944p98P930L421l841q652L067Q885Q13r050k359Q451
$$ -10046 -2553 6443 2473 -6471 -7269 661 4082 241 -8411 -5344 3541 4354 -4696 -7055 1396
1703A396J366k548l788l3L984L544m594n641N430M053k943m319L027N93j89K525
$$ 1396 2762 214 -3574 -3607 377 3921 -673 -6314 -884 3169 226 -4093 -1066 -473 -662 1863
1719A863l515j254N680m9m538K822J966k367J40M27P44q26k57j658Q07L199l415
$$ 1863 -1652 -2906 2774 2725 -1813 1009 2975 608 748 1175 1919 1093 836 -822 -15 3184 -231
1736b31l365K460M754k579n518K066M749m04k998k336N55O194K44p815j699P838
$$ -231 -3596 -1136 3618 1039 -4479 -2413 2336 1932 -1066 -3402 -2847 3347 3591 -4224 -5923 1915
1752A915L511p800l361L817L661Q54n161l943M374P109m959p071M103N238j360
$$ 1915 5426 -2374 -5735 -1918 1743 2597 -2564 -6507 -2133 4976 17 -7054 -2951 2287 927
1767I27k439k077m42P520l40p461r41O629K739o115j052J493J610J906k352l077
$$ 927 -1512 -3589 -4031 3489 3149 -4312 -5253 1376 4115 -2000 -3052 -1559 51 1957 -395 -3472
1783c472K580L740k874j687J871K604k421q2J526j936J352n71Kk20j19j338j076
$$ -3472 -892 2848 -26 -1713 158 2762 341 259 1785 -151 1201 630 632 412 293 -1045 -2121
1800b121L871K5m701j672P141q09l933Q17N00J935J214k122m610N169L315m412
$$ -2121 1750 1775 -2926 -4598 2543 1734 -2199 -1382 -882 1053 2267 145 -4465 704 4019 -393
1816c93k578J665K385j407Q25m317K19N175p86m839p28N127P8o72k812K22J831
$$ -393 -2971 -1306 1079 -328 497 -3820 -3601 1574 788 -4051 -4779 348 426 -246 -3058 -2836 -1005
1833a005L196j360p051M784M249j083n523K55M391J856k965l693J971L128L487
$$ -1005 2191 831 -6220 -1436 2813 1730 -3793 -3538 853 2709 -256 -3949 -1978 1150 4637
1848D637p283k449P665J71k892j647J044R13K506j777l022J013L883j738m898
$$ 4637 -2646 -5095 2570 2741 -151 -1798 -754 159 2665 888 -2134 -1121 2762 1024 -3874
1863c874O327k013k515L768j136j310O99L13M13J550k476o58l89L694J513p210
$$ -3874 2453 440 -2075 1693 557 -753 -54 259 672 2222 -254 -912 -1301 2393 3906 -3304
1879c304J930L038J84k4l297j668M675J912l688k632k61Q000l508n954M273n11
$$ -3304 -1374 1664 1848 1824 -1473 -3141 1534 3446 -242 -2874 -3135 4865 1357 -4597 -324 -835
1895h35K662Q83o739J056O125o78k289m245L864N166o226J768j778p42P321n154
$$ -835 1827 2710 -4029 -2973 3152 2474 185 -4060 -196 4970 -1256 512 -1266 -2008 5313 159
1911A59n023N403J349j432q62k056K808j67J187n23n915N333L234n623J349K93
$$ 159 -4864 539 1888 456 -406 -2462 346 179 1366 843 -5072 261 3495 -2128 -779 -486
1927d86j659M176j531k766K717r49K689l73m030M337k017r93N040n744m76M147
$$ -486 -2145 2031 500 -2266 451 -498 2191 1818 -2212 2125 108 -885 4155 -1589 -2065 2082
1943B082k484K241j840k850M659k960L936o69q820J0887R37p271L819l065J681
$$ 2082 -402 1839 -1 -2851 1808 -1152 2784 2115 -6705 4182 5119 -2152 1667 -1398 283
1958B83M698o121n96J110J645L055p712J845N211m974K697j347k210N287q73m554
$$ 283 4981 -1140 -1736 -626 1019 4074 -3638 -1793 3418 -1556 1141 -206 -2416 2871 1998 -2556
1974b556K023J524O23j578m619O067L24l871L123l916J411O097o299k201M763
$$ -2556 -533 991 1614 36 -4583 1484 1808 -2063 1060 -2856 -1445 4652 -1647 -3848 915
1989I15j720L938m723l343P934m164L674k225p144R826P3n589M012l265J604L893
$$ 915 -805 3133 -1590 -4933 3001 -1163 2511 286 -6858 2968 3041 -2548 1464 -1801 -197 3696
2005C696m726K429l863J784N757q434L355J485m502N004J010n708J650J783M73
$$ 3696 -1030 1399 -2464 -680 5077 -3357 -2 1483 -3019 1985 2995 -2713 -1063 720 1193
2020A193J591m337P60Q58K053J671n960j346N826K62l303R58l922M470L439n221
$$ 1193 2784 -1553 -793 65 2118 3789 -2171 -3517 2309 2571 -732 226 -3696 774 4213 -1008
2036a008Q97l094N149L728q822J399M561l555M137k449o073P923j019q52k795
$$ -1008 -111 -3205 1944 5672 -3150 -1751 2810 -745 3392 943 -5130 2793 1774 922 -1873
2051a873j112P129m133r47J490l111M620J356p505L652L789k742m6k670L988J14
$$ -1873 -2985 4144 11 -936 554 -2557 2063 3419 -4086 -434 3355 613 567 -2103 1885 1999
2067A999k401Q74k209J820L052l449l197N144o62q08j03j713K716l94R7m38r88
$$ 1999 -402 472 -1737 83 3135 -314 -3511 1633 971 163 60 -1653 1063 669 766 328 -660
2084f60J477J618l268J392J333l755L691n27j713Q56k94J746j358n35J346k389
$$ -660 817 2435 -833 559 1892 -1863 1828 1301 -412 444 150 1896 538 3 1349 -1040
2100a040J377L900m333j314L518r97J188q35k095K39L584j52m044n35L437O53
$$ -1040 337 4237 -96 -1410 2108 1111 2299 1464 -631 -392 3192 3040 -1004 -1539 1898 2551
2116B551k665m97k045K707M020n368k920L267L685p74m576j33M240K23j016j736
$$ 2551 -114 -611 -2656 51 4071 -1297 -4217 -950 2735 1961 -2615 -2748 1492 1715 699 -1037
2132a037k203N515N55m907r79K708K561k401k561J149N44L027j285m667K499M739
$$ -1037 -3240 2275 2830 -2077 -3056 -348 2213 -188 -2749 -1600 -1056 1971 686 -3981 -1482 3257
2148C257k602k493J264J790o50O73p37k530L892O61l628N67J730K85k253J397
$$ 3257 655 -1838 -574 1216 566 1239 502 -2028 1864 2525 -1103 -536 1194 1479 -774 623
2164F23N63j393P41L01m64K54k27j152J114J101o47k920J962L347m134K22q2M79
$$ 623 1186 -207 534 835 371 625 398 -754 360 1461 814 -2106 -144 3203 -931 -709 -791 -312
2182c12J498j351q87j179K215J705k939j604L438l56p08P61k131Q70J998J324
$$ -312 1186 -165 -1052 -2231 -16 1689 -1250 -2854 584 228 -480 281 -1850 -980 1018 2342
2198B342m882J75L744q38j85k101j162K958L043m508l133M018K843k258k978J936
$$ 2342 -2540 -2365 1379 541 356 -1745 -2907 51 3094 -1414 -4547 -529 2314 56 -2922 -986
2214i86O20K283j602k687J304L232K84m637Q51K107R72j436j103J25R15J179j714
$$ -986 -366 1917 315 -2372 -1068 2164 2448 -2189 -1338 769 1741 305 -798 -673 242 1421 -293
2231b93n89K95K037j668p32K209j582KJ348Q9l073K018J330j962P96J47r26p96
$$ -293 -882 -587 1450 -218 -950 1259 -323 -321 1027 1116 -1957 61 1391 -571 225 372 -554 -1350
2249a350L209j405k355K124O56n61k88L93j711K306M35k259p67K200J437l178
$$ -1350 1859 454 -1901 223 879 318 30 423 -1288 1018 1453 -806 -1573 627 2064 -1114
2265a114P38R0L14R74q21j799P86K482j376j840M08K533j043o48O50j091J045
$$ -1114 -376 -286 28 1002 181 -1618 -832 1650 274 -1566 -1158 1375 332 -316 334 -757 288
2282B88R32j0k827J464J553j001L7j025o68J357J979l192j659K926J700k598n29
$$ 288 1220 1210 -1617 -153 1400 399 436 -589 -1257 100 2079 -1113 -2772 154 1854 -744 -1273
2299a273J086j412K977p5l529N87K781K72k141N28k9M6J171K9j954k42K273n42
$$ -1273 -187 -1599 1378 1303 -2226 -1639 1142 1414 -727 -199 -228 -182 989 1018 -936 -1178 1095 553
2317E53r53m99K74Q20J176j162k474J848K408l65l257N74K575j135M15p87j051
$$ 553 -400 -899 -625 195 1371 209 -2265 -417 1991 1626 -1631 -1057 1518 383 798 11 -1040
2334a040J922R31j951r96J741J272k340r6J876j846P15R75k688J692J479j682
$$ -1040 882 1813 -138 -1134 607 1879 -461 -557 1319 -527 188 1163 -1525 167 1646 -36
2350c6p76J473P0p87M27r6p45J119Q42k077r73K583j43j338k30J68N8J159q74
$$ -36 -812 661 731 -56 371 275 -470 649 1491 -586 -1559 1024 881 -457 -687 -519 -461 698 -176
2369a76p92L85N51J873k805K11J999j961K213k5k332N22J397j47p0j806J211n29
$$ -176 -968 -583 -32 1841 -964 -753 1246 -715 1498 1473 -859 -337 1060 913 843 -963 248 -281
2387b81J16L349n387O29L790k257O85n01j423J660J878j311j667j226M242M81
$$ -281 -165 3184 -2203 -1574 2216 -41 644 143 -1280 380 2258 947 -720 -1946 2296 2777
2403B777l745N99r17K235K283l526l088M111J792k165j016j247L363l59j124n53
$$ 2777 -968 -369 -1286 949 3232 -294 -3382 729 2521 356 -660 -1907 1456 1097 -27 -580
2419e80j246L584M60m058O67K904j121K44k285J473J952l125K633k593o5L563
$$ -580 -1826 1758 2218 -1840 -1173 1731 610 854 -1431 42 1994 -1131 1502 -1091 -1156 2407
2435B407l638p91L472j700Q4J015k580J904O40K02o85k597L890o67k199K086r77
$$ 2407 -1231 -2022 1450 -250 -166 849 -1731 173 813 1015 330 -2267 1623 956 -1243 843 -134
2452a34j260L107k184j232K558j836J564r50m33K423k296M32J478j770O13R79
$$ -134 -1394 1713 -471 -1703 855 -981 583 -367 -800 1623 -673 -241 1237 -533 80 1059
2468A059l283L813l74k317R11q86L739j944l437L462o90j3K140m534P34N149k325
$$ 1059 -2224 1589 1215 -1102 -191 -1077 2662 718 -2719 743 53 40 2180 -2354 -1620 3529 1204
2485A204j702r42J802K838l715m53N63O61K324k955l740N694Q06l914P90o61K476
$$ 1204 -498 -1440 362 3200 -515 -968 -405 256 2580 -375 -4115 1579 2385 -1529 -739 -1400 1076
2502A076R46l372o24J694K410o51m624J775M739l173r09l72M9L975k589k520J229
$$ 1076 2022 -1350 -1974 -280 2130 1479 -3145 -1370 3369 196 -713 -1085 -1036 2939 350 -2170 -941
2519i41R35K531k550l768M253J026j887R69k837J994K818k476r75M1K904k0l644
$$ -941 -6 2525 -25 -3793 460 1486 -401 568 -2269 -275 2543 67 -908 -867 2037 2017 -1627
2536a627J861J223k296K435j737k117M269j451k333J935M92J40j686k75K808k86
$$ -1627 234 1457 -839 1596 -141 -2258 2011 560 -1773 162 654 794 -892 -1167 1641 1355
2552A355r86j005n51L369P95m965M24K657J269j698l470K025K151j8j667k973
$$ 1355 369 -636 -1187 2182 2977 -1988 -1564 1093 2362 664 -2806 -781 1370 1352 -315 -3288
2568c288K258M760k728m834K943K741O05l100k026K856K209p70l421p71M467J820
$$ -3288 -1030 3730 1002 -3832 -889 1852 2457 -643 -2669 187 2396 1626 -1795 -2566 1901 3721
2584C721n748k19K732N03R74l597r05L652J925l677k502L111L080k159k740J650
$$ 3721 -2027 -2246 486 989 1963 -1634 -2539 1113 3038 -639 -3141 -30 3050 891 -1849 -199
2600a99L84K405j658l119K578J407n51k512l6K165J83k061l3L74P40J375l203
$$ -199 185 2590 932 -2187 391 1798 1247 -1265 -1301 864 1047 -1014 -1047 -673 67 1442 -1761
2617a761O43K415Q9j841q56K808k16j612k32J052n12J495j385k741L321J561k181
$$ -1761 -1118 1297 1386 -455 -1311 1497 1281 -331 -563 489 -23 1472 87 -2654 667 2228 47
2634D7k524K461J366l56j038j620K072K068j130l725J739L511j086k943k24K203
$$ 47 -2477 -16 1350 994 -44 -1664 408 2476 1346 -2379 -640 2871 1785 -1158 -1382 821
2650H21J360p32l626M76L678O98l347k198L945J601k151k608J205K418M39k112
$$ 821 2181 1449 -2177 -1701 1977 2675 -672 -2870 1075 2676 525 -2083 -878 1540 1979 -133
2666a33k317K408J991r71l447J245K545j039o28q49j9J951K17k346k2K554p1k203
$$ -133 -2450 -42 1949 978 -2469 -1224 1321 282 -346 -1195 -1214 737 954 -1392 -1414 1140 1069 -1134
2684a134L43K204j948N13N44j042R19Pr23q9J741p76j423N07J378k76p28k67K3
$$ -1134 -791 1413 -535 -22 522 -520 399 406 -517 -606 1135 359 -1064 -557 821 545 -183 -450 -427
2703d27J839k74j594m93K025R68k346o41J049J308o55j122l30N27J834m70k881
$$ -427 1412 1138 -456 -949 1076 2044 -302 -943 106 1414 759 -363 -693 -166 1668 1198 -1683
2720a683P58K758r63j799n8P63J509l11j359j331K014K116l328q16J663N80k04
$$ -1683 -925 1833 870 -929 -987 -224 1285 974 -385 -1716 298 2414 -914 -1730 -67 513 309
2737C09m07j375O90K181j109k112P40K597j086j614O25O53M21n97k86R3O31r2
$$ 309 -98 -1473 -783 1398 289 -1823 -1083 1514 428 -1186 -561 92 513 -84 -370 -277 354 262
2755B62j047N94R38m83j487Q53J428j154o47o2R36N78l08k323J330K553j293k086
$$ 262 -785 -191 747 264 -1223 -370 1058 -96 -743 -805 131 709 401 -1922 -592 1961 668 -1418
2773a418j91L815j277j667J28J00J868Q7k448j041L412K72k527l43J422L22j15
$$ -1418 -1609 2206 929 -738 -610 -510 1358 1445 -1003 -2044 1368 1640 -887 -1230 192 514 399
2790C99n54j715K071Q93q36j745Q37J832j245j77P1M7O14Rj035l93J035R00j388
$$ 399 -155 -1870 201 1094 258 -1487 -650 1182 -63 -240 -169 -122 492 501 -534 -927 108 1008 -380
2809c80j315K193o51o7L48j052M83N95K74j309N23L68j27j64K10m1j470K647o07
$$ -380 -1695 498 -153 -220 128 -924 -441 154 428 -881 -358 10 -117 -281 -71 -112 -1582 1065 458
2828D58j299Q36m18m99J326R44k914M94R94J071j243r70Q54L62J160r14j986J032
$$ 458 -841 -5 -423 -922 404 1348 -1566 -1072 -78 993 -250 -1220 -366 -4 1156 242 -1744 -712
2846g12K504j285j206q7P48J852j732p71l91J060K034k273j425J931Q07j483M99
$$ -712 1792 507 -699 -786 -38 1814 82 -689 -1080 -20 2014 -259 -1684 247 1054 -429 70
2863G0m66J026r9p81N62r64J573j05k376J955J128k473P45L93r58J945j625p37
$$ 70 -396 630 531 -250 312 -652 921 816 -1560 395 1523 -950 -205 188 -770 1175 -450 -1187
2881a187J145L50N02k267O16K132j648k90J361k117J462N01j574J123q93O21J69
$$ -1187 -42 308 810 -1457 -841 1291 -357 -647 714 -1403 59 560 -1014 109 -784 -163 6
2898Fr51J682j229j096K389n73m83P54j922J396J489j572j72r82J715J629l014
$$ 6 -945 737 -492 -1588 801 228 -255 499 -1423 -27 1462 -110 -282 -1264 451 2080 -934
2915i34r1J555j092K240p91l729L034J708j220j415p57K265O17j490J88j514J672
$$ -934 -1025 530 -562 1678 887 -2842 192 1900 680 -735 -1492 773 1390 -100 88 -1426 246
2932B46K558l737J62J756j338J218p14j342J933q20N36m48j050K254j280j390
$$ 246 2804 -933 -771 985 -353 865 151 -1191 742 -78 458 10 -1040 1214 -66 -1456
2948a456K765j213n89J218j495J526k39j310J768j410P50R29k976J520J632k154
$$ -1456 1309 96 -493 725 -770 756 517 -793 975 -435 315 1244 -1732 -212 1420 -734
2964g34P79j73r54K104j075m42M79J17J106k271N94K268j913m26J332j764J666
$$ -734 45 -128 -1082 1022 -53 -495 -16 101 1207 -1064 -470 1798 -115 -541 791 -973 693
2981F93O08k652J037N56Q74j282j413J980L04q32J71p97K39K648k183r33R06K49
$$ 693 1301 -1351 -314 242 1116 -166 -1579 401 705 -127 44 -753 -514 2134 -49 -982 -76 173
2999A73J242j438q34J469n73O85M03l066K200J778k604M82k79P18Q25j214K89
$$ 173 1415 -23 -857 612 39 724 1127 -1939 261 2039 -565 -83 -362 356 1181 -33 256
3016B56n94N96J536k207l88K923j824l4J026k084K090l58j072l69M59J110j182
$$ 256 -338 258 1794 -413 -801 2122 298 264 1290 -794 1296 938 -134 -503 -44 1066 -116
3033a16o49J381j73j217J416o84P4O72r19M73k80M17m07k45n5J058j261k99J403
$$ -116 -765 616 443 -774 642 -42 32 704 -215 258 -22 395 -12 -257 -312 746 -515 -814 589
3052E89j164Q88p65n92J187P01r18j062R40Q68m98j134J120n77O52Q96k222J20
$$ 589 -575 313 -452 -1044 143 844 -74 -1136 -196 672 174 -960 160 -417 235 1131 -1091 -971
3070i71J735K90j660O6Q39M32k60m84n27L01J996j664j245J251K21J27k02q65
$$ -971 764 1054 -606 -540 299 731 471 -13 -540 -239 1757 93 -1152 99 320 447 245 -620
3088f20R9J627r4j114j142J564Q97j800n41O93R73j09r81m95P65R54l73j660N48
$$ -620 -521 1106 1012 -102 -1244 320 1217 -583 -1124 -431 542 433 -548 -1043 -278 676 303 -1357 -809
3107h09J598r49o77M89j88O99K30j260j02J152Q2j532M84J347r52n39P11l45J04
$$ -809 789 -160 -837 -348 -536 163 393 -867 -969 183 265 -1267 -783 564 -388 -927 -216 -561 -457
3126d57O41r62j07J006M53j701M34J190k23n83p97R72P21k85q73p77J430Q77j555
$$ -457 184 -778 -885 121 574 -1127 -693 497 274 -309 -1106 -134 587 302 -571 -1348 82 959 -596
3145e96o85J363P09l31j021l83J403L93l44j584j71K618l45j954m48J242P69m77
$$ -596 -1281 82 791 460 -561 -944 459 852 508 -1076 -1247 1371 1026 -928 -1376 -134 635 158
3163A58p67p78J546J183j626j568J895J095r00q20p45J342J213m73k544J023J961
$$ 158 -609 -1387 159 1342 -284 -1852 43 1138 238 -582 -1327 15 1228 755 -1789 -766 1195
3180A195m97j897J99J016N29m64j264N12J154J92j251q18J917K19j068n02J022
$$ 1195 698 -1199 -1000 16 545 81 -1183 -671 483 675 -576 -1394 523 742 -326 -828 194
3197A94K60m55n44r1J084J97j156q51J999J97j394m86R33J194j717R6l53Q47J470
$$ 194 454 -1 -545 -636 448 645 -511 -1362 637 834 -560 -1046 -113 1081 -636 -540 -893 -46 1424
3216A424j315j940J507K171j616j008k00J693M70j021j232J28K698m01k581k03
$$ 1424 109 -1831 -324 1847 231 -777 -977 716 1186 165 -1067 -939 1759 1358 -1223 -1426
3232a426K402N41j393q48l06J943L81j320j509J621J775j542j340L35K046q25
$$ -1426 976 1517 124 -724 -1030 913 1294 -26 -1535 86 1861 319 -1021 -686 1360 535
3248E35p90o52N67J633p16j438n68K362jj613j17R63q1K11l75j313J664P56j714
$$ 535 -255 -907 -340 1293 577 -861 -1429 933 932 -681 -798 165 84 295 -80 -1393 271 1027 -687
3267f87n91J531L06o97k44l5O04J28o20n13M59J272j188r58J339P04q67r87L22
$$ -687 -1278 253 559 -138 -382 -417 187 315 -305 -818 -359 913 -275 -1233 106 810 -57 -1044 -722
3286g22J526M92k109l24R01J737q19k576J424K211r87j432p21J481J613p86j831
$$ -722 804 1296 -813 -1137 -236 1501 682 -1894 -470 1741 754 -678 -1399 82 1695 909 -922
3303i22m30J951J701k645j273K067M14k48p80j105J707J049j344j295P99J279
$$ -922 -1352 599 2300 -345 -1618 449 863 615 -165 -1270 437 1486 142 -1153 -354 925
3319I25k77j955R04O88J9M96j712j44J934m86j296K27M95R83j052o53P67K6M10
$$ 925 648 -1307 -403 285 304 800 -912 -1056 878 392 -904 -677 -182 801 -251 -904 -137 -111 299
3338B99M4j595J307O25j128N10k08K86K92j000P80j88p54J306j313O12J530k440
$$ 299 343 -1252 55 680 -448 62 -146 140 432 -568 212 24 -730 576 -737 -125 1405 -1035
3356a035N37J512k57q17o11p0J663l28n20q08l20L179j103k337J076O65L68J52
$$ -1035 -498 1014 757 -60 -671 -741 922 594 74 -734 -1054 2125 1022 -1315 -239 426 794 946
3374I46k232L81K816p82r10j492J408J733j904l54J69O7J215q24j652J901j1q9
$$ 946 -1286 -905 1911 1129 219 -1273 135 1868 -36 -390 -221 -154 1061 237 -1415 486 475 386
3392C86l65r89K451j302r45J498o04RO90j341L03J324j244j17p0O96K79j348Q79
$$ 386 21 -968 1483 181 -764 734 130 139 829 -512 -209 1115 -129 -246 -316 380 659 -689 190
3411A90j95k97Q70l54j673K268p70r16J420q56O21n69o8J107r13l00N16l11N64
$$ 190 -5 -302 568 214 -1459 809 39 -877 543 -313 308 -261 -329 778 -135 -435 81 -230 334
3430C34L21k171J367N58l58L21j534J193N46n55K51r49q4K605j421j634J631m43
$$ 334 655 -1516 -149 409 51 372 -1162 31 577 22 273 -676 -760 1845 424 -1210 421 -22
3448b2Q96m87q21L99K62J080p82j613J182J192j289J83m77m49J966p05p55K16
$$ -22 874 387 -434 -35 227 1307 525 -1088 94 1286 -3 180 -297 -746 1220 515 -240 -24
3466b4K50K17l16k96N17m20l2Q23j760J018K73o47N16l73j87K60k26N47R5j160
$$ -24 226 443 127 -169 348 -72 -104 719 -1041 -23 250 -397 119 -254 -441 -181 -407 140 235 -925
3486i25J111K71j014N84q03M52Q68j010m57P53O37m86q70N00Q79o98K83k64r04
$$ -925 186 457 -557 27 -776 -324 544 -466 -923 -170 467 -19 -889 -389 490 -208 75 -189 -1093
3505a093K217q08j308L93Q15M06o36o59N34L76m6m0j056R03J222j525N4J19K97
$$ -1093 1124 316 -992 -599 216 622 -14 -673 -139 237 191 151 -905 -2 1220 -305 -251 -132 165
3524A65O94r79m43K41N82M47r80k39R73j76k31j02N4r6l4J78n54L77J59j28j89
$$ 165 859 -120 -563 -322 260 707 -273 -512 461 285 54 -48 6 -90 -124 54 -500 -123 36 -92 -281
3545b81M92K5q94N26M24o24M43l37k3M28K19r27j13P36M80j162k11J304n24O7
$$ -281 211 236 -658 -132 292 -332 111 -226 -249 179 398 -529 -642 94 574 -588 -799 505 -19 48
3565D8j29j047J005P56n20r55L96R07K3j283l8Q56M59R5j565K82J426K21j268
$$ 48 -81 -1128 -123 633 113 -842 -446 461 484 -799 -837 19 478 573 -992 -710 716 937 -331
3584c31r78J544M14n53o82j26P27Q44p06j542J079J081k45j451M73L44L45K80
$$ -331 -1309 235 649 96 -586 -712 15 859 153 -1389 -310 771 526 -925 -452 -108 237 517
3602E17j026J4P03O98j471K19N83j51L33p46O3O2P01p89j25L25M85k76l71M40
$$ 517 -509 -495 208 906 -565 -346 237 86 419 -327 -264 -202 499 -290 -415 -90 395 119 -252 188
3622A88l02j00m5L56j76O9O1p47O88J26l64n49L92P29n46J1j78O39K9j58j188
$$ 188 -114 -214 -259 97 -79 -10 51 -696 -8 118 -246 -795 -403 326 -220 -209 -387 252 281 123 -1065
3643a065Q01Q20l49r45o0J307m65j31l41m52J184M52j253q31J751R1l64q18K02
$$ -1065 -264 556 207 -738 -798 509 44 -87 -428 -880 304 756 -497 -1328 423 514 150 -668 -466
3662d66O55L25m64r13M94J010j62r05j15Q42J03R9j204J03R28M86j158n28Q55
$$ -466 189 514 50 -863 -369 641 479 -426 -541 301 404 503 -701 -598 330 816 -342 -870 -15
3681a5P88n85o12N99j40O46l18p46n2N94O83j413M5P25k55Q3J78n81J6R45p42
$$ -15 773 188 -424 175 35 681 363 -383 -435 159 842 -571 -526 199 -56 27 205 -376 -360 585 -157
3702a57k82L85L9k64K39J5n80L73J84K60n74L02J19m24L09K85p87J81L60J96m10
$$ -157 -439 -54 -15 -279 -40 -25 -605 -232 -48 212 -362 -60 59 -365 -56 229 -558 -377 -17 179 -231
3723b31l11J37L65K66l59o27O40Q79m31p20K94M57K70m42o03p3N75J131j311q46
$$ -231 -542 -405 -40 226 -133 -760 -120 759 328 -392 -98 359 629 187 -416 -489 86 1217 -94 -940
3743i40J204M16p42l7l64N13P99n40q53K20Q16J23o41l81M29K22L54r23n14J169
$$ -940 264 680 -62 -99 -463 50 849 309 -544 -324 492 615 -26 -407 22 244 598 -325 -839 330
3763C30N06p94m80K14N42q9j65m16N72o9L21j014J42J104n35m06m37O08L44m03
$$ 330 836 42 -438 -224 318 229 64 -352 220 151 472 -542 -400 704 169 -237 -674 -66 278 -125
3783a25K6k18j56O43j75p02R84k15n05M90k65k35M16L55p23J42n8L27m72M89k3
$$ -125 -99 -317 -473 170 -5 -707 277 62 -443 47 -218 -453 -37 318 -405 -263 -321 6 -466 23 0
3804@p91O89K28k65j83q0k7O90J69r03j33K56Q27k28r08K51M12N15m32o32j8J349
$$ 0 -791 -102 126 -139 -322 -402 -429 261 430 -473 -606 -350 477 249 -659 -408 4 519 87 -545 -563 786
3826G86k08r83o59J099R08q11l20k17r2J056k25j155O14O10l30q3o20O76J78l53
$$ 786 578 -405 -1064 35 943 132 -188 -405 -497 559 334 -821 -207 403 73 -10 -630 46 224 -129
3846a29pl62N26L50j071L49O31p50J80N6n26Q19l42M53o24m1P84k62m53K62o0
$$ -129 -136 -498 28 378 -693 -344 287 -463 -283 -227 -753 66 -276 177 -447 -488 296 34 -419 -157 -217
3867b17r5P79q57j95N24n5N0j10k06K71l75L40L29r87O71L31n97M29m33j35O85
$$ -217 -312 467 -390 -585 -61 -116 -66 -176 -382 -111 -486 -146 183 -804 -133 198 -399 30 -403 -538 147
3888A47J99p3r04J05J434q52l73L97m86O92O08j521P9P50R3O9q49J45P52l36J45
$$ 147 346 273 -631 -526 908 56 -317 80 -406 286 894 -627 -548 202 295 364 -485 -340 412 76 221
3909B21o87k29J397j83j072M35Q3J31Q2o50M22j99J74J57m92J91R72j123J02L23
$$ 221 -466 -695 702 519 -553 -118 -35 96 178 -472 -50 -249 -75 82 -410 -219 753 -370 -268 55
3929E5j60P5j80n2J86k2L53m87R6N55r75N12N55q27N8P14p69M62l16K34J62l57
$$ 55 -105 -30 -210 -262 -76 -98 255 -232 -136 419 -556 -44 511 -316 -258 456 -313 149 -167 67 229 -128
3951a28L70n26j44R14R0j368P61K07Q3J96j107N14O32q5l19n74L41O24l69j37
$$ -128 242 -284 -428 486 576 -792 -31 176 259 455 -652 -138 494 409 90 -484 -143 481 112 -25
3971b5J69q10J163N2r97L79rO16k17o07L29K21l04M81o98j12J503q56m67K56J96
$$ -25 144 -666 497 549 -448 -69 -78 538 321 -286 43 264 -40 441 -257 -369 1134 278 -189 67 263
3992B63j13k5o0j49M15J9l5o43P77l61l89P3L44M0q2J2k50L91m77L23k80L1N19
$$ 263 150 125 65 -84 331 350 315 -328 449 88 -301 -228 116 156 74 86 -164 227 -250 73 -207 -176 343
4015C43o76L12L77n07r7M4Q2L61K3o21J54M73L84j097k72J133j35k95j31qj1P59
$$ 343 -333 -21 356 -151 -248 -204 -122 239 262 -359 -205 268 652 -445 -717 416 281 -14 -145 -153 -164 595
4037E95l86p80L98P80k88r07N17L19J21j66n32n3P03N22j404L30M45J70p1m03
$$ 595 209 -571 -173 607 319 -588 -71 248 369 203 -329 -382 321 843 -561 -231 214 384 313 -90
4057i0n1M5O61m22n98M30N26m25m76K37K50L94m65l8j06K68K79n30J58J48P6n21
$$ -90 -141 -96 565 143 -455 -25 501 76 -400 -163 87 481 16 -22 -128 140 419 -111 47 195 271 -250
4079b50J70K31m3j57p7k57J68L44l80j00K80M75n84j6M27j67J61j91k59P44k26
$$ -250 -80 151 108 -49 -126 -383 -215 129 -251 -351 -71 404 -180 -196 231 64 225 34 -225 519 293
4100B93m98k13M11M63k62m80L35L07k6r8p90N02M98l07n82j94J131k11o39J11
$$ 293 -205 -418 -7 456 194 -286 49 356 330 232 -558 -56 442 135 -447 -641 490 279 -360 -249
4120b49K50M58k15o50l02R19L21p35k22L80J62O5k91m71P10M34m45l44K4Q31n38
$$ -249 1 459 244 -406 -708 211 532 -203 -425 -45 117 182 -109 -580 130 564 119 -225 -201 630 92
4141I2j56k82L02J87o6m3n13M27O28j009KM49J05k32J87l19M82l03J43k57M0M09
$$ 92 -64 -346 -44 143 77 34 -479 -52 576 -433 -431 18 123 -109 78 -241 241 -62 81 -176 -136 273
4163B73n80J8M73j8j84JP2j12o7l5O5K8N06m96m90O62K40l73l11M00k76P09j17
$$ 273 -307 -289 184 166 -18 -17 55 -57 -124 -159 -94 -66 440 -56 -546 116 356 -17 -328 72 -204 505 388
4186C88p90kO38J50p04j24L49M54j00n04j69L73Q35j016k12J44P07o0r67k3Q45
$$ 388 -402 -404 234 384 -320 -444 -95 359 259 -245 -414 -41 794 -222 -434 -290 417 357 -610 -633 212
4207B12K64l49m63j64J096n9q49LN61K7j57k48J48L10o9k70l69L81N96q65J13
$$ 212 476 127 -336 -500 596 537 -312 -309 252 279 122 -126 22 332 263 -7 -376 5 601 -264 -151
4228a51J82j47j16K17k88J77K55j56j54J27K37n66Q0N67n28ON4K96K35k69l10
$$ -151 31 -116 -232 -15 -303 -126 129 -27 -181 -54 183 -383 -303 264 -264 -258 -204 92 327 58 -252
4249b52mL03J13o9p22M19L03l7P4m82l4P06M2q25Q7N59L93l49o75N75K04K05l39
$$ -252 -256 47 160 91 -631 -212 91 54 128 -354 -388 318 360 -465 -378 181 574 225 -450 125 329 534 195
4272A95q12L26P14lr02J66L54N34o49j22kK18M83o88M9N41j20n85M21P5r2j18
$$ 195 -617 -291 423 420 -482 -316 38 572 -77 -199 -201 17 500 -188 -139 402 282 -303 118 193 101 -17
4294a7q5J21L02J60n91l00L06O66p32R2R6l2Q6j64j83M28j25K0p6m5M38l62m19
$$ -17 -102 19 321 481 -110 -410 -104 562 -170 -78 18 -14 72 -92 -275 153 28 48 -28 -73 365 3 -416
4317d16P07k29k11J21p3L34k34j50m45O79N50m88p73P55K81k67J24n69Q3P32K02
$$ -416 291 62 -149 -28 -101 233 -1 -151 -596 83 633 145 -628 127 408 141 265 -304 -221 511 713
4338G13j238K15j65Q58k00m75M8K70L74k68m73Q3Q74m00j32j83k18R48o52L15
$$ 713 -525 -310 -475 383 183 -292 -244 26 400 132 -341 -258 616 216 84 -99 -317 631 -21 294
4358B94k19r9L29j20n95P55l65m58P79m46K89Q1k50j34K35J93j98m58O13J07q29
$$ 294 75 -24 305 185 -410 345 -20 -478 301 -145 144 225 -25 -159 76 269 71 -387 226 333 -496
4379d96N34K55n93O32l87J46j4O7k09j94L89J24l02m49Q36l95K68m59j26N90J74
$$ -496 38 293 -300 332 -55 91 77 144 -65 -259 130 254 -48 -497 339 -56 212 -247 -373 217 391
4400C91n77l03L80N40j31r10N00L69k65N21j205K76N98O9p9p33K53P45l36l45
$$ 391 -186 -489 -109 431 300 -610 -110 259 -6 515 -690 -414 184 253 174 -559 -306 439 103 -242
4420b42K43m07O72L5p49N01J09j57k13K51j43L81j97k7j44q5P20o37J16L03p99
$$ -242 1 -406 266 301 -448 53 162 5 -208 43 -100 281 84 57 -87 -172 548 -89 27 330 -469
4441d69M10N6JJ53j30n4K73n32N88k47m65P68k83k37K9J21N4L69o55J04K45k45
$$ -469 -59 -3 -2 151 21 -33 240 -292 296 49 -416 352 69 -168 -139 -18 36 405 -250 -146 99 -146
4463a46p0k76K65Q15q73OM49M6M8j34o20L25Q41o76n06P2Q30j54o38K34j0J69
$$ -146 -216 -492 -227 588 -285 -279 170 216 264 130 -490 -165 676 0 -506 -434 396 242 -396 -162 -172 -3
4485cL62n80r6N60j67j27k12K28K75k74k0J01j32N29m15k73O29q5l18j29j18L63
$$ -3 359 -221 -317 243 76 -51 -263 -35 240 -34 -54 47 -85 444 29 -244 385 300 -18 -147 -265 98
4507I8J75k37o3k06L10%l58L24k9p5L0P3rK2J10l22QL19mk45K4J66o3o6p6J59
$$ 98 273 36 -27 -233 77 77 -281 43 14 -61 -31 42 33 55 165 -157 -149 170 166 -79 -55 111 48 -18 -94 65
4533F5k14L88l28j84J23L33m8n38L88J40j75L5k86K79L81j43p50L19M05n4l52
$$ 65 -149 239 -89 -273 -150 183 135 -403 -15 125 -50 -15 -301 -22 359 216 -534 -215 190 136 -216
4554b16o8L62K22o4m04j92L37O02o48L0Q6J79k9k69r8J57M27l28k13K77O5j33
$$ -216 -284 78 300 236 -168 -360 -23 579 -69 -39 47 226 197 -72 -170 -13 414 86 -127 150 215 82
4576H2l64M77j40J01P3k82OL20P5o20J87L07K3m16K37J29Jj95k14J79R5n0p2J10
$$ 82 -282 195 55 156 229 -53 -47 273 348 -272 -85 222 245 -171 66 195 196 1 -213 -34 61 11 -61 49
4600D9L0L62l85k13L68p5j88j03j06L72j42K71m56J39L18m65p9L47q3q9L46l73
$$ 49 79 441 56 -157 211 136 -52 -155 -261 111 -31 240 -216 -77 241 -224 -303 44 -39 -128 218 -155
4622a55J31m8L55l25k66M50l1J55n92J42K1M09k14k43K11j2K23k42p3J89L6N3
$$ -155 -24 -72 283 -42 -308 142 111 266 -326 -184 -163 246 32 -211 0 -12 211 -31 -104 85 121 174
4644A74j36l18N02Q6l18j41O04l97pm04L75K99r7k4l45J51K29k09j98L43j64r
$$ 174 38 -280 222 308 -10 -151 453 56 49 -355 20 319 222 198 -147 4 233 24 -174 169 5 -4
4666dj69R4K61N7j49r9J31q9J4j77M42k77k66L34ok54o2J57L22l68J26J23k64
$$ -4 -173 -79 182 239 90 -9 122 33 47 -130 312 35 -231 103 97 -157 -219 -62 260 -108 18 141 -123
4689a23n6L67j42J1j01j62M52l09jj30J28J18k40k17K91K74l41M07l82m00R86
$$ -123 -179 188 46 57 -44 -206 246 -63 -64 -194 -66 52 -188 -405 -114 160 -181 226 -156 -556 430
4710D30l26l33J55K10J18K0l78j63K61L69j72l00J62O7j51o7J82j14J61lj94M42
$$ 430 104 -229 -74 136 254 274 -104 -267 -6 363 191 -109 53 120 -31 -98 84 -30 131 128 -66 376
4732C76l07J42k99n5M02j78k91M44k46q5m5q3K67J12j66j2J17J04J24o03M80Q6
$$ 376 69 211 -88 -143 259 81 -210 234 -12 -97 -142 -225 42 154 -12 -24 93 197 321 -282 198 284
4754B84n67K20K61k93L27j57l07Q0N7k09j08K25K94k48J30j87J68L03j66k16k34
$$ 284 -283 -63 198 -95 232 75 -232 -152 -95 -304 -412 -187 107 -141 -11 -198 -30 273 107 -109 -343
4775c43M39O8L0o98K88L26j15N0m28L24L92m11j42J80k64M63j80j68J98j48L28
$$ -343 96 164 194 -504 -216 110 -5 45 -383 -59 333 -78 -220 -40 -304 159 -21 -189 9 -139 189
4796A89Mo22K04N72n47J27J85l2J00k12P8j6J2K11l04p2N50l71j94M83m59J73
$$ 189 193 -429 -225 347 -200 -73 112 80 180 -32 46 30 42 253 -51 -123 427 56 -138 345 -114 59
4818E9J83n99M64J13k48l9j25M29K1m06J58M21n27Q2k82J90M30m96k9K1P1K77
$$ 59 242 -357 107 220 -28 -67 -192 237 258 -148 10 431 -96 -14 -296 -106 324 -172 -201 -180 -109 168
4840A68k1m45L14J8K59n44l02P41K28m99k78K82K63j25l99M14O1K1L30r71J66
$$ 168 147 -298 16 34 293 -251 -553 188 416 -83 -361 -79 184 59 -340 74 135 156 486 -485 -319
4861c19O44k81j05j63J83R1O6l95K91O6M8n2l25K37K04j25Q2l12QK75k01J17j66
$$ -319 325 44 -61 -224 -41 50 116 -279 12 78 126 74 -251 -14 190 65 147 -165 -157 118 -83 34 -132
$$ [...]
8191a14
##END NTUPLES=NMR FID
##END=
