##TITLE=1H_SA_Sl.Me.2.1
 CDCl3, 8 sc, 
 26.8.2020
##JCAMPDX= 6.0         $$ Bruker NMR JCAMP-DX V2.0
##DATA TYPE= NMR FID
##DATA CLASS= NTUPLES
##ORIGIN= UXNMR, Bruker Analytische Messtechnik GmbH
##OWNER= root
$$ XWIN-NMR		Version 3.5
$$ Thu Aug 27 11:08:40 2020 Russian Standard Time (UT+4h)  she@DPX200
##.OBSERVE FREQUENCY= 200.1315066352
##.OBSERVE NUCLEUS= ^1H
##.DELAY= (6, 6)
##.ACQUISITION MODE= SIMULTANEOUS
##.ACQUISITION SCHEME= undefined
##.AVERAGES= 8
##.DIGITISER RES= 18
##SPECTROMETER/DATA SYSTEM= spect
##.PULSE SEQUENCE= zg30
##.SOLVENT NAME= CDCl3
##.SHIFT REFERENCE= (INTERNAL, CDCl3, 0, 15.7039)
##AUDIT TRAIL= $$ (NUMBER, WHEN, WHO, WHERE, WHAT)
$$ ##TITLE= Audit trail, XWIN-NMR		Version 3.5
$$ ##JCAMPDX= 5.01
$$ ##ORIGIN= Bruker BioSpin GmbH
$$ ##OWNER= she
$$ F:/spectra/data/she/nmr/H-F/1/audita.txt
$$ ##AUDIT TRAIL=  $$ (NUMBER, WHEN, WHO, WHERE, WHAT)
(   1,<2020-08-27 11:07:23.40 +0400>,<she>,<DPX200>,
      <created by zg, POWCHK disabled, PULCHK disabled
       configuration hash MD5:
       00 E9 B6 7A A2 85 ED C7 34 08 36 98 17 FE 4E 26
       data hash MD5: 16K
       BA 88 C3 3D 99 C7 90 27 26 B6 D2 39 E9 51 D9 C0>)
$$ ##END=
$$ 
$$ hash MD5
$$ 2A DA 68 5F B5 41 7B B7 58 29 59 C6 F7 7D FA 53
##$RELAX= 
##$RELAX= 
##$RELAX= 
##$RELAX= 
##$RELAX= 
##$RELAX= 
$$ Bruker specific parameters
$$ --------------------------
##$DU= <F:/spectra>
##$EXPNO= 1
##$NAME= <H-F>
##$PROCNO= 1
##$TYPE= <nmr>
##$USER= <she>
##$AMP= (0..31)
100 100 100 100 100 100 100 100 100 100 100 100 100 100 100 100 100 100 
100 100 100 100 100 100 100 100 100 100 100 100 100 100 
##$AQSEQ= 0
##$AQ_mod= 1
##$AUNM= <au_zg>
##$AUTOPOS= <>
##$BF1= 200.13
##$BF2= 200.13
##$BF3= 200.13
##$BF4= 200.13
##$BF5= 200.13
##$BF6= 200.13
##$BF7= 200.13
##$BF8= 200.13
##$BYTORDA= 1
##$CFDGTYP= 0
##$CFRGTYP= 5
##$CHEMSTR= <none>
##$CNST= (0..31)
1 1 145 1 1 1 1 1 1 1 1 1 1 1 1 1 1 1 1 1 1 1 1 1 1 1 1 1 1 1 1 1 
##$CPDPRG= <>
##$CPDPRG1= <>
##$CPDPRG2= <>
##$CPDPRG3= <>
##$CPDPRG4= <mlev>
##$CPDPRG5= <mlev>
##$CPDPRG6= <mlev>
##$CPDPRG7= <mlev>
##$CPDPRG8= <mlev>
##$CPDPRGB= <>
##$CPDPRGT= <>
##$D= (0..31)
0 1.2 0 0 0 0 0 0 0 0.06 0 0.03 0 0 0 0 0.0002 0 0 0 0 0 0 0 0 0 0 0 0 
0 0 0 
##$DATE= 1598512042
##$DBL= (0..7)
120 120 120 120 120 120 120 120 
##$DBP= (0..7)
150 150 150 150 150 150 150 150 
##$DBP07= 0
##$DBPNAM0= <>
##$DBPNAM1= <>
##$DBPNAM2= <>
##$DBPNAM3= <>
##$DBPNAM4= <>
##$DBPNAM5= <>
##$DBPNAM6= <>
##$DBPNAM7= <>
##$DBPOAL= (0..7)
0.5 0.5 0.5 0.5 0.5 0.5 0.5 0.5 
##$DBPOFFS= (0..7)
0 0 0 0 0 0 0 0 
##$DE= 6
##$DECBNUC= <off>
##$DECIM= 32
##$DECNUC= <off>
##$DECSTAT= 4
##$DIGMOD= 1
##$DIGTYP= 9
##$DL= (0..7)
0 120 120 120 120 120 120 120 
##$DP= (0..7)
150 150 150 150 150 150 150 150 
##$DP07= 0
##$DPNAME0= <>
##$DPNAME1= <>
##$DPNAME2= <>
##$DPNAME3= <>
##$DPNAME4= <>
##$DPNAME5= <>
##$DPNAME6= <>
##$DPNAME7= <>
##$DPOAL= (0..7)
0.5 0.5 0.5 0.5 0.5 0.5 0.5 0.5 
##$DPOFFS= (0..7)
0 0 0 0 0 0 0 0 
##$DQDMODE= 0
##$DR= 18
##$DS= 0
##$DSLIST= <SSSSSSSSSSSSSSS>
$$ [...]
##$SUBNAM2= <"">
##$SUBNAM3= <"">
##$SUBNAM4= <"">
##$SUBNAM5= <"">
##$SUBNAM6= <"">
##$SUBNAM7= <"">
##$SUBNAM8= <"">
##$SUBNAM9= <"">
##$SW= 16.880792210976
##$SWIBOX= (0..15)
0 0 2 0 0 0 0 0 0 0 0 0 0 0 0 0 
##$SW_h= 3378.37837837838
##$TD= 16384
##$TD0= 1
##$TE= 0
##$TE2= 300
##$TE3= 300
##$TEG= 300
##$TL= (0..7)
0 120 120 120 120 120 120 120 
##$TP= (0..7)
150 150 150 150 150 150 150 150 
##$TP07= 0
##$TPNAME0= <>
##$TPNAME1= <>
##$TPNAME2= <>
##$TPNAME3= <>
##$TPNAME4= <>
##$TPNAME5= <>
##$TPNAME6= <>
##$TPNAME7= <>
##$TPOAL= (0..7)
0.5 0.5 0.5 0.5 0.5 0.5 0.5 0.5 
##$TPOFFS= (0..7)
0 0 0 0 0 0 0 0 
##$TUNHIN= 0
##$TUNHOUT= 0
##$TUNXOUT= 0
##$USERA1= <user>
##$USERA2= <user>
##$USERA3= <user>
##$USERA4= <user>
##$USERA5= <user>
##$V9= 5
##$VALIST= <valist>
##$VCLIST= <CCCCCCCCCCCCCCC>
##$VD= 0
##$VDLIST= <DDDDDDDDDDDDDDD>
##$VPLIST= <PPPPPPPPPPPPPPP>
##$VTLIST= <TTTTTTTTTTTTTTT>
##$WBST= 1024
##$WBSW= 4
##$XGAIN= (0..3)
0 0 0 0 
##$XL= 0
##$YL= 0
##$YMAX_a= 653041
##$YMIN_a= -562191
##$ZGOPTNS= <>
##$ZL1= 120
##$ZL2= 120
##$ZL3= 120
##$ZL4= 120
##$ABSF1= 10
##$ABSF2= 0
##$ABSG= 5
##$ABSL= 3
##$ALPHA= 0
##$AQORDER= 0
##$ASSFAC= 0
##$ASSFACI= 0
##$ASSFACX= 0
##$ASSWID= 0
##$AUNMP= <proc_1d>
##$AZFE= 0.1
##$AZFW= 0.1
##$BCFW= 1
##$BC_mod= 2
##$BYTORDP= 1
##$COROFFS= 0
##$CY= 11.3945322036743
##$DATMOD= 1
##$DC= 2
##$DFILT= <>
##$DTYPP= 0
##$F1P= 16.9975609425685
##$F2P= -3.02152046262296
##$FCOR= 0.5
##$FTSIZE= 0
##$FT_mod= 4
##$GAMMA= 1
##$GB= 0.15
##$INTBC= 1
##$INTSCL= 1
##$ISEN= 128
##$LB= 0.24
##$LEV0= 0
##$LPBIN= 0
##$MAXI= 10000
##$MC2= 0
##$MEAN= 0
##$ME_mod= 0
##$MI= 1.114404
##$NCOEF= 0
##$NC_proc= 0
##$NLEV= 6
##$NOISF1= 3.799351
##$NOISF2= 2.8
##$NSP= 1
##$NTH_PI= 0
##$NZP= 0
##$OFFSET= 15.70392
##$PC= 1
##$PHC0= -9967.472
##$PHC1= 6.80092
##$PH_mod= 1
##$PKNL= yes
##$PPARMOD= 0
##$PSCAL= 0
##$PSIGN= 0
##$REVERSE= no
##$SF= 200.130013532006
##$SI= 16384
##$SIGF1= 3
##$SIGF2= 2
##$SINO= 400
##$SIOLD= 16384
##$SREGLST= <1H.CDCl3>
##$SSB= 0
##$STSI= 0
##$STSR= 0
##$SW_p= 3612.71676300578
##$SYMM= 0
##$S_DEV= 0
##$TDeff= 0
##$TDoff= 0
##$TI= <>
##$TILT= no
##$TM1= 0
##$TM2= 0
##$TOPLEV= 0
##$USERP1= <user>
##$USERP2= <user>
##$USERP3= <user>
##$USERP4= <user>
##$USERP5= <user>
##$WDW= 1
##$XDIM= 8192
##$YMAX_p= 0
##$YMIN_p= 0
$$ End of Bruker specific parameters
$$ ---------------------------------
##NTUPLES= NMR FID
##VAR_NAME=  TIME,          FID/REAL,        FID/IMAG
##SYMBOL=    X,             R,               I
##VAR_TYPE=  INDEPENDENT,   DEPENDENT,       DEPENDENT
##VAR_FORM=  AFFN,          ASDF,            ASDF
##VAR_DIM=   8192,          8192,            8192
##UNITS=     SECONDS,       ARBITRARY UNITS, ARBITRARY UNITS
##FACTOR=    0.000296,      1,               1
##FIRST=     0,             0,               0
##LAST=      2.424536,      0,               0
##MIN=       0,             -562191,         0
##MAX=       2.424536,      653041,          0
$$ Real data points
##PAGE= N=1
##DATA TABLE= (X++(R..R)), XYDATA
0@%%%%%%%%%lJ1j6J6j6K2l0M0m8N6p2Q8j05J27j55J85k18K54k95L44m01M66n34
32b84O10o94P86q93J009j137J279j433J601j784J988k211K453k716L002l317L661
49A920m034M445m897N390n934O538p208P955q794R745j0834J2087j3546J5272
63H105j7348J9893k3060K7054l1988L6715l8176O71846q94992J7851P30512q89388
75c82976L66865K70555m92852L30466j9265j82679K35086k83390J45931J68387
85A56128k87439K01766J305k75600L45504j34298j88985M47740l41339j01315
95a76533M80553n25025J28651M65435o47468K32757L41307n85042L12893J29919
105A57447l49929L06547q0054j42913J75077j57786J23144P6231k67183K25912
$$ y = [0, 0, 0, 0, 0, 0, 0, 0, 0, 0, -3, 8, -8, 8, -8, 14, -16, 24, -24, 32, -40, 48, -57, 70, -85, 100, -118, 136, -159, 185, -216, 250, -284, 326, -368, 418, -475, 534, -603, 676, -757, 844, -940, 1048, -1163, 1290, -1426, 1576, -1741, 1920, -2114, 2331, -2566, 2824, -3110, 3428, -3780, 4175, -4619, 5126, -5708, 6379, -7167, 8105, -9243, 10650, -12410, 14644, -17344, 19371, -18805, 653041, -241951, -224100, 506412, -382976, -16111, 254444, -238408, 92058, 72793, -109886, 125200, -158190, -12259, 156128, -131311, 70455, 71760, -203840, 141664, 7366, -181619, 266121, -75218, -176533, 304020, -221005, -92354, 373081, -274387, -41630, 299677, -285365, 27528, 157447, -192482, 114065, 34011, -108902, 66175, -91611, 31533, 107764, -159419, 66493]
115F6493J1208k50533K89004r4827j81969L53456k05041j56543L43834k73919
125i8837K8601L00318m10615J55559K04609l82825K36682O3594k31496K43190
135A08780j22705p1902J79849k12066J70391N3234k98565L13815m9861l01477
145b30507L75041r4423k24884L48037j95786j29520L02416j99906j571J67542
155A16439k05144J08022M7847j83179J75052l3553q8097J42913j38408L2907R1948
166F6747j42753J36708k6175j51020K30089j15108j41494K93142j54939j14032
176a18835K61482j77281p2340K34526j48457m0236J54623j24748P06O4477o1715
187b7798M3134o417j7604K4930n5299M9663J5827q4423J05519l0695r3947J40146
$$ y = [66493, 77701, -172832, 116172, 21345, -160624, 192832, -12209, -168752, 175082, -98837, -70236, 230082, -180533, -24974, 179635, -203190, 33492, 97086, -134410, 108780, -13925, -85827, 94022, -118044, 52347, 105581, -192984, 120831, 70970, -230507, 144534, 50111, -174773, 173264, -22522, -152042, 150374, -49532, -51103, 116439, -88705, 19317, 67164, -116015, 59037, 25484, -62613, 80300, -58108, -25201, 66747, -76006, 60702, 34527, -116493, 113596, -1512, -143006, 150136, -4803, -118835, 142647, -34634, -106974, 127552, -20905, -61141, 93482, -31266, -30560, 33917, -27798, 15336, 8919, -8685, 16245, -39054, 10609, 26436, -57987, 47532, 16837, -77110, 63036]
199F3036p6075o7347J77455j00448q4263J69992j04691n3747J60176r7126l6750
210d9788J05335p3549j6615N9404l4068J5048r12j1107J5852m4499M7445N443
222A7989n7135P6195l4397n7326J03786n6448l9788J17304q7782k6944J04934
233F0388q4490j7336J00777n8443m2783P5766k9003m0079N4332P130n0086K0258
245c569L5975n4121l216O1374l0743l6128O3926l1022m9013Q0772k2338n2919
257d1022P1477r318o7550O0578Q442n9784N7250P139o8482M7888K5087p4239M6062
270C528K9709o4512L5189J5048m2932J9082K9170k7012j6876K9041J102l6771
282b6234L1705J4710n6087N4567N632p7847O7710K2895q1608N4499K5505q8175
$$ y = [63036, -13039, -80386, 97069, -3379, -87642, 82350, -22341, -76088, 84088, -13038, -49788, 55547, -18002, -34617, 24787, -9281, 5767, 4855, -6252, 9600, -34899, 12546, 17989, -39146, 37049, 2652, -54674, 49112, -7336, -47124, 70180, -17602, -44546, 60388, -24102, -41438, 59339, 896, -41887, 33879, 4876, -35203, 19129, 26259, -23827, -3569, 32406, -21715, -24931, 36443, 5700, -30428, 33498, 2476, -46537, 34235, 11897, -41022, 30455, 21137, -46413, 14165, 22607, -37177, 20073, 27212, -41270, 6618, 31705, -42534, 3528, 33237, -31275, 3914, 18962, -23970, -4888, 24282, -2730, -19606, 9435, 10537, -26234, 5471, 20181, -35906, 18661, 24293, -53554, 14156, 37051, -44557, 9942, 35447, -52728]
294e2728O3738K7969r1350N5772M3025q0577K3321M1774n3950J6871L2472l2538
306f201j8528M2943P683o5383M0963M1318p6955K9482N0032r1942M1556O5751
318F0719j07481L5231O4496q6655K7141M7022p4922L7989L4027p0309K9927K0197
330A7382k4824J0150m437N747m045n366K4756l9492P197O3987q4977J1524P5311
343E2913r3697L4255N8700j06906N1057O2957j10066M3791M5635p2350M0409R683
355A6381m3817L1074R423j5460o911m170L6748l0748j8136N9046n6058R620O4533
368E1525r4051K0704Q5141r8097J4656P1114q9296L1703N0185p9066K2875M6369
380C3762m2595qJ5847n706M277j3193J6608j0221j5386M7774l6012k9386P1020
$$ y = [-52728, 11010, 38979, -52371, 3401, 46426, -34151, -10830, 30944, -23006, -6135, 26337, -6201, -24729, 18214, 25897, -39486, 1477, 42795, -34160, -4678, 45354, -46588, -5032, 60719, -46762, -11531, 52965, -33690, -6549, 40473, -34449, 3540, 37567, -32742, -2815, 17382, -7442, 2708, -1729, 4018, -27, -5393, 19363, -20129, -12932, 51055, -33922, -22398, 52913, -40784, -6529, 52171, -54735, -3678, 59279, -50787, -6996, 38639, -33711, 6698, 16381, -27436, 3638, 13061, -2399, -9310, -13480, 23268, -7480, -25616, 33430, -22628, -13008, 51525, -42526, -21822, 63319, -34778, -20122, 50992, -38304, -6601, 43584, -35482, -12607, 33762, -8833, -8841, 7006, 1300, 5577, -7616, 8992, -1229, -16615, 31159, -4853, -34239, 36781]
393C6781l3327l3772O5406m9514l141O4545p3394R206N8508o4914K0149L4613
405C1146o6635M2479K6270o1977K7297J5010j7562M820q811J7632q152j7403M4310
418B8424m1901j9661Q7438p0076k6872R3646o5817j4276P3031o8702O069N9773
430D1076o1030J0680K2480k6424K5967j4553j6214K7215j0709L134J090k3028
442b0316L8392j3957k8127M7513l4690j0464O1060n4111j7044P2741n2126j4829
454b5958N9014m6375m10L9346l5912m21K4104j5790L571o31k083J2373j7855O039
468i88O235r448J2920j3130q678L1890k1423j3144M4407m4910k444O5201o5601
481a9113j3711Q0083n7414j8556O7931n5323o718N3784l0357j5856J4707J2184
$$ y = [36781, 3454, -30318, 35088, -14426, -17567, 46978, -26416, -17210, 41298, -23616, -3467, 31146, -35489, 6990, 33260, -28717, -1420, 13590, -3972, 848, -7963, 9669, 1517, -15886, 28424, -13477, -33138, 54300, -15776, -42648, 50998, -14819, -29095, 43936, -24766, -18697, 41076, -19954, -9274, 13206, -13218, 12749, -1804, -18018, 9197, -1512, 1622, 2712, -20316, 18076, 4119, -24008, 23505, -11185, -21649, 39411, -14700, -31744, 40997, -11129, -25958, 33056, -13319, -13729, 25617, -10295, -10716, 13388, -2402, 1169, 538, -1545, 10828, -7027, -988, 5247, -4201, 8719, -4411, -13089, 18801, -2622, -15766, 28641, -16269, -18713, 46488, -19113, -32824, 47259, -10155, -28711, 39220, -16103, -22821, 30963, 606, -15250, -543, 11641]
493A1641j2595j8485L4360q655l4722N1333j8957l7716N6913k3829j8018M0056
505B1326l4777J101L6310m4018J1843L7060n1148J2593L5301m0423Q90L5089k5637
518d490j0564K8597j0354j8313J4675K0282k7082n908L2772k7045j0542M1224
530B3252k4414k0900M2929k1410j6095L2829j9216n430K5792j8019j2484K5998
542A2832j5608o771K7340j6962j4653K2120j734j6674J2390P492j1684r402K3149
555A1835n806l3862M6540M97n0161M3216L363m7542M2936P434l8813K4931J857
568F425j4505M672O570J721r022P475j246j2050J2817m18j1650K1843j2331j7004
582a6703K8008j2427j3806L2014j1446l0926L8691j598m1527L9252J0064m3990
$$ y = [11641, -954, -19439, 14921, 6266, -28456, 22877, 3920, -33796, 23117, -712, -18730, 21326, -13451, -12350, 23960, -20058, -8215, 28845, -22303, -9710, 25591, -14832, -13942, 21147, -4490, -15054, 13543, 3189, -15124, -449, 19833, -7249, -13157, 19615, -7430, -17972, 23252, -1162, -22062, 20867, -543, -16638, 16191, -3025, -8455, 17337, -682, -13166, 12832, -2776, -9547, 17793, 831, -13822, 8298, 6564, -10110, 2280, 9772, -1912, -11314, 11835, 6029, -27833, 18707, 19204, -30957, 12259, 15622, -31920, 11016, 18450, -20363, 4568, 6425, -8080, -3408, 3162, 4883, -4139, 3336, 2090, -9960, 2857, 2439, -9211, 12632, 301, -16703, 11305, -1122, -14928, 17086, 5640, -25286, 13405, 11807, -29720, 9532, 19596, -24394]
594b4394K7878J8673n0198K1941L6764m1723j831L2569k7146q661L7246k1453
606c35j4520L1324j1810k1806K1866N722k3042K0884Q053l6196J8380K3297m0587
619a8770J9165K9194n2030J9220K5619m4329K1226K3528l6525J0428J7441k2946
631h779L501J2205j341r352M767L900j8774J4717J3988k5337R550J4189k9099
644a5865J5430J4043l0435K0833J4567l5717R444K3047k9526J2125K2584l4803
656a4273N626K2662k2898r15K1821j0238r046P719M083j3035L681K4386k7457
669g884l150L1561l3195k605M0010l1563m805L4991l6255n18L4285k6704j330
682g162K2743k1466k075J3884j1464P947J776j540j170j1618J7289m657j1778
$$ y = [-24394, 3484, 22157, -28041, -6100, 30664, -11059, -12890, 19679, -7467, -16128, 21118, -335, -14855, 16469, 4659, -17147, 4719, 10441, -12601, 8283, 16336, -19860, -1480, 21817, -18770, 395, 29589, -22441, -3221, 22398, -21931, -705, 22823, -13702, -3274, 14167, -8779, -5278, 6927, 5586, -3766, 1001, 4901, -13873, 844, 14832, -10505, -955, 13234, -15865, -435, 13608, -16827, 4006, 18573, -17144, -7700, 15347, -14179, -2054, 20530, -14273, -8647, 14015, -8883, -9798, 12023, 1785, -7261, 458, 4541, -8494, -4813, 19573, -7884, -11034, 20527, -12668, -15273, 24737, -6826, -11631, 23360, -12895, -13413, 20872, -5832, -7162, 15581, -5885, -7960, 5924, -5540, 2407, 4183, 2643, 1473, -10145, 7144, 2487, -9291]
695i291K6268j8411j2460L3600l2317J851L9511m1991P705K6311m0311J5601K5010
708B1076l5166J3162J7434k8870P324J1406p297n2M493O39j2235L17K0219j5332
722b882r088L3639k7664j2472L8436k8583m863L8945l4028o698L3266l1524N888
735g628K3954k4212O431Q373j5775N459P021k661J747p634Q162m070j1390K5149
749A2926j2460j1294K9389k3692j4260L9524k3699q253L5835l4485p99K9177k9124
762a1215N905K3591k4989M254J0387j7994R874N730j123m517l883J2861j3999
775e118m250K7701k1191j0523L6570l4061r226M7103l2462j0621M0185k9615j3234
788a8742L6434k0323q893K5085j2907j0552J0300L104p754L367R208j0514p284
$$ y = [-9291, 16977, -1434, -13894, 19706, -12611, -10760, 28751, -13240, -5535, 20776, -19535, -3934, 21076, -14090, -928, 16506, -12364, -5040, 6366, -931, -983, 3510, 4149, -8086, -7769, 12450, -2882, -11970, 21669, -5995, -18467, 19969, -8614, -13477, 25468, -8560, -15258, 18008, -13516, -7628, 16326, -7886, -1455, 6918, -8857, -3398, 3623, 962, 2709, -4925, 3237, -833, -12223, 12926, 466, -10828, 18561, -5131, -19391, 20133, -3566, -11819, 24016, -10469, -11268, 17909, -11215, -5310, 18281, -6708, -2454, 7933, -10061, -187, 5543, 4420, -97, -3980, 8881, -5118, -9368, 18333, -2858, -13381, 23189, -10872, -20098, 27005, -5457, -16078, 24107, -5508, -18742, 17692, -2631, -11524, 13561, 654, -9898, 402, 3506, -4248, -881, 8327, -2187, -9471]
801i471J7034r033j1239K8185j5031j5136K7344j6579j1823L3557j8819j4874
813a5885L3964k4133j0905L2342j7070q798K3696j3695j2453J8423k264q282N824
826G64P639j3779l140K0467j5765n754K8173j8657j7931L4198j5823j9511L8907
839A9788j5119k4346L4158r322k5909L3584l273k3549K2103j289j9160J2648J0879
852A1193j5430O8J4581j2588q366K0597p221j5224K4881r388j8791K4330l505
865E137j8414K2568k54k6538K2991L152k5047K2080M708k5886J9291L430k1855
878a4637J9024J891j2536P514J382o134k078R790p82j1884J2131K592k1615K0251
892D909N760k7877K4800M454l1826K4896Q388l4050K6887R190l3284K0649O489
$$ y = [-9471, 7563, -1470, -12709, 15476, 445, -14691, 12653, -3926, -15749, 17808, -1011, -15885, 18079, -6054, -16959, 15383, -1687, -10485, 13211, -484, -12937, 5486, 3222, -5060, 764, 8403, -5376, -8516, 11951, -3814, -9568, 18605, -52, -17983, 16215, 392, -19119, 19788, 4669, -19677, 14481, 5159, -20750, 12834, 9561, -13988, 8115, 6826, -12334, 314, 11193, -4237, -4169, 10412, -2176, -10542, 10055, 2834, -12390, 12491, 3103, -15688, 8642, 5137, -13277, 9291, 9037, -17501, 5490, 8642, -16405, 5675, 10383, -15503, 3788, 7218, -14637, 4387, 6278, -6258, 1256, 2638, -3496, -5574, 4216, 3434, -8450, 3681, 6273, -15342, 4909, 10669, -17208, 7592, 12046, -19780, 5116, 13504, -20546, 6341, 15531, -17753, 2896, 9385]
905I385j9125J0764N700p809l339N107P655j6519M981J9673k7838Q527J9074l0957
919a4721J3093J8747k8968J0244J4793k5582J3621R229k0347J2633M979j7270
931i549J0695M963j4491J0040K033o340Q25J816M089j0935O824J1299k2487O487
945d731K0226k9410J0589K1008l5125J5140J9670l3072J2613J7944k8887J4090
957E5J1910k6073J4307O987j3649P125R52l416R8%P966j2407j04K2079k8408O770
973e808K6733l7945J3026K6185l9331J3918K1449l4785J8098J1183k4430J3622
985A915J921p717P944m456j440M874n287N374m937k371J2309j2601M332Q200j9694
1000a1634J3671J1839k8919J6178J4022l2751K0496J1614l0822J7228J3246k5168
$$ y = [9385, -9740, 1024, 6724, -1085, -4424, 683, 8338, -8181, -3200, 16473, -11365, -2838, 16236, -14721, -1628, 17119, -11849, -1605, 13188, -12394, 1227, 10456, -9891, 2742, 7721, -9549, 1146, 6109, -8382, 1658, 3691, -2649, -1824, -8, 4081, -6854, -30, 11269, -11218, -4731, 15495, -13915, -3326, 17682, -17443, -2303, 17367, -15705, -3092, 14852, -14035, 55, 11965, -14108, 199, 7186, -6463, 662, 1614, -1802, -1704, -1704, 6262, -6145, -6249, 15830, -12578, -5808, 20925, -17020, -3994, 22191, -17140, -3222, 18227, -16558, 1540, 12723, -11707, 1915, 3836, -3881, 4063, -393, -1833, 3041, -2246, 3128, -1809, -4180, 8129, -4472, -140, 8060, -11634, 2037, 13876, -15043, 1135, 15157, -17594, 2902, 14516, -16306, 922, 14168, -11000]
1012a1000R083J1893j6912M870P324m863n528M845O398j1777L277J2160j7341
1025g571Q83K0507k2789J944K1438k5553P592J8278k7687Q318J9492k5159R161
1038a146J1231k1014J1104O740j1873K369M259O33l204k573R070r000j800J8749
1052A3545k1648J257K2241k4879N969J8021k6243J0172J6211k7006J2407J0902
1064A0949j9905Q748Q494j1900M84R169n785n138R531J143j5114R295J1742k1041
1078i328O640J5598k1319K745K2133k4687j863K7245k2412l537K0551j5880l900
1091h014J8669j1913o363J3708m359o470N339L063q332L744O716j1225J761J1372
1105G696j0695l489J5999j3571l259J8308j5530l303K0182j6107n642K1701j6288
$$ y = [-11000, -1917, 9976, -6936, -2066, 5258, 395, -5133, -288, 6110, -5667, -2390, 9770, -7571, -6688, 13819, -8970, -7026, 14412, -11141, -3549, 14729, -12958, -4640, 14852, -10307, -1146, 10085, -10929, 175, 6915, -4958, -2589, 1670, 2303, -901, -3474, 5596, -3404, -5204, 13545, -8103, -6846, 15395, -9484, -3515, 14506, -11737, -1565, 14646, -12360, 47, 10949, -8956, -208, 8286, -3614, -3130, 6039, 254, -4884, 4647, 5790, -9324, -29, 11713, -9328, -2688, 12910, -8409, -5664, 16469, -8218, -10081, 17164, -5248, -8785, 11766, -4114, -8014, 10655, -1258, -7621, 6087, 1728, -4742, 597, 3660, -4672, -928, 5788, -5437, -3676, 7696, -2999, -6488, 9511, -4060, -7319, 10989, -4541, -7844, 12338, -3769, -9411, 12290, -3998]
1118c998k994J7231j3601k594J2715o068p538R243K702r385K407R844j2928K49
1132d715J7056j7731k201K0064j5275o752K1072j2237q807K1031j0907j1281J8483
1145G800l724j3214J4668j010j2652J1109J548q910M658N584q078r50P963n161
1159c69m658J0347k443j1114J4185l450j2354J6233k468j2825J3622j503j3242
1172a0039J5273k775r999J2248k886p896Q217j012n123O116r63l239p87M348K40
1187A723p738J1329k792j2219J5446j964j6391K0710k124j9445K1009m194j5421
1200a2071J7956J015j5452J0450L636j2021O292M677n119j791O044j935p558P728
1214A851L586j0091N845N654j5691J0413N939j6563J3725K015j5780J3275l44
$$ y = [-3998, -6992, 10239, -3362, -5956, 6759, 691, -6847, 2396, 5098, -4287, -1880, 7964, -4964, -4715, 12341, -5390, -7591, 12473, -2802, -9554, 11518, -719, -9526, 11505, 598, -10683, 7800, 4076, -9138, 5530, 4520, -8132, 2977, 4525, -4385, 273, 5857, -2221, -3171, 4792, -369, -5027, 5320, 2877, -8237, 5948, 2498, -9856, 6377, 3909, -8916, 4706, 3203, -10039, 5234, 2459, -7540, 4708, 1822, -6074, 2143, 1131, -3992, 2124, 1161, -2078, -2865, 1483, 1723, -6015, 5314, 2522, -9697, 5749, 3785, -12606, 8104, 5980, -13465, 7544, 3350, -12071, 5885, 6900, -8552, 1898, 5534, -6487, -195, 4482, -637, -2428, 3616, 1681, -5877, 1851, 5437, -4654, 1191, 6845, -8846, 1567, 7506, -9057, 4668, 6683, -9097, 4178, 3834]
1227C834j3512J7017l724j1526J3715n782n748R423j818m676M585n55l158q93
1241b818M561K012r621Q484J165j3296J2506L078j6924J6106J790k1195J9133
1254D981l18j5689J7721k436j3661J2443p12q268Q547j053k040r45J67L066o131
1269d328N787M235j1800N940O738j5328R205P584j6657J2383K508j6854J2821
1282B234M164j3258J1703j151j1219J1488k748m797O248m06k288l46n58K086k145
1297i93K502L810j1627O824N267j4210J0989O027j7655J1596N246k0767J5901
1310B910O686j8985J1213M476j4203P008O278q432K817L865k460p224N116P580
1324F645j2676N752R181j7399M339J4390j8480M990J5854k0088L986J0980j4977
$$ y = [3834, -9678, 7339, 3615, -7911, 5804, 22, -5726, 3697, 1879, -2797, 1788, 1233, -1925, -2818, 1743, 3755, -5866, 2618, 3783, -9513, 2993, 6071, -10853, 5253, 7043, -14152, 4981, 4663, -11026, 6695, 4259, -9402, 3041, 2329, -5939, 2608, 1555, -485, -1430, -1263, 1803, -4328, 1459, 5694, -6106, -166, 6572, -8756, 449, 8033, -8624, 3759, 6267, -10587, 2234, 6398, -6860, 4843, 3692, -7527, 3961, 1213, -3584, 2664, 2258, -30, -376, -934, 1152, -993, 1509, 5319, -6308, 516, 5783, -8427, 2562, 8589, -9066, 2530, 7776, -12991, 2910, 9596, -9389, 1824, 6300, -7903, -895, 5383, -3049, -232, 3633, 1173, -6051, -935, 6645, -6031, -279, 8902, -8497, -4158, 10232, -8248, -3258, 12596, -7492, -3506, 7474, -7503]
1337g503O215R520j3150M185N493j0233N022L653l125n77K085q59o312O002O170
1352F586j1705M413J0135j8378N995J3552j8868O875J4802k1344J487J8217j7645
1365e878K365J5371j6330k51J1842r570k738J1555m498n078M244J590p900M746
1379e30J0567j6175K934J4017j9394K427K0092k0984J068K0982k3293l20K0773
1392A2164j5895k221J6429j2230n083J0808m295k289M224K228o472j271Q559p152
1406b496j582J1062r505k354J2139j4302L194J4460j6221L471J0182j5932M222
1419c662J3836j5351J054J3173j1735l249J0230k874o153Q357J188j0489K310
1432c365J0269r092k238J4005j1983m578J4938r133m919J4770q356o737J2756
$$ y = [-7503, -1288, 8232, -4918, -733, 4760, -5473, -451, 3202, 77, -500, 1585, 726, -5586, 416, 6586, -5119, -706, 9429, -8949, -2954, 10598, -8270, -1395, 13407, -7937, -6450, 11767, -5878, -3513, 11858, -4472, -4723, 7119, -2451, -5189, 6366, 1868, -3210, 1034, 2624, -5276, -530, 10037, -6138, -3204, 10813, -8581, -6154, 13938, -7046, -5978, 15004, -8289, -8609, 12164, -3731, -5952, 10477, -1753, -6836, 3972, -323, -2612, 1612, 3840, -2632, -3903, 4656, -2496, -4078, 6984, -2521, -4875, 7264, -7038, -3844, 10616, -5605, -2134, 8048, -7884, -3662, 10174, -5177, -4123, 9050, -2685, -5934, 4296, 1422, -4731, 3626, 4814, -5675, -3365, 6904, -2188, -4426, 9579, -2404, -6982, 7956, -1177, -6096, 8674, 318, -6419, 6337]
1445F337q043l448J1699n331m876Q020n129m083P910p33l175r3M004m281l875
1460e097J0858n266o607J3869p839r707J6899p124o823J5273r726m919J0870n767
1474a106k942R090n585k784O310m763j701M847R86m701K269L400p748J471J0617
1489G660j0311l085J5367j4126l308J8333j2259n594J5809q051q683J3242l340
1502A654p715J0097J79j0454N973M447q228N677K149o379K158K672l737m42O478
1517D529m612k705P035n055m857J2483n770o802J3533r008n840J3619n272p154
1531e876J1564m458p959J1039l062o440P566P40p195L365K769m430J055N967n205
1546e60n645J1926n544q199J5750p148r252J6431o544j1568J6795l433j0522J1216
$$ y = [6337, -1706, -5154, 6545, 1214, -3662, 4358, -771, -4854, 3056, 2323, -852, -945, 3059, -1222, -5097, 5761, 495, -6112, 7757, -82, -9789, 7110, -14, -6837, 8436, -1290, -6209, 4661, -1106, -4048, 5042, -543, -3327, 2983, -1780, -3481, 1366, 2352, -2349, -80, 3320, -4428, -2957, 7660, -2651, -5736, 9631, -4495, -7803, 10530, -1729, -7323, 8486, 435, -8248, 4994, 1654, -6061, 4036, 4215, -6239, -266, 4181, -4047, 1630, 3779, -2600, -442, 2230, -1507, -1949, 4529, -83, -2788, 4247, -808, -5665, 6818, 1048, -5754, 7779, -1229, -7069, 6550, 1278, -5876, 5688, 1230, -6729, 4310, 1248, -5192, 2374, 3114, -4081, -716, 2053, -2377, -1322, 4645, -560, -6205, 5721, 177, -8022, 7728, 580, -8672, 7759, 1215, -10353, 6442, 3009, -7513, 3703]
1560C703m27j0331P071N389j0376M012O255r189K75Q360m782m104P730k061o912
1575e387Q299o8r904J1683J108j5061J3549k14j3009J5042j379j4204J4777O6
1589E298j3911J1830J374r261O272L120q691J552P289m714m700Q114R7j1424J1362
1604C607J894j5877J5536K521k0072J6292M429k1108J7439K478j8103J4815J766
1617E617j3913Q866M991r223J020N658k793m916P098J334j2011J0501M733j7008
1631a0046R550R269j7981R409Q182j9181J2486O493j7806J1182M587j3558R452
1644B038J676j0420R120P76n935J407L114Q9n392M962K465r817P675O021j8651
1659a0872J1755J0384k2131J1384J0036k1087J1693R166k0828J1044Q211j5266
$$ y = [3703, 3276, -7055, 16, 5405, -4971, -959, 5296, -3893, -3618, 4742, -40, -4144, 3586, 1525, -5387, 2912, 2844, -7060, 4623, 5731, -9330, 4219, 4005, -9004, 6038, 4659, -9545, 5232, 5298, -8613, 3217, 4591, -4670, 1602, 4722, -3969, -2417, 4872, 158, -4542, 3572, 3669, -7755, 3607, 5501, -10376, 5160, 7681, -12391, 3901, 8330, -12778, 4661, 7139, -10964, 3851, 5617, -8296, 570, 5561, -3662, -2642, 3016, 223, -4693, 2405, 3739, -8272, 2229, 6962, -10046, -496, 8773, -9208, 201, 8383, -10798, 1688, 8181, -9625, 1557, 6144, -7414, 2038, 3714, -6706, 2414, 3190, -2745, -1338, 1776, 1865, -3527, 1435, 3900, -5917, 1758, 7779, -10872, 883, 11267, -10864, 520, 10556, -10531, 1162, 10328, -10500, 544, 8755, -6511]
1671f511O107M457n762J370K602j793l512M114L647j0063L559J0153j5320N564
1685a388J0084j7120Q096J0516j9618P014J2394j7973O706P984j3442O462N556
1698E271r854K791N271m254k75oK289k399O2M729p921L217P166j0916K303R185
1714F659j2193M764Q226j6054Q577R027j6670O297R116j3909N596O832j2045M317
1728a460O347n391l024N065J948o658K383O135r078J576J0408j3545J885J2521
1742I112j2811O31J0342j0684R31R313j0821K485O806q193J746M116m968J407
1756e88L535l953k1K509r8l679J667M712p371K634N240r611L819P849j1458K231
1772b583R605j1649J651Q887r527O59R237q906j486R219o566j565O343l963k564
$$ y = [-6511, -404, 4053, -1709, -339, 2263, 470, -3042, 1072, 4719, -5344, -1785, 8368, -6952, -1388, 8696, -8424, -328, 10188, -9430, -2416, 9978, -7995, -1289, 6695, -6747, -285, 5271, -4583, -1792, 3479, -775, -1050, -1056, 1233, -1166, -1104, 3625, -4296, -1079, 6087, -4829, -2526, 6659, -5534, -770, 7456, -8598, -21, 9006, -7664, -1367, 7749, -6160, -564, 6268, -5777, -1460, 4887, -504, -3528, 1537, 3485, -3173, -790, 5345, -3733, -2157, 8251, -5294, -3409, 9112, -3699, -3068, 7274, -3410, -2479, 6834, -3987, -1502, 5304, -2889, -1143, 2973, -1995, -588, 2947, -1006, -1027, 1482, 1384, -2295, -628, 4084, -3287, -653, 4587, -5024, -1205, 6644, -4814, -2583, 7022, -4627, -2976, 5911, -3616, -2957, 6280, -2626, -4112, 5107, -1459, -3024, 3319, -644, -3208]
1787c208N394r44n197M517K887o817J691O855q953J351R312j0544m43J0975r418
1802b542k571J2489q675l518J1219o902m167Q964l196m606O697k321l123L664
1816A412J03k104K61L226m268K42M355n273M16P174p847q90R623r839L1J1152
1832G774j0272k329J2129q764m664J2314n906n285Q495j737o667N613L056p374
1846c617J970N868n966l197R448m877m926J0687n446o180J0936l808p211J1004
1860D685l956n986R342m270m884Q887j835o174N286O9l479K049K339k079l298
1875c304P039k830p068J0223j109q859R883j708r896J2870l280q000J0847k950
1889A858o411P747k387m340P275k658l319K335K089k719k385O733k755n228Q534
$$ y = [-3208, 2186, 1242, -3955, 562, 3449, -3368, -1677, 5178, -3775, -2424, 6888, -3656, -4099, 6876, -2542, -5113, 7376, -1299, -4817, 6402, -500, -4667, 4297, 1101, -3505, 3192, 871, -2252, 1412, 1515, -589, -328, 2898, -1370, -1128, 3227, -2046, -1630, 5544, -2303, -3193, 6430, -3409, -3378, 7774, -2498, -4827, 7302, -1462, -6126, 6188, 282, -5003, 3492, 1755, -4912, 701, 3757, -3617, -1647, 4221, -1745, -4942, 4506, -371, -5297, 5390, -56, -6236, 4700, 892, -6319, 4685, 729, -5257, 4085, -185, -5069, 3818, 1983, -4191, 1095, 1164, -2315, -266, 2073, -6, -3304, 3735, 905, -6163, 4060, 2951, -5908, 3975, 2267, -7629, 5241, 1961, -6039, 4808, 1858, -4553, 3194, 807, -3533, 3742, 1084, -2235, 100, 2189, -530, -2915, 3818, 1063, -4165, 4369]
1904D369l630q602J4551l339j2983J5441k307j1726J2227k61j1052J0448J474
1917D610j0678N344L890m542l37M003l090k505N199q47n253N926J450r041P147
1932A276J287q229Q908j52j0053J0144L71j0845J0532K4q234P661j487n653N596
1947A146J923m972J224K124l54l349K735J733n684O624l3r586Q233L090j0434
1962e580Q707P64j0932J0854p96r238R051Q94p457N086J85l857K420J756o37m078
1978b858M288J382p697O225L204q456M335L489q887O039L582q788M712K897o316
1993b849K061K546m357M023P89o017L243J795k110M57J611j975P8J611j005k715
2009b814L866K774p690M055K068o662N576K968q715N250M134j0068N255L922p413
$$ y = [4369, 739, -7863, 6688, 3349, -9634, 5807, 3500, -8226, 4001, 3740, -7312, 3136, 4610, -6068, -724, 3166, -1376, -1713, 2290, -800, -3305, 1894, 1047, -4206, 1720, 3170, -5871, 1276, 2563, -5666, 3242, 3090, -6963, 3181, 3552, -7293, 3239, 3263, -4971, 2690, 1203, -4450, 1146, 3069, -1903, -679, 1445, 1091, -2258, 477, 2210, -3474, 3150, 3117, -6469, 1764, 4854, -5580, 3127, 3891, -7041, 3813, 3017, -6221, 2830, 3724, -3733, 1353, 1538, -2319, 101, 1857, 1220, -2858, 1430, 2812, -4885, 1340, 4544, -3912, 423, 3912, -4975, 1064, 4646, -4142, 570, 3467, -2849, -788, 1758, -2599, 1424, 2213, -3804, -561, 1234, -876, -419, 1192, -783, -705, 906, -99, -2814, 1052, 3826, -3864, 191, 2259, -4403, 1173, 4141, -4574, 676, 4810, -5258, -3, 3919, -3494]
2024c494M311K264o815L305L660n350J739K928k125k383K923O49l974M108K100
2039C846p815L711N166r039M153N119q648L832L182p186L177M267n252J189J876
2054A578l385J949J502k490M58K518l177m43K467j155k83J884n51l916M059J387
2070B402o087L868M452q563K523O212r635L932O769r456J169O521o657j31N923
2085C242m427l18L163j583k490K617K256l880N04L622m559n54O806o718j98Q791
2101F274r205k12Q729p956q4Q090q037k66O998n791l62M457k041k154K310L71
2117A121k618J143L432m015j091N973n971k98P241o540n27P076p279q37R279q772
2133b683j39Q670q115j067P870n505k392P333l539l660L862J573m946R99O429
$$ y = [-3494, 817, 3081, -3734, -429, 3231, -2119, -380, 2548, 423, -1960, 963, 1612, -2362, 1746, 3846, -3969, -258, 4908, -4131, 22, 5141, -3507, 325, 3507, -3679, -502, 3765, -1487, -298, 1578, -1807, 142, 1644, -846, -388, 2130, -1047, -1490, 977, -178, -461, 1423, 872, -3044, 1015, 2402, -3685, 183, 4635, -3928, -1405, 4807, -4828, -896, 5873, -3583, -2414, 4107, -2550, -2681, 3242, -1185, -1503, 1660, 77, -2413, 204, 2460, -1420, -916, 2706, -1853, -2407, 4399, -2319, -2517, 6274, -2931, -3143, 5586, -2370, -2454, 5636, -2401, -2667, 4331, -1460, -1822, 2635, 594, -1560, 750, 1121, -1497, -354, 3078, -937, -2028, 3945, -2026, -2324, 4917, -1623, -2150, 4926, -2353, -3190, 6089, -2683, -2822, 5848, -2267, -3334, 4536, -969, -3361, 3972, 433, -3227, 635, 2208, -2738, -1739, 4690]
2148D690o801j765Q725o442l594J0997o510m964J1189o597l991R291l751m398
2162c921P164l249l474N805j859k050K225O24k659O83K746k871p41M671l382l458
2178c746P663l992l905Q629m519m250Q661l976n264R534l960m252O505k471l170
2193b513M371J70l850K502J365k961p53M201k437k709O036l445l967P825k388
2208A447o505Q616j798p451R038j916o072P085q6o163M368J810m709J925K113
2223A702k270j440L846j768l376N176j17m785M051P46n567N521K12n824N366K49
2239A722n355M892M40m839N062o74m586M558Mk918J581K043k885M04K431k134
2255b54j663M848j685n007O292q50n245N697N81o967N843J955q129N832K102o283
$$ y = [4690, -2111, -3876, 4849, -1593, -5187, 5810, -700, -5664, 5525, -1072, -5063, 4228, 477, -3921, 3243, -6, -3480, 2325, 466, -1584, 641, 1265, -1394, -711, 2035, -836, -1577, 3094, -288, -3746, 3917, -75, -3980, 4649, 130, -4120, 4541, 565, -4699, 4835, 875, -3377, 3128, 657, -2513, 1858, 2028, -1822, 680, 2045, -916, -1669, 2532, 95, -2614, 3422, -23, -3990, 3835, 1447, -5058, 3558, 1760, -5691, 3347, 1431, -4641, 2444, 2358, -3805, 563, 2373, -2336, -411, 1702, -568, -2008, 1838, 70, -3306, 1870, 1753, -3032, 1019, 1765, -3802, 1719, 1931, -3893, 1473, 1722, -3633, 1259, 1699, -3140, 1922, 1248, -3338, 1220, 1224, -1694, -113, 1930, -955, -551, 1880, -254, -1917, 2931, 1246, -3761, 2531, 1681, -3564, 2133, 2714, -4253, 1590, 3545, -4584, 1248, 3350, -2933]
2271b933L658J908n060K412K755m613J604K001j824j151K397k71l303L742j11
2286A211m019L275K113n720L638K229o382M687J299o094M446K049o300M563P65
2301A760m823M083M6k864J922J060k535L15K036j203j327K439K98m306M829j31
2317A599n525N631J009o975N361K164q143O621J985p789M591K806o029K542K748
2332B596m283J068K406j193k614L005J223m757L179J661n099K916L304o311K784
2347a15L490o527L630K291n908L532L177o718L229K900o379L643K073m000R66
2362g16K742k624j020K474P0l662K905K759p006L984L774q363M418M622r083M091
2378f35N240r050L949M297p651L186L931n121j78M455k497j747K743M65m152L087
$$ y = [-2933, 725, 2633, -2427, -15, 2740, -1873, -269, 1732, -92, -1243, 1154, 883, -2420, 1322, 1211, -2808, 467, 2580, -3140, 498, 2727, -3655, 1032, 2331, -3763, 683, 2732, -3568, 995, 1760, -3063, 1020, 1066, -1798, 124, 1184, -1351, -1036, 1000, -203, -1530, 909, 1207, -3099, 1730, 1599, -3926, 1705, 2714, -4261, 1100, 3264, -4879, 1742, 3727, -4062, 529, 3335, -2694, -152, 2596, -1687, -619, 1787, 594, -2020, 985, 2208, -2549, 630, 2291, -2808, 108, 3412, -2899, -115, 3375, -3152, 478, 2769, -3139, 393, 3570, -3148, 81, 2981, -3398, 245, 2318, -1682, -716, 2026, -598, -1618, 856, 926, -2736, 169, 2928, -4078, -94, 3680, -4683, -265, 4357, -4726, -635, 4605, -4445, -496, 3801, -3850, -664, 3267, -1854, -2032, 2423, -74, -1821, 922, 1387, -2765, 322]
2394C22L176p614L188N261p783K449N757q382K190O611q413J727N553n754K06
2409a506M587m090p65M683l182r92K632l64k873K703J011m090K751K143m726J226
2425h52N041o917J246O071p302O72O531o480n87P329o472j299O964m628k116N438
2441B639k358l583M933o77l743K538K801m429N0N500n917n58O905n578k142P708
2457D089n275k603P808m993k447O457l116k947M836j208l133L976n99k711J962
2472I6J395k576N36K941l000m27K921j989k049M982k636k994O207l689k801O380
2488C297k991l572O928l256l813O163k096l018L941k37l396K715N41k315M25K791
2504B107j610l021M342j069l713N709j629m755O244j148n852P223j918m347N852
$$ y = [322, 3498, -4116, -928, 4333, -3450, -1001, 4756, -3626, -1436, 5175, -3238, -1511, 4042, -1712, -1506, 3081, -1009, -1774, 2909, -273, -1265, 1367, 1003, -1870, 833, 1844, -2246, 505, 2648, -2078, -852, 4189, -2728, -1482, 4589, -2713, -2041, 4490, -1990, -2577, 4752, -1720, -3019, 3945, -683, -2799, 2639, 281, -3302, 1631, 954, -2789, -251, 2550, -1879, -1829, 3671, -2246, -2804, 4101, -1477, -3619, 4089, -1186, -3789, 4019, -974, -3421, 3036, -80, -3027, 1809, 601, -2532, 1444, 845, -1866, 96, 1491, -1085, -549, 2392, -608, -1035, 1886, -103, -2152, 2830, 194, -2800, 3407, -282, -3083, 3297, 306, -3266, 3662, 406, -3407, 2756, 660, -2358, 1583, 1346, -2050, 665, 1206, -1109, -684, 2107, 497, -2524, 1818, 749, -2964, 2745, 1116, -3639, 2605, 1457, -4395, 2828, 910, -3437, 2415]
2519B415j887l725M471l63k948K910n24j410N24J316o39j579K938j164l073M413
2535A675m56m464N472j316m381O147k370l801O528k069m562N967k065l334N735
2550B706k529k517M043m96l051K032J134j938L94K115j678k613N282j781m603
2565c500O457j165n937O971j119o195Q033j981n494O280j053l924M477j088k236
2580a474K535r28j038O23J273k88k433K629l50k966M067p54m013N635j414n507
2596d403P152k217m034O507k746m219O629j973m049N161j430j839J664M37j685
2611a045K74K697k220k157M144p03m379N628o83n627O706j576n947P283K81o575
2627c899N721L8n198N016J30l840K352K108l035p26K997o97k469K960k2m920N423
$$ y = [2415, 528, -3197, 1274, 911, -2037, 873, 349, -1061, -537, 779, 140, -1439, 1499, 335, -2738, 1675, 1219, -3245, 2227, 911, -3470, 2677, 307, -3494, 3034, 965, -3597, 2370, 305, -3029, 2706, 177, -2340, 1703, 1207, -1844, 188, 1322, -616, -222, 1893, 215, -2398, 2884, 1103, -3500, 2957, 1792, -4145, 2826, 1707, -4488, 3545, 1564, -3930, 2350, 1297, -2627, 1850, 762, -1474, 1061, 133, -905, -282, 991, 703, -1730, 899, 549, -2417, 1650, 896, -3117, 2518, 1104, -4403, 2749, 532, -3502, 3005, 259, -3960, 2669, 696, -3353, 1808, 378, -1461, 203, 640, -1045, -771, 1926, -294, -2451, 1693, 990, -3389, 2239, 1556, -4071, 2635, 1059, -4888, 2395, 2676, -3899, 1822, 1860, -3338, 1678, 1808, -2032, 320, 2428, -607, -1333, 1664, 967, -1502, 1458, 1436, -3484, 1939]
2644A939O0n915N377J584o520M762J074o279O027J81n738M440J113m598K536J731
2660A774l399J781J482k893r15M337j251l917M919r35m468N076N42o996O897J232
2676C266q457O138J737o479M281K757o661K921L778n797P41M314k659k079M126
2691A927j767k806M798n55m534L728J761n800L835K061n440L711K162o473L051
2706c41L821n712K076K810m544J255L184l917K42L896k891j309K571m00k194K591
2722A138L76l529K784J112m144K028L122m741J535L121n651K478L615n537J390
2737i03L931n135O80L693l423l7K724j549k079K726K43k490J306K086k887l58
2753a472M321m565J24M497l810j274M322k921j307M662l718l09L434l000J79K088
$$ y = [1939, 1999, -3916, 1461, 3045, -3475, 1287, 2361, -3918, 2109, 2290, -3448, 992, 2105, -2493, 43, 1774, -1625, 156, 1638, -1255, -2170, 2167, 916, -3001, 1918, 983, -3485, 1591, 2133, -4863, 2034, 3266, -5191, 947, 2684, -3795, 486, 3243, -3418, -497, 3281, -2516, -1775, 2539, -120, -2199, 1927, 160, -2646, 2152, 1597, -2937, 791, 2552, -3248, 587, 2648, -2792, 919, 3081, -3392, -341, 3480, -2232, -156, 2654, -1890, -635, 2549, -1368, -1126, 2770, -121, -1430, 1141, 741, -1453, 1138, 1514, -2015, 769, 1881, -2263, -235, 2887, -1854, -319, 2802, -2849, -371, 3244, -2293, -903, 3028, -2107, -1427, 2266, -1157, -1194, 1530, -19, -2098, 628, 871, -1619, -313, 1773, -1114, -1472, 2849, -1716, -1592, 2905, -905, -2179, 2143, -778, -2085, 2577, -1141, -1450, 1984, -1016, -837, 1251]
2769A251j489r8J483j842K74N68M87m99o56J922k112l57L226k682j137M969l946
2786f38j448N512m838k77N146m427j073N210m295R3L642l237M48J172j196k85
2802d91O27O54o65j113K531j982j445M681l646j373N453m233j578N956m514j280
2818b418N905m900o11M801m333M69K768k172J84R67j629Q95J17J85k03j202K184
2835A007j558r10L074k517l96M212m302r98O060n017n08N367n332r2N425m998
2851a483l61M964l713l91J881r34l16N87R85j441j016L603k115l255O221l037
2867A79k888N931l815k171O558m305k184O030l854j498M430l637J90K623j444
2882A45j262J082Q91j001j078K255q74k287M361k854k038N600k951l071N713k643
$$ y = [1251, -238, -336, 1147, -695, -421, 147, 634, 135, -521, 1401, -711, -1068, 2158, -524, -1661, 3308, -638, -2086, 3426, -1412, -1689, 3457, -970, -2043, 3167, -1128, -1035, 2607, -630, -182, 990, -206, -491, 136, 790, 125, -988, 1543, -439, -1884, 2797, -849, -2222, 3231, -1002, -2580, 3376, -1138, -2418, 3487, -1413, -2024, 2777, -1556, -1087, 1681, -491, -307, 660, -969, -74, 43, 228, 25, -1177, 1007, -551, -1461, 1613, -904, -1300, 2912, -1390, -2388, 3672, -1345, -1853, 3514, -1818, -1910, 3515, -1483, -1844, 3120, -593, -984, 897, -37, -353, 234, 1219, -222, -1238, 2365, 250, -3005, 3216, 179, -2709, 3222, -593, -2764, 3794, -511, -2695, 3335, -519, -2017, 2413, -1224, -1034, 1589, 145, -1117, -35, 856, -145, -1223, 1032, 158, -2129, 2232, -622, -2660, 2940, -11, -3082, 2631, -12]
2898a2k919O126l659k126N424k901k801M650j060l006L685r38k339K095J698l124
2914a207k60L800k368k160M201j705l414O182k115n399P215j012n344N624m71
2929A567n189N723l42m807M477Q3k605J011J078j624K96J505j021j548K909m22
2945A091m217N045m93m486N088r24m444N687o98n254N279J27m601L487N29l348
2961b132K835Q88l600J413K326k156r44K256p65k046L509j249l405M486N01n122
2977c205L995J280n484M443R99n550M072K009n557K531K955m162J311J719k141
2992g85k18K411j144j972K361Q56l071J339K263m099K330K194m982K679K492m798
3008b144K209K250m388K851J026l949K742J068k878J014J243j459K5J004k73j548
$$ y = [-12, -2931, 3195, -464, -2590, 2834, -67, -2868, 1782, 722, -2284, 1401, 463, -1876, 219, 1917, -1207, -1467, 2333, -35, -2195, 2006, 301, -3113, 3069, 954, -4445, 2770, 1758, -3586, 2038, 1567, -3622, 2101, 1759, -3048, 1429, 1512, -1093, -82, 996, -628, -332, 1173, 152, -1396, 1513, 1091, -3126, 1919, 1426, -3060, 2028, 1104, -3340, 2347, 1649, -3605, 1674, 1801, -2800, 687, 1216, -2132, 703, 1591, -2009, -596, 1730, -426, -1370, 886, 121, -1925, 1584, 335, -3070, 1416, 1917, -3205, 790, 2070, -3414, 1029, 2028, -3522, 550, 2559, -2998, -467, 2488, -1674, -363, 1356, -785, -1003, 1408, 264, -1708, 653, 1509, -1562, -223, 2040, -2059, 271, 2465, -2517, 162, 2654, -2144, 65, 2315, -2073, 778, 1804, -2145, 597, 1665, -1213, -199, 1044, -415, -390, 614, 341, -1207]
3024a207K079P49l644K253J840l949J756K526m899K533K320n171K795K129m154
3039b044K052J482l220J729J408k709Q94J164r85o62J201M59j790J203J068k848
3055a598R37K947m572J738K672m227J989J877l741J726K203l788J999J144k663
3070a357J998P5j644J253M75j616R27K84P9r86N77J133k876K299J141m004K747
3087E05J932m950K801K498n718L517J809m981K568J982l505J134K202k605N15
3102b96Q41k90j181J176R00k425J380J276k639R59K311m016J830K324m558K296
3118a12K356m557K266K116m329K264J724l404J506J313j942K62J531j050j252
3133a308J880P0k053J135K176l872J947J970m170J967K818m731J699L259n161
$$ y = [-1207, 872, 1621, -2023, 230, 2070, -1879, -123, 2403, -2496, 37, 2357, -2814, -19, 2110, -2044, 8, 1490, -1730, -1, 1407, -1302, -408, 756, -229, -891, 310, 769, -1021, 182, 1250, -1598, -661, 2286, -2286, -548, 2124, -2103, -114, 1763, -1978, -252, 1951, -1837, 162, 1306, -1357, 641, 716, -928, 325, 800, -816, 111, 395, 474, -512, 65, 1198, -1678, 621, 1762, -2242, 505, 2437, -2513, 288, 2786, -2932, 585, 2394, -2587, -19, 1963, -1542, -408, 1794, -811, -296, 545, 255, -926, 250, 1150, -1275, 105, 1381, -1258, -299, 2012, -2004, -174, 2150, -2408, -112, 2244, -2313, -47, 2069, -2260, 4, 1728, -1676, -170, 1143, -799, -537, 994, -56, -1308, 572, 642, -1411, -276, 1900, -1972, -25, 1945, -2225, -258, 2560, -2171, -472, 2787, -2374]
3148b374K301K661m683J494K939l247J51K569j959q64J849K48k404J572K112m372
3164b007J549L082l956O2M363m451k28M674m552L38L927l390q39L374k715k24
3180i93K840k440J4J411m01j354J191M88j704O43J671k635J84L687m086k11M448
3197B753m013q42M869l728j479N523l869j637M942k679j547L098j084j967K421
3212G61l99j401N95K252k202j070L377k336j382M230k541k530N501k915k936N836
3228B840k699k316M720k536k293M336j362k403K707n17r79M81O15o74l75J528
3244A073j173j302K652n74k686M067j616k523M366k114k215M209j995k478M582
3259B273k555j678L626j813j289K477l34j757Q96L18j55r39J379n0k388L317m52
$$ y = [-2374, -73, 2588, -2095, -601, 2338, -909, -758, 1811, -148, -1012, 837, 1085, -1319, 253, 2365, -2007, -458, 2624, -1332, -1270, 3093, -1358, -1586, 3088, -1464, -1126, 2801, -589, -1428, 1946, -769, -993, 1847, -593, -579, 832, 431, -923, 268, 756, -948, -305, 1366, -1269, -1085, 2602, -1484, -1695, 2753, -1260, -2102, 2767, -961, -2440, 3083, -786, -2423, 2519, -160, -1707, 1391, 307, -1660, 761, 362, -1039, -444, 1808, -394, -1464, 1913, -423, -1805, 2425, -116, -2646, 2855, -60, -2996, 2840, 141, -2175, 2545, 9, -2284, 2052, 690, -1713, 994, 477, -502, -21, 594, -80, -455, 1073, -100, -1402, 1250, 676, -2010, 2057, 441, -2082, 2284, 170, -2045, 2164, 169, -2309, 2273, -282, -1960, 1666, -147, -1436, 1041, 707, -1050, -154, 164, 9, -930, 449, 399, -1989, 1328, 876]
3276H76l271L764p0l839L988q38l264M547j529k554L296q62j601K320r87n42J288
3293G22j056J24J09J42O03j596J155Q17k279J712Q85l317L276l17l369L616m38
3310G89k408K978p04k167L260j827j373K739j564j21P87n69j01N87O7k28r43J175
3328C77K34k184K919o97k816L733r50l026L584k00l430L448m30k439K924n86j435
3345i74J726l65j558J446p07L73j18k84Q01r48P39Q2j625J955M51k486K367l44
3363E31k596L431q66k467L417p84k472K907o55j873K668j006j202J409K47p80
3379i1K3Q66o88q52J583m80j722K650o28k538K897m9k844K940L95l706L260K77
3397A293l363K595Q64k714J463J165k320O62R81n70p11J345p0j826J484O51k120
$$ y = [876, -2395, 1369, 1299, -2540, 1448, 610, -2654, 1893, 364, -2190, 1106, 244, -1357, 963, -24, -566, 722, -334, -210, -101, 41, 644, -952, 203, 1020, -1259, 453, 1338, -1979, 1297, 980, -2389, 1227, 789, -1619, 1359, 655, -1512, 1748, -79, -1452, 1287, -277, -398, 389, -180, -281, 306, 373, 145, -798, 377, 611, -1573, 1346, 649, -2167, 1566, 616, -2410, 1174, 974, -2456, 992, 562, -1877, 1047, 461, -974, 752, 387, -1171, 275, -432, -59, -177, -461, 340, -608, 131, 213, -1412, 543, 994, -1492, 875, 531, -2065, 1366, 500, -1967, 1450, 666, -1806, 1101, 446, -1427, 1241, 235, -967, 442, 689, -91, -68, 798, 110, -742, 841, 361, -1361, 1289, 661, -1877, 1020, 971, -1873, 1067, 1462, -2244, 1016, 1293, -2070, 525, 1389, -1325, 138, 1303, -1017, -355, 626, 56, -655, 690, 620, -1206, 278, 929, -1191]
3414a191J203J392l118J436J893l885K470J009l206K349Q83l251K155J147k829
3429a543J678Q02j558J39J311j022r27J728M7k060J587J417l421J801K024m259
3445b256K173K253l799J093K669l658J168K218l069P93K070k269j59J834j016
3460D5p54J262P8j642J346J196k890J041K616l333K37L033l568L56L562l899N37
3477g77K667k822J39K284k183J6J997j862J26P73k57m86MR71j365K52J485j753
3495g91j56L213l446j86L480l728Q17L046l732J42L565l503J48K605j898K6R58
3512E60l00j002P12J205j817l39K464j640j505L344k077q29L244k523j096L719
3528B120k232j051K875k399J38K043k008m7J642p11n94L01J3J34o28J137r61o32
$$ y = [-1191, 12, 1404, -1714, -278, 1615, -2270, 200, 1209, -1997, 352, 1235, -2016, 139, 1286, -1543, 135, 937, -621, -482, 829, -193, -1120, 608, 655, -1405, 182, 1599, -1822, -21, 2003, -2256, -83, 2170, -1629, -536, 2133, -1525, -357, 1861, -1208, -415, 1655, -614, -773, 1061, 45, -709, 553, 631, -1011, 335, 1531, -1359, -318, 2298, -1035, -798, 2235, -1333, -977, 2585, -1314, -777, 1890, -932, -793, 1491, -692, -676, 1321, -541, -415, 358, 101, -385, -381, 590, -775, -523, 962, -791, -947, 2266, -1180, -1366, 2114, -1614, -797, 2249, -1483, -1341, 2224, -1279, -1131, 1474, -424, -398, 560, 260, -742, -30, 1175, -642, -981, 1483, -157, -1662, 1682, -395, -1224, 2020, -503, -1599, 2120, -112, -1163, 1712, -687, -549, 1494, -514, -561, 1081, 370, -224, 77, 90, 224, -404, 733, -228, -860]
3546h60K265j650j342K790j079j131K625k301o11L076k534n16K631j717o73K293
3562A266j976RJ872j512l07L60P83r94j35J349j053n78K315j640j462L649j990
3579d4j566L160j707j104K655j627j074K792j683n20J503r82J63M37j84n72P32
3596C79l4n15m54J376l76j029J617j472kK208j930j105L110j771j231K832k196
3613e93k20K447j836j102K812j071j627J928o02m83O57L99j649O68J593j584p25
3630i88J941j208q23K388j655j352L399j816j563K891r05k132L119j325j849L061
3646A183n55j934J420M53j670J001P74j166J99J027j012r08K352j131j379K244
3662H98o04j620K383o17k234L495j134k259K970l90k639K988k60k723K576J39
$$ y = [-860, 1405, -245, -1587, 1203, 124, -1007, 1618, -683, -1294, 1782, -752, -1268, 1363, -354, -1027, 1266, -710, -701, 1171, -341, -648, -288, 495, -499, -634, 715, -338, -916, 1399, -241, -1703, 1946, -44, -1610, 1550, -157, -1261, 1394, -233, -1307, 1485, -198, -718, 785, -197, -34, 403, 219, -353, 379, 345, -170, -624, 752, 376, -653, 964, -508, -510, 1698, -232, -1337, 1773, 2, -1229, 1603, -593, -813, 1634, -202, -1304, 1508, 437, -1190, 738, 136, -347, 310, 709, -940, -272, 1321, -263, -988, 953, -255, -1078, 1310, -345, -1697, 1702, -114, -1677, 1214, 309, -1823, 1296, -29, -1878, 1183, 628, -1306, 114, 567, -1103, -102, 672, -494, -295, 732, -280, -1188, 1164, 33, -1346, 898, 294, -1326, 1057, 440, -1794, 1701, 567, -1692, 1278, 888, -1751, 1237, 977, -1746, 830, 969]
3678I69j962J062J062j650R2J395j016q67K123n33k529L194q6l512L470J93l639
3695b234L370N03l792K927P12l385K367O56k462J350R49j433J69J133p69j088
3711a027J626J95k361K021M51k846K464P71l666K832J103l818K923L25l051K522
3727D64N54k540J537Q42k073J009P60r30j63J155k88j621J893K66k487K088J003
3744A469l442K389J718m198K192J960l749J530K158l637J513J700k366N77J092
3759I06r31q65J720m83j125J009P43j859P30K010l267J214J595k805J106K253
3775A951l367R15K369l379J157J722k554J150J224j728K32Q70o06rn5L91q38O9
3793d86J271k024J010J869l007O13K095k797Q43K561l647J314K138l086O13K086
$$ y = [969, -993, 69, 1131, -519, -427, 968, -48, -915, 1208, 675, -1854, 1340, 1254, -2258, 1212, 1405, -2234, 1136, 1639, -2153, 774, 1486, -1899, 468, 1124, -1338, 12, 961, -472, -303, 830, 61, -1027, 599, 794, -1567, 454, 905, -1941, 523, 1294, -2372, 460, 1563, -2255, 668, 993, -2058, 464, 1018, -1522, 15, 857, -1216, -207, 553, -377, -540, 615, 327, -1294, 599, 865, -1622, 466, 1469, -1973, 416, 2134, -2064, 128, 2088, -1661, -131, 2027, -1610, -97, 1603, -763, -186, 906, -25, -890, 830, 347, -778, 231, 974, -885, -155, 1855, -1412, -198, 1397, -1408, -302, 1951, -1416, -501, 1868, -1511, -354, 1368, -1186, -36, 1188, -540, -308, 562, -44, -53, -108, 283, -555, -486, 785, -1239, -229, 1640, -1367, -754, 1341, -1456, -613, 1948, -1699, -385, 1753, -1333, -720, 1366]
3809A366j950J21J418j402k46J081L52j608Q33J056j557J71J062j273K54K215
3825A893k783K88J983k064K57J569j595J61J775k504N47J871j712R4P02p84J23
3842a79P40q14n16J332J19j090o1J522j377J17J215j820J16K531k828K9K685k654
3860i33N60J319j874L22J912j962j67J709j199n1M59j14r24J101N99j863Q92J485
3878A271j803m51K355k235l4K421k504K79K221j978o85K353j575n1J652j916K6
3895f54J868r95j018J179j71n86P37J88j059O56J035j862j53K363j982m59K688
3912A775k343n35L265k814q20L378j878j286K754j698r36K243j160q12J395J74
3928G02j590M97J311j565L85J382j750n56K824j978j556L640j873j272K827j637
$$ y = [1366, -584, -463, 955, -447, -693, 388, 740, -868, -35, 1021, -536, -365, 697, -576, -322, 1893, -890, -602, 1381, -683, -426, 1143, -452, -291, 1484, -1020, -473, 1398, -314, -220, 482, -302, -179, 561, -253, -769, 563, 682, -408, -469, 1053, -324, -207, 1008, -812, -696, 1835, -993, -964, 1721, -933, -373, 946, -928, -606, 1306, -656, -823, 886, -313, -364, 95, -19, -943, 158, 757, -1106, -214, 1271, -532, -983, 1372, -863, -897, 1524, -980, -701, 1520, -458, -1143, 1210, -365, -416, 1236, -680, -654, 1214, 219, -799, 380, 209, -377, 360, 548, -511, 145, 1180, -682, -835, 1528, -454, -913, 1775, -568, -1103, 2162, -652, -1472, 1906, 28, -1258, 1496, -202, -1138, 1105, -55, -867, 528, 702, -888, -391, 920, -645, -260, 1122, -628, -1184, 1640, -338, -1894, 1746, -127, -1399, 1428, -209]
3944b09j709L411j418j995L063q77j329J334qj345J465K77j371L7J454p25j381
3961a326K512j508r44L036j913j543L242j345k406L925j523j759L016r61k271
3976a768K755k89k096J868K21j286M24J097r13j058K523j145j921K794m77k621
3992a892L076n87k524L641q61k774K973r6k584K484o4k070J753J17j485P47Q31
4009F85j103k60J256m86j173J676J86k432K498m92k048K654k57k402K445M65l067
4026a855K474N7k395K006M35j613Q73P06j327P13N08p65o24J321k79j429K122
4043I28k91k112K102M57l001K363R10l283K320O69k611J405J820k594J195P89
4059A066j592N84M90n74o37J042m6p66N05L17q40O57Q69k213J154J111k202J446
$$ y = [-209, -1918, 1493, 75, -1920, 1143, 266, -1063, 271, 263, -1082, 383, 660, -711, -674, 780, 55, -1326, 1186, -322, -1266, 1770, -143, -1686, 1556, 211, -2195, 1730, 207, -1552, 1464, 503, -1768, 987, 698, -1398, 470, 691, -595, -171, 926, 13, -1045, 1478, 333, -1588, 1206, 729, -1892, 1184, 597, -1927, 1714, 853, -1921, 1052, 956, -1628, 856, 792, -1278, 475, 592, -893, -146, 685, -418, -678, 578, 92, -1081, 595, 781, -1651, 847, 355, -1693, 961, 704, -1698, 747, 1212, -1855, 619, 676, -1719, 287, 722, -891, -18, 688, -639, 74, 582, -183, -807, 514, 235, -1194, 928, 637, -1475, 627, 1084, -1917, 446, 1356, -1927, 393, 1062, -1549, -144, 1676, -918, 277, 1066, -526, 58, 548, -26, -663, 379, 333, -433, 72, 389, -451, 206, 1075, -1138, 16, 1127, -1075, 371]
4077C71O71k228J364J003k501J740O14k217J206N45j035N09N42j337M85N61j77
4094A16o32P65L48j498J222L66j571O50J145k224J411J005k514J503P26j990J159
4111a3J138k391J108J209j651O34J59k93Q2K60r9n32M34N07q42k19J487j579N44
4130e7R96j949J165R45j997Q91J424k604J774M17k503J930N03j757P63P59q36
4147a36M7N08k47l17K66N82j563Q66J249k134L57J819k384O62J906k900J247J674
4165A502k780O58J912k082L21J610j905L05J141o74o33P65M63j167L48Q91j517
4182h42N19J769k547N04K309k542K76J888k364L60K215k695O82J947j918J50R93
4199G04q50j69J081o67o87Q28N82j277L22J593k249K75K217k864O88K420l166
$$ y = [371, 1042, -1186, 178, 1181, -1320, 420, 1034, -1183, 23, 568, -467, 42, 584, -753, -268, 293, 116, -516, 249, 597, -901, 321, 687, -884, -234, 911, -1313, 98, 1103, -1411, 92, 818, -1172, -13, 1125, -1266, -158, 1051, -600, 34, 193, -100, -18, 242, 143, -389, 45, 552, -290, -509, 978, -601, -57, 939, -1010, 155, 1100, -897, -6, 1418, -1186, 588, 1005, -1498, 432, 935, -822, -59, 700, -136, -89, 419, 172, -145, 121, 703, -860, 6, 1255, -879, -522, 1297, -1087, -425, 1481, -1419, -172, 1502, -1278, -620, 1292, -790, -469, 1141, -764, -459, 682, 8, -625, 140, 603, -564, -216, 675, -842, -323, 1446, -1101, -597, 1712, -830, -554, 1334, -1030, -670, 1545, -1150, -468, 1479, -439, -289, 704, -146, -315, 766, 99, -588, 240, 822, -455, -133, 1460, -789, -514, 1703, -1161, -473, 1947, -1219]
4216a219K30L000k750L6K162k047j93K009j417p28J375%j217O55Q07j297K06J590
4234A202k073K11J900j706o02K627k127n30K616k013o06K396j706o86J919j022
4250b00p93J696q59n37Q11L35j259N10J083j151l19J592q56r76K100j725m40K554
4268A566j782q93K560j499j107K510j252j028J979q27r46J142O5j186R38O01j255
4285d14n3J627j008j336K427j214j167K187p06j495K382j103j507K476p65j215
4301h84J450l36j066J215J49j280Q58K01l24r9L93o04q8P96l56o79R67l5j525
4320a247K073m44j708J932n05j377J757q8j785J953l50j042J224l60l54N57Qm47
4338b03Q3M77k15m92P27K33j385J448L6j746J658J90j995J791J54j866J831l10
$$ y = [-1219, -989, 2011, -739, -703, 1459, -588, -781, 1228, -189, -917, 458, 458, -759, -104, 703, -594, -388, 1202, -871, -660, 1240, -466, -1068, 1559, -568, -1098, 1518, -495, -1101, 1295, -411, -1097, 822, -200, -993, 703, -156, -693, 118, 453, -806, -296, 787, -364, -683, 909, 53, -923, 1177, -548, -988, 1566, -216, -1109, 1451, -48, -1155, 1355, 103, -925, 1054, 227, -719, 423, 488, -698, 240, 841, -414, -467, 1160, 152, -1184, 1243, 29, -1138, 1049, 343, -1152, 1230, 127, -1380, 1096, 331, -884, 566, 230, -836, 379, 528, -752, 106, 307, -17, -116, 277, -327, -415, 381, 25, -654, 313, 278, -1247, 826, 382, -1326, 606, 101, -1276, 481, 393, -1392, 561, 211, -831, 393, 33, -321, 236, 244, -203, -120, 357, 142, -350, 377, 610, -775, 673, 709, -1037, 621, 811, -1184, 607, 761, -1105, 726, 416]
4356D16j447J609j15j044J012j36p75N29p7K45l69M89N0j059J082j3j123Q30P04
4375H08j569R72L19j747J833m82j150J625L6j858J980n05j257J441j69r18P05
4392F4K5m15J28L10O2n00L55L18j314J175O36k069J319P78k225J789M21k245K200
4411H12j93j825J576R3j350J445n9j303J167l97k3m7K22L17j085Q52N91j220O61
4430B34O19k039J667O70k588J949K00k000J679L57j964J591L90j819J269K71q56
4447c70L00L47l16m31O54Q2j055R99P82k125J221J139k613J517J070k629J252
4464a76J709l070J485J117k331J101R89j679L19J265q66k00K71M47o99J01R26
4481G09j556J250N86j909Q31J555k631J151J577k941J355J534k542P93J552j982
$$ y = [416, -1031, 578, 463, -581, 431, 295, -480, 49, -28, 217, -152, 337, 387, -672, 410, 397, -726, 104, 808, -761, 211, 530, -1217, 616, 134, -1016, 609, 645, -1213, 767, 262, -995, 446, 277, -641, 64, 89, -326, -198, 112, 174, -326, 29, 347, -967, 208, 844, -1225, 94, 872, -1353, 436, 857, -1388, 812, 619, -1206, 370, 463, -887, 558, 499, -804, 363, -34, -57, -104, 118, 435, -650, 202, 793, -427, 234, 853, -1186, 481, 1151, -1437, 512, 712, -1288, 391, 748, -1216, 375, 765, -1054, 215, 486, -370, -70, 277, -39, -470, 184, 266, -789, 210, 992, -1133, 88, 1227, -1386, 131, 1201, -1428, -176, 1533, -1537, -52, 1065, -1266, -165, 824, -855, -536, 729, -137, -337, -66, 381, -318, -217, 709, -847, 403, 989, -920, -89, 1466, -1165, -14, 1563, -1378, -23, 1511, -1031, -238, 1314, -668]
4497f68N31J164j819L87R64l61p74J101K12j480Q48P26j609P68J441k542Q24J891
4515A604k577L36K170k219q2K512k533O4J937j388n97J606p51q88R57O0p02L81
4533a10Q25j241m5J622j873P3J930k122o0K163j547o05K465k018l50J831j087
4550a49o43J949j395n71J386p20k14M07M71r70L34O51j000J33J029r01p66K127
4568A158j384o56K093j443o54K071j055j051J868j126o06J547o51m79R36m2j053
4585e27P90L85o87k95J025o41o64J657j008j074J946o95j268K076q66r93J794
4602I55j049n13J147o39m82P66j40m60P72n47J46J50J14j62m10P92n38m23J037
4621E16n17j156K152j176p65K033j240p99J771p79r70J909j106o58J354q34j41
$$ y = [-668, -137, 1027, -792, -405, 559, 198, -576, 525, 737, -743, 105, 831, -778, -10, 1431, -1111, -287, 1604, -973, -637, 1533, -686, -768, 1744, -789, -725, 1212, -176, -773, 833, 82, -806, 151, 211, -491, -110, 715, -526, -571, 1051, -822, -749, 1181, -941, -1001, 1162, -385, -990, 1475, -543, -893, 938, -149, -792, 1157, -238, -809, 577, -143, -357, 50, 521, -449, -115, 536, -464, -331, 698, -203, -969, 1158, -226, -882, 1211, -232, -886, 1185, 130, -921, 947, -179, -785, 762, 111, -368, 568, 526, -527, 263, 648, -39, -334, 691, 50, -614, 1043, 35, -1039, 907, 212, -1056, 1020, 154, -839, 955, -94, -607, 540, -99, -581, 185, 45, -415, 357, -190, -44, 106, 220, 58, -352, 440, -98, -521, 516, -1, -1157, 995, -181, -946, 1087, -153, -952, 819, 40, -930, 979, -127, -785, 569, -265, -406]
4638d06P22k66m49L80K88n99R2J015p84o00J373j205j73J557r47q17J854q75r71
4657h11J716j145m48J778j033m12R66o02j62P86p22j19J44L40k37j82M62m55n13
4676f49J284q34m67J767j234q46K176j457o35K059j445n92J745r90r79J721p56
4693a32l61P64P3r23L97N15p86k28J276n85j426K586j104j098K261j180j177K083
4711I55q92j314K248p90j066J447l54q65R57K50j014L77L66m82q0P18o26q63J930
4730I02r04q27J632r66q81K023o33j460K194o09j572J891m24j300J409n9j269
4747h53J270K79q29P1Q31r63o61J642m91j155J339K7k056K227k39j768J661L97
4765G29k008J448L20j663J348J27j045Q32K83p19k28J081m72o77O21J40r43R87
$$ y = [-406, 316, 50, -399, -19, 269, -330, -238, 777, -7, -607, 766, -439, -612, 945, -2, -819, 1035, 160, -811, 905, -240, -688, 1090, 57, -355, 611, 9, -153, 633, -89, -208, -64, 276, 39, -143, 319, -136, -649, 635, -199, -666, 1101, -133, -979, 1197, -260, -895, 1164, -281, -873, 872, -118, -1097, 624, -132, -493, 271, 344, -579, -182, 333, -453, -681, 595, 10, -1416, 1170, 66, -1032, 1229, 49, -1128, 955, 63, -1251, 997, 207, -859, 588, 234, -631, 326, 576, -438, -61, 305, -177, -257, 461, -165, -1028, 902, -2, -829, 803, -163, -1044, 979, 346, -1114, 1080, 471, -1101, 790, 366, -934, 475, 416, -853, 417, 696, -133, -62, 769, -194, -855, 787, 296, -859, 480, 507, -1549, 678, 439, -1329, 332, 729, -1279, 169, 489, -1174, 174, 301, -744, 88, 371, -348, -576, 505, 33, -644, -23, 117, -826, 161]
4783A61M80j505J110L98j781J372P48k060J447O59k300J422O63j286N83N69j250
4800e70K96J144j126M4N56m5j039R21J46q67Q04L19j380Q44J265k042O08J382
4818A260j968N63R38j494P46Q77j455K89R20j011J04N22l53l69L48M04n68j36
4836c83Q18q82j03J244j317K52J094j319J79J305j357J55Q99j579J023L67q83
4853d87L68N07l77j10L08k44P6l46M71k99k27R84r17MR00o85l58J381j256j42
4873d49J304j451L11R69p83k80J121r28r2P85p65K28J22q6O6j90L21j21m59P45
4893C68m14p27J463p99n47J266r04L9Q51j062J72R13j184M70M69r06R02j01n26
4912b57M27J79n49J52j5J24m03j12Q65o31j56Q08q26j80J225j320J16J530j563
$$ y = [161, 641, -864, 246, 644, -1137, 235, 983, -1077, 370, 1029, -1271, 151, 814, -472, 111, 680, -570, -274, 870, -256, -212, 344, 299, -740, 181, 327, -540, 264, 583, -797, 47, 1312, -730, -122, 1260, -708, -145, 793, -701, 45, 922, -533, -244, 676, -335, -231, 291, -62, -431, -83, 321, -247, -383, 435, -447, -550, 694, -623, -371, 723, -596, -417, 888, -469, -314, 585, -994, 29, 396, -487, -119, 388, 11, -99, 209, -35, 41, -305, 166, -133, -360, 624, -293, -289, 611, -74, -432, 949, -307, -449, 855, -596, -285, 684, -99, -379, 742, -186, -278, 507, -258, -30, 92, 6, 72, -118, 203, 82, -377, 368, -46, -773, 690, -109, -656, 610, -294, -255, 596, -466, -294, 619, -565, -95, 374, -532, 370, 269, -257, 170, 349, -200, -48, -63, 61, -342, -454, 411, -220, -376, 432, -394, -574, 651, -669, -553, 977, -586]
4931e86L28J075j231P9J048j148K08P50j055M56O0p4K54n89N36k96k54O63l09
4950h5n99J439j012P9Q56r86p4J275j030k74J222j178K17P65r87J28N91k78k92
4969b23P13l96k45J2L06j59l33R01q71k23J274q51q23J897j168o27J751j008n80
4988f53J802j473l89J120n34m37R26k86p59M17N72q03k73J373p13o23J184m02
5006D9j019K081q28j282J637o81n84J144k20j161J405n56k26O41l75l26K93N0
5024D2k54L50J63l59j01Q29m52r38J276j26j172J408k02j469J527Pj789K022m47
5043C15j189J286K1j247Q11L32q10J80O44o72j17Q13k32o14Q88N2j484J227M93
5062F97j770J395K51j895J519J07j360J021O73j442N63N34o12K67K25j65l87P43
$$ y = [-586, -258, 817, -414, -335, 713, -435, -227, 523, -532, -76, -16, -90, 164, -425, 111, -185, -439, 224, -85, -684, 755, -257, -178, 678, -308, -382, 893, -137, -411, 811, -367, -150, 615, -372, -244, 347, 69, -223, 490, 94, -151, -139, 167, 8, -325, 576, -295, -518, 756, -95, -918, 979, -189, -816, 935, -73, -653, 1149, -324, -713, 407, -127, -564, 362, 76, -683, -266, 306, -497, -770, 603, -110, -733, 451, 49, -970, 1111, 283, -999, 638, -43, -627, 517, 297, -864, 541, -15, -241, 400, 25, -301, -8, 42, -212, 138, 301, -58, -159, 670, 218, -720, 556, 430, -742, 666, 464, -1005, 522, 529, -1260, 762, 315, -874, 412, 433, -814, -3, 329, -481, -301, 343, -329, -446, 367, 135, -479, 409, 461, -1023, 204, 697, -1073, 322, 573, -1322, 197, 304, -1056, -35, 638, -804, -241, 293, -319, -52, 173, 8, -379, 364]
5080C64j53n53J55N62r92N36O01j084P83M13j406J137K27j220R26K67j335J118
5098C46J98j168Q56q2m18K76J27j21k85N20O2p08L01P05j224P31O21j499P66Q20
5118H24j377N70P78j372M68M62p03M95N32r34J71J12JN1k74M86m91j85Q37p86
5138c35J61Q04j068K39R49j220L82O21r33K40N23q60N75M72p16L60J38q74N67
5157B5Q5l85L34Q3l11P9n4K13m01J32Q85j241M57P90j084L41Q09j703J121N23
5177F98j268O16N28j057N38K19m38J97J16j71K8J52J23l22J86J05n61L63M53q76
5197c71L42K40o86M95O67j464J074K60j225P22O50j465N62O99q17M09J06n08K5
5216b85N26k24m60O70k16n13N20M43j131N90Q16j372M73O30j021L94J043j380
$$ y = [364, 211, -342, -187, 375, -617, -81, 520, -564, 219, 632, -774, 363, 590, -630, 296, 563, -772, 346, 544, -624, 232, 150, -268, 8, 135, 14, -271, 249, 311, -397, -96, 609, -615, 116, 737, -762, 4, 824, -553, 17, 795, -577, -109, 353, -350, 145, 677, -257, -86, 26, 27, 78, -196, 290, -201, -386, 451, -335, -174, 630, -438, -199, 750, -470, -88, 533, -400, -160, 363, -497, 78, 550, -166, 194, 332, -542, 25, 110, -275, 59, 142, -169, -90, -144, 69, -332, -200, 685, -556, -99, 691, -393, -52, 757, -946, 175, 698, -570, 46, 574, -483, 55, 274, -164, 33, 149, -22, 6, 158, 281, -41, 145, 250, -311, 52, 505, -371, -29, 211, -475, 20, 687, -777, 297, 557, -668, 54, 704, -761, -199, 500, -317, 92, 198, -310, -285, 241, 17, -443, 227, 11, -502, 18, 461, -670, -80, 736, -636, -163, 467, -554, -160, 883, -497]
5234d97J45J142j069o6J196j046p5Q23o40j40N07Rq21M71M77r94N18N29r40K50
5254b21R86j264J74J298j417p0J284j100o4J371j234k10J118p07k71O85k81m79
5272d02M28L65o66L00M59r92J77J026j208o7J551j462j52J422j246n66J989j303
5290c47k55J474j004r74J647l98q19J217l38p26L24Q04j098J48Q84q05j48J144
5308G30q14p17J725q13j127J970q17j040J544n16p90J253o73n50J200n23k08M00
5326B34j27L2l66N53l29l31Q29m34q36J207l90q73J405o14r08J650n22r65J529
5345G44o41p14J022l99l52L34L09n31K99L13m32m96R67k60o19Q51m98n70J079
5364D06j85j404J685k87j055J528q00o14J079l58m30P60l9o09M90j01r1j15L25
$$ y = [-497, -352, 790, -279, -345, 851, -195, -270, 553, -87, -227, 280, 289, -532, -61, 416, -578, -60, 469, -471, -221, 765, -499, -325, 973, -444, -514, 770, -330, -394, 977, -257, -467, 651, -56, -327, 358, 77, -402, 26, 391, -275, 25, 484, -508, -331, 695, -513, -580, 971, -491, -643, 779, -467, -1033, 956, -347, -602, 872, -132, -1106, 541, 143, -676, 541, 203, -523, -199, 605, -493, -345, 539, -266, -414, 730, -84, -801, 924, 111, -1016, 954, 137, -903, 641, 125, -665, 588, -85, -635, 565, 42, -166, 234, 107, 139, -227, 326, -3, -334, 495, 61, -775, 432, 42, -831, 574, -40, -948, 702, 180, -785, 744, 103, -611, 411, 12, -340, -6, 303, -228, 71, 384, -48, -544, 423, 163, -456, 395, -103, -673, 406, 221, -1183, 502, 215, -840, 688, -112, -726, 353, -5, -435, 325, 286, -323, 167, 66, -25, -140, 185]
5383A85j43l11N40q7p25O43J51o31R88l13q70J241o05n18Q28k01o61R56m06l87
5403c26Q12m15j47J84j9r3o5K58j24k01L74J89q06P26k36p83J224l12q56Q09j43
5424E0m87J002m34o62J020m69j80N22j43o39M68j56J15j32K38j29l17M95l41r8
5444b77M55J73r32P02p9o78J283p39n25J048j85r84J108k79p11R28m63P3J22J97
5464B37m72K17N99n60k95M23J70p89R35l59q10Q91J39r13J096l1j223J097O2j058
5484f44J020R7r48M84L20o33J45P02p65k72Q71l5o99P39r7q64P38P9j242J223
5504B19J63j219J219J45j559J338M16j361Q59J52j111O91O12r67J48P20l98l67
5522c00O04j96p53N10P11j409J095K34j224O61N95j357P57R03j468N61R19j545
$$ y = [185, 42, -269, 271, 184, -541, 102, 253, -378, 610, 297, -573, 668, 63, -455, 373, 172, -489, 467, 61, -326, 486, 71, -76, 108, 89, -4, -69, 189, 65, -136, 238, 427, -379, 347, 111, -672, 552, 240, -616, 193, 50, -437, 565, 131, -531, 489, 20, -160, 362, 219, -420, 48, -108, 7, -125, 113, -16, -333, 162, -179, -277, 178, 351, -581, 121, 42, -636, 647, -92, -617, 431, 246, -738, 370, 91, -620, 308, -155, -82, 40, 237, -235, -18, 581, 21, -274, 149, 319, -470, 465, 106, -704, 187, 326, -587, 509, 478, -745, 352, 414, -644, 376, 473, -475, 9, 329, -304, -159, 543, -222, -494, 377, 342, -357, 382, 285, -579, 159, 238, -1004, 219, 382, -837, 382, 527, -1032, 306, 722, -639, 220, 372, -739, -48, 564, -403, -255, 465, 67, -300, 304, 108, -645, -135, 576, -833, 262, 496, -728, -67, 528, -829, -72, 831, -637, -76, 843, -702]
5540g02P04O68j241N23N01n64k15M14J32n74M44M68j019Q46K54j210O84O59j345
5559e73N64P07j352O21P37j211N74O54j198K67P69q73J76L81M2o22N65K29q46
5578c89M70M33j063J39J249j607M23P94j161L76J332j437j20J412j372RJ054q73
5596c31M5N53r6n62M63j18K4J1K74k69m16J162r20n7R78j041jJ028j100j10J332
5617H49j178qQ38o67N9N72n72l2O14n03K11l31L21j76l7L73k30k12N75o57k44
5638d35R38n47k54Q96o76l23J105p40n25J161j015O3O97l58j45K77j51j24O0M6
5658e0l8k02N37k47o17J113p29L3P95o87k70N98m80k99J044p68J18P27p92K34
5678B0K53p05N22K93o33J92J68j26J79k2k4k85K09J34k5m11O91n16l86Q35n35
$$ y = [-702, 2, 670, -571, -48, 453, -111, -326, 88, 220, -354, 90, 558, -461, 385, 639, -571, 113, 772, -573, -9, 698, -654, -33, 704, -507, 67, 721, -477, -210, 559, -314, -138, 243, 285, -337, 228, 457, -389, 81, 514, -549, -410, 839, -768, -345, 449, -712, -336, 996, -441, -561, 851, -521, -512, 542, -331, -286, 267, 171, -391, 72, -46, -22, -11, 263, -6, -422, 740, -180, -237, 741, -300, -301, 727, -373, -483, 849, -329, -337, 501, -166, -107, 465, -107, -139, 475, -28, 183, -148, 173, -3, -40, 333, 103, -109, 466, -191, -435, 503, -44, -298, 598, -78, -401, 704, -36, -561, 600, -415, -352, 345, -13, -158, 119, -32, -156, -96, -50, -88, -290, 247, 0, -617, 496, -233, -200, 595, -92, -362, 236, -244, -543, 501, -267, -149, 578, -214, 20, 273, -432, 90, 383, -250, -58, 110, -16, 163, 141, 117, -168, 41, 175, 150, -261, 430, -86, -472, 363, -172]
5699a72q7O12m56p7J139r80l54R49p39p7N43k10q5M0M7j13J13m5N1k80P93q87
5721b75J38O41m96n21O65k04n26J175r00k07R05n98j05N87n17m2N29l89j22L39
5741G7J7k56R2L40k55q4L42n9n51P76l61o54J257n25o59J141n55o53J096m36q64
5762g74J082k07m00N56R5m94n0L64n39R0M77j29o14J192l19q45R16j73q51J061
5782D38J20j256J094j22p77R00m9n47l0L15m42L71J21l19J17K25j16l34N00K5
5802B34p47O36J54j031J150K07j457J245r7j213J059L03j081Q02K23p43L48L19
5820C11m04j22J52J08l75M75N8n57L85N65j114M76O82j314P60N80j164N49O79
5839G30j121L39M73o90M89m0L0l94L57o5m50N47P1m55L43N25j086J42O88r39N68
$$ y = [-172, -259, 353, -103, -180, 959, -21, -375, 574, -165, -242, 301, 91, 6, 46, 93, -20, 93, 48, 99, -181, 612, -275, -137, 504, 8, -513, 152, -52, -578, 597, -303, -510, 395, -203, -308, 279, -238, -280, 249, -140, -262, 77, 94, -162, -70, 270, 15, -69, 273, 214, -337, 439, 78, -576, 681, 156, -503, 638, 83, -570, 526, 90, -774, 308, 101, -299, 257, 352, -142, -192, 172, -367, -277, 200, 71, -543, 649, 330, -515, 401, 228, -623, 438, 558, -698, 396, 274, -503, 397, 348, -199, -229, 86, -356, 15, 136, -183, -66, 159, 43, -291, 209, 234, -513, 123, 277, -754, 396, 603, -854, 391, 294, -919, 140, 443, -638, 164, 387, -356, -8, 311, -93, -215, -63, 45, -330, 145, 203, -354, 31, 596, -518, -42, 640, -674, 86, 666, -498, 51, 730, -391, -52, 421, -269, 220, 180, 210, -184, 173, 108, -342, 205, 276, -179, 164, 689, -397, -255, 433, -506, 62]
5860F2N63j051L92N38r89N27N34q66J26M53l86J45L48l58j37J25R7m07J41O04
5880D61r76K90O51r39L54P06r88K84Q51j070K58L76n73j86P81n13M1M88l11o1
5900g6k33N40j90P9J27k21k6L64j74o61R08p65K43Q11r71K23R5l73J22N25p34
5921c87K57N71n55j11K13K2J92j67J89k58J55K14l51qL76m53R7K88m16j10N72
5942C30m40Q8L60o67J62N48p94J57O25n88J9L47r4m5J12j3l63K02K90l16l7K85
5964A68k29j89Q03q26K5O64o07L6N07m82qM87p17K83M51o79K49K14k44n9K88N8
5986A93r5o2M7j94K91O8m58NO50q39j30J113p51m1J044j074j07Q99n83m44R09
6007D41n80j78R10p17j31M27j38l78M29K03m96r4Q22n70l63R07n02l97Q39n25
$$ y = [62, 625, -426, -34, 504, -485, 42, 576, -290, -164, 289, -97, 48, 396, 38, -99, 26, 123, -284, -143, 461, -515, -225, 426, -513, -159, 547, -441, -157, 694, -376, -118, 258, -315, -501, 280, -233, -192, 296, -15, -76, -309, 231, 41, 120, 247, 26, 0, 364, 190, -471, 437, -328, -85, 726, -245, -22, 73, -300, -178, 347, -387, -130, 441, -114, -225, -12, 10, 202, 35, 224, -34, 121, 335, -16, -24, 352, -101, -4, 284, -132, -242, 330, -110, -22, 338, -329, -167, 381, -413, -256, 369, -219, -200, 147, 53, 8, 120, 107, -256, -54, 236, -80, -117, 168, -61, -250, 553, -273, -248, 416, -191, -155, 352, -130, -138, 349, -368, -85, 366, -313, -64, 150, -94, -153, 135, 193, 98, 36, 83, -111, 180, 248, -210, -205, 445, -394, -524, 589, -162, -203, 841, -233, -340, 559, -24, -468, 441, -139, -317, 593, -124, -255, 172, 34, -344, 85, 288, -208, -302, 520, -50, -413, 494, -8, -405, 434, -91]
6027i1n98J296p46o61J432q98j24R44o22k14N71j45l61K92L6q1q3L13k80m60R04
6048D24m30k60R42n60r77J734p41q39J381m94r24J026j63o82J041k85n32P20j16
6067B65l92q5N70m35p2P57l60o33R15m41q55J349m65r08J383l79j017J295M4j217
6087f81R85m9m92L30J11l37J16K22k74j61M73Rq14Q74P4j106J042k5q26Q83R5
6108D49j248Q54K99j010J050K6j214Q33K43q87P02K78q21L20J46j49l99Q46n8
6127B60q23P92m1j004J066P1q90M65O23j243Q42N96j101L86M02p69M41K89n14
6146a52K66J95l52PK76l23k07K24K77l51q2M30n46N91J88q36L37N16r21O8O88
6167B93q91O58J24o70N85K40o40J37L12j30PJ25j82k31P24k29m46J81K08n55M10
$$ y = [-91, -689, 607, -139, -800, 632, -266, -390, 554, -68, -282, 289, 144, -217, 75, 111, 30, -53, 260, -20, -480, 424, -6, -266, 676, 116, -861, 873, 132, -707, 674, 180, -744, 282, 119, -563, 478, 193, -339, 381, 265, -127, -212, 358, -77, -149, 608, 248, -385, 530, 89, -766, 583, 118, -790, 593, 214, -803, 492, 536, -681, 304, 255, -237, 93, 204, -133, -17, 205, -69, -230, 243, 252, -562, 312, 386, -720, 322, 297, -529, 354, 449, -799, 55, 354, -656, 394, 420, -794, 39, 282, -605, 97, 375, -446, -126, 20, -129, -528, 318, 260, -563, 229, 188, -816, 250, 321, -569, -104, 519, -724, 118, 714, -387, -1, 401, -368, 73, 362, -152, 114, 309, -43, -36, 240, -83, -290, -66, 211, -140, -222, 208, -338, 253, 441, -395, -58, 458, -463, -395, 293, -598, 60, 184, -486, 99, 339, -301, -164, 148, 18, 25, 150, -32, -263, 461, 232, -214, -33, 175, -380, 30]
6188C0K42o06L9M73o43M07M80o51J64L82r49N58L12q52O28j52n6M8K24j7j30o3
6210a32L09k64J2M32n80K72K01l96K88J7n76M09L79p40L99J11m13N69k64l47O02
6231B88J78n93K46n9j38lJ99L0k50K17N3n94N05O68j433Q67N18j315Q65Pq49N71
6253b2K94o87K69L34n00M07k0k57j55N59j86k45N84k20n96K99L92o35L11L99r90
6274f65P82M11r62L91M45j038O51K84n51J18N35n28j15N92n67J63L91J04p23K24
6294e8M24p78L82N05j138N93P40j086L51O68j125K80R04q85N5P09n50k66M38m1
6314A22m36L51K58k56O2J01m07J46L46p13o8J072r35J00R75j051j59R01q30m3
6334d64J066o94j51O49o46r5K99J55k02J28kk32N1O08p74J53O94r01J3J036r58
$$ y = [30, 272, -334, -295, 178, -465, -58, 422, -229, -65, 317, -632, -74, 238, -614, 14, -138, -194, -146, 78, 61, -69, -132, 177, -87, -75, 357, -223, 49, 250, -146, 142, 159, -417, -8, 371, -369, 30, 141, -272, 297, 33, -314, 288, 466, -127, 119, 60, -78, -81, 118, 148, -102, 115, 168, -426, 79, 747, -686, 181, 699, -616, 249, 256, -593, -22, 272, -415, -146, 188, -312, 95, 75, -182, -337, 222, 36, -209, 375, 155, -441, -142, 250, -385, -74, 325, -665, 117, 528, -434, -43, 402, -636, 15, 299, -252, -134, 401, -127, -242, 350, -217, -54, 337, 441, -282, -58, 366, -412, -30, 475, -663, -70, 670, -416, -65, 603, -522, -242, 662, -223, -168, 541, -9, -275, 163, 122, -314, 37, 295, 39, 101, 202, -205, -59, 287, -426, -494, 578, -357, -257, 718, -333, -492, 409, -421, -464, 602, -92, -243, 406, -240, -335, -36, 119, -83, 45, 43, -189, -138, 470, -304, -151, 543, -358, -345, 691, -267]
6355b67l36J183o31k39P77n98j79M93l42j19L19L3m81L45L54m28K9K97m20j56
6375c66P99l47m60N89K3n05Q09n32l29N61k74j39N16l49k68L67k9j22J38k7j14
6396e9M02j63j03k56N32k15k14J67M5p38Q64j78m10O32k12m40N43k26l77O56j71
6417G9o32O05m1k51J72M44n34j9J70K99n79N53k59m13P98q7o27P3N54p45O70K1
6439B51n49M24j00k83M96M2l99L11j05k21L81l71j93M32k62K97j71k71K50j23
6459a64J0M66o63M41m3l80M98J35o73N23m5n23P72j74k61K91j85j62L45k02k13
6480b07N06l09O1n4J87K59p55K35M02o18N13l74m49Q46N1o78N41n4m87O76k00
6501I2n08N61k4n44O60l52l2J5K70k01o6M26j53m09M26J23n44M92J46p73P87k53
$$ y = [-267, -603, 580, -51, -290, 487, -111, -290, 203, -139, -258, 61, 94, -387, -42, 312, -116, -87, 210, -210, -366, 433, 86, -374, 215, 238, -267, 542, 10, -319, 242, -32, -171, 345, -4, -272, 95, 66, -56, 82, 55, -59, 343, 180, 77, -179, 353, 138, -76, 91, 136, -602, 262, 84, -326, 306, 94, -346, 197, -29, -406, 250, 79, -553, 52, 11, -240, -68, 376, -158, -177, -7, 292, -287, 266, 7, -406, 392, 305, -322, -249, 305, -440, 230, 251, -298, 126, 26, -257, 239, 281, -118, 193, 88, -133, 248, -123, -316, 116, -146, 151, -20, -291, -41, -164, -154, 312, -351, 90, 47, -333, 165, 300, -373, 150, 105, -418, 354, 180, -81, 210, 25, -137, 208, 6, -207, 299, -10, 51, -3, 184, 443, -312, -77, 325, -293, 220, -154, -603, 243, 294, -384, 157, 103, -384, 292, 92, -416, 145, 121, -423, 237, -115, -147, -132, 138, -63, -129, 297, 144, -265, 161, 284, -260, 232, 378, -395, 392, 139]
6523A39n35O03J11p56M42M09p49K93K38n98K42M10l48J59J65l45o1J61K04l95
6543b11L49J44o25L59J29m24q3P40r97N03P66r76K47N23r41L90N38r12K55M10
6563A84j2l95L11N0n06M38L10r00L89P53j121N28K64r53O43L92q87M47M28n65
6583b02K05M86p91J95J60Ro40P70k54r9K19L21o94J40P07j131N58N83q72J64O82
6604E16r74L45N75q37K92K21r8k48L96J08k94J09P6n48L83L68o62K71L56n66J50
6625f1P08p78k71Q04n72k30R78q18j51Q48l45k58N19n05j50M56L3l87j12M85m35
6646b42J66L18m78q1N17j73o07J039o94K14N19m77j82M45j84k64O25m37m00N05
6666A29pj67K64j10j91mM05m43o8L68J68q17J076n19n67P23m8n55N87j43m50N47
$$ y = [139, -396, 207, 318, -438, 4, 413, -336, -43, 195, -403, -161, 249, -99, 60, 225, -120, -181, -20, 184, -211, 138, 282, -343, 16, 145, -279, -362, 378, -619, -116, 650, -326, -79, 444, -497, -107, 431, -481, -226, 184, 172, -223, 88, 138, -368, 70, 380, -520, -131, 622, -499, 29, 293, -660, -17, 375, -512, -65, 363, -202, 3, 489, -302, -107, 53, 62, -578, 192, -62, -161, 58, 379, -315, -175, 532, -599, -41, 542, -330, -166, 516, -458, -113, 462, -375, -83, 138, 40, -208, 188, 296, 2, 111, 187, -361, 22, 390, -272, -1, 355, -211, -61, 647, -131, -402, 402, -170, -400, 578, -240, -391, 457, 112, -146, 373, -132, -282, 174, 207, -180, -292, 193, -242, -76, 242, -236, -317, 200, 27, -580, 459, -235, -21, 498, 21, -161, 284, 100, -164, 461, 24, -376, 129, 122, -45, 219, 109, -82, -86, 319, -124, -192, 176, 344, -473, 603, 84, -483, 240, 192, -363, 224, 81, -369, 178]
6688A78k36j63M28k27m5J39k6j84j0K50k74L01J31l31l44N23j2m32N54k18n68
6709e66P07N9n92P98o14j2O46n22k92N99l88O3L06j02p1o5p3m1M2K94k27KJ57
6732A08P9n00N04k5m73M85k70k87P35j62o16N73j20j43M14n14K81L62n44q5L98
6753B00J10j92l12J93M1k77L65j43j81N36l06m12O44j63m88Q29n14l78O26k25
6773d7k40O01l25n06P36k10n6R6J9l18M8N16m13l29N77j18k63P01m53o83R75k16
6795I2l47L38n2m19O82j87n33O21q0n76N50J54m22J99J30k36j58M19l22J00O54
6816F07n75m69O79k83m14R05j38r52J138k21o80N80J31p73M84M88q40L75L10o32
6836b80J25M28l59r9N33m9p35N64K18p90P49M5r01O62M68j049L81M15r08M95L13
$$ y = [178, -58, -221, 207, -20, -65, 74, 48, -136, -146, 104, -170, 131, 262, -69, -413, 110, 98, -334, 220, 2, -566, 141, 200, -392, 406, -208, -220, 426, -96, -388, 211, -177, -114, 192, 90, 19, -46, -119, -160, -118, 176, -51, -49, 108, 187, -313, 191, 166, -307, 178, -92, -379, 356, 194, -422, 151, 31, -112, 302, -212, 69, 431, -113, -198, 200, 310, 118, -194, -1, 40, -237, 128, -15, -196, 340, 34, -378, 266, 103, -385, 444, -70, -448, 178, -47, -287, 314, -11, -517, 219, 9, -47, 49, 68, -250, -202, 314, -99, -428, 149, 31, -232, 469, 16, -667, 308, 92, -255, 83, 31, -388, 294, 107, -426, 195, 115, -461, 89, 243, -179, 20, 150, -86, -244, 175, -147, -47, 607, 32, -437, 242, -41, -455, 450, 312, -640, 498, 277, -403, 177, 308, -465, 19, 507, -333, 42, 352, -280, -155, 273, -86, -185, 348, 299, -436, 128, 346, -444, 305, 350, -551, 111, 579, -470, -89, 326, -582, -87, 226]
6857B26o00M3O62n29r6O75m17j62J09J08k14K55M51q02N55q9p94R43M9p20L68
6878B1O81j156N27N75j152J85J000p79j97P86o43K37K43k64l34M73m6m35M12L58
6898D92q96O13J42o35K09P17o39J9N99p80J75M30p67L32L34m86nL67j01k95L01
6919A26M0m65K07N1j0j96O62p17M67J29n55j2N23l12k41P66q39K5O59n54J43M04
6941C01l38J30mq0j76N1L62k70j14L51l50R7K37k08k71N86q12L42L16k13j81O20
6963C76m81M5L81l78Q8L27p01K07J22J37k66K07l3j61K52o5J01l05O16o28j05
6984b64K75k28J67L78o34j7Q70q05J52K60l88J93k0k9n1K11q4m19L54J2J44l6
7006D1J24m90J44L97l57m00R72o09J63L94l84p5N55o84N2O28p54K23L03k92Q6
$$ y = [226, -374, -331, 331, -198, -294, 381, -36, -198, -89, 19, -195, 60, 511, -291, 264, 175, -619, 324, 373, -347, 21, 702, -454, 73, 648, -504, -319, 681, -98, -295, 491, -152, 85, 328, 64, -270, 203, 157, -278, 134, 492, -404, 209, 351, -284, -75, 642, 3, 22, 621, -159, 16, 446, -321, 11, 345, -141, -146, 221, 120, -175, 126, 166, -299, -92, -41, -51, -247, 415, -302, 165, 294, -261, -273, 250, -62, -303, 463, -376, -351, 308, -246, -103, 301, -37, 93, 89, 9, -167, -116, 246, -24, -138, 213, -137, -40, 197, -11, -282, 304, -508, -166, 150, -63, -244, 376, -105, -60, 321, -57, 31, 358, -343, -136, -14, 123, -143, 64, 31, -130, 122, 57, 158, -147, 469, -159, -264, 11, -217, -50, 328, -306, -323, 547, -258, -106, 154, -234, -41, -61, -90, -141, 70, -14, -433, -79, -67, 77, 41, 165, -325, -181, 216, -141, -541, 431, -178, -15, 379, -5, -80, 475, -209, -157, 471, -283, -60, 243, -49, 37]
7027C7K01k53j0R0K15n01J71K45k02j28N03n07L4L10m75l1O97m06l31P66p03Q7
7049a91N02n30l1M49m03m4N26K8m44M28q0m07L5N13l37j44O28n31k36O30l16k81
7071b36P67q34k1Q28n70k42N64k47l66N27k79j96M69Ok59R7L22o49n4O77l48k19
7093b63O34k58n66R41m31l74O61p0p43O94l6m56N28j01k28K76k27k44K21J93k96
7114a45N0N89n07r8N71o16k16P28l46k12N97l9q77P50j0q57Q27k18m63M46K16
7135A70l37L01r2o7K88m7k42k90M16K0p31O30J73n69N29M3m93N16k1l16J56J84
7157B21m52J93K15l18P7L6Q7r1Q1l24L4J98J43l33N05j13m65L86J37m48M72j9
7179B22n30K03M45m78K85j6k12k3J43k85K13M09l55L4j00L07m94M21q4m84N77
$$ y = [37, 238, -15, -25, 65, 280, -221, -50, 195, -7, -135, 368, -139, -105, 205, -270, -301, 396, -10, -341, 425, -278, -191, 311, -219, -250, 199, -204, -248, 278, 306, -138, 290, 210, -197, -162, 351, 14, -130, 498, -33, -269, 361, 45, -236, 531, -303, -324, 504, -66, -308, 256, 9, -357, 170, -109, -305, 164, 170, -89, 8, 330, -319, -373, 304, -44, -263, 371, 113, -453, 488, 57, -317, 344, 274, -469, 225, 189, -267, 261, 160, -68, 208, -19, -263, -42, 151, -145, -95, 494, -13, -111, 460, -156, -372, 356, 10, -202, 395, 356, -521, 229, 219, -638, 189, -29, -492, -46, 170, -167, 134, 42, -25, 263, 216, -26, -316, 100, 120, -611, 19, 192, -377, 152, 195, -298, 218, 197, -119, 37, 221, -231, -38, 177, -141, -64, -28, 59, -32, 49, -275, -241, -43, 100, -233, 272, 159, -306, 80, 217, -231, 241, 222, -308, -105, 340, -138, 147, 131, -81, -104, 39, -246, -33, 376, 21, 55, -45, 262, -232, 189, 105, -379, 198]
7200A98j7k67j1L16m52L12K63n99K91J20k11mK52n4K05k20q8J5j54L68J40o83
7222b80K76J38j60K38m31k8M79n99K65L85l38L07M6o27M11k5l60M04l7j76J50
7243C8p1k07L09k19p1K52K26k38r6k70O78o77L13R7k71O3K01j82K51P9m10K79
7265G4Q5k54L44j12l90N38k22m00M73m3k90L52j60R8j58J61N2m38M83J02n27J97
7287c5J69k75O7K65n88M96K12p96O55J6l71L43k0l35K71L00p31J89K90L6l21K73
7309A10K03o12L82r1Q1j07K86m48O1M02o07J86L07l51J85M33o29J56M4k37L64
7330A18n9k39R9j03K82Pl36L23J3l81O03m39lL16m56K43O01q37n6N39m32j0O40
7353D33o48N7M68l30l08N05j90l31L32K25k95j97N56m21K4L08l01k94Q06o98K86
$$ y = [198, 181, -86, -97, 219, -233, 79, 342, -257, 34, 154, -57, -61, 191, 137, 342, 122, 34, 49, -105, 263, 403, -280, -4, 134, -26, 212, -219, -247, 232, -367, -102, 283, -55, 252, 298, -329, 82, 57, -303, 101, 64, -112, 38, -33, -240, 69, -150, -221, 31, 257, 19, -77, -347, 331, -346, -33, 64, -207, -144, 57, -125, 126, 205, -205, 74, 159, -95, 249, 137, -253, 285, 63, -337, 136, 93, -197, 155, -5, 93, -65, 96, 148, -290, 193, 295, -232, -35, 134, -141, -74, 191, -397, 99, 311, -485, 170, 186, -185, 158, 138, -197, 74, 374, -357, -168, 122, 158, -163, 110, 313, -299, 83, -8, 73, -34, 252, -196, -135, 267, -340, -154, 153, -198, -13, 420, -209, -53, -9, -246, 118, 59, -180, -81, -184, 98, 105, -231, 92, 105, -276, 327, -112, -115, 201, -255, -12, 589, -248, -304, 235, -197, -207, 433, -215, -158, 310, -20, -328, 177, -13, -344, -12, 213, -82, -279, 277, -144, -120, 188, -113, -407, 399, -299, -13]
7374a3N95q08k4N53m46m4N04j95j49K68p3k80o1L04n0OK56m62k88N91k5j81K89
7397B67L9o48P73j83n85O81m04o2L82r0k72K11l14N7Q0Q1J9l40O13l82j25K10
7419HN1j48K15nk71L46R5n00L79j13m44N03J59l98K10J17m24K70J60l09rK94j88
7442bQ3J42j04m05M68k5k53m6Q2l48N76P0m62L52k39j69M76k36l94N43M7j65j40
7465a49J87Pj44J97k87k31N59pj71j2J40m73M83o8l48M31Rm80K81K99o45O74j00
7488A52kq9j83J65k36L95k31jK34o0j64m2M19m03O9N1j80J50J30r0J78k11l38
7511b87N26k86p6J02O4k18J24J82k85K03m03M21j29K4K8j15K79j75jl6J88l44
7533b14J44J46k30K45l45J00L30k58j85L11J2k40J22J02J0j25Kr9L42j9k66M01
$$ y = [-13, 582, -226, -250, 303, -143, -187, 317, 122, -27, 241, 168, -112, -173, 131, 81, 87, 343, -119, -407, 184, 159, -22, 267, 306, -342, 431, 248, -337, 344, -60, -122, 260, 170, -102, 109, -205, -148, -68, 13, 32, -308, 305, -77, -202, 8, 59, -89, 126, 121, -150, 196, 291, -209, 170, 57, -387, 116, 275, -123, 87, 204, -220, 50, 210, -99, -108, 186, -2, 81, 223, 119, -286, 182, 157, -96, -142, -60, -408, 168, 238, -224, 128, -111, -280, 196, -40, -434, 109, 156, -9, -149, 38, 45, -99, 98, -189, -420, 139, 132, -39, -51, 89, -384, 99, 31, -317, 114, 123, -357, -76, 223, -422, 252, 152, 150, 61, -122, 43, -193, 202, -29, -30, 204, 144, -20, -62, 357, -46, 23, 74, -106, 44, 174, 84, 262, 51, -287, 239, -47, -123, -21, 43, -175, -51, 131, -154, 49, -354, 67, -62, -38, -10, -125, 154, -21, -22, -58, 130, -214, -70, 76, -154, 91, -254, -154, 176, -82, -267, 44, 56, -184, -62, 40, 50, -75, -73, -172, 170, 151, -115, 286]
7555B86n37M1J9J17K38m18L01M3j72M16n3o59N03J25n35M91N7n81L36K20k72J78
7577A44L33o73K08Qp1P0J17pk60M38N2o20K89M22p38K89Q8l21L28K36o28L93J03
7600B00m46K29n3k34J97M52m87N6J84j71p7Q1J03m03L66M28q47N85l1m19p2Q72
7622E13q69L92J09k88L15K73m40m30O55m85K58J30j40k29N08r7j62K12K52q98
7642d21M25L89n53j8M92o45N19m1l56K33M71l92l5J97m71J56L02%m69K61L34o32
7664b54L99K10n27n1O14n15k15R87q46J8M97l12n21P28k92j61M00k69lJ37k13
7685a89l20M48K35l56K36jj80k60N69k47l62O15j95l50M32j2j72N58l26m44M73
7706A52K9l31K54q9l08M04kj82J60M7q3L9k9j27NL63k47m46Q32l82j49L17k24
$$ y = [286, -251, -210, -191, -74, 164, -254, 47, 90, -82, 334, 281, -378, 125, 250, -285, 206, 263, -318, 18, 238, -34, 144, 477, -196, 12, 20, -51, 19, 136, 129, -131, 307, 359, -261, 28, 450, -288, 1, 89, -232, 96, 332, -296, 97, 200, -246, -17, -70, -304, -107, 345, -142, -86, 98, -73, -150, -69, 34, -369, -3, 425, -422, 163, 132, -287, -359, 513, -356, 36, 145, -143, 172, 445, 5, -425, 230, -255, 3, 133, -7, -236, 272, 175, 13, 225, 477, -421, 4, 393, -160, -178, 314, -331, 188, 147, -209, 24, 495, 103, 68, 265, -206, -50, 252, 252, -217, 44, 378, -254, 145, 355, -172, -223, 391, -124, -339, 648, -198, -180, 317, 5, -516, 212, -80, -241, 159, -110, -113, 24, -189, -509, -61, 174, -182, 54, 53, -127, -387, 182, -65, -427, 188, -7, -357, 75, 63, -109, 449, 123, -321, 152, 181, -150, 104, 15, -293, 111, 109, -73, 87, 134, 51, 90, 61, -66, -61, 302, 55, -391, 441, 59, -90, 227, 3]
7729Cl10M92l29j23L28R7k21J20l31K43J68J3r7P8j04Q7N6k30K75m95N05l16j90
7752b81N83L7p05O61l19j56L9k7j87L88r1j03K57j05l74L11J72k3oJ20l28J43
7774FJ89j97P2L17l64j26L65k14L0J66k73Q1K93k90j82L53p9k57M67n25Q7J79
7796I8N9j65K71K8k36q1L79j68n8L9j40k00M31k55M2J02l4k39M37o01LN52l00
7819c6o9R4N3k00P65l89k71J90P8k62k29M10j42pj6j66q1L45l51J4O88m87m30
7842d99P56m14k33N79m59j74O67q9k54K5J08n4r3M47l90P0K45j88k42J59J70l16
7864a79N06j78n11M80J2n42O78m7m31J99O9k54J92l0q6J49j7k33J46J02j0k49
7886b34N47l30k86M12J18m20N39j38n61O63k04k78M07K5p60L93L12k76nJ40j88
$$ y = [3, -307, 185, -144, -267, 61, 158, -63, 57, -274, -31, 137, 150, 53, 131, 27, 114, 170, -60, 215, -280, 225, -91, -281, 302, 339, -366, 295, -24, -180, -141, -168, -355, 33, -58, -161, 96, -9, -383, -72, 100, 77, 71, 191, -137, 6, 195, -2, 70, 387, 23, -103, 262, 48, 78, 244, -29, 52, 345, 55, -127, 226, 147, -110, 357, -168, -81, 98, 157, -8, 263, 291, 55, -26, 353, 185, 127, 166, 26, -174, 257, 2, 44, 146, 112, -127, 310, -291, -288, 264, -36, -105, -11, 42, -158, 607, 218, -53, 137, 215, -47, -276, 134, -8, -15, -31, -197, -278, 67, -284, -270, 418, -69, -499, 257, -157, -390, 189, -270, -444, 223, 134, -120, -95, 13, -41, -134, 313, -77, -7, 238, 50, -192, -33, 137, -179, 327, 149, -362, 118, 130, -412, 266, 219, -212, -13, 56, -198, -6, -36, -122, 27, 10, -223, -77, 25, 15, -234, 313, -17, -303, 109, 227, -193, 346, 208, -353, 310, 106, -172, 235, 260, -500, -107, 205, -71, -76, 64, -124]
7907a24J64R2k27Q7K81l2n13L86M1l90L90J29o52L63M3n51L63L58l31P2J46k45
7929a50j36L60j35J7K61j40k05Q1O8m39N96J74o48M36J21n41L52Q8o64N86L68
7950D50r25L57L60l54O7J05j64K24j95jL5j93P0J63mJ93n65L69J03l13M32j80
7972C4k93L71n0k84K44n5K44l79Q3q2Q7L03k47j0J82j38j45p1L58j48j88K86k9
7995G3o3J51j79J63j08j67J32L14l36j79K97l35L29J40j37m2k05J58O5J9j26J69
8017A33l34K35j49J65pk18M36m75L07j43J32k1j10L76m75J50R1l29K42P9r2J21
8039A14r1n7lk02K37l00L04j46j16L89k25j39N5J97k7K1K81l59q8L04k97O9K42
8062A63l16j10K59j22O0K89k45J79k22J3J01Q8J04j26q2R3k08K14L5l07N2K11
$$ y = [-124, 40, 132, -95, -8, 273, 241, -272, 114, 155, -235, 155, 284, -368, -5, 38, -513, -150, 208, -123, -51, 95, -150, -286, 74, -61, -44, 217, 77, -128, -47, 21, -418, 178, 352, -296, 140, 261, -280, 72, 160, -504, 82, 450, -475, -118, 242, -112, -45, 60, -104, 120, -75, -76, -41, -234, -164, -1, -5, 188, -377, -8, 95, -218, 214, 34, -259, 112, 62, -222, 22, -33, 211, -168, -85, -167, -80, 223, -24, -34, 148, 10, -135, -206, 152, 4, -184, 102, 73, 10, 161, -18, 145, 37, -130, 2, 316, -20, -199, 98, -237, 92, 232, 95, 53, -152, 6, 71, 90, -36, 133, -201, 34, -115, 50, 43, -175, 261, -214, 93, -50, 82, 61, -49, 327, -148, 2, 93, -236, 6, 85, -7, 114, 23, -34, -37, -239, -2, -302, 2, -144, -260, 129, -96, -235, -180, 17, -10, 11, 292, -67, -155, 149, -148, -79, 163, -153, -263, -4, -126, -66, 223, -22, 157, -65, -52, 49, 137, 241, 115, 33, 126, -82, 132, 167, -140, -88, 123]
8084A23j57K0J75j78p8J32J04j84M4q2j11K58r0k07L52j97K75j39Kk87K29l0J50
8107A24q2O0k44Q5L07l42lM45m99N9L95n51K91J48k23J4K25j22j27J07o2jj05
8130a01K42l79N8N55k25m53N36p7k90N54n07k4N44m95q2K17j85p4K92j16p7K27
8152A40j85l07J66K37j41j65O17l02k44K99Kk97N06l09k93M74j63j73M00j61l72
8173b71M31k95r2K61p5o1L22j66j99R9P8P7j02l4J7l87O01N
$$ y = [123, -34, -14, 161, -17, -95, 37, 141, -43, 1, -81, -192, 66, -24, -231, 121, -76, 199, 60, 62, -225, 4, -26, 124, 42, 102, -142, -57, 250, -92, -95, 350, -149, -90, 305, -246, 45, 193, -30, -16, 209, 87, -40, 67, 5, 4, -101, 141, -238, -180, 375, 150, -303, 233, 156, -134, 420, -87, -111, 433, -62, -144, 73, -112, -186, 106, -10, -87, 140, -45, -352, -186, 51, -90, -255, 362, 60, -184, 115, 117, -180, 326, 17, -276, 198, 35, -138, 262, 101, -271, 160, -135, -227, 34, -41, -102, 220, 54, -145, -46, 32, 109, 7, -27, -10, -397, 204, 209]
8191B09
$$ Imaginary data points
##PAGE= N=2
##DATA TABLE= (X++(I..I)), XYDATA
0@%%%%%%%Qj6J6j9K7m0N6p2Q8j04J28j52J80k20K64l13L69m33N05n89O84p90R08
30D85j040J184j344J522j719J939k179K442k730L043l387L766m178M628n119N655
46B968o241O880p580Q349r196J0130j1165J2315j3599J5047j6690J8572k0753
59a0963K3312k6366L0088l4735M0718m8741O0101p7489J07560j73203N43147k61799
71A71630p33821J106961p10921r1716O44708n33274P5186K83656l82040K39399
81F9768j07694n0765K87703k63293J1971J96004l15599K14336R9367l34593L45556
92A52761o0849l68233N16424k50702k33961O06717m64534j46460O02653n16833
102a63017J6625M22390m33236J50946J38329k89570J99260l7061m1086J69386
$$ y = [0, 0, 0, 0, 0, 0, 0, 0, 8, -8, 8, -11, 16, -24, 32, -40, 48, -56, 72, -80, 100, -120, 144, -169, 200, -233, 272, -317, 367, -423, 485, -555, 629, -715, 807, -912, 1027, -1152, 1290, -1440, 1603, -1784, 1982, -2196, 2432, -2687, 2968, -3273, 3607, -3973, 4376, -4820, 5310, -5855, 6460, -7139, 7908, -8782, 9790, -10963, 12349, -14017, 16071, -18664, 22054, -26687, 33414, -44075, 63485, -109718, 433429, 171630, -562191, 544770, -166151, -257867, 386841, -146433, -71247, 212409, -169631, 69768, -37926, -88691, 199012, -64281, -52310, 143694, -171905, 42431, 141798, -192795, 152761, 91912, -276321, 240103, -10599, -244560, 362157, -102377, -248837, 353816, -163017, -146392, 275998, -157238, -6292, 132037, -157533, 41727, 4666, -36420, 132966]
112A32966k44226P8209J78863k95663J71808J03985k92597K68566o484l15422
122b19995L36684o8887k06962L68900k69505r5305L82836l43576L8000K68085
132A90275l07159J37575N8868k13618K18446j03147k3793J94063k99468J48446
142D88J64232l73137K54920J23022l64765K73754J1261k88405L15317n9825j76687
153a19825K36272j45012l1994J64661j90084Q7025R3112j75125J26794m0251p6174
164g0601J58197j20758K6374Q5863j87844J48081L5366k30774K42969n281k42649
175a61057K51027m4164j91655K44890n4502j55774J83977o5761q0291J19110n4575
186h775R10L1897m7256K9676k3787O157N4587q3323M6749M1145j26947J01534
$$ y = [132966, -111260, -33051, 145812, -149851, 21957, 125942, -166655, 101911, 95427, -219995, 116689, 47802, -159160, 209740, -59765, -155070, 227766, -115810, -77810, 190275, -116884, 20691, 79559, -134059, 84387, -18760, -42553, 151510, -147958, 488, 164720, -208417, 46503, 169525, -195240, 78514, 89775, -198630, 116687, 56862, -119825, 116447, -28565, -60559, 104102, -85982, 1043, 94155, -80970, 45824, 5573, -70601, 87596, -33162, -6788, 79075, -108769, 39312, 74678, -156096, 86873, 81592, -161057, 89970, 45806, -145849, 99041, 44539, -111235, 72742, 6981, -73310, 45800, -8775, -7865, 24032, -23224, 6452, -17335, -11178, 43409, -39914, 6835, 47980, -78967, 22567]
198B2567J6394j25498J48912j6821j54208J57190j3616j31246J60553l1706j09915
209g7394J22121l1564o4614Q1325k0005j9872K4195k6401K0850k1354J1544L8288
221C7119o8094M0756J8747q2042Q1517N250r0169J03807k8885q6956J15713l6850
233I913o5442J04865k6675p8493P4977L751o1007M8951K0994n2837M954M5082
245B9033l9415k0978O1567j3040n2699M8917O500o6146O3131J4853p5606N3464
257I581K3369p6486L8820M3538o9666K8602L6071p0467K2518N3465o7262J1313
269a6604O0583o7390O847M3488m4946P182L6350k4497k3663K7111R645l2739J2780
282e853L3556m9555J8556M0011p8025L4708N6935q3227J7340O2605q1961K0781
$$ y = [22567, 38961, -86537, 62375, 45554, -108654, 48536, 34920, -96326, 64227, 32521, -77394, 44727, 13163, -51451, 29874, 9869, -10003, 14192, -12209, 8641, -12713, -1169, 37119, -30975, 9781, 28528, -53514, 28003, 33253, -56916, 46891, 18006, -68950, 46763, 9913, -55529, 49336, 22661, -55832, 19145, 22896, -38111, 10840, 31834, -21003, -16049, 29033, -10382, -31360, 30207, 17167, -35532, 13385, 19885, -46261, 16870, 31723, -43883, 9581, 32950, -43536, -4716, 38822, -30844, -2242, 33829, -36638, -14120, 39345, -27917, -16604, 43979, -23411, -16564, 26924, -18022, -10840, 25510, 1013, -22650, 4461, 14106, -18633, -5853, 27703, -21852, -3296, 36715, -41310, -6602, 50333, -32894, -15554, 47051, -34910, -14129]
294a4129O7449q9810J8300P3111p6311q210O8276m6299j0385M6458l0414k1732
306b3696L4408J7614n6285J3458O0685o4877r889P3389o6466q772R3737q6155
318b2849j7086R8286p3355j8692P6657o0504m933O5179o7112L226M9199l6937
330h921L056P206l527N391j1246J6629j3013j9403O1311m7630l6430R7997o2799
343a1379k5396R1104q3270o117R9924r3812q607R1418p3899M205M5344n3247J9092
356d640K6578k7602j682R63K1462p378l8489N4762j8581l5161P5189n9251k8624
369d2454J03559o8111m1503J00756o3820k0294Q2157o7750j0495O8332m0687k0482
381b0792L2557q948l17n881K835P856k3755L2852p068m6515O0492l08o2563N8673
$$ y = [-14129, 53320, -36490, -18190, 54921, -21390, -29600, 38676, -7623, -18008, 28450, -1964, -23696, 10712, 28326, -27959, -14501, 46184, -18693, -28582, 44807, -21659, -30431, 63306, -22849, -39935, 58351, -15004, -33696, 42961, -17543, -22476, 42703, -24409, -21183, 28016, -8921, -5865, 1341, -2186, 3205, -8041, 8588, -4425, -23828, 37483, -10147, -46577, 51420, -11379, -36775, 54329, -28941, -35058, 64866, -28946, -37553, 53865, -20034, -15829, 29515, -23732, -4640, 21938, -5664, -7346, -6383, 15079, 7701, -30788, 23974, 5393, -29768, 45421, -13830, -42454, 61105, -7006, -48509, 52247, -11573, -31867, 50290, -17460, -27955, 40377, -310, -20792, 11765, 2817, 2500, -3381, -546, 7310, -16445, 16407, 9339, -37176, 23316, 23008, -39555, 19118]
395A9118q904m4934P1237m1925l2799P8963m6440k1827N9991n3236M207N6127
407C9578o3766P017M0950k9720J634P53M298O847k4159K8769n925m5011P4203
420C5468k4774o9908R7478k4354o1657Q4076l4793l9370P7394m4546k4262N1992
432B2744k9269P742P249k7433K6691N86j4975J2784j8508J9437J0242m3498L7615
445A1407k272l7300N7019k3087m6540P3005j9753n1826O6999k2657l2305N1052
457B3742k3921j9380L4562j2356r605J0728p898J0719r361m697J5915j2249N113
470A312q03j4130K4718l672k9169L8379j5299l2147O3817l4291m6142Q2884k4086
483A1371n6841P4008k4146m1548O5290k0114l2867K5613R591r593j7994K2423
$$ y = [19118, 10214, -34720, 36517, -5408, -38207, 40756, -5684, -27511, 32480, -20756, -16549, 39578, -24188, -17171, 23779, -5941, -4307, -3554, 744, 7591, -16568, 12201, 6276, -38735, 35468, 10694, -59214, 38264, 13910, -47747, 36329, 1536, -37834, 39560, -4986, -29248, 22744, -6525, 1217, 8466, -18967, 7724, 8310, -6665, 6119, -12389, 7048, 17290, -26208, 11407, 9135, -28165, 28854, 5767, -40773, 32232, 12479, -39347, 27652, 4995, -27310, 23742, -179, -19559, 15003, 2647, -6958, 3770, -4128, 6591, -2770, -7467, 8448, -3801, 1312, 509, -13621, 11097, 7425, -21744, 16635, 1336, -30811, 33006, -1285, -47427, 35457, 11371, -45470, 28538, 4392, -37156, 28134, 8020, -24847, 766, 10357, 764, -17230, 5193]
495E193R894m0754L2193J3561n4604M6908N831m5089M0589j1842k3049M3381k5738
508c526j5698M7954l7922j3169M9301l1431j6412M0927j4881k4144L0066k155
520H910k2723J3340J8848j9226j6936L3004j0866k4715L7617o966l5543L8183
532A2927Kl4529L3545m845k1214K5873p983k1110K5365j205j9623K5353p466k2316
546a7226K1035O897j9984Q434J1001j2693p389J4469O304l2031K6757K2516n5949
559b7859K3750L0251n2020K3346L1294m8537J4142J9529k3417N817P719O5q478
572d398K164N329j1393P502Q250j5166J2246K264k4341K4380K740k3014K3940
585A0503J488l4988K5862J8491m4903K3100K8374m6109R464L4202m2501J658M9043
$$ y = [5193, 15087, -25667, 6526, 20087, -34517, 12391, 18222, -26867, 13722, 1880, -21169, 22212, -3526, -19224, 28730, -9192, -22361, 26940, -4491, -20903, 20024, 5143, -19001, 11065, 8910, -13813, -473, 18375, -851, -17787, 15217, 4351, -20364, 17253, 10287, -25256, 12927, 12929, -21600, 11945, 7100, -14114, 11759, 3776, -17334, 8031, 6826, -12797, 12556, 5090, -17226, 3809, 10706, -9278, -844, 10157, -2536, -9925, 4544, 10848, -21183, 5574, 28090, -27859, -4109, 26142, -25878, -2532, 28762, -19775, -5633, 13896, -9521, -3704, 4015, 4080, -4398, -2234, 3095, -8298, -796, 7454, -7712, 4534, 6798, -17543, 6837, 9577, -13437, 10503, 11991, -22997, 2865, 21356, -23547, -447, 27927, -18182, -8718, 25484, -17017, -15359, 33684]
598C3684l6360j9919L9952j4361k2641L6067o915k9257L0612j000k7429J8339
610G72J4935k3946O965J7848l1024M455L3825l1495n063M0983m1948o310M5852
623B5849l7782m13L7654l4242o142K9790k0511m640J8710l770r458K3Q625j2399
637h706N024J9652k1975l471K2590k1983n94K6573k6921M345K4923l1520k802
650a4865L2479k0972o869L0162k7538q749L2013j6170j1685K4450o691j5773J0372
663A64M959q117k168K0822j5321j8410L4224j6450j9210M1701j6067k6764L8876
676A8239j9045k0320M1802j7089j8700K8397j3140j3556K1970q313j476Q197r084
689b118K321p303R514O470j8837J7771k274k4740L0819r069k1639M4183k7217
$$ y = [33684, -2676, -22595, 17357, 2996, -19645, 16422, 9507, -19750, 10862, 9862, -17567, 772, 15707, -8239, -1274, 16574, -14450, -9995, 23830, -7665, -12728, 28255, -13693, -20003, 25849, -11933, -12346, 25308, -8934, -15076, 14714, -5797, -10437, 8273, 4503, -4955, -4932, 3693, -8706, -3682, 15970, -6005, -9476, 13114, -8869, -9463, 17110, -9811, -5466, 19457, -12063, -14865, 17614, -3358, -10227, 19935, -7603, -16352, 15661, -509, -12194, 12256, 5565, -10208, 164, 5123, -2994, -5162, 15660, 339, -18071, 16153, -297, -19507, 22194, 6127, -20637, 18239, -806, -21126, 20676, 3587, -15113, 13284, 144, -13412, 8558, 245, -1231, 6966, -2118, 203, -7100, 2414, 8884, -9953, 7818, 5544, -19196, 11623, 2554, -19085, 25098, -2119]
702b119j9186M1207k9611m673L7971k9829o090K9971k6814k406K1618r236l678
715b875M483J1p753j677J7017m969j8847K7632q294k8934L9286r932k5252L9527
729A9423j6982k6851L9993j5174j5413L4200k0933p785J8611j4436P39J3124o440
742B076q57l660J085N772j3292J6860J677k2917K3518n996k6027L6000l299k9590
756a8650L6272j6177k2432L9019j8570j2386L0622j9280j0346K1618j5217J930
768c597J3109q388k443m119R137l302j1094K3314p969k4004L2974j1525k8350
781b6257M8333j4076l2907M1649j2544k9281L8020n161k4847K7518n800j7642
793a2995J3023O025p953l20Q563o926r407J3855J732j7362K0793o83k6143K4904
$$ y = [-2119, -21305, 19902, -9709, -14382, 23589, -6240, -12330, 17641, -9173, -11579, 10039, 803, -2875, 1608, 1619, -6134, -7811, 9206, 4237, -14610, 13022, 4728, -24206, 15080, 5148, -20104, 19423, 2441, -24410, 15583, 409, -15004, 19196, -1737, -9522, 9089, -5347, -4608, 8516, 2076, 1219, -2441, -1356, 4416, -8876, 7984, 9661, -13256, 10262, 4266, -21761, 14239, 10940, -18650, 17622, 1445, -20987, 18032, -538, -12924, 17698, -1582, -11928, 9690, -5527, -3597, 9512, 1124, -1319, -5438, 3699, 397, -10697, 12617, 4648, -19356, 13618, 2093, -26257, 22076, 8000, -24907, 16742, 4198, -25083, 12937, 7776, -17071, 10447, 4647, -12995, 28, 6053, -1900, -2220, 6343, -583, -9990, 3865, 5597, -11765, 9028, 8345, -17798, 7106]
807G106p31k2572K8781k992k9365L1226n587k5761L3514m887k2458K3113m037
820E350j9857J9207L853j3473M881O641q720p659J9528n592j5343K4011o437k6557
834b0167K8888K392l1230L1700J869l5426K8129P851l3454K4026J2607l3058J6019
847A46J0711k2811R415J4288j4120o198J5810o516j2070J7533J552k0716J7547
860D571L757k5368K0055Q297k3209J3766J0744k8052J2546J7786k7576J1048J6554
873A4919k7192Q329J6982k4445J0068J3325j8923N064N582o413j384P457J747
886E116j1271N329R389j8240Q128J7638k8150J0216J8724l2069J1120K3456l3086
899a3700R770K5180l5690Q630K1668k3505M973J1699j0768k606M614O256r429
$$ y = [7106, 6375, -16197, 12584, 9592, -19773, 11453, 5866, -19895, 13619, 8732, -13726, 9387, 5350, -14507, 4700, 8553, -4920, -39, 6602, -2118, -9777, 9751, 4159, -11184, 12827, 6390, -20167, 8721, 11113, -20117, 11583, 13452, -21974, 6155, 14006, -19448, 4578, 17185, -15873, 146, 10857, -11954, -2539, 11749, -2371, -8569, 7241, 725, -11345, 6188, 7740, -12976, 4571, 8328, -17040, 3015, 11312, -11897, 1869, 12613, -15439, -2893, 14893, -12683, -1635, 14919, -12273, -3944, 13038, -11407, -1339, 11986, -6937, -1873, 3709, -2704, -4088, 3369, 5116, -6155, -826, 8563, -9677, -1549, 16089, -12061, -1845, 16879, -15190, -4070, 19386, -13700, -3930, 21250, -14440, -5810, 15858, -7647, -2674, 9025, -1743, -4349, 265, 6521, -2908]
912b908m682K2028j8131q104K8356k3852l188K8767k4184m723K5441k1410O1K0339
926A3810k1362L414J4217j7687L361J2925j5033L656R027j0380J769K065K640
939B422n350j063J3425j5465m566K5067j9055p455L0583k6978l845L2251k8516
952h545l109K9203k4404k074K4611k4733L242J8458j7591K615O871o343J151P85
966A37L793m233p815K0588j4163j2012L3891k5851r113L8368l1148p111L6367
979B1698l0059l05K6916k7062M602J3490j3632N805P30n622O294l016l20K075
993A594o915J1034n333o284J3925j4328J991J8931k4036Q71K5935k8240L621K5307
1007A8073l0312M796K3777k4199j613K1005j5601k250J2746o364n064L624P219
$$ y = [-2908, -7590, 14438, -3693, -11797, 16559, -7293, -10481, 18286, -5898, -10621, 14820, -6590, -6529, 13810, -7552, -4138, 10079, -7608, -4247, 8678, -6355, -2699, 6328, -4052, -2283, -218, 2422, -2928, -3991, 9434, -6031, -10597, 14470, -4585, -12040, 18543, -8435, -12280, 19971, -8545, -11654, 17549, -6855, -8929, 15682, -9051, -5809, 12649, -4942, -2327, 4544, -1799, -648, 137, 3930, -303, -8118, 12470, -1693, -13705, 20186, -5665, -14778, 23590, -7558, -14669, 21698, -8361, -8666, 18250, -8812, -4210, 9280, -4352, 1453, 2183, -3439, 2855, -161, -481, 1594, -5321, 5713, 380, -5904, 8021, -6307, -4316, 14615, -9421, -8550, 17385, -10855, -7234, 18073, -12239, -7443, 16334, -7865, -9478, 11527, -4074, -6324, 6422, 58, -5006, -1382, 5837]
1020E837q691k431J3313j0315p538K1153j2196j2013K6600j6217p777K5413k0756
1033e618n658K7340j9432n921K2032j8843J407J5273j4087n83Q114j914k430k438
1047b758O098j471q379J6411j0394j1930K6805j5577r730K5748j9051n423K5667
1060A6016k2653j497K2081j9944J104J4408j1901l566J0996l631p327Q047L348
1073E481j2433K726J5645j6468l658K0963j5518p405K3581j4285j4212K9597j2267
1086A747j7018K4824p798j3377J9625m777j4128J5178n38r579N320M283o366m90
1100c094R003q587k635J2077n851r040J5077m758j2553J8897p047j2045K0516
1113I960p138j5307K2292o812j4348K0395p345j0356J4753k606j0232Q382M892
$$ y = [5837, -2854, -5285, 8028, -2287, -9825, 11328, -868, -12881, 13719, -2498, -10275, 15138, -5618, -11276, 16064, -3368, -9289, 12743, -6100, -4693, 10580, -3507, -4090, 4024, 2110, -320, -2758, 3340, 1869, -6510, 9901, -493, -12423, 14382, -1195, -10925, 14823, -4228, -9651, 16016, -6637, -8134, 13947, -5997, -4893, 9515, -2386, -5952, 5044, 1413, -5914, 2133, 5481, -6952, -4226, 11419, -5049, -8707, 12256, -3262, -10667, 12914, -1371, -15583, 14014, 1747, -15271, 9553, 1755, -11622, 8003, 3226, -10902, 4276, 3738, -5841, -521, 3762, -2604, -3094, 5909, -2678, -5313, 6764, 913, -8127, 6950, 2192, -10361, 8536, 1489, -10556, 9960, 2822, -12485, 9807, 2995, -11353, 9042, 1697, -8659, 6094, 3488, -6744, 1638, 6530]
1126F530r738O2R736o908o854J7176r806j1513K1742p869j4186K0061k885j7214
1140a1666J8885j779j7689J6462L634j7110R980P030j5853P807O806j1021K632
1153a882O580n929m191R270k606o644Q131J905j2455Q707N673j5786J0976N200
1167F949j6216R366O485j5454R938O382j5416R619L314j1420O819L453p325M384
1181H78J902n451J456K289K204p202N625M109j4210R932O787j8195J2056R168
1195A1348k3757J4071Q659k1425J3562Q164j8301N875R878j2720K538Q418o491
1208a81k491M965J15p310N119O316r538M81R323j2331J657J4019j6545N110J0254
1223H963j7604P377Q583j6003J0426O337j7603J1447K018j0844R210J386p536
$$ y = [6530, -3208, -3146, 6590, -318, -7172, 10004, 198, -11315, 10427, 2558, -11628, 8433, 5548, -11666, 7219, 5440, -12249, 4213, 7847, -9263, 717, 7747, -8106, -299, 6507, -4514, -1882, 4698, -1231, -5422, 3848, 1242, -5402, 2729, 4634, -7821, 886, 6559, -9227, 1749, 6949, -9267, 99, 6584, -8870, 1068, 7450, -7966, 1653, 4967, -6453, 366, 3819, -3506, 878, 2780, -2671, -1215, 1074, 3278, -3924, 1701, 5810, -8400, 1532, 8319, -9876, 2180, 11348, -12409, 1662, 10321, -11104, 2458, 10622, -7679, -1804, 8074, -4646, -2108, 6310, -181, -2672, 2293, 2408, -4902, 217, 6533, -3005, -2524, 6799, -5532, -3875, 10144, -6401, -1291, 8963, -8641, -1264, 7319, -8684, 1742, 8079, -9524, 1923, 3941, -6903, 2307, 3693, -3843]
1236c843L678J816m096N76K746K788p593K195P301j2801O293R849j6913O852J1675
1251A0523k2220R982J2847k1220J2080O949j8496R459O571j2066O675L182o030
1264a764J396j053L583l650J536O247r946j7J0940j1452L10J4656j5894K861J1038
1279H791j6866O162J1976j5077M254P364j4252Q499M043r329O261J054m660N80
1293a200O70J173Kj047M145q024L04J0876j2161K839J2099j6397K684J3596j8482
1308h923N740J6163k0594M028J2132j5302K735J1227r280n06N625l409m516K468
1322b412R250r274k473J2959j2812l124J8391j2709n945K0379j5086o834J8385
1335H695j1449j736J4074j1700l326J1425r227Q28P734n091j070J202M77m488
$$ y = [-3843, -165, 1651, -2445, -1869, 877, 3665, -3928, -1733, 5568, -7233, -940, 8909, -8004, -1152, 10523, -11697, -1715, 11132, -10088, 1992, 8941, -9555, -96, 6475, -5591, 1084, 4266, -1764, -368, -1421, 2162, -1488, 48, 6295, -3651, -3668, 7272, -4180, -3870, 10786, -5108, -2247, 8791, -8075, -1913, 10063, -5014, -760, 6604, -7648, 851, 4894, -4435, 1826, 2880, -1780, -1200, -530, 643, 645, -402, 3743, -4281, -3977, 6899, -5262, -2423, 9676, -6721, -4037, 9559, -8923, -3183, 12980, -7614, -3586, 8546, -6756, -4021, 7206, -2074, -2580, 3045, -364, -4880, -2412, 6838, -2436, -4909, 8050, -4762, -7886, 10505, -2204, -8149, 12230, -2856, -9690, 8695, -2754, -4490, 9584, -2116, -5442, 5983, -3244, -2416, 5318, 227, -843, 359, 836, -3652]
1349c652L191P388q868k433J2845j2581l324J9245j4703l762J8805j5657p804
1362a1310K2527j0749r111J8922j1043q761J5971n755p393J1772j963q476M473
$$ y = [-3652, -461, 6927, -1941, -4374, 8471, -4110, -7434, 11811, -2892, -6654, 12151, -3506, -11310, 11217, 468, -8643, 10279, -764, -9525, 6446, 691, -6702, 5070, 3107, -5369, -896]
$$ [...]
8191g8
##END NTUPLES=NMR FID
##END=
