##TITLE=1H_SA_Sl.Me.2
 CDCl3, 8 sc, 
 26.8.2020
##JCAMPDX= 6.0         $$ Bruker NMR JCAMP-DX V2.0
##DATA TYPE= NMR FID
##DATA CLASS= NTUPLES
##ORIGIN= UXNMR, Bruker Analytische Messtechnik GmbH
##OWNER= root
$$ XWIN-NMR		Version 3.5
$$ Thu Aug 27 11:14:50 2020 Russian Standard Time (UT+4h)  she@DPX200
##.OBSERVE FREQUENCY= 200.1315066352
##.OBSERVE NUCLEUS= ^1H
##.DELAY= (6, 6)
##.ACQUISITION MODE= SIMULTANEOUS
##.ACQUISITION SCHEME= undefined
##.AVERAGES= 8
##.DIGITISER RES= 18
##SPECTROMETER/DATA SYSTEM= spect
##.PULSE SEQUENCE= zg30
##.SOLVENT NAME= CDCl3
##.SHIFT REFERENCE= (INTERNAL, CDCl3, 0, 15.7039)
##AUDIT TRAIL= $$ (NUMBER, WHEN, WHO, WHERE, WHAT)
$$ ##TITLE= Audit trail, XWIN-NMR		Version 3.5
$$ ##JCAMPDX= 5.01
$$ ##ORIGIN= Bruker BioSpin GmbH
$$ ##OWNER= she
$$ F:/spectra/data/she/nmr/H-F/1/audita.txt
$$ ##AUDIT TRAIL=  $$ (NUMBER, WHEN, WHO, WHERE, WHAT)
(   1,<2020-08-27 11:13:30.64 +0400>,<she>,<DPX200>,
      <created by zg, POWCHK disabled, PULCHK disabled
       configuration hash MD5:
       00 E9 B6 7A A2 85 ED C7 34 08 36 98 17 FE 4E 26
       data hash MD5: 16K
       B9 D7 9E BB FA 9A B8 89 4C B6 6B 4B D5 E1 EE 90>)
$$ ##END=
$$ 
$$ hash MD5
$$ 43 03 7F 85 26 CE 60 BF CB 9C 54 A8 2A 3E 37 EF
##$RELAX= 
##$RELAX= 
##$RELAX= 
##$RELAX= 
##$RELAX= 
##$RELAX= 
$$ Bruker specific parameters
$$ --------------------------
##$DU= <F:/spectra>
##$EXPNO= 1
##$NAME= <H-F>
##$PROCNO= 1
##$TYPE= <nmr>
##$USER= <she>
##$AMP= (0..31)
100 100 100 100 100 100 100 100 100 100 100 100 100 100 100 100 100 100 
100 100 100 100 100 100 100 100 100 100 100 100 100 100 
##$AQSEQ= 0
##$AQ_mod= 1
##$AUNM= <au_zg>
##$AUTOPOS= <>
##$BF1= 200.13
##$BF2= 200.13
##$BF3= 200.13
##$BF4= 200.13
##$BF5= 200.13
##$BF6= 200.13
##$BF7= 200.13
##$BF8= 200.13
##$BYTORDA= 1
##$CFDGTYP= 0
##$CFRGTYP= 5
##$CHEMSTR= <none>
##$CNST= (0..31)
1 1 145 1 1 1 1 1 1 1 1 1 1 1 1 1 1 1 1 1 1 1 1 1 1 1 1 1 1 1 1 1 
##$CPDPRG= <>
##$CPDPRG1= <>
##$CPDPRG2= <>
##$CPDPRG3= <>
##$CPDPRG4= <mlev>
##$CPDPRG5= <mlev>
##$CPDPRG6= <mlev>
##$CPDPRG7= <mlev>
##$CPDPRG8= <mlev>
##$CPDPRGB= <>
##$CPDPRGT= <>
##$D= (0..31)
0 1.2 0 0 0 0 0 0 0 0.06 0 0.03 0 0 0 0 0.0002 0 0 0 0 0 0 0 0 0 0 0 0 
0 0 0 
##$DATE= 1598512410
##$DBL= (0..7)
120 120 120 120 120 120 120 120 
##$DBP= (0..7)
150 150 150 150 150 150 150 150 
##$DBP07= 0
##$DBPNAM0= <>
##$DBPNAM1= <>
##$DBPNAM2= <>
##$DBPNAM3= <>
##$DBPNAM4= <>
##$DBPNAM5= <>
##$DBPNAM6= <>
##$DBPNAM7= <>
##$DBPOAL= (0..7)
0.5 0.5 0.5 0.5 0.5 0.5 0.5 0.5 
##$DBPOFFS= (0..7)
0 0 0 0 0 0 0 0 
##$DE= 6
##$DECBNUC= <off>
##$DECIM= 32
##$DECNUC= <off>
##$DECSTAT= 4
##$DIGMOD= 1
##$DIGTYP= 9
##$DL= (0..7)
0 120 120 120 120 120 120 120 
##$DP= (0..7)
150 150 150 150 150 150 150 150 
##$DP07= 0
##$DPNAME0= <>
##$DPNAME1= <>
##$DPNAME2= <>
##$DPNAME3= <>
##$DPNAME4= <>
##$DPNAME5= <>
##$DPNAME6= <>
##$DPNAME7= <>
##$DPOAL= (0..7)
0.5 0.5 0.5 0.5 0.5 0.5 0.5 0.5 
##$DPOFFS= (0..7)
0 0 0 0 0 0 0 0 
##$DQDMODE= 0
##$DR= 18
##$DS= 0
##$DSLIST= <SSSSSSSSSSSSSSS>
$$ [...]
##$SUBNAM2= <"">
##$SUBNAM3= <"">
##$SUBNAM4= <"">
##$SUBNAM5= <"">
##$SUBNAM6= <"">
##$SUBNAM7= <"">
##$SUBNAM8= <"">
##$SUBNAM9= <"">
##$SW= 16.880792210976
##$SWIBOX= (0..15)
0 0 2 0 0 0 0 0 0 0 0 0 0 0 0 0 
##$SW_h= 3378.37837837838
##$TD= 16384
##$TD0= 1
##$TE= 0
##$TE2= 300
##$TE3= 300
##$TEG= 300
##$TL= (0..7)
0 120 120 120 120 120 120 120 
##$TP= (0..7)
150 150 150 150 150 150 150 150 
##$TP07= 0
##$TPNAME0= <>
##$TPNAME1= <>
##$TPNAME2= <>
##$TPNAME3= <>
##$TPNAME4= <>
##$TPNAME5= <>
##$TPNAME6= <>
##$TPNAME7= <>
##$TPOAL= (0..7)
0.5 0.5 0.5 0.5 0.5 0.5 0.5 0.5 
##$TPOFFS= (0..7)
0 0 0 0 0 0 0 0 
##$TUNHIN= 0
##$TUNHOUT= 0
##$TUNXOUT= 0
##$USERA1= <user>
##$USERA2= <user>
##$USERA3= <user>
##$USERA4= <user>
##$USERA5= <user>
##$V9= 5
##$VALIST= <valist>
##$VCLIST= <CCCCCCCCCCCCCCC>
##$VD= 0
##$VDLIST= <DDDDDDDDDDDDDDD>
##$VPLIST= <PPPPPPPPPPPPPPP>
##$VTLIST= <TTTTTTTTTTTTTTT>
##$WBST= 1024
##$WBSW= 4
##$XGAIN= (0..3)
0 0 0 0 
##$XL= 0
##$YL= 0
##$YMAX_a= 223154
##$YMIN_a= -160638
##$ZGOPTNS= <>
##$ZL1= 120
##$ZL2= 120
##$ZL3= 120
##$ZL4= 120
##$ABSF1= 10
##$ABSF2= 0
##$ABSG= 5
##$ABSL= 3
##$ALPHA= 0
##$AQORDER= 0
##$ASSFAC= 0
##$ASSFACI= 0
##$ASSFACX= 0
##$ASSWID= 0
##$AUNMP= <proc_1d>
##$AZFE= 0.1
##$AZFW= 0.1
##$BCFW= 1
##$BC_mod= 2
##$BYTORDP= 1
##$COROFFS= 0
##$CY= 11.3945322036743
##$DATMOD= 1
##$DC= 2
##$DFILT= <>
##$DTYPP= 0
##$F1P= 16.9975609425685
##$F2P= -3.02152046262296
##$FCOR= 0.5
##$FTSIZE= 0
##$FT_mod= 4
##$GAMMA= 1
##$GB= 0.15
##$INTBC= 1
##$INTSCL= 1
##$ISEN= 128
##$LB= 0.24
##$LEV0= 0
##$LPBIN= 0
##$MAXI= 10000
##$MC2= 0
##$MEAN= 0
##$ME_mod= 0
##$MI= 1.114404
##$NCOEF= 0
##$NC_proc= 0
##$NLEV= 6
##$NOISF1= 3.799351
##$NOISF2= 2.8
##$NSP= 1
##$NTH_PI= 0
##$NZP= 0
##$OFFSET= 15.70392
##$PC= 1
##$PHC0= -9982.243
##$PHC1= 23.00092
##$PH_mod= 1
##$PKNL= yes
##$PPARMOD= 0
##$PSCAL= 0
##$PSIGN= 0
##$REVERSE= no
##$SF= 200.130013532006
##$SI= 16384
##$SIGF1= 3
##$SIGF2= 2
##$SINO= 400
##$SIOLD= 16384
##$SREGLST= <1H.CDCl3>
##$SSB= 0
##$STSI= 0
##$STSR= 0
##$SW_p= 3612.71676300578
##$SYMM= 0
##$S_DEV= 0
##$TDeff= 0
##$TDoff= 0
##$TI= <>
##$TILT= no
##$TM1= 0
##$TM2= 0
##$TOPLEV= 0
##$USERP1= <user>
##$USERP2= <user>
##$USERP3= <user>
##$USERP4= <user>
##$USERP5= <user>
##$WDW= 1
##$XDIM= 8192
##$YMAX_p= 0
##$YMIN_p= 0
$$ End of Bruker specific parameters
$$ ---------------------------------
##NTUPLES= NMR FID
##VAR_NAME=  TIME,          FID/REAL,        FID/IMAG
##SYMBOL=    X,             R,               I
##VAR_TYPE=  INDEPENDENT,   DEPENDENT,       DEPENDENT
##VAR_FORM=  AFFN,          ASDF,            ASDF
##VAR_DIM=   8192,          8192,            8192
##UNITS=     SECONDS,       ARBITRARY UNITS, ARBITRARY UNITS
##FACTOR=    0.000296,      1,               1
##FIRST=     0,             0,               0
##LAST=      2.424536,      0,               0
##MIN=       0,             -160638,         0
##MAX=       2.424536,      223154,          0
$$ Real data points
##PAGE= N=1
##DATA TABLE= (X++(R..R)), XYDATA
$$ [...]
2131f96r48J299K439j306k650M51K529O73k081j459J011K578j018j807J8J406
$$ -696 -1644 -345 2094 788 -1862 -1411 1118 1791 -290 -1749 -738 1840 822 -985 -967 439
2147D39P50j398j130O64J238o98m33j147J259N83p91p2q1P82o00j97L06P23o49
$$ 439 1189 -209 -1339 -675 563 -135 -568 -1715 -456 127 -664 -736 -817 -35 -635 -832 -526 197 -452
2166d52n51Q24K48K41j904L89J451O80j238j376J651J522m0k815J12K120J430
$$ -452 -1003 -179 69 310 -1594 -1205 246 926 -312 -1688 -37 1485 1445 -1370 -1258 862 2292
2183B292j360k831J177K374O40l177j062J733K173j236k432K15J841J863k678
$$ 2292 932 -1899 -722 1652 2292 -885 -1947 -214 1959 723 -1709 -1494 347 2210 -468
2198d68j687J472K108l06k429m21J443J584j492j186qJ314O15j339j52L17J224
$$ -468 -2155 -683 1425 1119 -1310 -1731 -288 1296 -196 -1382 -1390 -76 539 -800 -952 -635 589
2215E89o62m39J43K91Q5n76K96k85N47m97m0M62j12n25J9R46P5m92j105O21J259
$$ 589 -73 -512 -369 -78 7 -569 -273 -558 -11 -508 -548 -86 -198 -723 -704 242 317 -175 -1280 -659 600
2236F00q0j182j148K038P33q79j961L95J960N89j814j677J595J616L31k571m68
$$ 600 520 -662 -1810 228 961 82 -1879 -1484 476 1065 -749 -2426 -831 785 1116 -1455 -1923
2253a923K192J339j133k201P33K065N16j848r84J168J679l02k290N62R86R94j098
$$ -1923 269 1608 475 -1726 -993 1072 1588 -260 -1244 -76 1603 1301 -989 -427 559 1553 455
2270D55j067M12Q85K92j073n11O22P00o48m26L13l39M48k19K12l48j21q8O47L03
$$ 455 -612 -200 685 977 -96 -607 15 715 67 -359 -46 -385 63 -156 56 -292 -413 -501 146 449
2290D49o74k94k56J768l75j455j72O76J213n62j698j41K316L55j307j507O64K416
$$ 449 -225 -519 -775 993 618 -837 -1009 -333 880 318 -1380 -1521 795 1150 -157 -1664 -1000 1416
2308A416n76j744m48J460J452r27j944L89J568N03j143j499J448J270l69j222
$$ 1416 840 -904 -1352 108 1560 633 -1311 -922 646 1149 6 -1493 -45 1225 856 -366
2324c66m21J126Q31j034r34Q68L08N60r70k01O66m21O82o33j85M40K89m44O63
$$ -366 -787 339 1170 136 -798 70 378 938 -32 -233 433 12 694 61 -124 316 605 161 824
2343H24j71m58J01l3M90l82m02K36O10K63j082q58R19J152r96q53l47J270P67
$$ 824 653 195 296 263 753 371 -31 205 815 1078 -4 -862 57 1209 213 -640 -987 283 1050
2362A050j484p81O88J545j68j420j008J976J027j134j404k52K309L69j741q84
$$ 1050 -434 -1215 -527 1018 850 -570 -1578 398 1425 291 -1113 -1365 944 1313 -428 -1312
2378a312J78K051J24k016m09J479N86l27j631L53J567j66n80p36N23J064m37r17
$$ -1312 -1134 917 1041 -975 -1384 95 681 354 -1277 -924 643 477 -103 -839 -316 748 311 -606
2396f06K78N71k10K80o48Q09n24J29K75J10p9l88n34Q40R02j728L17M18N61M21
$$ -606 -328 243 33 313 -335 474 -50 79 354 464 385 -3 -537 303 1205 -523 -206 212 773 1194
2416A194k001K42P57J278r51j777M41J838M05j965n63N25K460j016k210kJ833
$$ 1194 -807 -565 192 1470 519 -1258 -817 1021 1426 -539 -1102 -577 1883 867 -1343 -1345 488
2433D88J132j571j785M75K547o17j329j077J334J971j578j272J58J724J4q08j458
$$ 488 1620 49 -1736 -1261 1286 669 -660 -1737 -403 1568 -10 -1282 -1124 600 614 -194 -1652
2450a652J160J212n87k05j365J667K78r76o1L14j15K09k88j36Q91j039J92K61
$$ -1652 -492 720 133 -72 -1437 230 508 -468 -529 -215 -330 -121 -409 -545 346 -693 -501 -240
2468b40J88M73j404K79J068l0q42m66R84R92o37j484P87O85R16j265j489J709
$$ -240 -52 421 -983 -704 364 334 -508 -974 10 1002 365 -1119 -332 353 1269 4 -1485 224
2486B24N99J15j559l46J201J377j772j068P70J508J56k178j81J422J079q54j662
$$ 224 823 938 -621 -967 234 1611 -161 -1229 -459 1049 1205 -973 -1154 268 1347 493 -1169
2503a169M27J148R86j889p21R27R63q1j523J43Q43N83q37k15j60J057k86m68J87
$$ -1169 -742 406 1392 -497 -1218 -291 672 591 -932 -789 54 637 -200 -415 -575 482 196 -272 -85
2522h5k78P31n71K75Q5l62m5K39Q6L14p09p50J197K44l07q23k27J310M51j226
$$ -85 -363 368 -203 72 157 -205 -250 -11 75 389 -320 -1070 127 371 64 -759 -986 324 775 -451
2542d51q00O75J367o5j967P0J334Q84q78j712J115J534j50j263p58J115J368p16
$$ -451 -1251 -576 791 726 -1241 -1171 163 1047 169 -1543 -428 1106 956 -307 -1065 50 1418 702
2560G02j481L83J296L62j165q22O15J392l81j279M22K38J043j413k02N35L93l2
$$ 702 -779 -396 900 1262 97 -725 -110 1282 901 -378 44 282 1325 -88 -290 245 638 606
2578F06q87J54J42O70q48J30K05m7k09o26P99N43q03n16M96P02m3j328m2J588
$$ 606 -281 -127 15 685 -163 -33 172 125 -84 -710 89 632 -171 -687 -191 511 468 -860 -902 686
2598F86R8o46j323M42J823m62j468n73J498J387j050j808P48J580L26j412j481
$$ 686 784 138 -1185 -743 1080 618 -850 -1423 75 1462 412 -1396 -648 932 1258 -154 -1635
2615a635J809J336n26k116n3K079O29j413j595J461R94J57j853l20J219J132p00
$$ -1635 174 1510 984 -1132 -1185 894 1523 110 -1485 -24 970 1127 -726 -1046 173 1305 605
2632F05j447O23R14j28j013K9Q21K23p3r46P17J83k65m82K50R12m73n66k08J103
$$ 605 -842 -219 695 567 -446 -417 404 627 554 -392 325 508 243 -239 11 923 450 -116 -324 779
2652G79M7q74m32N92J432j331r90j22J839Nj235j063J018J544p33j316o25K246
$$ 779 826 -48 -480 112 1544 213 -777 -899 940 945 -290 -1353 -335 1209 476 -840 -1465 781
2670G81M78j668j401J084J693l30j936l81J967J058j083j804L65K030K04j330
$$ 781 1259 -409 -1810 -726 967 637 -1299 -1680 287 1345 262 -1542 -1177 853 1057 -273
2686b73j143J073J414k97j625nJ115P20n94j168O53P67K2n60m49R11K03n38o17
$$ -273 -1416 -343 1071 774 -851 -856 259 979 385 -783 -130 637 659 99 -350 561 764 226 -391
2705c91P90o0J03k53r3N81o99j14K79N98l34p72R7P31N07r95k67N9J184j23j525
$$ -391 399 339 442 189 96 677 -22 -136 143 741 407 -365 -268 463 970 -25 -292 -233 951 828 -697
2726f97K80J019P60j258q68J51J875kj468j198J475J505j056j198l7R53J031j186
$$ -697 -417 602 1362 104 -764 -613 1262 1260 -208 -1406 69 1574 518 -680 -717 236 1267 81
2744H1j475R41J311m54q09p41R94R85o17j182J71J064L13p71m36L62K98L12m54
$$ 81 -1394 -453 858 404 -405 -1146 -152 833 216 -966 -795 269 582 -189 -625 -263 35 347 -107
2763a07l81O62o5n7k27K91K5l28L09L64r9p53M44L65M95q60n38R44N71k36j332
$$ -107 -488 174 109 52 -175 116 141 -187 122 486 387 -366 78 443 938 78 -460 484 1055 819 -513
2784e13K00P66R01j268p73M27J265K47j589o9P00J328q25j589JJ465Q88j413o10
$$ -513 -313 453 1354 86 -687 -260 1005 1252 -337 -406 294 1622 797 -792 -791 674 1562 149 -461
2803d61L4J547j33j275m86J131R05o65j259K53J052lo84l91K99Q35o56l20j70
$$ -461 -427 1120 987 -288 -774 357 1262 597 -662 -409 643 640 -44 -435 -136 699 43 -277 -447
2822d47M03O4J09k65J35J74m82L74j24K50m26j98Q96op47l65P30M89N00j745k21
$$ -447 -44 20 129 -136 -1 173 -309 65 -59 191 -235 -433 463 457 -290 -655 75 564 1064 -681 -902
2843i02J448M17l98j858Q82J347L14j439o54P40J367j05k048J33R17J321r86j713
$$ -902 546 963 565 -1293 -411 936 1250 -189 -843 -103 1264 1159 -889 -756 161 1482 496 -1217
2861a217Q52J125M64j332p07R33J174p43j166J17Q02J055j443n76N13P61qq13
$$ -1217 -365 760 1224 -108 -815 118 1292 549 -617 -500 302 1357 -86 -662 -149 612 604 -209
2879b09k81N95O06n85j01l3M49n8r09N82j24Q2j01l4q3M73l70m35P47r6j9j066
$$ -209 -490 105 711 126 25 -8 441 383 -526 56 -68 14 -87 -121 -204 269 -101 -536 211 115 96 -970
2901i70Q07M99m62m29m94J196L80m37j303O78R44J46q89p16J116Q50k41j445m00
$$ -970 -163 336 -126 -555 -1049 147 527 90 -1213 -535 409 555 -334 -1050 66 916 675 -770 -1170
2920a170J681L60r10p20N96J012K09j470k72R62N50n52r98K06Q00M99o42n92M37
$$ -1170 511 871 -39 -759 -163 849 1058 -412 -684 278 828 276 -722 -516 284 783 141 -451 -14
2939a4N97n6q81K36J79K98r4l08k40M70p8J66n7k71J16n1J17j9l95j51N86K42
$$ -14 583 527 -354 -118 61 359 265 -43 -283 187 109 275 218 -53 63 12 129 110 -285 -436 150 392
2961C92k37n79p1Q54K6o64n52p5J021K81j062j95N81O13j02j323L07J126N6m61
$$ 392 155 -424 -495 359 385 -279 -831 -906 115 396 -666 -861 -280 333 231 -1092 -785 341 397 -64
2981f4j049M71J019p8p11m84Q46N16k05j064J57R19K46m76o17K73L90M49l84k61
$$ -64 -1113 -642 377 299 -412 -896 -50 466 261 -803 -646 273 519 43 -574 -301 89 538 154 -107
3001a07R0L83l6o90K64J48J36j0k49q2j07K10J05j15j56J42j29P51j11q68K81
$$ -107 -17 366 330 -360 -96 52 188 178 -71 -153 -260 -50 55 -60 -216 -74 -203 548 437 -431 -150
3022a50K47N06p36k68L39Q58l07l79p66P49J027q36o93j41J099L87p77p89O09
$$ -150 97 603 -133 -401 -62 796 489 110 -656 93 1120 284 -409 -550 549 936 159 -630 -21
3041b1Q05n03r12m99J433N75p41r91M0J163n2o09p52Q88L98l42k84n52R31o9J54
$$ -21 784 281 -631 -1130 303 878 137 -854 -814 349 297 -312 -1064 -176 222 -120 -404 -956 -25 -94 60
3062F0n54p1P44k48Q4n18M79PMK4K90k96j75L83p1M28m10P8j02P68n60n74K18
$$ 60 -494 -565 179 -69 15 -503 -24 -17 -13 11 301 5 -170 213 142 570 160 238 136 904 344 -230 -12
3085a2M01P73j514J0L39O84k05j262K56J120M53j013l88J20R52M1j314o7Q32O30
$$ -12 389 1162 -352 -342 -3 681 476 -786 -530 590 1043 30 -358 -238 714 755 -559 -626 206 836
3105H36l36q07l56J035N52q36p68M35R02l25n43m73N87O41n54k12j08P23l59m5
$$ 836 500 -307 -663 372 924 88 -680 -245 657 332 -211 -684 -97 544 -10 -222 -330 393 34 -11
3125a1j76K70P7j12j9m09K50K2J1j13J41l42O7L76j1k93k58R4P10m8n17m14M18
$$ -11 -187 83 160 48 29 -380 -130 -108 -97 -210 -69 -411 -344 32 21 -272 -530 -436 274 226 -291 -705 -287
3148b87P60J87j282j41Q86N45l34j262O87P10K43r34m62M07J312m75j217K89N41
$$ -287 473 660 -622 -763 123 668 334 -928 -241 469 712 -222 -684 -277 1035 560 -657 -368 173
3167A73Q55r17j044N40Q58n1q46j09N05M17k34p25j6P12L73m73l43P5L68P6j44
$$ 173 1028 111 -933 -393 465 414 -432 -541 -36 381 147 -578 -594 118 491 18 -325 -250 118 194 50
3188E0n00L19J5j24q7o5J70r9K07k12L1K39n64L47K77j94l43J85N37O5p46m69
$$ 50 -450 -131 -116 -240 -327 -392 -222 -321 -114 -326 -295 -56 -620 -273 4 -190 -533 -348 189 254 -492 -961
3210i61J005L64m14r56L74Q72K33o72q47Q72O58k18j031n7Q78N81n29q05L01N58
$$ -961 44 408 -6 -962 -588 284 517 -155 -1002 -130 528 310 -721 -778 100 681 152 -653 -352 206
3230B06M93r47m10M21R51k50j061K02M24P40m54n64l60Q91j8n45J38r7M87l47
$$ 206 699 -248 -658 -237 714 464 -597 -395 29 769 315 -249 -609 282 264 -281 -143 -240 247 -100
3250a00l4j19J62K1j01K04j66O9l27M97J44n44m7J58N34k02o03p6P29L40o11p55
$$ -100 -134 -253 -91 -70 -171 33 -133 -64 -391 106 250 -294 -341 -183 351 149 -454 -530 199 539 -72 -827
3272h27K24J063k2m08j067P22N42j61o24l63R35L89k49r27J38P74J91m10p34N13
$$ -827 -603 460 438 30 -1037 -315 227 66 -558 -921 14 403 154 -773 -635 139 330 -80 -814 -301
3292c01M66M5m67j59L83O81p10o18M58J50M39l00m54K94J28J21j5j64k47K54j
$$ -301 165 210 -257 -416 -33 648 -62 -680 -222 -72 367 67 -387 -93 35 156 141 -23 -270 -16 -17
3313a7J26J0k62M74l53M61o43l49N77M18k4q82r8O11M63n31p18J68P41M18r76
$$ -17 109 119 -143 331 -22 439 -204 -553 24 442 418 -464 -562 49 512 -19 -737 -569 172 590 -386
3334c86k47N10O60j58o91l82Q79L44q88m18k2J130K6o69m26L16Q89k55j017N7
$$ -386 -633 -123 537 379 -312 -694 185 529 -359 -777 -799 331 357 -312 -738 -422 467 212 -805 -748
3354g48R09j73k63n64L43N84k7k99l69M00J97J97o25J75J56mO8k02L15m3o8k4
$$ -748 161 -12 -275 -839 -496 88 61 -238 -607 -207 -10 187 -438 -263 -107 -111 -43 -245 70 27 -41 -65
3376f5M84m20j91J90M1M84p22k77K73P70j21q89P8Q53L20p94n62K39J152j54j024
$$ -65 419 -1 -192 -2 39 523 -199 -476 -203 567 446 -443 -365 488 808 14 -548 -309 843 689 -335
3397c35k32N33J010l19j355L6Q75O97q31q70N94O80p2m88o57L77J249o92o29m9
$$ -335 -567 -34 976 657 -698 -662 213 910 79 -791 -197 483 411 -77 -734 -357 892 200 -429 -478
3417d78O96L58n07o22K69O16p4l70l28N24K00k76j77M91m78O7QJ46P9m00J93L87
$$ -478 218 576 69 -553 -284 332 258 -112 -440 84 284 8 -169 322 -156 -89 -81 65 144 -256 -63 324
3439C24l37R1n22J75P18k24n02K4L75L31j06p32K82L98L08p17l91M99P10k64q04
$$ 324 -13 78 -444 -269 449 225 -277 -253 122 453 347 -385 -103 295 603 -114 -505 -6 704 440 -364
3460c64K05M52N66n75n76J58Q06L08q20m97N48O34m16m92k42M67M99p53Lo7L44
$$ -364 -159 293 859 284 -292 -134 672 980 160 -337 211 845 429 -63 -305 162 661 -92 -89 -156 188
3481A88K74n77l73L82K62k3o3l90N74n17L12R4j1j64j05P1L32m40l11N93K12k30
$$ 188 462 -115 -488 -106 156 133 70 -320 254 -263 49 143 132 -32 -137 -66 266 -174 -485 108 320 90
3503I0j28l88P14Pk22p18L08J123l81m19o47O66K67J34r33K25M67L54l54r03M20
$$ 90 -38 -426 288 295 73 -645 -337 786 405 -14 -661 5 272 406 -527 -302 165 519 165 -738 -318
3524c18O89K38r94k46P00N29l01q01J95N32J40j53n53N58J07K1n98K52J07M39
$$ -318 371 609 -385 -631 69 598 297 -504 -309 223 363 210 -343 215 322 343 -255 -3 104 543
3544E43m37k31N47k9K36q15P3L75p0l34J65R4j74r0j97O30j96l60k60M47N66l96
$$ 543 106 -125 422 393 629 -186 -113 262 192 -142 23 117 -57 -147 -344 286 90 -270 -530 -83 483 87
3566H7p12R8Q10Ko29k37M42P73n08o70k78R75M15l24j068L58J083l79m07p98O37
$$ 87 -625 -527 283 285 -344 -581 -139 634 126 -544 -822 153 568 244 -824 -466 617 238 -169 -967 -330
3587c30P57J4r49O7P24L64o78o50N24P00j63m43m82O45L68k42n85K70J90L99n57
$$ -330 427 441 -508 -441 283 647 -31 -681 -157 543 380 -63 -545 100 468 226 -359 -89 101 500 -57
3608e7k55K85L81M6p82L19L5Lj24J71N5K65l98r6N57l81P0k56J4N24l96m23m7
$$ -57 -312 -27 354 400 -382 -63 -28 -25 -149 22 77 342 -56 -152 405 24 94 -162 -148 376 -20 -443 -490
3631d90N59M00l82o51M13O98k93p01j65Q40K86m76o35K78Q07j0q83m81Q86K99
$$ -490 69 469 87 -564 -151 547 254 -447 -612 228 514 38 -597 -319 488 478 -405 -886 0 299
3651B99q8r28P1R30M1k31m71P1P70j07p52j17M74J64q5p41L85L48J42k50j46J34
$$ 299 211 -717 -646 284 325 94 -377 -306 464 357 -395 -512 -38 126 41 -700 -315 33 175 -75 -221 -87
3673h7L48ll38L91m40J31j6j59K89k80J09R2M61l46k19j71O06J90l64n17M49N21
$$ -87 261 258 -80 311 -129 2 -14 -173 116 -164 -55 37 498 152 -67 -238 368 558 194 -323 126 647
3695F47k60m79l96Q80K58l95n47l22J004J20o29o56Q29O80o09m36l16R40Q3l04
$$ 647 387 -92 -488 392 650 255 -292 -614 390 510 -119 -775 54 734 125 -311 -627 313 396 92
3715I2p02L50J023n99o00l28O84J55j87k00k04Q92j65n17j76M65K35l59N6p4N31
$$ 92 -610 -260 763 164 -436 -764 -80 75 -112 -312 -516 376 211 -306 -482 -17 218 -141 -85 -159 372
3736C72n40K55k49K33k22j25K54PP0k93J94J84M25n05l17K24M62l6p70M2J43Q52
$$ 372 -168 87 -162 71 -151 -276 -22 -15 55 -238 -44 140 565 60 -257 -33 429 393 -377 -335 -192 660
3758F60k82j116M82O37L06p17l06J53J030k39r23j4Q41J97p31m78lJ139q2q84
$$ 660 378 -738 -256 381 687 -30 -336 -183 847 608 -315 -329 512 709 -22 -500 -503 636 554 -330
3778c30m17P46O50o81k94K2O19J02k35m92J63J64n1l57m6L09J61j48k46k7N36
$$ -330 -747 -1 649 -32 -326 -304 315 417 182 -310 -147 17 -34 -391 -437 -128 33 -115 -361 -388 148
3799A48n62J07J31K80l65k3M41j88J42o22J79N04R3p53j33K81N47j00p55J79M83
$$ 148 -414 -307 -176 104 -261 -284 157 -31 111 -511 -332 172 265 -488 -621 -340 207 107 -648 -469 14
3820A4M64m23n75K97P01m9q05k41P68L32m69p90N63N56J63o19r8N5N49l8n88q3
$$ 14 478 55 -520 -223 478 429 -376 -617 151 483 14 -776 -213 343 506 -113 -211 -156 393 355 -233 -316
3842c16N77N52p11m88K18L43J19l50j44M36J04l81Q3k10J32J59Q4j52j08%L7k6
$$ -316 261 813 102 -386 -168 175 294 -56 -200 236 340 -41 42 -168 -36 123 207 55 -53 -53 -16 -42
3864d2J98k71k47n2L23r8j62k79N39K55j35k83k80N55L07l33m14L42M35K10p90
$$ -42 156 -115 -362 -414 -91 -189 -351 -630 -91 164 29 -254 -534 21 328 -5 -419 -77 358 568 -222
3885b22j60M29M69m21l57j27P14L40o43j50J9N56m3p63K29J62M24k37n74L50J00
$$ -222 -382 47 516 95 -262 -389 325 665 22 -128 -109 447 404 -359 -130 32 456 219 -355 -5 95
3906I5M32o41M3J82J59J33l15J12l2J67k03K5l7J14qO4L23n83Ko0L93k4k94m3
$$ 95 527 -114 -71 111 270 403 88 200 168 335 132 157 120 234 226 290 613 30 32 -28 365 341 47 4
3930DK41K79m30j19l24R36O9p03j62q7P82j56o83OK70L28j15o15m7Q01R6k66r10
$$ 4 245 524 94 -25 -349 587 656 -47 -209 -296 486 330 -353 -347 -77 251 136 -479 -526 275 371 105 -805
3953h05P33M18l51l22j06N31J56J9p15K65N34P4l67m49M21QK10p6j81j14K04j
$$ -805 -72 346 -5 -327 -433 98 254 273 -442 -177 357 431 64 -385 36 44 254 178 -3 -117 87 86
3975H6j09J21j49J39M5nj06q2J56J96J24k75j43q0N59m45P0r7K5M04k34m23J5
$$ 86 -23 98 -51 88 133 128 22 -60 96 292 416 141 -2 -82 477 32 102 5 30 434 200 -223 -208
3998b08N05J32o74j71M96P10o85k71r3Q96l98k78k41N8O70j05m98k43M77J25K8
$$ -208 297 429 -245 -416 80 790 105 -166 -259 637 239 -39 -280 -222 448 343 -155 -398 79 204 232
4019B32q05J80N49J18m06m79O10P0k2j69k84M42k0k1l83L8M17L4j94K8j1j73K06
$$ 232 -573 -393 156 274 -132 -611 -1 69 47 -122 -406 36 16 -5 -388 -350 67 101 -93 -65 -76 -249 -43
4042d3J64j48J57j67K29N7jj78n24M13L31j12o18N40K28L6n16m82M46M24o2m69
$$ -43 121 -27 130 -37 192 249 248 70 -454 -41 290 178 -440 100 328 364 -152 -634 -188 236 174 -295
4064b95J75M76K98n68l18M1P05k56k31k34L01K04k99l51L20L7N12p22k45M54L00
$$ -295 -120 356 654 86 -232 -191 514 258 27 -207 94 298 -1 -352 -32 5 517 -205 -450 4 304
4085C04l02r0j64L03N5j21l69J17K82n4j78j7L12m18J18J32p5L02l65J26o3k8
$$ 304 2 -88 -252 51 106 -15 -384 -267 15 -39 -217 -234 78 -340 -222 -90 -165 137 -228 -102 -165 -193
4107a93l5Q3K27J72m53j48K08M20j45k05m09N85N22l55n17J07L93L81p31j97J84
$$ -193 -228 -145 82 254 -199 -347 -139 281 136 -69 -478 107 629 274 -243 -136 257 638 -93 -290 -106
4128a06M30J27p60q6N00J78l60j11k5M15K27m62k2k5M34Q1m56j07K02M01n35P3
$$ -106 324 451 -309 -395 105 283 -77 -188 -213 202 429 -33 -55 -80 354 435 -21 -128 74 475 -60 13
4150A3j81J39L35m44J62m9K15j90M7P8k00j44J53M12k28j52k17L12K94l16m07
$$ 13 -168 -29 306 -138 24 -25 190 0 47 125 -75 -219 -66 346 118 -34 -251 61 355 39 -368
4171c68rO43j08l72%j7M95mk84l54N40k3k61m26K65L53K1m79l93P67K58J53q78
$$ -368 -377 266 158 -214 -214 -231 264 260 -24 -378 162 139 -122 -548 -283 70 91 -388 -781 -14 244 397 -481
4194d81K22P19q8n49j04K72K38J33m02k28L73K42j2o81L42K76J25l57l28L16L55
$$ -481 -259 460 372 -177 -281 -9 229 362 -40 -268 105 347 335 -346 -4 272 397 40 -288 28 383
4215C83j03m72M50k17L12l70M5oj8j00j9J74J00j57k68K52L26j35j94j78P24l61
$$ 383 280 -192 258 41 353 -17 28 22 4 -96 -115 59 159 2 -266 -14 312 177 -17 -195 529 168
4237A68r6k15J31N06l46o34J5O21Q3k99k25K04N28l08o02P7L57N09m11n69J53
$$ 168 72 -143 -12 494 148 -486 -471 150 233 -66 -291 -87 441 133 -469 -392 -35 474 63 -506 -353
4258c53K31K56k9q97R24J04j95m34K6M56K35k90k17O5L46Ol87O7J22L30j48l95
$$ -353 -122 134 105 -792 132 236 41 -393 -367 89 324 34 -183 -118 228 234 -153 -86 36 366 218 -177
4280a77J30P9m1R4j7O6N1J19k18O2kj63N2K32k37j01k54M62K93m66m1k67N57K03
$$ -177 -47 32 -9 85 68 134 185 304 86 148 146 -17 35 267 30 -71 -325 137 430 -36 -77 -344 213 416
4304D16j41l77j78N51j35l75l95P73L61k83m94l2N65L6j81l51J34K14K04o81L5
$$ 416 275 -102 -280 271 136 -239 -634 139 500 217 -277 -309 256 292 111 -240 -106 108 312 -369 -334
4325c34O53j08k29l64J02M16o9l87JK68j30K12m22J84K33R5j48k26K43R9J29j17
$$ -334 319 211 -18 -382 -280 136 67 -320 -319 -51 -181 31 -391 -207 26 121 -27 -253 -10 89 218 101
4347A01R8j5k66K02p8J56j70%J13Q5o0j75l07N42K70o45j85J73M09J53m79l76
$$ 101 199 184 -82 120 42 198 28 28 141 226 166 -9 -316 226 496 -149 -334 -161 248 401 -78 -454
4369d54M81P35p94j82l2N78J73n84k46J20O32k03n31LM06K67l14j66j15L79m2
$$ -454 27 762 -32 -214 -246 332 505 -79 -325 -205 427 224 -307 -304 102 369 55 -111 -226 153 111
4390A11k93l34K58O05o78J94l24M90l4j73K91l26M00j4j90M5n3r4J89p7J46q2
$$ 111 -182 -516 -258 347 -331 -137 -461 29 -5 -178 113 -213 187 173 -17 28 -25 -119 70 -7 139 57
4412E7m01K04k5K43l54j1K41N28l00n84L88K04K52p86J51K84J42Om75K67J52K92
$$ 57 -344 -140 -165 78 -276 -287 -46 482 182 -402 -14 190 442 -344 -193 91 233 239 -236 31 183 475
4434D75m44m71M34M38j8n00p5M31M1m30J62j55K20R6k84l9n9N57k48k84k22M46
$$ 475 31 -440 -6 432 414 -86 -161 270 311 -119 43 -112 108 204 -80 -119 -178 379 131 -153 -375 71
4456G1K65l68j02J80J12k09j92J22J34qr2J66l32q8M7J74m3K27j53k36L93k6q
$$ 71 336 -32 -134 46 158 -51 -243 -121 13 5 -87 79 -253 -341 -294 -120 -163 64 -89 -325 68 42 34
4479C4m04j13M49J67j52l99M84K20K8n80j20N49J63k03n27J43N37L3l83n7J27
$$ 34 -370 -483 -34 133 -19 -418 66 286 314 -266 -386 163 326 123 -404 -261 276 309 -74 -131 -4
4500dM26j34m41J81J76L78m83j99Q8L32j23k62j37K86J16n4l94J33J95J18P0k56
$$ -4 422 288 -153 28 204 582 99 -100 -12 320 197 -65 -202 84 200 146 -248 -115 80 198 268 12
4522A2j14K32j21R2j67j88J59L9J84k33o9P9P7K48j52k4k40K73p1J0l19n9M53
$$ 12 -102 130 9 101 -66 -254 -95 -56 128 -105 -174 -95 -18 230 78 54 -186 87 16 26 -293 -352 101
4545A01J51l86M6R3L19k99m06N14K02j96k63m64N68L75l99k41K07j43N11m61k49
$$ 101 252 -134 -88 5 324 25 -381 133 335 139 -124 -588 -20 355 -44 -285 -78 -221 290 -171 -420
4566d20J77J49L50n22q3L13L5K51l9j70J3R7o9k85K66k91J38O1K06j60L38m93
$$ -420 -243 -94 256 -266 -349 -36 -1 250 211 41 54 151 82 -203 63 -228 -90 -29 177 17 355 -138
4588a38K33K55j98K0k48O27k83j78j11J00O9n7m75J29L78q4j64j62K90K26l95
$$ -138 95 350 152 172 -76 551 268 90 -21 79 148 91 -384 -255 123 39 -125 -287 3 229 -166
4609a66p6K41L65k70j50l49L00L63k29k7l93N66l05O9k34J94L85l50j66J45QK56
$$ -166 -242 -1 364 94 -56 -405 -105 258 29 2 -391 175 -130 -61 -295 -101 284 -66 -232 -87 -79 177
4631A77r7l29J07J65l5J17k33M3J55k16L3K82k95K28pK1J5j12j38j01K44J55k89
$$ 177 80 -249 -142 23 -12 105 -128 -85 70 -146 -113 169 -126 102 95 116 131 19 -119 -220 24 179 -110
4654a10J4J07L44n67j3J00J69J90l49J14J24K92m63j35J61N44k8l72k81J10M78
$$ -110 -96 11 355 -212 -225 -125 44 234 -115 -1 123 415 -48 -183 -22 522 494 122 -159 -49 429
4675D29q4m86k35O27K24o63L06l27L06P7j03j02m5L41k14j94j24K52j48J30n2
$$ 429 345 -141 -376 251 475 -188 118 -209 97 174 71 -31 -76 265 51 -143 -267 -15 -163 -33 -85
4696h5NJ29j65j15J14L68n3l11J03j2P6r7j30L7K15j91J43n0M1k06P1O3n9J89
$$ -85 -80 49 -116 -231 -117 251 198 -113 -10 -22 54 -43 -173 -136 79 -112 31 -19 22 -184 -113 -50 -109 80
4720H0j66o9J74K95m08j30L57j87M97m22k83L43N0L51n45j18L35K6K38n09Q9L52
$$ 80 -86 -155 19 314 -94 -224 133 -54 443 21 -262 81 131 482 -63 -181 154 180 418 -91 -2 350
4742C50o8n75K51j40O77l59l28j8L11J79k25j00k62M56L4k12j06J05j2M1K5L2
$$ 350 282 -293 -42 -182 495 136 -192 -210 101 280 55 -45 -307 149 183 -29 -135 -30 -42 -1 24 56
4764E6P5l48J21K7J6l04K01J92Jl12K68m8O6k03l0m2L51K5j43j13o0K68mk79k61
$$ 56 131 -217 -96 -69 -53 -357 -156 36 37 -275 -7 -55 11 -192 -222 -264 87 112 -31 -144 -204 64 60 -219 -480
4789d80N16K40M0m33j77J25J46J29m27J19K88q4l27L62L0qJ26l51J13J24K25m49
$$ -480 36 276 316 -117 -294 -169 -23 106 -321 -202 86 2 -325 37 67 59 185 -166 -53 71 296 -153
4811a53K58k83M09J78l60p5J43J46k69j46Q6J38K71j55l46R0J73J27l13J98l35
$$ -153 105 -178 231 409 49 -26 117 263 -6 -152 -66 72 343 188 -158 -68 105 232 -81 117 -218
4832b18K64l97K46Ql4NJ60J57J49m50k84M22L2p0l62J84K57r9j11j59K65K9L32
$$ -218 46 -351 -105 -97 -131 -126 34 191 340 -110 -394 28 60 -10 -372 -188 69 -30 -141 -300 -35 -6 326
4855C26p38P9L93M9p2n85K81L59K17m53m9K58R9k32q3k14O56j95%k20J68N1R4
$$ 326 -412 -333 60 109 37 -548 -267 92 309 -144 -193 65 164 -68 -151 -365 291 96 96 -124 44 95 189
4878A89k04o7J42J06n4J94k5n37J89K49k71nK41o5J22j11o2K33k17Q0j29k34j0
$$ 189 -15 -82 60 166 112 306 281 -256 -67 182 -89 -94 147 82 204 93 31 264 47 127 -2 -236 -246
4901b46K47k0n4J67m03N59n1j56l55K28L67l09j01j07L62J03k51j57k22N64q8
$$ -246 1 -19 -73 94 -309 250 199 43 -312 -84 283 -26 -127 -234 128 231 -20 -177 -399 165 77
4922G7k48j85K88L60n6m39p6M74J40j33k44R7J29Lj30m28N22j92J51k97P5K66
$$ 77 -171 -356 -68 292 236 -203 -279 195 335 202 -42 55 184 187 57 -371 151 -41 110 -187 -112 154
4944A54k86J30J48k4j41j9pJ00R8j60J82k97K50q3k44K35K68j26j32l98N72o3
$$ 154 -132 -2 146 122 -19 -38 -45 55 153 -7 175 -122 128 45 -199 36 304 178 46 -352 220 157
4966A57L0k04L1M77k88l48J31J22O5J08n94l2M97J64j38l45J31L53k84k53l00
$$ 157 187 -17 14 491 203 -145 -14 108 173 281 -313 -345 152 316 178 -167 -36 317 33 -220 -520
4987e20L97L73l18k70L87pJ0j27l15K73L6K12k50j76M14j50J42l67J64lJ37J4
$$ -520 -123 250 -68 -338 49 42 52 -75 -390 -117 -81 131 -119 -295 119 -31 111 -256 -92 -95 42 56
5009E6O4k21J04o6J21q1j76J68l7L9J10k82J07K96J41k17k62J79O1J05k62j97
$$ 56 120 -101 3 -63 58 -23 -199 -31 -68 -29 81 -201 -94 202 343 126 -136 43 104 209 -53 -250
5031b50K64K83l52M9j31J45L72l95R6j21L23k74J96m82L17J51k80j7k06M15K38
$$ -250 14 297 -55 -6 -137 8 380 -15 81 -40 283 9 205 -277 40 191 -89 -106 -312 103 341
5052C41j18o10L09K06q9K40l93LJ86m1j48j2K84N3l17k17M65j92j7m6R5O0n2J46
$$ 341 223 -387 -78 128 39 279 -114 -111 75 34 -114 -126 158 211 -106 -323 142 -50 -67 -113 -18 42 -10 136
5076A36J03j08l57K20N6m0N2k19l0L73k31j19Q2oK87k19k74R1L95J07n19j0N0
$$ 136 239 131 -226 -6 50 10 62 -157 -187 186 -45 -164 -82 -88 199 -20 -294 -203 192 299 -220 -230 -180
5099a80O07j76l69J0N5J87l8l04K93K3jL9j05j93K07J97Rl23J86J1r0k65M4M01
$$ -180 427 251 -118 -108 -53 134 96 -208 85 108 107 146 41 -152 55 252 261 -62 124 135 45 -220 -176 225
5123B25M0k96J66l91M61nj76q8J99K0q9J23j17k6L0k34J78p9q5J7j00K05n4k88
$$ 225 265 -31 135 -256 205 200 24 -64 135 155 66 189 72 46 76 -158 20 -59 -144 -127 -227 -22 -76 -364
5147c64K84R0j06j20J73L7J11K18n29L59j64K20m79M7J07J91j2j95K39j40J67
$$ -364 -80 10 -96 -216 -43 -6 105 323 -206 153 -11 209 -270 -223 -116 75 63 -132 107 -33 134
5168A34k42q9J79K33K33p80o0N19j0n6k47P2K73K95m87M4k00J93j65J54r0K53
$$ 134 -108 -197 -18 215 448 -332 -392 127 117 61 -186 -114 159 454 -33 11 -189 4 -161 -7 -97 156
5190A56j5k07J25q7J20J35l30L75l5l30k2L06j37K4j08j85O12l85N8k52J13J79
$$ 156 141 -66 59 -28 92 227 -103 272 237 -93 -115 191 54 78 -30 -215 397 12 70 -182 -69 110
5212A10l35r7O2J94K01j42k42r6M35Pl00k2J66K33l03rJ55K24p4k61q5J2L35R9
$$ 110 -225 -322 -260 -66 135 -7 -249 -345 90 97 -203 -225 -59 174 -129 -138 17 241 167 -94 -179 -167 168 267
5236B67o15K74N4K89k62j60jL07l2m40J43K97k72J71j46K92L5k76k9L14k80R5
$$ 267 -348 -74 -20 269 7 -153 -154 153 121 -319 -176 121 -151 20 -126 166 201 -75 -104 210 -70 25
5258B5J36m9m3r9p5J32k9j01K2m1J03J26j7%j03L3J23l51R5RO07k74k78j52N41
$$ 25 161 112 69 -30 -105 27 -2 -103 -81 -122 -19 107 90 90 -13 20 143 -208 -113 -104 503 229 -49 -201 340
5283C40j34l48J8j55N99j44l81k91P45k88O1l00J80nO7k1j27J77J26j35j53k39
$$ 340 206 -142 -124 -279 320 176 -205 -496 249 -39 22 -278 -98 -103 -36 -57 -184 -7 119 -16 -169 -408
5305d08N70%qj88L1KK76l39j01K57n5M5J35k80k01J30O2R3L19k75m05N25k17J52
$$ -408 162 162 154 -34 -3 -1 275 -64 -165 92 37 82 217 -63 -264 -134 -72 21 340 65 -340 185 -32 120
5329A20k03R3j34L25j73J90M5O6l04k28N6K81K86k41k78K30j02L70m94k54O03
$$ 120 -83 10 -124 201 28 218 263 329 25 -203 -147 134 420 179 -99 131 29 399 -95 -349 254
5350B54O3k4m52m0K03K31m13n6K7L71j85K4j84L96k32P6l30J55J56J41k92R6J2
$$ 254 317 293 -159 -199 4 235 -178 -234 -207 164 -21 3 -181 215 -17 59 -271 -116 40 181 -111 -15 -3
5373cj42O4J03k70K51pj09K02m5j09j06K15k5j77j18J69J75k7j84J1K67J21l09
$$ -3 -145 -81 22 -248 3 -4 -113 89 44 -65 -171 44 19 -158 -276 -107 68 41 -143 -132 135 256 -53
5396e3j67P0K42N4J47k16q4Q7J05j63n7n7L18q0l6l74K06J90J27o38K10J2M63
$$ -53 -220 -150 92 146 293 77 -7 80 185 22 -35 -92 226 146 110 -264 -58 132 259 -379 -169 -157 306
5419C06l26o1O7K46l01J26l64M19N0j78k39K08K00j43j29m4J03q9J85o4J87N2
$$ 306 -20 -81 -14 232 -69 57 -307 112 162 -16 -255 -47 153 10 -119 -163 -60 -149 36 -28 159 211
5441B11l08Q9J13O6j91q2m2J14j21k40J80J94k7O6k36J8J87J92m77J06j07M76
$$ 211 -97 -8 105 171 -20 -102 -144 -30 -151 -391 -211 -17 -44 22 -214 -196 -9 183 -294 -188 -295 181
5463A81K8m19J85J16o7J8k89J24N78m52p2K12J7kj60k68L22J64l6j99K4J60rl
$$ 181 209 -210 -25 91 24 42 -247 -123 455 3 -69 143 160 158 -2 -270 52 216 180 -19 5 165 156 153
5487A53n5j63J89K6J02j60l03K99j05M1k25K47k88M45j26k42K29j97J28l1m8K12
$$ 153 98 -65 124 150 252 92 -211 88 -17 24 -201 46 -242 203 77 -165 64 -133 -5 -36 -84 128
5509A28m17K97J67l70K38j06K27j05k40j2J68J01j35O5r2j3J94j79j73K68P1J36
$$ 128 -289 8 175 -195 43 -63 164 59 -181 -193 -25 76 -59 6 -86 -99 95 -84 -257 11 82 218
5531B18l48k02K71K19K1l80J79J15k03k3j04J69K7K07l26J41k6M38l21Lp3n9l
$$ 218 -130 -332 -61 158 179 -201 -22 93 -110 -133 -237 -68 -41 166 -160 -19 -45 393 72 75 2 -57 -60
5554f0J32M6J34m74L83r9j97J73J59j96K45Ol90J62J24N3l42n1J62J15j95K8R0
$$ -60 72 118 252 -222 161 62 -135 38 197 1 246 252 -138 24 148 201 -141 -192 -30 85 -110 -82 8
5577HJ67l3k59J13k3L01l10K04l25K75J33r6j15k07K79R4p7k39J97k94K14k00
$$ 8 175 142 -117 -4 -27 274 -36 168 -157 118 251 155 40 -167 112 206 129 -110 87 -207 7 -193
5599a93K4K71R3P0n50J58K49j31j76m8J71L8j24j53K38%K39K3l07L16k54R9R5
$$ -193 -169 102 195 265 -285 -127 122 -9 -185 -233 -62 -24 -148 -301 -63 -63 176 199 -108 208 -46 53 148
5622A48rm8k44L41j57j67J50J05n1Q4Q3j52j27J4K74k83j56K49J26j02O5l24k4
$$ 148 139 91 -153 188 31 -136 14 119 68 152 235 83 -44 -30 244 -39 -195 54 180 78 143 -181 -205
5645b05K57m5j95j50K77M35m71L3K85j16J06k09l30L10j14l5JQ9j04K81k11oQ7
$$ -205 52 7 -188 -338 -61 374 -97 -64 221 105 211 2 -328 -18 -132 -167 -166 -77 -181 100 -111 -117 -30
5668c0J44r4j55J28N5k65L45L9k89K55k63M32l07N5m13J85J08J72q0k17K80j01
$$ -30 114 20 -135 -7 48 -217 128 167 -122 133 -130 302 -5 50 -363 -178 -70 102 22 -195 85 -16
5690a6L78k52j92J25K72n0l04k53K53L12k86k92J0L35M25o51K89j72M07l9k79
$$ -16 362 110 -82 43 315 265 -39 -292 -39 273 -13 -305 -295 40 465 -186 103 -69 338 299 20
5711B0m7j15M25r0l66J12K50PP5k99P3J00j35m1j74M18j33M0k90J40J55k95N0
$$ 20 -27 -142 283 193 -173 -61 189 196 271 -28 45 145 10 -31 -205 213 80 120 -170 -30 125 -170 -120
5734a20J59J3l37K42Q1k80J87q7K66J05M9l88P2J96j04o1P1j90P4K61l79K9oK37
$$ -120 39 52 -285 -43 38 -242 -55 -142 124 229 278 -110 -38 158 54 -7 64 -126 -52 209 -170 -141 -147 90
5758I0j05k14K24J57j07j43J28j83J00L31n96K92K68j39qj24m0K18k9o5k70L41
$$ 90 -15 -229 -5 152 45 -98 30 -153 -53 278 -318 -26 242 103 95 -29 -69 149 120 55 -215 126
5780A26K39k96P4K07j86R1j33l60J76K2M53n15J26J69j3k29m2j5P8J1n7Jj00L77
$$ 126 365 69 143 350 164 255 122 -238 -62 -40 413 -102 24 193 180 -49 -91 -106 -28 -17 -74 -73 -173 204
5804B04l80K22n0J33n42L93J47j87N7q9K33j67M9j37J45m2M1l0kj16J63J59l02
$$ 204 -176 46 -4 129 -413 -20 127 -60 -3 -92 141 -26 23 -114 31 -11 30 0 -2 -118 45 204 -98
5827i8J54L2k11L26l94L59n3k46K03j55m0K11J12k26J77k48K44r7l94J43L15j62
$$ -98 56 88 -123 203 -191 168 115 -131 72 -83 -123 88 200 -26 151 -97 147 50 -344 -201 114 -48
5849d8O8m3Q4q1Q2q4nK22k95K59k11j79N89n31L08p0Q7j05L0P9j85J7L7J32k72
$$ -48 20 -23 61 -20 62 -22 -27 195 -100 159 -52 -231 358 -173 135 65 152 47 77 156 -29 -12 25 157 -115
5874a15j30J14J04K04o8j14j96J83n2Q4q7J48j46K09k12J2J17J55r6m79N7K97
$$ -115 -245 -131 -27 177 109 -5 -201 -18 -70 14 -73 75 -71 138 -74 -62 55 210 114 -365 -308 -11
5896a1O5j06j74L32q7j91p5r5K53Q5J47j40j30J26L5p9j31J53J50r3j45K84k31
$$ -11 54 -52 -226 106 19 -172 -247 -342 -89 -4 143 3 -127 -1 34 -45 -176 -23 127 34 -111 173 -58
5919e8k4J53q6J67n2j8J66j19j10j96K61J49p1j87m7m9L26k56Q3M9J0K46k12j56
$$ -58 -82 71 -15 152 100 82 248 129 19 -177 84 233 162 -25 -72 -121 205 -51 32 81 91 337 125 -31
5943c1j1J84k14J42k16K49R7o1r2j85K69J17k27o7L9O9j09n7L3o8K65J18k77J9
$$ -31 -42 142 -72 70 -146 103 200 139 47 -138 131 248 21 -46 -7 62 -47 -104 -71 -139 126 244 -33 -14
5967a4N2n7J42K9l66J13K9j2P9J57p3q3L5k47J27K56k01R9Q5k74j21K45K31r0
$$ -14 38 -19 123 152 -214 -101 -72 -84 -5 152 79 -4 31 -216 -89 167 -34 65 150 -124 -245 0 231 141
5991A41l50J32N0K83k68Mn2L78j26k71j18K34K25l35l1J73l7K74k46p3j20M50
$$ 141 -209 -77 -27 256 -12 -8 -60 318 192 -79 -197 37 262 -73 -104 69 32 306 60 -13 -133 317
6013C17k24m6l57M76J02j86n53N76j07J29j63o2J58K9m8n9K3L4R7K6l24N9L4J13
$$ 317 93 47 -310 166 268 82 -471 105 -2 127 -36 -98 60 89 41 -18 5 39 136 162 -162 -103 -69 44
6037D4R6l86K95j03M8j44%J96l5k15M4K12k02k8K29nj82k6N3N3J0N1k73K53J46
$$ 44 140 -246 49 -54 -6 -150 -150 46 11 -204 -160 52 -150 -178 51 46 -136 -162 -109 -56 -46 5 -268 -15 131
6062A31l9k1r3J49l8q7L2P2k58K07j44l6K12R8l80M1J35J23J78l12R3k74M19k83
$$ 131 92 71 -22 127 89 2 34 106 -152 55 -89 -125 87 185 -195 -154 -19 104 282 -30 63 -211 208 -75
6086g5L1Q3J12J7K07k32k45L41k18j50J7M07j75j54L73l44j28L14j49j25Q4o5
$$ -75 -44 39 151 168 375 143 -102 239 21 -129 -112 295 120 -34 339 -5 -133 181 32 -93 -9 -74
6108g4R6o3j41J17J40j10K16j15k13L3J24K14k6k55j56J49JJ5p6j15L69kl34J80
$$ -74 22 -41 -182 -65 75 -35 181 66 -147 -114 10 224 198 -57 -213 -64 -63 -48 -124 -239 130 128 -206 -26
6132b6k2O4m5j30o8J99K66l92o2J81j01J39j10K46j03o1J71j78j00k0K00j58Q9
$$ -26 -48 16 -29 -159 -227 -28 238 -154 -216 -35 -136 3 -107 139 36 -25 146 -32 -132 -152 48 -110 -21
6155b1M3K72k60q3J06j17J13j39K6j13L92o7J94j60k57m2L1qJ51l1J37M9j35M4
$$ -21 22 294 34 -49 57 -60 53 -86 -60 -173 219 152 346 186 -71 -113 -82 -90 61 30 167 216 81 125
6179A25o3k89K10L47l24l59M33J36k38m1k8K78K8k14k91l2M33r7j0pj85M25j26
$$ 125 62 -227 -17 330 6 -353 80 216 -22 -63 -91 187 215 1 -290 -322 111 14 4 -3 -188 237 111
6202A11k45Rj00M67j49j0l6j58J82j87n0J69j29L0j93Q9M08j57j57j15M50p9j17
$$ 111 -134 -125 -225 242 93 83 47 -111 71 -116 -166 3 -126 -96 -289 -200 208 51 -106 -221 229 150 33
6225C3Q3j68L36k40O3n7K85o38K27l1J11K04m44J81r3J70j72K39l33L36j78J76
$$ 33 116 -52 284 44 107 50 335 -303 -76 -107 4 208 -236 -55 -148 22 -150 89 -244 92 -86 90
6247I0k65r2N84k59n2K07L5k45Q3j20k10K90l5R0j16J54m1J6M0l81L06k27J96
$$ 90 -175 -267 317 58 6 213 248 3 86 -34 -244 46 11 101 -15 139 98 114 154 -227 79 -148 48
6270D8j63K83j32j16M4J54o1j40J31L9j88K78k58K24l02K9J56J23J36m23K28N1
$$ 48 -115 168 36 -80 -36 118 57 -83 48 87 -101 177 -81 143 -159 -130 26 149 285 -138 90 141
6292A41J72k84j07J16n1J63p5J06j54J90k34O4J13l36L52m3J97k57k48L50j3j40
$$ 141 313 29 -78 38 -13 150 75 181 27 217 -17 47 160 -176 176 133 330 73 -175 175 162 22
6314B2l2l15L72J19l75J57J78O9m10K11k77K75K51k74l4R6K52l54r3J07J31m8
$$ 22 -10 -325 47 166 -209 -52 126 195 -215 -4 -281 -6 245 -29 -63 33 285 -69 -162 -55 76 28
6336B8p1Rj3n3m1J79O7k03P9k13L23j88J91k53L83k94K85m99R7R7pL9r7K9n4K12
$$ 28 -43 -34 -47 -100 -141 38 105 -98 -19 -232 91 -97 94 -159 224 -70 215 -284 -187 -90 -97 -58 -155 -126 -180 32
6362C2j46r5J96o5L35k93k49J35K78o0k93J01J02j0r1R8q1J86J42r0k20M41k14
$$ 32 -114 -209 -13 -78 257 -36 -285 -150 128 68 -225 -124 -22 -32 -123 -25 -106 80 222 132 -88 353 139
6385A39j49ML8J53k75L40n60L72L52k60k95l4P3J47k06J04J19j71n3J79r4K5R1
$$ 139 -10 -6 32 185 -90 250 -310 62 414 154 -141 -175 -102 45 -161 -57 62 -109 -162 17 -77 -52 39
6408C9j90K07P3p3p2J31r5OJ0q8k14L72j40M3J45k13P7q4j57L09J35p3j52N7R4
$$ 39 -151 56 129 56 -16 115 20 26 36 -52 -266 106 -34 9 154 -59 18 -66 -223 86 221 148 -4 53 147
6433A47q9j16m8r9K89j75j42L89j39J94k93L7J05q0J26j23m7K14j73J42j95J70
$$ 147 58 -58 -106 -205 84 -91 -233 156 17 211 -82 -45 60 -20 106 -17 -64 150 -23 119 -76 94
6455I4P4k86K12l53L15k2r4J36q4J72l56j27K35m0L16j95j23L44j95kpj8J91k49
$$ 94 168 -118 94 -259 56 34 -60 76 -8 164 -192 -319 -84 -124 192 -3 -126 218 23 21 14 -4 187 -62
6479f2j04K88j86M2J1j81K31l49J48J11k25K02l7P6j21J38J42k6l11N6J22J17
$$ -62 -166 122 -64 -22 -11 -192 39 -310 -162 -51 -276 -74 -111 -35 -156 -18 124 98 -213 -157 -35 82
6501H2o0l05M28j80K48j22l30J69K91J82m18k4J21k03K42k33k1l3k3N30l60M7
$$ 82 22 -283 145 -35 213 91 -239 -70 221 403 -15 -39 82 -121 121 -112 -133 -166 -189 341 -19 28
6523B8l41J72K56j47Q2n7l8Q8J32k96K45R7rj70O0k45J07M4k7J24j68K64l15K03
$$ 28 -313 -141 115 -32 50 -7 -45 43 175 -121 124 221 212 42 102 -143 -36 8 -19 105 -63 201 -114 89
6547H9k50K17J9q7J05k73K75j86R9k73L53M9j73j64M1R5R1m9J17j22J01r7l85
$$ 89 -161 56 75 -12 93 -180 95 -91 8 -265 88 137 -36 -200 -159 -64 27 -22 95 -27 74 -23 -408
6570d08L98o8L2J11j99P0o5J2Q3k71K78K13j07l9l37K45J00N6l56J95l3j8n8J88
$$ -408 -10 -78 -46 65 -134 -64 -129 -117 -34 -305 -27 186 79 40 -297 -52 48 104 -252 -57 -90 -108 -166 22
6594B2Qk82M05j11J50l7l93R8K85j7j47q7J9K17k59N4N7J83o4j63P3m3R4R7j28
$$ 22 30 -252 153 42 192 155 -238 -140 145 128 -19 -106 -87 130 -129 -75 -18 165 101 -62 11 -32 62 159 31
6619C1J08JR5K9l53J50K84k79P5k61J68J99j03j9j49j61K17N2k44K15l45L11M5
$$ 31 139 140 235 264 -89 61 345 66 141 -120 48 247 144 125 -24 -185 32 84 -160 55 -290 21 66
6642F6Rm8j44lnQ7P8J8k93O3K29j52o1J05L11j90k37L29l42K00%RJ14k05L95l34
$$ 66 75 27 -117 -120 -125 -38 40 58 -235 -172 57 -95 -156 -51 260 70 -167 162 -180 20 20 29 143 -62 333 -1
6668aj45K38j01l2k11N92j83j33J46Oj4q8k84K40J26j10J6j23L0J3K54l20J50
$$ -1 -146 92 -9 -41 -252 340 157 24 170 176 162 74 -210 30 156 46 62 -61 -31 -18 236 -84 66
6691F6M7L1j86J43J20k97K14L1j49o4P7l66P1M65l73K22o2J8L2k8l3m3P8K28k08
$$ 66 113 144 -42 101 221 -76 138 169 20 -44 33 -333 -262 203 -170 52 -10 8 40 12 -21 -64 14 242 34
6716C4j03j99K54rj24J60j9k1J26j30j88j41N54l18j63N47n51M63l63J46q1K13
$$ 34 -69 -268 -14 -23 -147 13 -6 -27 99 -31 -219 -360 194 -124 -287 260 -291 172 -191 -45 -126 87
6738H7J60j69j44J77K10l95K36j90J38P2l43M25k38n7J07k7R5l07J75j55k0J9
$$ 87 247 78 -66 111 321 -74 162 -28 110 182 -161 264 26 -31 76 49 144 -163 12 -143 -163 -144
6760a44K07L1M4K4p2j05k24K13J69M0j56j42J18J29P0l42J95O4j46J47j48r4J53
$$ -144 63 94 138 162 90 -15 -239 -26 143 183 27 -115 3 132 202 -140 55 119 -27 120 -28 -122 31
6783C1j0k41L10r6J00k79K9J8J99l9m3K97l51J63k05R7j4M41k85j07k32L25J01
$$ 31 21 -220 90 -6 94 -185 -156 -138 61 22 -21 276 -75 88 -117 -20 -34 407 122 15 -217 108 209
6806B09l98N2K77p0j55j29J78q5K29L9l10J18M3j17l0p2K73Oj80LQ0J88k94J20
$$ 209 -189 -137 140 70 -85 -214 -36 -121 108 147 -163 -45 -2 -119 -149 -221 52 58 -122 -119 -39 149 -145 -25
6830b5O6pk01J70J84m60N62k74j15j9J25K38j89Mj06%M3k04N24k08j93N4k41N08
$$ -25 41 34 -167 3 187 -273 289 15 -100 -119 6 244 55 59 -47 -47 -4 -208 316 108 -85 -31 -272 236
6854B36Rl82R6J83j24m9j13J48l5Q6k91K51j2J96m38M32j31Q8J7j52k06J80K4
$$ 236 245 -137 -41 142 18 -31 -144 4 -31 55 -236 15 3 199 -239 193 62 150 167 15 -191 -11 13
6877A3j90J64K4k24M41m27L30m59N15m1k72J09q5J41j61K67J57m91M35j52n0m6
$$ 13 -177 -13 11 -213 228 -199 131 -328 187 146 -126 -17 -102 39 -122 145 302 -189 246 94 44 -2
6899bJ16j02k08J57R4j11J23p4n0K45j56k81M52n8j57P8L0L9k01k0K9K52l14Q5
$$ -2 114 12 -196 -39 55 -56 67 -7 -57 188 32 -249 203 145 -12 66 96 135 -66 -86 -57 195 -119 -34
6923c4r7L07l43N29k96n05M05q4Rj34K80K59l47Q2j23j3K08K7j40j17K44q3k02
$$ -34 -131 176 -167 362 66 -439 -34 -118 -109 -243 37 296 -51 31 -92 -105 103 130 -10 -127 117 34 -168
6946a68J02r0r1J7J5K55J97k64j86K64Jn6N2j73P4j94Qk5J62M8Q8j1j57J81J01
$$ -168 -66 -156 -247 -230 -215 40 237 -27 -213 51 52 -4 48 -125 -51 -245 -237 -262 -100 -52 36 25 -132 49 150
6971A50p7l0k8P4r8r1K3K00J11k66J09k08K53j5J0l38O6J59j30kL63J20n46J34
$$ 150 73 43 15 89 -9 -100 -77 123 234 -32 77 -131 122 107 117 -221 -155 4 -126 -128 235 355 -191 -57
6995e7o2M4L86l09M8k9j15L78k66J07Rm41K89m5K56r4q0K26l09P5j0N5k8M0L6
$$ -57 -119 -75 311 2 50 21 -94 284 18 125 134 -307 -18 -63 193 99 19 245 -64 11 1 56 28 68 104
7020A04j28K30p2j01K01l09K46n1m3Jj66K45p8R1k72l4N3M4J82M7j58O4j33Q4
$$ 104 -24 206 134 33 234 -75 171 120 77 78 -88 157 79 170 -102 -136 -83 -39 143 190 32 96 -37 47
7044D7j7n3J01O5p7ql1O3j6k3J28l0o6j99nL35l8j27j71R6P5K38k09J78j7q8N2
$$ 47 30 -23 78 143 66 58 27 90 74 51 179 149 83 -116 -121 214 176 49 -122 -26 49 287 78 256 239 151 203
7071B03k67K79o7j00K7OO0l94J19j3Q3J80o1k37L55k26m2j28M26j40P3k65m9m3
$$ 203 -64 215 148 48 75 81 141 -253 -134 -147 -64 116 55 -182 173 -53 -95 -223 203 63 136 -129 -178 -221
7095b21J63K67k66K29k70L5M7R0j58Q1J4r9L48k96j07M5K62k93K47Q3m16P0K83
$$ -221 -58 209 -57 172 -98 -63 -16 74 -84 -3 11 -88 260 -36 -143 -98 164 -129 118 201 -215 -145 138
7118A38j51R6P2M7J13k12j05kL7r9J27j25NJ20j9k30L68l99L97l99K72r8n4K66
$$ 138 -13 83 155 202 315 103 -2 -4 33 -66 61 -64 -59 61 42 -188 180 -219 178 -221 51 -47 -101 165
7142A65k1p6R9j11Q1p9QJ22k95N5J26Q9j01k20J17j54J86j47k42N04J15k40o9
$$ 165 144 68 167 56 137 58 66 188 -107 -52 74 163 62 -158 -41 -195 -9 -156 -398 106 221 -19 -88
7165h8L1J85K71k74k58q3K95j55n2O8j09J21K44l57K07j24L79l71J61N9k13K89
$$ -88 -57 128 399 125 -133 -216 79 -76 -128 -60 -169 -48 196 -161 46 -78 301 -70 91 150 -63 226
7187B26l79J70J04J72j96j05J53j08J48j19j05j38O4L8J03m5j01O9RK60k50j76
$$ 226 -153 17 121 293 97 -8 145 37 185 66 -39 -177 -113 -75 28 -17 -118 -49 -40 220 -30 -206
7209b06K71ol8j19q2K7J51K3j48K15p0J98j53k37l6K21J33j51k02K11j10m0K73
$$ -206 65 59 21 -98 -180 -153 -2 21 -127 88 18 216 63 -174 -210 11 144 -7 -209 2 -108 -148 125
7232A25l28L38j37R6l18K13l2R5N7m43L7L34R0k44K05j25O0K04j74j93K2J76j72
$$ 125 -203 135 -2 94 -224 -11 -43 52 109 -334 -297 37 127 -117 88 -37 23 227 53 -140 -118 58 -114
7255a14J32M1J5k00J44q4PO2kJ47j25Q0k78L83j62K45m19j25K73N9j53K59l21
$$ -114 18 59 74 -126 18 -66 -59 3 1 148 23 103 -175 208 46 291 -128 -253 20 79 -74 185 -136
7278a36P7L65k92k80K11K02k83L78j88r5P3k12J5L55j70J71J3m45L01K61j87j33
$$ -136 -59 306 14 -266 -55 147 -136 242 54 -41 32 -180 -165 190 20 191 204 -241 60 321 134 1
7300Ap0K52k49J11k55J39J41m8P4J19j98j6m5nJ47JL2j13l4N3j17J82J8j60j58
$$ 1 -69 183 -66 45 -210 -71 70 22 96 215 17 1 -44 -49 98 99 131 18 -16 37 -80 102 120 -40 -198
7325a98N1M6J36j1q2j90J94kn6q0J43JK78m12K49R1k53J31K4j05R6j31r1J68j2
$$ -198 -147 -101 35 24 -58 -248 -54 -56 -112 -192 -49 -48 230 -182 67 158 -95 36 60 -45 51 -80 -171 -3 -15
7350a5r7K85k57J4K45o1m3j02K7O7k0J80p3l17J43J6L7m4K97k98J26k6j40R7r1
$$ -15 -112 173 -84 -70 175 114 71 -31 -4 63 43 223 150 -167 -24 -8 29 -15 282 -16 110 84 -56 41 -50
7375e0k56N07j82K88k07k36oK78j81O3j19J65k4N7l5P9k23q6K61k48J44k3k08
$$ -50 -306 201 19 307 100 -136 -142 136 -45 18 -101 64 40 97 62 141 -82 -168 93 -155 -11 -34 -242
7398b42K20m4M2q6N6Q4M6J11k97o3K34k76K65k9r1R8j67O3K68j94K10j81Kj24
$$ -242 -22 -66 -24 -110 -54 30 76 187 -110 -173 61 -215 50 21 -70 28 -139 -76 192 -2 208 27 29 -95
7422i5K26k89K85j43N1j00j58L89p8J31j07k3k05N1J05J37J95m79J15k2Q0r5L
$$ -95 131 -158 127 -16 35 -65 -223 166 88 219 112 89 -116 -65 40 177 372 -107 8 -14 66 -29 -26
7445b6P0k40L03k6J65m01L43J8r3J81l77M7J76k58oJ18R0K2m7j8j18K81k77J73
$$ -26 44 -196 107 81 246 -155 188 206 113 294 -83 -36 140 -118 -124 -6 84 106 59 41 -77 204 -73 100
7469A00r0R0j19J50k34J87k44J89j18M6j4J79m1k08r3L20K0j47j94mL09k19J98
$$ 100 10 100 -19 131 -103 84 -160 29 -89 -43 -57 122 81 -127 -220 100 120 -27 -221 -225 84 -135 63
7492F3m3j10J53O9J1l19K14O2p4K9l1J14m64L5K18o6J93p1J46j15J28j00J03j69
$$ 63 20 -90 63 132 143 -176 38 100 26 55 24 138 -326 -291 -73 -139 54 -17 129 14 142 42 145 -24
7516b4J50k32J26k40L73j81j54K66r7K2j2q0j02L42ok61O4J72m2L6j28P3k21K6
$$ -24 126 -106 20 -220 153 -28 -182 84 -13 9 -3 -83 -185 157 151 -110 -46 126 84 120 -8 65 -156 -130
7540a30K9P7M0J88k67k64K07L4J76j12k54K88m5P1p7o1K44l13L1O7J47k35jK65
$$ -130 -101 -24 16 204 -63 -327 -120 -86 90 -22 -276 12 -33 38 -39 -100 144 -169 -138 -71 76 -159 -160 105
7564A05k9J29j95Qm5K9p7Q9m7J76q8k8J09r0Q7k18Q1k68L23o3j31J47K01M2j33
$$ 105 76 205 10 18 -27 2 -75 14 -33 143 55 27 136 46 133 -85 -4 -272 51 -12 -143 4 205 247 114
7589A14Nk17J73K2j00j26Q0qo6L05l00J43K70k91j50J21K09j56j38n3J97k02L82
$$ 114 119 -98 75 97 -3 -129 -49 -57 -123 182 -118 25 295 4 -146 -25 184 28 -110 -163 34 -168 214
7612B14k4m90N17j18k62J30J02J11k53J67N8q0K1j27J24l26J25mk2J5K78k17J23
$$ 214 190 -300 217 99 -163 -33 69 180 -73 94 152 72 93 -34 90 -236 -111 -115 -137 -122 156 -61 62
7635F2l16L05L7l1j89LJ83k30L28j25q0J89o7l19K64j52Q8R1K5J68k24J27j04
$$ 62 -254 51 88 57 -132 -129 54 -176 152 27 -53 136 69 -250 14 -138 -50 41 66 234 10 137 33
7658C3l00L94r6L46l14l8j50J29k20J50m7Q4LJ16n6q1J46j82K07l75J63m3j16
$$ 33 -267 127 31 377 63 25 -125 4 -216 -66 -113 -29 -26 90 34 -47 99 -83 124 -251 -88 -131 -247
7681b47J63j23J20J57k36Q5J0J41j54J44p0Q6k18J25l3nJ10j93K14j52j8J78r6
$$ -247 -84 -207 -87 70 -166 -81 -71 70 -84 60 -10 76 -142 -17 -50 -55 55 -138 76 -76 -94 84 -12
7704a2oj32K07P1J47n22L07M5j05J77k45k4P9K10l04J72r0o9J06k65J86J67P3
$$ -12 -18 -150 57 128 275 -247 60 105 0 177 -68 -92 -13 197 -107 65 -25 -94 12 -253 -67 100 173
7727A73j57Q1M7o4N9q5J37k26L38j97R0q6J74j44J27p2r3j23o6K48k19R3Q0j58
$$ 173 16 97 144 80 139 54 191 -35 303 106 196 110 284 140 267 195 102 -21 -87 161 -58 35 115 -43
7751d3J3j15K44k27J26R2J59k52J05q6j19Q4j55l6K54J02j96j57q7R8K03k10J33
$$ -43 -30 -145 99 -128 -2 90 249 -3 102 16 -103 -19 -174 -210 44 146 -50 -207 -294 -196 7 -203 -70
7774g0LJ40p0q7l3Q1K94k19l04K18M5J59j26j8nm4R5R9k40K03k4k28J28J4O6l04
$$ -70 -67 73 3 -84 -117 -36 258 39 -265 -47 -2 157 31 13 8 -36 59 158 -82 121 97 -131 -3 11 77 -227
7800b27Q2J20J64l76M04k99R7Qj03J23q9L36j82j53L60o8l83R3q8J96J81l89R6
$$ -227 -145 -25 139 -237 167 -132 -35 -27 -130 -7 -96 240 58 -95 265 197 -186 -93 -181 15 196 -193 -97
7823i7j25K90k4k00J14J87k39Q4r6R7n5M2J13k74JM79m12J89o1j30J38r3k2M63
$$ -97 -222 68 44 -156 -42 145 -94 -10 -106 -9 -64 -22 91 -183 -182 297 -115 74 13 -117 21 -72 -94 369
7847C69k03l0k62J54O2j73J56Rr2J33k6j36Pp1N9O0J53q3k64K26j93N6J08j74
$$ 369 166 136 -126 28 90 -83 73 82 -10 123 97 -39 -32 -103 -44 16 169 86 -178 48 -145 -89 19 -155
7871a55o1K40l4l3K04m43J76K75k13O6o6qJ62L2k59J17K07k22n5k7M09k85qj95
$$ -155 -216 24 -10 -43 161 -282 -106 169 -44 22 -44 -52 110 142 -117 0 207 -15 -70 -97 312 27 19 -176
7895a76K42j10O7k4r1J42k61J72j44J18l7L68l14K32l08L21l31M8O7L06k75j65
$$ -176 66 -44 23 -1 -92 50 -211 -39 -183 -65 -102 266 -48 184 -124 197 -134 -86 -19 287 12 -153
7917a53O6J0K77k66J53k7oK9q5q3O7J2o1K83l44j97L4P8J88j28K03k72J86P8o2
$$ -153 -87 -77 200 -66 87 60 54 83 -2 -85 -18 -6 -67 216 -128 -325 -291 -213 -25 -153 50 -222 -36 42 -20
7942b0M7j19L3L39l20%J32j51K81l17m3K30l3r5j58K00j12Q5M1j20J09K00l04
$$ -20 27 -92 -59 280 -40 -40 92 -59 222 -95 -138 92 59 -36 -194 6 -106 -21 20 -100 9 209 -95
7965i5N0q6n7M07q1k84L70l2k92K37j83J98L1r7k10O0p6O9n2J10K64l82O2J65
$$ -95 -45 -131 -188 219 138 -146 224 192 -100 137 -46 152 183 86 -124 -64 -140 -71 -123 -13 251 -131 -69 96
7989I6nJ81n02o0J10J10k8j03K36n7N7j87L18R9k62J21l06L94k03LJ49j48J25
$$ 96 91 272 -230 -290 -180 -70 -98 -201 35 -22 35 -152 166 265 3 124 -182 212 9 12 161 13 138
8012A38r5l16K2K97K2J04j91j01j2J48J82l40M5m7J43n0R5k02K06j03J07o3r0
$$ 138 43 -273 -251 46 68 172 -19 -120 -132 16 198 -142 -97 -144 -1 -51 44 -158 48 -55 52 -11 -101
8035a01L67m5ll61K47j96M2K13k44R7J87k49O5k6j46L92l04P1o9K7n0J55O0m73
$$ -101 266 221 218 -143 104 -92 -50 163 -81 16 203 -46 19 -7 -153 239 -65 6 -63 -36 -86 69 129 -344
8059c44M18l59L04q3m8K85j63J19J18k75lj43L84m77L62L0K4m93L31m6m7K2N4
$$ -344 74 -285 19 -64 -112 173 10 129 247 -28 -31 -174 210 -267 95 125 149 -344 -13 -59 -106 -84 -30
8082c0l12L70Qj77J78j67J38n4P4%l0n9l8o5Q2m6J71j04m3J54J39q7j6q1J91k84
$$ -30 -342 28 36 -141 37 -130 8 -46 28 28 -2 -61 -99 -164 -82 -128 43 -61 -104 50 189 102 86 5 196 -88
8108h8J26k27N3K39r2L4L2j08J42R4j45j92L48p9k65L63n1j54K37k17m1J16j75
$$ -88 38 -189 -136 103 11 45 77 -31 111 205 60 -132 216 137 -128 235 184 30 267 50 9 125 -50
8131e0PR3K08k45lO5m3J39r1l79L34j4M9j91rK43j19k0j10J47l3J41j54P6M6j58
$$ -50 -43 50 258 13 10 75 32 171 80 -299 35 21 70 -121 -130 113 -6 -26 -136 11 -22 119 -35 41 87 -71
8157g1J94o6k73L27j75J15j52J68q7K63j39r1K5M4j86P8L1J34k01%p1K16J00j94
$$ -71 123 57 -216 111 -64 51 -101 67 -20 243 104 13 38 82 -104 -26 5 139 -62 -62 -133 83 183 -11
8181a1J92l8q7Kj83K68kq9k4L4
$$ -11 181 143 56 58 -125 143 141 52 28 62
8191F2
$$ Imaginary data points
##PAGE= N=2
##DATA TABLE= (X++(I..I)), XYDATA
0@%%%%%%%%%Qj6J6j6K4l2L2m0N6p2Q1r7J20j36J60j92K24k58K98l44L95m53N17
$$ 0 0 0 0 0 0 0 0 0 0 8 -8 8 -8 16 -16 16 -24 32 -40 41 -56 64 -72 88 -104 120 -138 160 -184 211 -242 275
32B75n88O67p54Q50r55J071j198J336j487J654j835K032k248K484k742L024l332
$$ 275 -313 354 -400 450 -505 566 -632 704 -783 871 -964 1068 -1180 1304 -1438 1586 -1746
49a746L669m040M449m904N410n975O611p331Q157r113J0232j1571J3200j5231
$$ -1746 1923 -2117 2332 -2572 2838 -3137 3474 -3857 4300 -4813 5419 -6152 7048 -8183
63h183J7849k1361K6347l4019M7432p7488K62735R842l54716K23895p8313J28658
$$ -8183 9666 -11695 14652 -19367 28065 -49423 213312 223154 -131562 92333 14020 142678
75A42678m986k23096O3524J23647n228n9183j36770J38190O1046n9089J2222o5189
$$ 142678 137692 -85404 -21880 101767 96539 37356 -99414 38776 99822 40733 52955 -12234
87a2234L8820O8659p1934j5395J7114J9539p752j1248j3038J0060n41n58J1333
$$ -12234 26586 95245 23311 7916 25030 44569 36817 25569 12531 22591 22050 21492 32825
100C2825k354O418L928l4620L0231K0019o7128L5935L481j7827M2999q7428J3105
$$ 32825 30471 36889 40817 6197 36428 56447 -10681 25254 28735 10908 53907 -33521 -20416
113b0416O4136l5480P000l5765J7137Q2952o7399l2567K1271P047R1224p8590
$$ -20416 43720 8240 15240 -20525 -3388 79564 12165 -20402 869 7916 99140 20550
125B0550r0271Q8151J2580m495l2189o1811O4239N8054m4310n4981j1585Q0593
$$ 20550 -69721 18430 31010 26515 -5674 -67485 -3246 54808 10498 -44483 -56068 24525
137B4525L7019p0577o296J0781L1049L9421o9210l2291O4776J3601j6203k3588
$$ 24525 61544 -9033 -15329 -4548 26501 65922 -3288 -35579 29197 42798 26595 3007
149C007l0550M7845J2082l0653J596j6884L4313K0368n3608O245J3250j1513K9688
$$ 3007 -27543 20302 32384 1731 3327 -13557 20756 41124 -12484 -6239 7011 -4502 25186
162B5186k2839k1689K2073j7048J2449J87k3796J6090L717J0362J1324l9983J313
$$ 25186 2347 -19342 2731 -14317 -1868 -1681 -25477 -9387 -5670 4692 16016 -23967 -22654
175b2654L7507J014K037l0316j3172M9193M83l6468j5309L985M4511R195o2638
$$ -22654 14853 15867 17904 -12412 -25584 23609 24092 -12376 -27685 -23700 20811 30006 -32632
188c2632o742L3361K7409n24n5489O852M9682J327j4279l3667l486O0752r904
$$ -32632 -39374 -6013 21396 20872 -34617 -27765 21917 23244 8965 -24702 -28188 32564 22660
201B2660l8830K991k550L4727m535l9279J3024R835J2625M388l4150J0199K1260
$$ 22660 -16170 -13179 -15729 18998 14463 -24816 -11792 -1957 10668 15056 -19094 -8895 12365
214A2365j6839J6949j2748j3435K5687j0887K461K052j7796J3451J1709n984J234
$$ 12365 -4474 12475 -273 -13708 11979 1092 3553 5605 -12191 1260 12969 6985 8219
227H219j8682O898L0207j5276p537j1756O611L2281j7273k8792M311J8443J7654
$$ 8219 -10463 -3565 26642 11366 3829 -7927 -1316 30965 13692 -15100 -10789 7654 25308
240B5308j4050m2031J9822L1687l952j8306k7793K7102L4767j8041l1368k892
$$ 25308 11258 -30773 -10951 20736 16784 -1522 -29315 -2213 32554 14513 -16855 -19747
252a9747K5306K9623k6170l8478K4846J9243P537k2964k8154K8759K3872j3681
$$ -19747 5559 35182 9012 -29466 -4620 14623 22160 -804 -28958 -199 23673 9992
264I992k0843n793J7680K2346k4494j1142Q609O038J6398k2217q742J4744K993
$$ 9992 -10851 -16644 1036 23382 -1112 -12254 -3645 2393 18791 -3426 -12168 2576 5569
277E569J050l830q193P930L403o639J1086j2149P74N357k692J2944j2368j1429
$$ 5569 6619 2789 -5404 2526 5929 -710 10376 -1773 -999 4358 1666 14610 2242 -9187
291i187J1636J0551k082r139j5739J8877J8431j8976j0395r625K5125J8665k9495
$$ -9187 2449 13000 10918 1779 -13960 4917 23348 4372 -6023 -15648 9477 28142 -1353
304a353j8407J3807K2216N331k7014k0712L3546J5876j0966k3391r766L7750Q665
$$ -1353 -19760 -5953 16263 21594 -5420 -26132 7414 23290 12324 -11067 -20833 16917 25582
317B5582k5974j7127P800K5841O932l4190j0020K3626R679P50k8756j804K8149
$$ 25582 -392 -17519 -9719 16122 23054 -11136 -21156 2470 12149 12899 -15857 -17661 10488
330A0488J651j1482j2815J233K0232J780j9842K812K48Q392M728j8327O962L108
$$ 10488 12139 657 -12158 -10925 9307 11087 -8755 -5943 -5695 2697 7425 -10902 -3940 -832
344h32j684P669n600n556O855k959P358M748j9416M825N072N357K519k1954J600
$$ -832 -2516 5153 -447 -6003 852 -2107 5251 9999 -9417 -4592 480 5837 8356 -13598 -11998
359a1998J8054m96p310j0595J372K7102n063j8931o27P137K2427p298k5275N088
$$ -11998 6056 5560 -1750 -12345 -10973 16129 11066 -7865 -8492 -1355 21072 13774 -11501 -6413
373f413J4991O407q450k4422P765K4576p360j3330j2245J1000K1313j1400j4987
$$ -6413 8578 14985 6535 -17887 -10122 14454 7094 -6236 -18481 -7481 13832 2432 -12555
386a2555J341Q648J4517r727k0552J1979Q363R09k237j5063N750J0593k782l24
$$ -12555 -11214 -2566 11951 2224 -18328 -6349 2014 2923 686 -14377 -8627 1966 -816 -1140
400a140n949j866J3799k334j629k076j1710J5205O028j1661l664o470Q053J2484
$$ -1140 -7089 -8955 4844 2510 881 -1195 -12905 2300 8328 -3333 -6997 -13467 -5414 7070
414G070j7206q648P451O429J2879j9474j0413J7685P313L727j4563j1426K2249
$$ 7070 -10136 -18784 -11333 -4904 7975 -11499 -21912 -4227 3086 6813 -7750 -19176 3073
427C073Q103j5329o942o558J9488R214k5959k278O933J1273L246j9239j221J7595
$$ 3073 11176 -4153 -11095 -17653 1835 11049 -14910 -17188 -10255 1018 4264 -14975 -16196 1399
441A399N338l953j2284l474K2558k838j0071K4k420J0880J249j2364k072R164
$$ 1399 6737 2784 -9500 -12974 9584 6746 -3325 -3301 -5721 5159 6408 -5956 -8028 1136
455A136J497L060q046k712O512n164Q660l902j1080N642J259k202K939j2672l063
$$ 1136 2633 5693 -2353 -5065 1447 -3717 4943 1041 -10039 -4397 -3138 -5340 -2401 -15073 -18136
470a8136J6755j859N19j3705n88K4106l534o761n641N5K3438K42k9538M610J0716
$$ -18136 -1381 -3240 -2721 -16426 -17014 7092 3558 -3203 -8844 -8789 14649 14891 -14647 -10037 679
485F79R052J040l0650O767J7289N66n016k0518Q571K7046r040j5806l38L065K3225
$$ 679 9731 10771 -19879 -13112 4177 4743 -273 -20791 -12220 14826 5786 -10020 -10358 -7293 15932
500A5932j1113j9791J1391M050R754j0886j6701J2780R288k634k105j0835O382
$$ 15932 4819 -14972 -3581 469 10223 -663 -17364 -4584 4704 2070 -35 -10870 -4488
513d488J2203j2599L287q27j867R619n867l204J754l302j46R549k804l080k176
$$ -4488 7715 -4884 -1597 -2424 -4291 5328 -539 -3743 -1989 -5291 -5437 4112 1308 -1772 -3948
528c948M80J2228k591o818k76P417J0044l871k0820N389J5273n901l64j6215J424
$$ -3948 -3468 8760 6169 -649 -925 6492 16536 12665 -8155 -2766 12507 6606 6242 -9973 -8549
543h549K0692j0886j3301j070R015J6148j3742j4422J3640Q25J0142q666j8996
$$ -8549 12143 1257 -12044 -13114 -4099 12049 -1693 -16115 -2475 -1650 8492 -174 -19170
556a9170K5676J909r226k393j2157J7362R393j7265M63n54Q483R944k3478L935
$$ -19170 6506 8415 -811 -3204 -15361 2001 11394 -5871 -5408 -5962 2521 12465 -11013 -7078
570g078J0139m72P914j6764l503J3606k289j791l039l514Q399r34l074N35l705
$$ -7078 3061 2589 10503 -6261 -9764 3842 1553 -238 -3277 -6791 1608 674 -2400 -1865 -5570
585e570O893J125k97K095n610l023P325L763p787k430n53N046O373j4287q690
$$ -5570 1323 2448 2151 4246 -1364 -4387 2938 6701 -1086 -3516 -4069 977 7350 -6937 -15627
600a5627J2603P850O4j2473p764J8907L416n447p479o347K4284K922k1025j460
$$ -15627 -3024 4826 4890 -7583 -15347 3560 6976 1529 -5950 -12297 11987 14909 -6116 -7576
614g576K080J3584N364k4214J527J1918K927J083k1094L452J9356m902l302q903
$$ -7576 -5496 8088 13452 -10762 -9235 2683 5610 6693 -14401 -10949 8407 3505 203 -8700
628h700j653J6797m638j0644L294n02R486k324j1038N471O76L594K435o796J421
$$ -8700 -10353 6444 1806 -8838 -5544 -6046 3440 1116 -9922 -4451 -3775 -181 2254 -4542 -3121
643c121M043l915N234j319p532O200M98J932j458q821K821P098K89l572o078K249
$$ -3121 922 -2993 2241 922 -6610 -410 88 2020 562 -8259 -5438 1660 1949 -1623 -7701 -5452
659e452J3645n910p651q06M978J2634p009j3923L803J2631J457p604j1057O910
$$ -5452 8193 2283 -5368 -6174 -1196 11438 4429 -9494 -5691 6940 8397 793 -10264 -3354
673c354J4045o230q715o038J0192J1555r633j1099M655P739L787o242j1927J1342
$$ -3354 10691 4461 -4254 -10292 -100 11455 1822 -9277 -4622 3117 6904 662 -11265 77
687G7N976l406m419o877R890M218n920j956j023K482N956p809j174M599m201O446
$$ 77 6053 2647 -1772 -8649 1241 5459 -461 -2417 -3440 -958 4998 -2811 -3985 614 -3587 2859
703B859l810k325L258m062L125K536k862k246l73K786O121q550n066O133M130
$$ 2859 -951 -3276 -18 -4080 -955 1581 -1281 -3527 -3900 -1114 5007 -3543 -8609 -2476 1654
718A654M426j1637m188R528P360m734j0278M36J1638O616j3268o448M581J1913
$$ 1654 6080 -5557 -9745 -217 7143 2409 -7869 -7433 4205 10821 -2447 -8895 -4314 7599
732G599J034j5334l257J1200Q355p543r902k73J3353L244j0595l281K243J1460
$$ 7599 8633 -6701 -9958 1242 9597 2054 -7848 -8121 5232 8476 -2119 -5400 -3157 8303
746H303k349j0657M48O870L185l630o906Q73R190l440k360k051J435N631l856
$$ 8303 5954 -4703 -4255 2615 5800 2170 -4736 -3863 5327 1887 -473 -2524 -1089 4542 686
761F86o26J772j093n92J193j203J928l149l435O241j294j382m622l3Q459K99p449
$$ 686 60 1832 739 147 1340 137 2065 -1084 -4519 1722 428 -954 -5576 -5609 2850 3149 -4300
778d300k016N379O628n47j2411J486J0858K842n817j1574M329J2703j518j1202
$$ -4300 -6316 -937 5691 5144 -7267 -5781 5077 7919 2102 -9472 -5143 7560 6042 -5160
792e160l235O724J0706n063j3667L859R567M939p763r854O921R803l041q173l703
$$ -5160 -8395 -1671 9035 3972 -9695 -5836 3731 8670 907 -8947 -2026 7777 4736 -3437 -7140
807g140O633Q566p724o336K577N076L801o110k997M955K958o40k046k938M111
$$ -7140 -507 8059 335 -6001 -3424 1652 5453 -657 -3654 1301 4259 3619 1573 -1365 2746
822B746O16k991P72j978O31k49RK400j435l325K733M020R24k356m927M962O115
$$ 2746 3362 371 1143 -835 -204 -453 -444 1956 521 -2804 -71 3949 4873 2517 -2410 2552 8667
839H667l471o389j787O285M392p162q245L954O307K484r063o916J0123O484l467
$$ 8667 5196 -1193 -2980 3305 7697 535 -7710 -3756 2551 5035 -4028 -10944 -821 5663 2196
854B196q376j979J0438N221r920n141L426P584K315j2825k86Q002L559j713q123
$$ 2196 -6180 -8159 2279 7500 -2420 -7561 -4135 3449 5764 -7061 -7347 655 4214 2501 -5622
869e622K276Q926L38m883k129J88P990k994o281K873j016K354j841k701J090R69
$$ -5622 -3346 5580 5918 1035 -1094 -906 7084 4090 -2191 682 -334 2020 179 -2522 -1432 -463
885d63p44J425l1p03J230k167M884K56m623j50K513K350j290n564l049Q709P72
$$ -463 -1207 218 187 -516 714 -1453 3431 3687 -936 -1086 1427 3777 2487 -3077 -6126 2583 3355
902C355m300m705j42J1667j875p515j779N081Q586k087j1700K523Q237P63j206
$$ 3355 -945 -5650 -5792 5875 4000 -3515 -5294 -213 8373 6286 -5414 -2891 5346 6109 4903
917D903j2170N598J0401m400m632n659N740P961n091o200J354K545N456o570p190
$$ 4903 -7267 -1669 8732 4332 -300 -5959 -219 7742 2651 -3549 -2195 350 5806 -764 -7954
932g954P272l74J244l235m308L552K166j145j148Q36Q51K765j960J828P86k101
$$ -7954 -682 -1056 188 -3047 -7355 -3803 -1637 -2782 -3930 -3094 -2243 522 -1438 390 1176 -925
948i25K684L02p2n06j679j932N528j437m921J751k33N663l467n430L875K775L013
$$ -925 1759 2061 1989 1483 -196 -2128 3400 1963 -2958 -1207 -1440 4223 756 -4674 -799 1976 4989
965D989k793p725N753O684n517j009n442N760P472r654k406L77N393M505r492
$$ 4989 2196 -5529 224 6908 1391 382 -5060 700 8172 -1482 -3888 -3511 1882 6387 -3105
980c105l586P445K233l6o808l773J1616j022l965k854j720Q743r1o945p13M325
$$ -3105 -6691 754 2987 2951 -3857 -7630 3986 2964 -1001 -3855 -5575 3168 3077 -3868 -4581 -256
996b56L438j54o390J564N041p52M21m161P50L915k047k338N25j834L08K404k935
$$ -256 3182 3028 -3362 -1798 3243 2491 2912 -1249 -499 3416 1369 -969 -444 -2278 -1970 434 -2501
1013b501J421k193j561M287j59m51j842j200O531J386p067L3J658N380K143j0116
$$ -2501 -1080 -3273 -4834 -547 -706 -1157 -2999 -4199 2332 3718 -3349 -3316 -1658 3722 5865 -4251
1029d251p91O619L865k340q352M9J1553K09o338n050N75J1886j309j0419L00M162
$$ -4251 -5042 1577 5442 3102 -5250 -5201 6352 6561 223 -4827 -4252 7634 6325 -4094 -3794 368
1045C68N174j552j0162K374Q686n79k521o099L410P023l630k087j592J362N745
$$ 368 5542 3990 -6172 -3798 4888 4309 1788 -4311 -901 6122 2492 405 -1187 175 5920
1060E920m300m588M445j474R64j50l523L305j189o42J728j031O71n02j002L739
$$ 5920 1620 -2968 1477 3 967 817 -2706 599 -590 -1232 496 -535 136 -366 -1368 2371
1076B371p35m569K170J776K233j492n062J962M566M50n283j958K529O274k795
$$ 2371 1636 -2933 -763 1013 3246 1754 -3308 -1346 3220 3670 -1613 -3571 -1042 5232 2437
1091B437p301J539M078M425m934o714M519P014j950n182l716N099Q272o529m433
$$ 2437 -4864 -3325 753 5178 244 -6470 -1951 5063 3113 -2069 -5785 -686 7586 1057 -3376
1106c376J87M979N419p462m149M169M626L52n363m246P988J752l973r66l004O284
$$ -3376 -3189 1790 7209 -253 -4402 -233 4393 4745 -618 -4864 3124 4876 903 -63 -3067 3217
1122C217O39m306k75O24J882L59k279o2J367j478K232j046o11J140k709L235Q02
$$ 3217 3856 -450 -725 -101 1781 2140 -139 -201 1166 -312 1920 874 263 1403 -1306 1929 2731
1139B731j983k346J288K733J013m143k812M459K118l87o453j03O432J747m647
$$ 2731 748 -1598 -310 2423 3436 -707 -3519 940 3058 2671 -3782 -3885 2547 4294 -353
1154c53m515K847N528J377p978k117N464M140j315q165P01O564K616n117m467
$$ -353 -4868 -2021 3507 4884 -3094 -5211 253 4393 3078 -5087 -4386 2178 4794 -323 -4790
1169d790J535O785P49p486M75K238M403o91n951R92L929R58k423k752O10M249
$$ -4790 -3255 3530 4279 -3207 -2732 -494 3909 3218 -2733 -1741 2188 3146 723 -2029 -1419 2830
1185B830k414o14J91j093K955j907R72J046k161L12J999j34j76k757K11M654j698
$$ 2830 416 -198 -7 -1100 1855 -52 920 1966 -195 117 2116 1982 1806 -951 -740 3914 2216
1202B216k574j896J542M982k671m212O62M627J581k971m832K565O002j414m334
$$ 2216 -358 -2254 -712 4270 1599 -2613 -1951 2676 4257 1286 -3546 -981 5021 3607 -727
1217g27l396M467M285k640n303j10N363K581l683n786L451N014j78l907k933L636
$$ -727 -4123 344 4629 1989 -3314 -3424 1939 4520 837 -4949 -1498 3516 3338 -569 -3502 134
1233A34L896k939m638O60K897K099l505k073K004P86J352k026m34K300J97k14
$$ 134 4030 1091 -3547 -2887 10 2109 -1396 -3469 -1465 -679 673 -1353 -1787 513 710 496
1249D96Q17o75L92K5l09J783j829p13K51P79J218k073k450K406L080j164k757
$$ 496 1313 638 1030 1055 746 2529 700 -13 238 1017 2235 162 -2288 118 3198 2034 -723
1266g23j580L620K933k882l103J76M612Q96m338l962L890M236r47n074j796N809
$$ -723 -2303 1317 4250 1368 -1735 -1559 3053 3949 -389 -4351 -461 3775 2828 -2246 -4042 1767
1282A767K561k450m618Q44N712J305n292l174L443L039M7n673l02L814J042j632
$$ 1767 4328 1878 -2740 -1896 3816 5121 -171 -3345 98 3137 3184 -2489 -2791 1023 2065 433
1298D33l518J514M275o1l202K78P41K036j32k711J745m38Q2j099o77O82q01j045
$$ 433 -3085 -1571 2704 2643 -559 -281 460 2496 2364 -347 1398 960 1042 -57 -734 -52 -853 -1898
1316a898J224J050j983l24k94K762Q80l186k45J514L209j596l642R2M955R87l547
$$ -1898 -674 376 -1607 -1931 -2225 537 1417 -1769 -2014 -500 2709 1113 -2529 -2437 2518 3505 -42
1333d2k476J490N809j000m610o18L769L694k350n529J102N730o80l207l867K345
$$ -42 -2518 -1028 4781 3781 -829 -1447 2322 6016 3666 -1863 -761 4969 4289 1082 -2785 -440
1349d40N217l045l150j568L544L258k926l147K235K348K36j325l193L870J25p14
$$ -440 4777 1732 -1418 -2986 558 3816 890 -2257 -22 2326 2562 1237 -1956 1914 2039 1325
1365A325j150j183K250j146r20L20K11j021N80n3J313N14k901J829J358P45k018
$$ 1325 175 -1008 1242 96 -824 -504 -293 -1314 -734 -787 526 1040 -1861 -32 1326 2071 53
1382E3j986K387K707j365m104R95K312K446l304l545K928L659n92m198j566L528
$$ 53 -1933 454 3161 1796 -2308 -1313 999 3445 141 -3404 -476 3183 2591 -1607 -3173 355
1398C55L856m403k861N47L402K391o438j221K875L249N8n275J90N237R38k295
$$ 355 4211 -192 -3053 -2506 896 3287 -3151 -4372 -1497 1752 1810 -3465 -3275 1962 2900 605
1414F05k008n2N740r87l979K35Q94L080k331k817J617J114j63o62j669J654J532
$$ 605 -1403 -1455 4285 3298 -681 -446 448 3528 1197 -1620 -3 1111 948 286 -1383 271 1803
1431A803k387Q08L81K07m41q12J235N88j619j573K250M11J12k600j405M628N81
$$ 1803 -584 224 605 812 371 -441 794 1382 -237 -1810 440 851 963 -1637 -3042 1586 2167
1448B167k805k139P70M104O29n505o49K909K710n19o969J976M998K61k585m122
$$ 2167 -638 -2777 -2007 2097 2726 -2779 -3428 -519 2191 1672 -5297 -3321 1677 1938 -647 -4769
1464d769J920O689k266l840m23K189N284l635m611K781K095J160k943l136L272
$$ -4769 -2849 3840 1574 -2266 -2689 -500 4784 1149 -3462 -681 1414 2574 -369 -3505 -233
1479b33K348k448j006j009K266J876k965q6J178M4P31p85j79J338o20p98J055
$$ -233 2115 -333 -1339 -2348 -82 1794 -1171 -1257 -79 -35 696 -89 -268 1070 450 -348 707
1496G07m27R76j769m25K675l82j965n5O13J897m39l893K077K203k60j610l666
$$ 707 280 1256 -513 -938 1737 1355 -610 -665 -52 1845 1406 -2487 -410 1793 1533 -77 -3743
1513c743L722K816k189k328l49K618K725l791k902L081K045P63m465j097M472
$$ -3743 -21 2795 606 -1722 -2071 547 3272 -519 -3421 -340 1705 2468 -1997 -3094 1378
1528A378N88k037k653R05L219J043m327r93K436J462l7l261L72K607K98j251j135
$$ 1378 1966 -71 -2724 -1819 1400 2443 -1884 -2877 -441 1021 984 -2277 -1905 702 1000 -251 -1386
1545a386j47K557k33k135J607r46J442n14q50J587j551J8Q93K43l96m84j613L099
$$ -1386 -1533 1024 791 -1344 263 -683 759 245 -605 982 -569 -551 342 585 189 -295 -1908 1191
1563A191P05k569J09j147L782K47l326r63K381K753j140l950k58M604K85k100
$$ 1191 1896 -673 -564 -1711 2071 2318 -1008 -1971 410 3163 2023 -1927 -2185 2419 2704 604
1579F04l191J135M649j275k948j957L367K766j288m585P31M216m3j888l244K145
$$ 604 -2587 -1452 3197 1922 -1026 -2983 384 3150 1862 -2723 -1992 2224 2181 293 -2951 -806
1595h06K989j176l102j44K098K037j375l215K401M83K65l51j952K206O80j119
$$ -806 2183 1007 -2095 -2239 -141 1896 521 -2694 -293 190 455 104 -1848 358 1038 -81
1611h1m63J49K10K01j519J290J248k271O06l94J783K13k557N28K056R96j588k477
$$ -81 -544 -395 -185 16 -1503 -213 1035 -1236 -630 -1024 759 972 -1585 -1057 999 1995 407 -2070
1629b070R13L919q62k791j165K000L400k048l751M86M641R50l200k960K411M689
$$ -2070 -1157 2762 1900 -891 -2056 -56 3344 1296 -2455 -1969 2672 3622 422 -2538 -127 4562
1645D562j773l812j017L776K596l269l838J077M383Nl305k393L336L109k168k648
$$ 4562 2789 -1023 -2040 1736 4332 1063 -2775 -1698 2685 2690 -615 -3008 328 3437 1269 -1379
1661a379l70L453J442k934j675J581J408M7k204m59J905l41j93p62j37J257o54
$$ -1379 -1749 1704 3146 212 -1463 118 1526 1573 -631 -1090 815 474 281 -481 -618 639 -15
1678a5K1O76L06p15m89M24J461j148j391K32J522Q40k503j290J878L027j338k497
$$ -15 6 682 988 273 -216 208 1669 521 -870 -638 884 1724 -779 -2069 -191 2836 1498 -999
1696i99q82K800K204k472k676Q05L861P5m028j869L013K742j888l123l01M422
$$ -999 -1881 919 3123 651 -2025 -1220 2641 2716 -1312 -3181 -168 2574 686 -2437 -2738 1684
1712A684P55k812k014J648L589j87k933j207L121J219r72l091N26K705p6j050
$$ 1684 2439 -373 -2387 -739 2850 2663 -270 -1477 1644 2863 1891 -1200 -674 2031 1955 905
1728I05k081Q19K141o35j280k19O78L69J44j336N75p88L11M00k54k89j294M96
$$ 905 -1176 -357 1784 1149 -131 -350 328 697 841 -495 80 -708 -397 3 -251 -540 -1834 -1338
1746a338J416K73j956K7J005J053K67l107O33K200J094k040k396R78L280n68l104
$$ -1338 78 351 -1605 -1578 -573 480 747 -2360 -1727 473 1567 -473 -2869 -1891 1389 821 -2283
1763b283m83J802L036j890l143J256K451J872k812k069J715L199j355k381p47
$$ -2283 -2766 -964 2072 182 -2961 -1705 746 2618 -194 -2263 -548 2651 1296 -1085 -1832
1778a832J969K510k764k048K20K319L34k025q15J212J690p31q83o81J501L09r36
$$ -1832 137 2647 -117 -2165 -1945 374 708 -1317 -2132 -920 770 39 -844 -1525 -24 285 -651
1795f51L34j84O58o99K23K56K68r63L26J427j08n20j863J740J681m30k029j078
$$ -651 -317 -501 157 -542 -319 -63 205 -758 -432 995 887 367 -1496 244 1925 1495 -534 -1612
1813a612K168J564j946k910J691J752Q15k631k103K960K051q13l461K6L640J251
$$ -1612 556 2120 174 -2736 -1045 707 1522 -1109 -3212 -252 1799 986 -2475 -2449 1191 2442
1829B442l095k547J651K903M86m215q19K886J964j556l381J242K937N19k591q86
$$ 2442 -653 -3200 -1549 1354 1840 -2375 -3194 -308 1656 100 -3281 -2039 898 1417 -1174 -2060
1845b060J280K699p75k749J122R22J021j576q18J375K63j15o42K59K02M08j157
$$ -2060 -780 1919 1144 -1605 -483 439 1460 -116 -934 441 704 589 -53 206 408 816 -341
1862c41O00J354j344p1m84J184J98j700k02J169Q53q15j979n0L361K1j932j461
$$ -341 259 1613 269 198 -286 898 1096 -604 -806 363 1216 401 -1578 -1628 1733 1754 -178 -1639
1880a639J089K959k51l587o1K735J220j237l241R67L083k63k125j909J856L053
$$ -1639 -550 2409 2158 -1429 -1490 1245 2465 1228 -2013 -1046 2037 1774 -351 -2260 -404 2649
1896B649j786k857L79J888K013j826k593J692J396R0j350j239J510J421j297o02
$$ 2649 863 -1994 -1615 273 2286 460 -2133 -441 955 1045 -305 -1544 -34 1387 90 -512
1912e12oJ84J193j630M46M61o83R26m68j27L05o84J80R12k74k69p86N37J937j515
$$ -512 -518 -334 859 -771 -325 136 -547 379 -89 -216 89 -595 -415 497 223 -46 -832 -295 1642 127
1932A27p63M04J384K98j222j545J615J826j090j096j031K179J116k026j705J322
$$ 127 -636 -232 1152 1450 228 -1317 298 2124 1034 -62 -1093 1086 2202 176 -1529 -207
1948b07J743M70k481j569L032O91p28k002n72L560j21k144p14Q75J790n8k493
$$ -207 1536 2006 -475 -2044 988 1679 951 -1051 -1623 1937 1816 -328 -1042 -167 1623 1565 -928
1965i28L50J518j01K47k548Q21J389p21k25m39K28M86o31l31J251r89j2L10l56
$$ -928 -578 940 839 1086 -1462 -641 748 27 -198 -637 -409 77 -554 -885 366 -623 -635 -325 -681
1984f81J351j931l8J448O24p03j397k06K108Q41k775j4O72K685j061l064O15K064
$$ -681 670 -1261 -1299 149 773 70 -1327 -1533 575 1416 -1359 -1373 -701 1984 923 -2141 -1526 538
2002E38J577j898k346R49L176o89k320p07R80K973j713k195O8K385J275j788k066
$$ 538 2115 217 -2129 -1180 1996 1307 -1013 -1720 -740 2233 520 -1675 -1607 778 2053 265 -1801
2019a801J006K685j249q05j252J376J652j803q48M95R00J98r63q74J556J48j178
$$ -1801 -795 1890 641 -164 -1416 -40 1612 -191 -1039 -544 356 554 -409 -1283 273 421 -757
2036g57R23q41J228p91q55J126J56n40n89j55P78Q18k435R42O24P15l86k235J209
$$ -757 166 -675 553 -238 -1093 33 189 -351 -940 -1095 -317 501 -1934 -992 -368 347 -39 -2274 -1065
2055a065J660j52j686o31J184K294k126k065J108J561J459k695j609J669K452
$$ -1065 595 443 -1243 -1874 -690 1604 -522 -2587 -1479 82 1541 -1154 -2763 -1094 1358
2070A358n85k705L8K130J969k838j423O55K468K76k259j145J999J521j123j447
$$ 1358 773 -1932 -1894 236 2205 -633 -2056 -1401 1067 1343 -916 -2061 -62 1459 336 -1111
2086a111k69J711J006j842m76L44J363j68j280L04P63L9l18k00r1Q03p86L38O31
$$ -1111 -1380 331 1337 -505 -981 -637 726 558 -722 -418 345 384 66 -134 -225 578 -208 130 761
2105G61m75k28o03P83R09p71j022O95J063N19k227p72J805R51m99k607j43K912
$$ 761 286 58 -545 238 1147 376 -646 49 1112 1631 -596 -1368 437 1388 889 -1718 -1861 1051
2123A051M39k471j148J214K150ql087j29K111J709j300k849J189K250J7k399o21
$$ 1051 1490 -981 -2129 -915 1235 1227 -1860 -1989 122 1831 531 -2318 -1129 1121 1138 -1261 -1882
2140a882J253K323p38k559M05J798Q93j687r31J324J015m64r53j82M34J263j171
$$ -1882 -629 1694 956 -1603 -1198 600 1493 -194 -1125 199 1214 750 -203 -385 49 1312 141
2157A41l0J67M89o68k19M47M74m21q46J265m9k00j325J75K010k54j315j548J593
$$ 141 111 278 767 99 -120 327 801 380 -466 799 750 550 -775 -600 1410 1156 -159 -1707 -114
2176a14J327n63k041J21K620N12j401k506J666K495r7k797r29K611J779j863k666
$$ -114 1213 650 -1391 -1270 1350 1862 461 -2045 -379 2116 2019 -778 -1707 904 2683 820 -1846
2193a846J071K153M33j962k201K195J913r03k107r7J759J100j628j527R90R01
$$ -1846 -775 1378 1811 -151 -2352 -157 1756 853 -1254 -1351 408 1508 -120 -1647 -657 244
2209B44O79k120k2J056J75j17j226N66N58K23q37M53p5L42Jm40Q35j94n98j66
$$ 244 923 -1197 -1219 -163 12 -105 -1331 -765 -207 16 -821 -368 -443 -101 -100 -540 295 101 -497 -663
2229f63J108J73q87m08K47J597o88o95p99J894R83j376j443M25K330m27j305j885
$$ -663 445 618 -269 -677 -430 1167 479 -216 -1015 879 1862 486 -957 -532 1798 1371 66 -1819
2247a819J966J417q92j807o90K508P44j692j631O26K337J41k200r29J994J072
$$ -1819 147 1564 672 -1135 -1825 683 1427 -265 -1896 -1270 1067 1208 -992 -1921 73 1145
2263A145m22k421O89J614r2o48j342R13J146k09p98k49O16N77o32o63J014l13
$$ 1145 723 -1698 -1009 605 513 -135 -1477 -564 582 373 -425 -674 -58 519 -113 -776 238 -75
2281g5j12k0k36J87k63p3R8Q42j169k30M34J040k06j387L28N96J143j038j065
$$ -75 -187 -207 -443 -256 -519 -592 -494 348 -821 -1051 -617 423 217 -1170 -842 -246 897 -141 -1206
2300a206L04J665K75j839n22N80K252o72k404K79J473J349j272j926Q36K265l99
$$ -1206 -902 763 1038 -801 -1323 -743 1509 837 -1567 -1288 185 1534 262 -1664 -828 1437 1038
2317A038j050j146J433J499j380n26p59J492P65j045j002P39O30m42k27q08J068
$$ 1038 -12 -1158 275 1774 394 -132 -891 601 1366 321 -681 58 688 246 19 -789 279
2334B79l45K54k17m35L79j36j95N72L7n54K3K21K08P5j118O95N43R0p54m72N68
$$ 279 -66 188 -29 -464 -85 -221 -416 156 193 -361 -338 -117 91 166 -952 -257 286 376 -378 -850 -282
2355b82J226r40j339O52Q20Q80j795j021J461J389p11j551m18J643J441k015p97
$$ -282 944 4 -1335 -683 137 1017 -778 -1799 -338 1051 340 -1211 -1629 14 1455 -560 -1357
2372a357M44J769N70k460j61Q67J504l21j979j71J937O62j242q31K5J844l73j150
$$ -1357 -913 856 1426 -1034 -1195 -328 1176 855 -1124 -1295 642 1304 62 -769 -744 1100 727 -423
2390d23l25P08Q49l63o88j13J097n40J35o38O00K96q76N34o4Pk37j8J47R93j533
$$ -423 -748 -40 809 446 -242 -355 742 202 337 -301 299 595 -281 253 189 196 -41 -59 88 1081 -452
2411d52m23J232O5M79j586k47J468N33q80j508N96J750O3k079l64J095J630m21
$$ -452 -875 357 422 901 -685 -932 536 1069 189 -1319 -723 1027 1090 -989 -1353 -258 1372 951
2429I51k803J064J307O47j583j122P66K135p27j839J7J027J680j612j424R81Q85
$$ 951 -1852 -788 519 1166 -417 -1539 -773 1362 635 -1204 -1187 -160 1520 -92 -1516 -535 350
2446C50P49j553p17Q96J459j021n02j50L27J148j318O7O03Nj71k75k26R79n08
$$ 350 1099 -454 -1171 -275 1184 163 -339 -489 -162 986 -332 -265 338 343 172 -103 -329 650 142
2465A42k89O77m94N43p86k89J224l88o00m70R15M06p8j566O28J354j40p96j323
$$ 142 -147 530 36 579 -207 -496 728 340 -260 -730 185 591 513 -1053 -425 929 789 -7 -1330
2484a330J391J081p09j343j24J642O06j300j683J568J321k85k013m40K101M16
$$ -1330 61 1142 433 -910 -1034 608 1214 -86 -1769 -201 1120 835 -1178 -1618 483 899
2500H99r96j461O90J229N13j987k60J347N61l54j714L95J246N09j151m40L60O31
$$ 899 -97 -1558 -868 361 874 -1113 -1373 -26 535 181 -1533 -1138 108 617 -534 -974 -614 17
2518A7l6q04M22PJ88r4qM64l20l79P12m5k06j92m66R24O33j009l00j63J504J70
$$ 17 -19 -823 -401 -394 -206 -300 -308 156 -164 -543 169 124 -82 -274 -740 184 817 -192 -492 -655 849 1019
2540A019j620k18J084J250q95j610q1J911M00j128j452R78J880p47j749j86J302
$$ 1019 -601 -819 265 1515 620 -990 -1071 840 1240 112 -1340 -362 1518 771 -978 -1164 138
2557A38P75o36j676O35J658j67j221q06J354O28n65j143J91Q32M61m45j084Q74
$$ 138 913 277 -1399 -764 894 727 -494 -1300 54 682 117 -1026 -835 -3 458 13 -1071 -197
2575a97O13n33k65oK95K58l55O5M05m96j01m30O98M03r28l40O07O14k84r14j87
$$ -197 416 -117 -382 -388 -93 165 -190 -125 280 -216 -317 -747 -49 354 -574 -914 -307 307 23 -891 -1078
2596a078J518J46j069p19M99J842q28j479q0J566J202j545j289N70K270o88j460
$$ -1078 440 586 -483 -1202 -703 1139 311 -1168 -1248 318 1520 -25 -1314 -744 1526 838 -622
2613f22q70J970J708j698j339k1K059O18j666j133J534J151p35j467n80K168J17
$$ -622 -1492 478 2186 488 -851 -872 1187 1805 139 -994 540 1691 956 -511 -1091 1077 1194
2630A194r61j124N85J330k12j260p9R73J41p60o73Q71L70n76k38N6R20o35p33
$$ 1194 233 -891 -306 1024 812 -448 -527 446 587 -173 -846 25 395 -181 -419 -363 557 -78 -811
2649h11L38Q77J25j103J42N26J079j084j100N30J381R3j695n28J172J409j031
$$ -811 -473 404 529 -574 -432 94 1173 89 -1011 -481 900 993 -702 -1230 -58 1351 320
2666C20j258j52J908R43k246j008J383J716p87j629l20J374J231j792j335O22
$$ 320 -938 -1090 818 1761 -485 -1493 -110 1606 819 -810 -1130 244 1475 -317 -1652 -1030
2682a030K476m45j689m29J008J485r62j141k3J833K2r42q23L69J372m30q02m79
$$ -1030 1446 1001 -688 -1117 -109 1376 414 -727 -750 1083 1105 163 -660 -291 1081 651 -151 -630
2700f30J161K92o41j28L87J53l61J10k58M00l05l50K21L13J20j141J62R94M3j049
$$ -630 531 823 182 54 441 594 233 343 85 485 180 -170 51 364 484 -657 -495 499 542 -507
2720e07l41Q23N38r4j554K60J174N51j170j022P81J135O2j875O4J004J089r47
$$ -507 -848 -25 513 419 -1135 -875 299 850 -320 -1342 -561 574 636 -1239 -1175 -171 918 -29
2738b9j124L33J396M56j521p67Q46J235l05j373j73J365P25r72r94L65R81J26
$$ -29 -1153 -820 576 1032 -489 -1256 -410 825 520 -853 -1026 339 1064 92 -902 -537 444 570
2756E70p69n58Q56K20j21k36o08Q20J82l37L07l54J26q8K39N2k96k0L7L73p8l86
$$ 570 -199 -757 99 319 198 -38 -646 174 356 19 326 -28 98 10 249 301 5 -15 22 395 317 -69
2778f9o34Q12P28n14o88p9Q36Q94j462j024P91J224m0j820l20J741N85p36j203
$$ -69 -703 109 837 323 -365 -444 392 1286 -176 -1200 -409 815 775 -1045 -1365 376 961 225 -978
2797i78J05J599m0j492l43P26R78R2j855L53P12R49r50j028Q12O96O1q50J23N3
$$ -978 -873 726 686 -806 -1149 -423 555 647 -1208 -855 -143 806 -144 -1172 -360 336 397 -453 -330 -277
2817b77R00o64p16N32J87J18k05k7p3K84m63J65K29j34J31n20J130m5p17n58Q18
$$ -277 623 -41 -757 -225 -38 80 -125 -152 -225 59 -404 -239 -10 -144 -13 -533 597 552 -165 -723 95
2838I5J032n58r73l24J505J96m71j216K15J744m85r54n01J161R24o04j762J40
$$ 95 1127 569 -404 -728 777 973 502 -714 -499 1245 760 -194 -695 466 1390 786 -976 -836
2856h36J670K82n88k091J205J350lj464n53R22J095m88j553P62O33L68o37j240
$$ -836 834 1116 528 -1563 -358 992 989 -475 -1028 -106 989 501 -1052 -290 343 711 74 -1166
2874a166J085O82j58j110K13L58P26j014l62N45l2N81r44M63L63l31m0n9J45q8
$$ -1166 -81 601 443 -667 -454 -96 630 -384 -746 -201 -233 348 -596 -133 230 -101 -141 -200 -55 -143
2894a43k4j96P61k52l64j69K38J012o74n24k39R51M14p52q83L38J366k38q71p57
$$ -143 -167 -363 398 146 -218 -387 -149 863 189 -335 -574 377 791 39 -844 -506 860 622 -249 -1006
2914a006J293J062j295p94K03J338J14p92r52R99J022n31r89l37J525J65q63p61
$$ -1006 287 1349 54 -740 -537 801 915 123 -829 170 1192 661 -328 -665 860 1025 162 -599
2932e99J77P79L50r85o77J022M23j4r71M2O57j9J7o25n5K95L88m64l5J34q0K65
$$ -599 -422 357 707 -278 -955 67 490 476 -495 -453 204 185 202 -423 -478 -183 205 -259 -294 -160 -240 25
2954B5l05O05n24o2M55n4j73l07k44P98L50j077P7J62P49j9r89j92R22O01q29
$$ 25 -280 325 -199 -261 194 140 -33 -340 -584 214 564 -513 -436 -274 475 456 -533 -725 197 798 -31
2975c1q10J3J225P1o19n13L08J253n58r27o0J080L40n28r26J74R38N2k69o91L48
$$ -31 -841 -828 397 468 -151 -664 -356 897 339 -588 -648 432 772 244 -682 -508 430 482 213 -478 -130
2996a30P23k05m53j1J17O16L8q73L95r9J21J9l52K24k13J21M6O4l14O3R2K24m2
$$ -130 593 388 -65 -76 41 657 695 -178 217 118 239 258 -94 130 -83 38 84 148 -166 -103 -11 213 171
3019A71j141Q62j38L37n95m25N13O10k42o59j48N32J056j070o30L34O87M61r89
$$ 171 -970 -108 -246 91 -504 -929 -416 194 -48 -707 -855 -323 733 -337 -967 -633 54 515 -474
3038d74n43J006M26j65r57k36Q09J213j289m31J5J074k2r05J30K70Q87p18o11
$$ -474 -1017 -11 415 250 -707 -943 -134 1079 -210 -641 -626 448 426 -479 -349 -79 808 90 -521
3057e21j66R76N4l26l19J1N49k62j14K2p8L30M7j71j17O13q04M63P7k53j85j25
$$ -521 -687 289 343 17 -302 -291 258 -4 -118 -96 -174 156 203 32 -85 528 -276 187 264 11 -174 -299
3079b99O67R4j19j137O95L81M07q88k25R42K51l71r80K21N37N37j132m75M73N90
$$ -299 368 462 343 -794 -99 282 689 -199 -424 518 769 398 -582 -361 176 713 -419 -894 -421 169
3099A69L48j596L54P62P11q25j036L48J101L05j187m64N92R51k01j119K62M31
$$ 169 517 -1079 -725 37 748 -77 -1113 -765 336 641 -546 -1010 -418 533 332 -787 -525 -94
3117i4Q93j067m25N92K70j13j01k28R6N67k46J6m52K28J82J16k5r6J28k77L42
$$ -94 799 -268 -693 -101 169 56 -45 -273 -177 390 144 160 -292 -64 118 234 209 113 241 -36 306
3138C06Mj45j42L4M77P9m02m51L1Q81r3j180K64J012R8m85q95N19R21j73p06o63
$$ 306 310 165 23 57 534 613 211 -240 -209 672 579 -601 -337 675 773 288 -607 -88 833 660 -46 -709
3160g09J059N42l59j244L52P28N56o30j044O26P13j11j003q1O51O56o36o46k7
$$ -709 350 892 533 -711 -359 369 925 295 -749 -123 590 479 -524 -605 46 702 66 -580 -607
3179f07P04N48r56j84K04O32r4l76q3K77J21m26L5L0R4J45j31K30j74j61l3M11
$$ -607 97 645 -311 -495 -291 341 247 -129 -212 65 186 -240 -205 -175 -81 64 -67 163 -11 -172 -205 206
3201B06l9j94l57K0J113n69l32k13O23M31o76n67M31J120n10o29m04P03O82k18
$$ 206 167 -27 -384 -364 749 180 -152 -365 258 689 13 -554 -123 997 487 -142 -546 157 839 621
3221F21j101o7J192L12r31q72P99N27K82r49n32Q22N86j35j117K33O58L0l71k69
$$ 621 -480 -547 645 957 26 -846 -47 480 762 -187 -719 103 689 554 -563 -330 328 358 -13 -282
3241b82J51N56K0p63J81jM09P1m97pQ1J88n1J54o67N3J91K19n5k85J25j78O81
$$ -282 -131 425 445 -318 -137 -138 271 342 -155 -162 -81 107 56 210 -457 -404 -213 6 -49 -334 -209 -387 294
3264B94n47k13jP26L00p74l78J66J093k75l89m90K59J154o54r28K32J098K88o66
$$ 294 -253 -466 -467 259 559 -215 -593 -427 666 391 2 -488 -229 925 271 -657 -425 673 961 295
3284B95q44N16P89l34k42q27O80P92n86o53J2O46L20m83m43M04J80J61k97l18
$$ 295 -549 -33 756 422 180 -647 33 825 239 -414 -402 244 564 81 -362 42 222 383 86 -232
3304b32M68Q9J02k08k44Q8QpK63j63k07J01K3L13m57l92O17R6k3n14J0N66J88
$$ -232 236 325 427 219 -25 63 71 64 327 164 -43 58 81 394 -63 -455 162 258 235 -279 -269 297 485
3327D85m63p48O12M49J10r27j65N53P37l27r95R4P40M79p16n89J04J173k30q32
$$ 485 22 -726 -114 335 445 -482 -647 -94 643 316 -679 -585 155 634 -82 -671 -567 606 376 -456
3347d56k03O02N19j23p55nR38N8n99l06K48N62j36l96k46K28O67m40j08n5J97
$$ -456 -659 -57 462 339 -416 -421 517 575 -24 -330 -82 480 344 -52 -298 -70 597 157 49 -6 191
3368A91l19J77L1j90J71m7K80Jm05q2K64K66n8m44m53Q05L47o6r95K32R31J2p11
$$ 191 -128 49 80 -110 61 14 294 295 -110 -192 72 338 280 -164 -617 188 535 469 -526 -294 637 649 -62
3391f2o41J50J349j36j241j02P46P28n66j329M79R84J4q22o50M06J187l99q27
$$ -62 -703 -553 796 660 -581 -683 63 791 225 -1104 -625 359 373 -449 -1099 -693 494 95 -732
3410g32J29N86L28k52o79K30P18rn42k88K60P37p0n33l60O01J98l13j02K2K44
$$ -732 -603 -17 311 59 -620 -390 328 319 -223 -511 -251 486 416 -117 -477 124 322 9 -93 -71 173
3431A73j10q3l0M07l82k42L65j27%L2k9O16n08l06J65J79M01k18q64N68Q50k66
$$ 173 63 -20 -50 357 -25 -267 98 -29 -29 3 -26 590 82 -224 -59 120 521 303 -561 7 857 591
3453E91p76m84R38L13m04o97L03K83O71o97o23M49N56L61j127MN97L67j80q32
$$ 591 -185 -669 269 582 178 -519 -216 67 738 41 -582 -133 423 784 -343 -339 258 625 445 -387
3473c87Q8L23K76l16k81M2L25M50q40j57L61J78o5j48NM1J42J92r3n02L62j26
$$ -387 -299 24 300 -16 -297 -255 70 520 -320 -477 -116 62 -3 -151 -146 -105 37 229 136 -366 -4 -130
3495a30J09K6k69m9N38K45l45k44l97Q87J34o83J81kP45k77p36q8O09L12k11q02
$$ -130 -21 5 -264 -313 225 470 125 -119 -516 371 505 -178 3 1 746 469 -267 -355 254 566 355 -447
3517d47qJ019K35p50m59M35P70q7r63k17Q05K18l88n26J09O46j28l76n28O82K94
$$ -447 -455 564 799 49 -410 25 795 708 -255 -472 333 551 163 -363 -254 392 264 -112 -640 42 336
3538C36l4o41P4M21Q6k76k53J43J79J01n00L37j8j18j00L01p6r1J2j14J82J29
$$ 336 302 -339 -265 156 242 -34 -287 -144 35 136 -364 -27 -45 -163 -263 38 -38 -129 -117 -231 -49 80
3560H0j98l62M67L28m50m07J90N41K11q08l41N33R69n24p62j68R38J98n63n34
$$ 80 -118 -480 -13 315 -135 -542 -352 189 400 -408 -749 -216 753 229 -533 -701 237 435 -128 -662
3580f62J23J349j76r16n26P95Q06o32q61O6J156J81r14n06P67N42l60n99r8Q15
$$ -662 -539 810 634 -282 -808 -13 793 161 -700 -634 522 703 -211 -717 50 592 232 -367 -465 350
3600C50J09n76k24Q9O05j34k08k67N37J2j25l29j18P49n06J23j28J25j1m99K83
$$ 350 459 -117 -341 -252 353 219 11 -256 281 293 168 -161 -279 470 -36 87 -41 84 73 -426 -143
3621a43M07M0q08j44M59P11n00n50K37M60J8n95k87M36O97m20n91j0N94K28n13
$$ -143 264 304 -504 -648 -189 522 22 -528 -291 169 187 -408 -695 -259 438 18 -573 -583 11 239 -274
3642b74n28M26R77k34r67k43Q94M13n55m86L3R72j76o14j70N22N19k20n68k26
$$ -274 -802 -376 601 367 -600 -843 51 464 -91 -577 -544 428 252 -362 -532 -10 509 289 -279 -505
3662e05O58J91k34n17K09L24J39m05j40N05l51K42l29J75k4R3O1m9K46o19K39
$$ -505 153 344 110 -407 -198 126 265 -140 -280 225 -126 116 -213 -38 -62 31 92 43 289 -330 -91
3683i1O3L66n05k49K61J73K12n36o3J20M97k51m80K12L83L04n34n37O04M36j2
$$ -91 -28 338 -167 -416 -155 18 230 -306 -369 -249 248 -3 -483 -271 112 416 -118 -655 -51 385 373
3704C73q99lL37P37m71p53L3J017J79o17l04J80N20l51l01l31N56L71m77k70K3
$$ 373 -526 -529 -192 545 74 -679 -646 371 550 -67 -371 -191 329 -22 -323 -654 -98 273 -204 -474 -451
3725d51N41Jk15k11L29O9pr4J24j31J4K81r3j10L8k42J89m9K42j71k05N54j1l86
$$ -451 90 91 -124 -335 -6 63 56 -38 86 -45 -31 250 157 47 85 -157 32 -17 225 54 -151 403 392 6
3749Fn62P36O15k84m88m55P14K01l99q71O98N11j7o54m04P89L27l08r30N34M13
$$ 6 -556 180 795 511 23 -432 282 483 84 -787 -89 422 405 -249 -653 136 463 155 -775 -241 172
3770A72N01p44n79N74L75K3p60l34Q71K17n71k80K40M62m3n24O7J87M84n7n31
$$ 172 673 -71 -650 -76 299 322 -438 -772 99 316 -255 -535 -295 167 124 -400 -333 -146 338 281 -250
3791b50Q6J79J76l68k3J26R2p0k01M77q0l83L9M75m7r1l84J76M21q6m20M3N11
$$ -250 -164 15 191 -177 -200 -74 18 -52 -253 224 144 -239 -200 275 228 137 -247 -71 350 264 -156 -113 398
3814C98O9l18o88O1Q58j50m52l34O79K75j20n76j20P38K99k41j308N79Q56p9o29
$$ 398 467 149 -539 -478 380 230 -222 -556 123 398 278 -298 -418 320 619 378 -930 -351 505 426 -203
3835b03l65N63L92j87q27K11N89L15o76m97L67M89L3l72m0m3M71l91l7l6K52K5
$$ -203 -568 -5 387 200 -627 -416 173 488 -188 -685 -318 171 204 -168 -208 -251 220 -171 -208 -244 8 33
3857C3j02r1L3j26K05q2L20k67j16M9N9j10J29l57J60M19l23k42k46Q35j44k14
$$ 33 -69 -160 -127 -253 -48 -130 190 -77 -193 -144 -85 -195 -66 -423 -263 156 -167 -409 -655 180 36 -178
3879a78k49L10M96j16p25k04Q13R1j42o64K80P92j07n08o76R51L72J14r66j80
$$ -178 -427 -117 379 263 -462 -666 147 238 96 -568 -288 504 397 -111 -787 164 536 650 -316 -496
3899d96J006r4k23o20L75L28J22p79J27J83K48q4l62J47J63J0j64j28J35l04O54
$$ -496 510 416 193 -427 -52 276 398 -381 -254 -71 177 93 -269 -122 41 51 -113 -241 -106 -410 244
3920B44k95J30n38L8k0K67L2m66N4L57O44n97r0P1K86N31j117J35J70P95k73o75
$$ 244 -51 79 -459 -421 -441 -174 -142 -608 -554 -197 447 -150 -240 -169 117 648 -469 -334 -164 631 358 -317
3942c17j99M61M66n09k67m1R36n4m98o20Q16L02l08n53m16J056m1k83l05L46O05
$$ -317 -516 -55 411 -98 -365 -406 530 476 -22 -642 174 476 168 -385 -801 255 214 -69 -374 -28 577
3963E77l06k29k37K47P3q0K7j2N98k81j19m45O06l25K58qp4J3n47K33J15J11m43
$$ 577 271 42 -195 52 125 45 72 60 658 377 258 -187 419 94 352 344 270 283 -264 -31 84 195 -248
3986b48J90j31N52j14o56M14K2M68l55q38N79M99l4q83n1L09N08k42n45L11L03
$$ -248 -58 -189 363 249 -407 7 29 497 142 -696 -117 382 348 -535 -586 -277 231 -11 -556 -245 58
4007E8K51o49m7K31L66J0n53R2K17M63n28j97N4O73k19k77p9J45K69j89J60n03
$$ 58 309 -340 -387 -156 210 220 -333 -241 -24 439 -89 -286 -232 441 222 -55 -134 11 280 91 251 -252
4029b52L94m2J3j40mK0R7m6j76M68p7j36J44k64K45m61M59J5o7l17N9N01Jk55
$$ -252 142 100 113 -27 -31 -11 86 40 -136 332 255 119 263 -1 244 -217 242 257 190 -127 -68 433 434 179
4053A79l41K63J57J60o70J23J23M42k83o97N33K90L10q08l87M88N54j66n85k51
$$ 179 -162 101 258 418 -252 -129 -6 436 153 -544 -11 279 589 -219 -606 -118 436 270 -315 -566
4073e66N05N55n89l63J84N11j0r06L58Q2M17k95qj49K27O30o73J36j58K84k85
$$ -566 -61 494 -95 -458 -274 237 227 -679 -321 -239 178 -117 -125 -274 -47 583 -90 46 -112 172 -113
4094a13j03J83l4N3j23J07q7J32j63L03K8Q3k64k78N01M6j48l14j9M84j06l92
$$ -113 -216 -33 -67 -14 -137 -30 -117 15 -148 155 183 266 2 -276 225 271 123 -191 -210 274 168 -224
4116b24k61N94K03l36k94K02N71j63k57k28K94N40l38m63j34P09K67j93q49J31
$$ -224 -485 109 312 -24 -318 -116 455 292 35 -193 101 641 303 -160 -294 415 682 489 -360 -229
4136b29P65l05m58j19K45N62l13l37j11J85M89o14J48J04r7P5k31Q2l5j76K40
$$ -229 536 231 -227 -346 -101 461 148 -189 -300 -115 374 -240 -92 12 -85 -10 -241 -159 -194 -370 -130
4157a30j28K33p9pk73N92k48j65N7L2K60k70J31k74M07j72k10j10L30M03l56k25
$$ -130 -258 -25 -104 -111 -384 208 -40 -205 -148 -116 144 -126 5 -269 138 -34 -244 -354 -24 379 23 -202
4179b02M8O31r3l35k52K07L86k51k15l81O48K77m45m74K64M65J77m12m61J98M66
$$ -202 -154 477 384 49 -203 4 390 139 -76 -457 191 468 23 -451 -187 278 455 43 -418 -220 246
4200B46p4j92k86O13J57o0m76j87N40J42l69l64L69J34k23l25O88k94l3K3j20
$$ 246 172 -20 -306 307 464 404 -72 -259 281 423 54 -310 59 193 -30 -355 333 39 6 29 -91
4221i1K64l43J63j55L63l03j13j52K57L11m66R0p3N74j39k75m13N21M08l78j34
$$ -91 173 -170 -7 -162 201 -102 -215 -367 -110 201 -265 -175 -248 326 187 -88 -501 20 428 50 -84
4242h4k49O51J76o63J02j89N99Q8n90j58O54J02m24o76P62M21j74m97k22O62K93
$$ -84 -333 318 494 -169 -67 -256 343 431 -159 -317 337 439 15 -661 101 522 348 -149 -371 291 584
4263E84m73m18L09K09K15m77l18N22R4J30m12J28L26j82J10n04L07O2j67j66r
$$ 584 111 -307 2 211 426 -51 -369 153 247 377 -35 93 419 237 347 -157 150 212 45 -121 -130
4284a30Q5K48k66J55M1j49L8n0L8J52j20l8r3L34j13k79O1l4M21n92j74N1O91
$$ -130 -45 203 -63 92 133 -16 22 -28 10 162 42 4 -89 245 132 -147 -86 -120 301 -291 -465 -414 277
4307B77k52k52mK25J55k63j23l9N04K1m30l38M92O36m49l29j52N86J48k72j31
$$ 277 25 -227 -231 -6 149 -114 -237 -276 228 249 -181 -519 -27 609 160 -169 -321 265 413 141 10
4328A0m8L66k62k66K20J62j7R5m08L9K82k70R9l0k1M09k99p2J08m5P5pj05J22
$$ 10 -38 328 66 -200 20 182 165 260 -148 -109 173 -97 2 -28 -49 360 61 -11 97 52 127 120 15 137
4352A37j16M7J73K02r5m72j51M51M38n84j67J02M39K21q55J41M32J05m16m00K00
$$ 137 21 68 241 443 348 -124 -275 176 614 30 -137 -35 404 625 -230 -89 343 448 32 -368 -168
4373a68N09Q4n86k39L82M19m97l05J78P5L06m05j86O1N28L9k30l25K68K93k22
$$ -168 341 425 -161 -400 -18 401 -96 -401 -223 -148 158 -247 -433 -372 156 195 -35 -360 -92 201 -21
4394b1j29Q7J11p5k06J52K24M6k10R2J53L5k15LL71l30J23k13k0M30j58l39k42
$$ -21 -150 -63 48 -27 -233 -81 143 189 -21 71 224 259 44 47 418 88 211 -2 -22 408 250 -89 -331
4417c31N14J18l24m60O19L60k38k38m99P43O9k99k86J55K67L25o22k47O08J05
$$ -331 183 301 -23 -483 136 496 258 20 -479 264 333 34 -252 -97 170 495 -127 -374 234 339
4437C39M3p73J52M68Lk60n16M46J57K08n00q3J32K15l2m38L47p2K61k35l00L53
$$ 339 382 -391 -239 229 232 -28 -544 -98 59 267 -233 -316 -184 31 -1 -439 -92 -164 97 -138 -438 -85
4459h5J66k41l2l2K49m3k0P8J8o8o8p6M37l06Nk55L09J81l24j24K25J62M1k75
$$ -85 81 -160 -192 -224 25 -18 -38 40 58 -10 -78 -154 283 -23 -18 -273 36 217 -107 -231 -6 156 197 -78
4483g8l32M48J20J21l86j87N28o8l0l28J98K43J31n40k85O71J42l21k55o8N14
$$ -78 -410 38 158 279 -107 -294 234 166 136 -192 6 249 380 -160 -445 226 368 47 -208 -276 238
4504B38N9l20l26L72j3K74l56N8k3L04q3k60J63J78k42p2j5K41k71K08r5k23K35
$$ 238 297 -23 -349 23 10 284 -72 -14 -37 267 184 -76 87 265 23 -49 -64 177 -94 114 19 -204 31
4527C1J04l58J18j01j05L36N8k14m7l1M0K47k9o1l12K97M71n64m6J65J03Q9j49
$$ 31 135 -223 -105 -206 -311 25 83 -131 -178 -209 -169 78 49 -12 -324 -27 444 -120 -166 -1 102 191 42
4550D2m83K63L85l42M36o65O52k2J00m15m84O11J35k84k26M50j36M10n84k25M47
$$ 42 -441 -178 207 -135 301 -364 288 266 366 -49 -533 78 213 -71 -297 153 17 427 -157 -382 65
4571F5J96j09m79O33m07P2Q4k1O5m6O0n6j43j14K53J03j05k24J48p5n1O29p50
$$ 65 261 152 -327 306 -101 -29 55 34 99 53 113 57 -86 -200 53 156 51 -173 -25 -100 -151 478 -272
4594b72J5J65K21J6j39j16j95O31j85l24j76L29K31m47p0K10J82K86q07K05J5
$$ -272 -257 -92 129 145 6 -110 -305 326 141 -183 -359 -30 201 -246 -316 -106 76 362 -445 -240 -225
4615b25M45k57k45m7N00j09M2n06J83N71l53L1l90K94L39m44J55mJ01K87k97j67
$$ -225 220 -37 -282 -329 171 62 104 -402 -219 352 -1 30 -360 -66 273 -171 -16 -20 81 368 71 -96
4637i6N8K91J05m50P6L83l18o3J21L8K0k06J78k22K42j87L1J65n2j25K8P4K01
$$ -96 -38 253 358 -92 -16 367 49 -14 107 145 165 -41 137 -85 157 -30 1 166 114 -11 17 91 292
4660B92j04n58K47K5L20l19m2j00N41q2l54j49L18J35J87o35j94K89L92n15j93
$$ 292 188 -370 -123 -98 222 -97 -139 -239 302 220 -134 -283 35 170 357 -278 -472 -183 209 -306 -499
4681d99L44J67J15m78Q2M08J14k95j41K5K46K44l71k76J88kJ06M3P1j92J68N6
$$ -499 -155 12 127 -351 -269 139 253 -42 -183 -158 88 332 -39 -315 -127 -129 -23 20 91 -101 67 123
4703A23l98K95qJ94P7r3q1j35L06k0n2j67J29l16K12L7k83o6N17M7k46l93K81
$$ 123 -275 20 12 206 283 190 109 -26 280 260 208 41 170 -146 66 103 -180 -246 271 318 72 -321 -40
4726d0K89Nl60J16QJ51J8o86L06J79M50m93m57M60J44L79o97J8L84j40K14k64
$$ -40 249 254 -106 10 18 169 187 -499 -193 -14 436 -57 -514 -54 90 469 -228 -210 174 34 248 -16
4748a6Q0J13j11j10k28J30K63r9k43P2K24P9j14Q6q6k4O0n5k87L24j78Q0j30J12
$$ -16 64 177 66 -44 -272 -142 121 22 -221 -149 75 154 40 126 40 16 76 21 -266 58 -120 -40 -170 -58
4772e8p6J45k47J67J08j61j12M62R8l91J90l3K83k42L14r08O08K43m24Q0j69J89
$$ -58 -134 11 -236 -69 39 -122 -234 228 326 -65 125 92 375 133 447 -461 147 390 -34 46 -123 66
4794F6M19l86m14N16L57k18j61k09r5K08L39n87j93M40K22l03k67l0L15K8j25
$$ 66 485 99 -315 201 558 340 179 -30 -125 83 422 -165 -358 82 304 1 -266 -296 19 47 -78
4815g8O5Q5o2L11m54o0L46q0k74L73k26j0O5j70k8J29J87q8lp1J8j22NL79k18
$$ -78 -13 72 10 321 -133 -193 153 73 -201 172 -54 -64 1 -169 -197 -68 119 31 28 -43 -25 -147 -142 237 19
4840A9k44j09L84J54k99q2r0L82j61Ll50O79j7j31n0j00J71j20j38l15M83j0R0
$$ 19 -225 -334 50 204 -95 -177 -267 115 -46 -43 -393 286 269 138 88 -12 159 39 -99 -414 69 59 149
4863A49j43n07O40j32O6l22J80L50J80k05j48j31J48p9k30j9M33kj39r4K7k68
$$ 149 6 -501 139 7 73 -249 -69 281 461 256 108 -23 125 46 -184 -203 230 228 89 -5 22 -246
4885b46M14n2l50oQ0R2j36J91m2p6J90o2M0N6j57%J22k3k78J22J02j0r9q3O4M70
$$ -246 168 116 -234 -240 -160 -68 -204 -13 -55 -131 59 -3 37 93 -64 -64 58 35 -243 -121 -19 -29 -128 -211 -147 323
4911C23n75o1L0L69L3l2j13l18N26l08q6Q4J1K53j67k41pM24K1l1l53K52j8J53
$$ 323 -252 -313 -283 86 119 87 -26 -344 182 -126 -212 -128 -117 136 -31 -272 -279 145 166 135 -218 34 16 169
4935A69N6k41J22J33l9k37J66j62J11j00j02K30j88K8jJ87P1k33r0R4K39q2k37
$$ 169 225 -16 106 239 200 -37 129 -33 78 -22 -124 106 -82 -54 -55 132 203 -30 -120 -26 213 131 -106
4958a06L79j64J91l47N4Q5K17l45k69M19J37k50l29P4J32K02K2l44K16J55J06
$$ -106 273 109 300 -47 7 92 309 -36 -305 114 251 1 -328 -254 -122 80 102 -242 -26 129 235
4979B35l33l38K99K67j8l06m9K74K25j59k16N4J0M14m62l28L69K79k10J9k71N89
$$ 235 -98 -436 -137 130 112 -194 -243 31 256 97 -119 -65 -55 359 -103 -431 -62 217 7 26 -245 344
5001C44j66k04O3j74M70m33K65k76K05n9q2K6J43p5QJ22j31M7l83J87M08j17j40
$$ 344 178 -26 37 -137 333 -100 165 -111 94 35 -47 -21 122 47 55 177 46 93 -290 -103 305 188 48
5024D8p3M4O8L0j00P0l0m5K84n01J59L3K19n11J99R1K22J06n19P2K01R9N9l62
$$ 48 -25 19 87 117 17 87 57 12 296 -205 -46 -13 206 -305 -106 -15 207 313 -206 -134 67 166 225 -137
5048a37l8J54J09l52J02J29L60o16j47K65J0L25j52j08j47M58l24K94k9k35J36
$$ -137 -175 -21 88 -264 -162 -33 327 -289 -436 -171 -161 164 12 -96 -243 215 -109 185 156 -79 57
5069E7k98L08j42K68k81Q1l9J59l14J87r1L83k60k78K76P9k2k59j13N79QK6m61
$$ 57 -241 67 -75 193 -88 -7 -46 113 -201 -14 -105 278 18 -260 16 95 73 -186 -299 280 288 314 -147
5092a47N5J94J03j26k42L65m7J51m40KM14Ql8m71J58K12j07p9j14J67l05L11j25
$$ -147 -92 102 205 79 -163 202 155 306 -134 -132 282 290 252 -219 -61 151 44 -35 -149 18 -287 24 -101
5115a01K3J49l9j92j98M29j8o9L6L3k61M32l80L5K6mJ59O9K12m94L23l27K76J02
$$ -101 -78 71 32 -160 -358 71 53 -16 20 53 -208 224 -156 -121 -95 -99 60 129 341 -153 170 -157 119 221
5139B21k06j78N6K89j91j25k72M62K29J8m67M7J31J58j3n03L68K06j11q3l31O64
$$ 221 15 -163 -107 182 -9 -134 -406 56 285 303 -164 -117 14 172 159 -344 24 230 119 36 -295 369
5161C69j32q8n04M21J78k06O7k25P6K76o1k31j51N12r8k33Q7k04L39K42m29l01
$$ 369 237 149 -355 66 244 38 105 -120 -44 232 171 -60 -211 301 203 -30 57 -147 192 434 5 -296
5183b96N94J0m10j65N36m56K80k98K73N2k43J42o6j08R3j78K94j10J55k08m1j08
$$ -296 298 308 -102 -267 269 -187 93 -205 68 120 -123 19 -47 -155 -62 -240 54 -56 99 -109 -150 -258
5205b58N34l69j80K21kJ84j55J73j59J29J04l71o0J28K27k52O9k89M86n7l0k24
$$ -258 276 -93 -273 -52 -54 130 -25 148 -11 118 222 -149 -209 -81 146 -106 -37 -326 160 103 73 -151
5227a51O6M23j89j38m25O41j6j06k74L04J22R3k76k34K17j29p2K78m13L19pk10
$$ -151 -85 338 149 11 -414 227 211 105 -169 135 257 350 74 -160 57 -72 -144 134 -279 40 33 -177
5249a77J23j6J37K5l87J83K81j52K6j06J94k44J85o2j42K60o9J1j07K27l18r4
$$ -177 -54 -70 67 92 -295 -112 169 17 43 -63 131 -113 72 10 -132 128 59 70 -37 190 -128 -222
5271b22O7K44K24n63J89q2K45O5l33L2J09J42k41j04J08K45J51m68K58k21K94
$$ -222 -155 89 313 -250 -61 -143 102 167 -166 -134 -25 117 -124 -228 -120 125 276 -192 66 -155 139
5292A39m0l49M0J33K02l05J00k52L68j58k70L72R1O1k93M9l7J12J07j32K3k8J15
$$ 139 99 -250 -210 -77 125 -180 -80 -332 36 -122 -392 -20 71 132 -161 -112 -149 -37 70 -62 -39 -67 48
$$ [...]
8191A01
##END NTUPLES=NMR FID
##END=
