##TITLE=1H_SA_Sl.DLF
 CDCl3, 64 sc, 
 2.02.2021
##JCAMPDX= 6.0         $$ Bruker NMR JCAMP-DX V2.0
##DATA TYPE= NMR FID
##DATA CLASS= NTUPLES
##ORIGIN= UXNMR, Bruker Analytische Messtechnik GmbH
##OWNER= root
$$ XWIN-NMR		Version 3.5
$$ Tue Feb  2 10:13:50 2021 Russian Standard Time (UT+4h)  she@DPX200
##.OBSERVE FREQUENCY= 200.1315066352
##.OBSERVE NUCLEUS= ^1H
##.DELAY= (6, 6)
##.ACQUISITION MODE= SIMULTANEOUS
##.ACQUISITION SCHEME= undefined
##.AVERAGES= 64
##.DIGITISER RES= 18
##SPECTROMETER/DATA SYSTEM= spect
##.PULSE SEQUENCE= zg30
##.SOLVENT NAME= CDCl3
##.SHIFT REFERENCE= (INTERNAL, CDCl3, 0, 15.7039)
##AUDIT TRAIL= $$ (NUMBER, WHEN, WHO, WHERE, WHAT)
$$ ##TITLE= Audit trail, XWIN-NMR		Version 3.5
$$ ##JCAMPDX= 5.01
$$ ##ORIGIN= Bruker BioSpin GmbH
$$ ##OWNER= she
$$ F:/spectra/data/she/nmr/H-F/1/audita.txt
$$ ##AUDIT TRAIL=  $$ (NUMBER, WHEN, WHO, WHERE, WHAT)
(   1,<2021-02-02 10:12:31.26 +0400>,<she>,<DPX200>,
      <continue with go, POWCHK disabled, PULCHK disabled
       configuration hash MD5:
       00 E9 B6 7A A2 85 ED C7 34 08 36 98 17 FE 4E 26
       data hash MD5: 16K
       9B 72 32 29 06 A2 D5 CE 0C 43 0C CA 23 95 B0 0D>)
$$ ##END=
$$ 
$$ hash MD5
$$ 17 F6 71 52 8E 08 5C 8E B9 D7 3D 4B 14 8D 47 C0
##$RELAX= 
##$RELAX= 
##$RELAX= 
##$RELAX= 
##$RELAX= 
##$RELAX= 
$$ Bruker specific parameters
$$ --------------------------
##$DU= <F:/spectra>
##$EXPNO= 1
##$NAME= <H-F>
##$PROCNO= 1
##$TYPE= <nmr>
##$USER= <she>
##$AMP= (0..31)
100 100 100 100 100 100 100 100 100 100 100 100 100 100 100 100 100 100 
100 100 100 100 100 100 100 100 100 100 100 100 100 100 
##$AQSEQ= 0
##$AQ_mod= 1
##$AUNM= <au_zg>
##$AUTOPOS= <>
##$BF1= 200.13
##$BF2= 200.13
##$BF3= 200.13
##$BF4= 200.13
##$BF5= 200.13
##$BF6= 200.13
##$BF7= 200.13
##$BF8= 200.13
##$BYTORDA= 1
##$CFDGTYP= 0
##$CFRGTYP= 5
##$CHEMSTR= <none>
##$CNST= (0..31)
1 1 145 1 1 1 1 1 1 1 1 1 1 1 1 1 1 1 1 1 1 1 1 1 1 1 1 1 1 1 1 1 
##$CPDPRG= <>
##$CPDPRG1= <>
##$CPDPRG2= <>
##$CPDPRG3= <>
##$CPDPRG4= <mlev>
##$CPDPRG5= <mlev>
##$CPDPRG6= <mlev>
##$CPDPRG7= <mlev>
##$CPDPRG8= <mlev>
##$CPDPRGB= <>
##$CPDPRGT= <>
##$D= (0..31)
0 1.2 0 0 0 0 0 0 0 0.06 0 0.03 0 0 0 0 0.0002 0 0 0 0 0 0 0 0 0 0 0 0 
0 0 0 
##$DATE= 1612245909
##$DBL= (0..7)
120 120 120 120 120 120 120 120 
##$DBP= (0..7)
150 150 150 150 150 150 150 150 
##$DBP07= 0
##$DBPNAM0= <>
##$DBPNAM1= <>
##$DBPNAM2= <>
##$DBPNAM3= <>
##$DBPNAM4= <>
##$DBPNAM5= <>
##$DBPNAM6= <>
##$DBPNAM7= <>
##$DBPOAL= (0..7)
0.5 0.5 0.5 0.5 0.5 0.5 0.5 0.5 
##$DBPOFFS= (0..7)
0 0 0 0 0 0 0 0 
##$DE= 6
##$DECBNUC= <off>
##$DECIM= 32
##$DECNUC= <off>
##$DECSTAT= 4
##$DIGMOD= 1
##$DIGTYP= 9
##$DL= (0..7)
0 120 120 120 120 120 120 120 
##$DP= (0..7)
150 150 150 150 150 150 150 150 
##$DP07= 0
##$DPNAME0= <>
##$DPNAME1= <>
##$DPNAME2= <>
##$DPNAME3= <>
##$DPNAME4= <>
##$DPNAME5= <>
##$DPNAME6= <>
##$DPNAME7= <>
##$DPOAL= (0..7)
0.5 0.5 0.5 0.5 0.5 0.5 0.5 0.5 
##$DPOFFS= (0..7)
0 0 0 0 0 0 0 0 
##$DQDMODE= 0
##$DR= 18
##$DS= 0
$$ [...]
##$SUBNAM2= <"">
##$SUBNAM3= <"">
##$SUBNAM4= <"">
##$SUBNAM5= <"">
##$SUBNAM6= <"">
##$SUBNAM7= <"">
##$SUBNAM8= <"">
##$SUBNAM9= <"">
##$SW= 16.9725356469052
##$SWIBOX= (0..15)
0 0 2 0 0 0 0 0 0 0 0 0 0 0 0 0 
##$SW_h= 3396.73913043478
##$TD= 16384
##$TD0= 1
##$TE= 0
##$TE2= 300
##$TE3= 300
##$TEG= 300
##$TL= (0..7)
0 120 120 120 120 120 120 120 
##$TP= (0..7)
150 150 150 150 150 150 150 150 
##$TP07= 0
##$TPNAME0= <>
##$TPNAME1= <>
##$TPNAME2= <>
##$TPNAME3= <>
##$TPNAME4= <>
##$TPNAME5= <>
##$TPNAME6= <>
##$TPNAME7= <>
##$TPOAL= (0..7)
0.5 0.5 0.5 0.5 0.5 0.5 0.5 0.5 
##$TPOFFS= (0..7)
0 0 0 0 0 0 0 0 
##$TUNHIN= 0
##$TUNHOUT= 0
##$TUNXOUT= 0
##$USERA1= <user>
##$USERA2= <user>
##$USERA3= <user>
##$USERA4= <user>
##$USERA5= <user>
##$V9= 5
##$VALIST= <valist>
##$VCLIST= <CCCCCCCCCCCCCCC>
##$VD= 0
##$VDLIST= <DDDDDDDDDDDDDDD>
##$VPLIST= <PPPPPPPPPPPPPPP>
##$VTLIST= <TTTTTTTTTTTTTTT>
##$WBST= 1024
##$WBSW= 4
##$XGAIN= (0..3)
0 0 0 0 
##$XL= 0
##$YL= 0
##$YMAX_a= 624600
##$YMIN_a= -290850
##$ZGOPTNS= <>
##$ZL1= 120
##$ZL2= 120
##$ZL3= 120
##$ZL4= 120
##$ABSF1= 10
##$ABSF2= 0
##$ABSG= 5
##$ABSL= 3
##$ALPHA= 0
##$AQORDER= 0
##$ASSFAC= 0
##$ASSFACI= 0
##$ASSFACX= 0
##$ASSWID= 0
##$AUNMP= <proc_1d>
##$AZFE= 0.1
##$AZFW= 0.1
##$BCFW= 1
##$BC_mod= 2
##$BYTORDP= 1
##$COROFFS= 0
##$CY= 11.3945322036743
##$DATMOD= 1
##$DC= 2
##$DFILT= <>
##$DTYPP= 0
##$F1P= 15.9154993809931
##$F2P= -4.1035820241983
##$FCOR= 0.5
##$FTSIZE= 0
##$FT_mod= 4
##$GAMMA= 1
##$GB= 0.15
##$INTBC= 1
##$INTSCL= 1
##$ISEN= 128
##$LB= 0.24
##$LEV0= 0
##$LPBIN= 0
##$MAXI= 10000
##$MC2= 0
##$MEAN= 0
##$ME_mod= 0
##$MI= 1.114404
##$NCOEF= 0
##$NC_proc= 0
##$NLEV= 6
##$NOISF1= 3.799351
##$NOISF2= 2.8
##$NSP= 1
##$NTH_PI= 0
##$NZP= 0
##$OFFSET= 15.70392
##$PC= 1
##$PHC0= -10765.16
##$PHC1= 17.40095
##$PH_mod= 1
##$PKNL= yes
##$PPARMOD= 0
##$PSCAL= 0
##$PSIGN= 0
##$REVERSE= no
##$SF= 200.130013532006
##$SI= 16384
##$SIGF1= 3
##$SIGF2= 2
##$SINO= 400
##$SIOLD= 16384
##$SREGLST= <1H.CDCl3>
##$SSB= 0
##$STSI= 0
##$STSR= 0
##$SW_p= 3612.71676300578
##$SYMM= 0
##$S_DEV= 0
##$TDeff= 0
##$TDoff= 0
##$TI= <>
##$TILT= no
##$TM1= 0
##$TM2= 0
##$TOPLEV= 0
##$USERP1= <user>
##$USERP2= <user>
##$USERP3= <user>
##$USERP4= <user>
##$USERP5= <user>
##$WDW= 1
##$XDIM= 8192
##$YMAX_p= 0
##$YMIN_p= 0
$$ End of Bruker specific parameters
$$ ---------------------------------
##NTUPLES= NMR FID
##VAR_NAME=  TIME,          FID/REAL,        FID/IMAG
##SYMBOL=    X,             R,               I
##VAR_TYPE=  INDEPENDENT,   DEPENDENT,       DEPENDENT
##VAR_FORM=  AFFN,          ASDF,            ASDF
##VAR_DIM=   8192,          8192,            8192
##UNITS=     SECONDS,       ARBITRARY UNITS, ARBITRARY UNITS
##FACTOR=    0.0002944,     1,               1
##FIRST=     0,             0,               0
##LAST=      2.4114304,     0,               0
##MIN=       0,             -290850,         0
##MAX=       2.4114304,     624600,          0
$$ Real data points
##PAGE= N=1
##DATA TABLE= (X++(R..R)), XYDATA
$$ [...]
$$ plain form
2898 -1042 2552 -456 -802 -2794 1179 339 -255 -1463 -334 1702 -575 -681 -1948 133 255 -287
2914 -287 167 -533 1917 -849 1102 1694 1075 457 -88 2645 260 1065 -993 2555 1569 1271 -446
2931 -446 -1014 2827 1402 824 -1427 985 2471 953 -456 -2172 1746 762 995 -1609 548 2503
2947 2503 545 -351 -1794 1404 18 1213 -1910 -314 530 -600 -429 -1266 260 -914 -1127 -432
2963 -432 75 -1309 -2599 332 -699 127 -2771 -1994 -291 -267 -1386 -3720 -385 -303 310 -2011 -2317
2980 -2317 -208 1274 -964 -2850 479 628 1128 -1437 -1945 661 1573 126 -1162 -434 547 1993
2996 1993 -75 469 1434 641 1455 164 184 869 747 381 2290 432 -1095 2057 -288 997 1371
3013 1371 -252 -571 1143 1036 -1008 -960 1099 2901 -2063 -1440 587 678 1227 -1045 -2920 254 1857
$$ packed form
2898a042L594l008l46j992L973q40n94j208J129K036k277j06j267K081J22n42
2914b87M54p00K450k766J951N92o19o18n45K733k385Q05k058L548r86k98j717
2931d46n68L841j425n78k251K412J486j518j409j716L918r84K33k604K157J955
2947B503j958q96j443L198j386J195l123J596Q44j130J71q37J526j174k13O95
2963d32N07j384j290K931j031Q26k898P77J703K4j119k334L335Q2O13k321l06
2980b317K109J482k238j886L329J49N00k565n08K606R12j447j288P28R81J446
2996A993k068N44R65p93Q14j291K0O85j22l66J909j858j527L152k345J285L74
3013A371j623l19J714j07k044M8K059J802m964O23K027R1N49k272j875L174J603
$$ plain form
3030 1857 -877 -1368 -1908 447 454 -852 -600 -722 217 -1288 -1214 -1037 295 -1641 -1462 456 -831 -1078
3048 -1078 -1131 -1137 -221 -294 -892 -978 1140 -540 -1391 -2482 826 1477 1001 -1267 -842 1187 -342 560 -2583
3067 -2583 -31 1421 1102 -937 -2035 877 1101 163 -1234 613 1153 543 261 -297 1648 554 415
3084 415 704 497 1136 -544 404 -995 2471 -1114 1288 1343 -447 187 -2450 285 400 1759 -1613
3101 -1613 -260 1805 142 -413 -2710 1329 -7 253 -977 -1401 1445 81 -104 -3354 677 556
3117 556 1150 -1971 -1459 732 610 -5 -2652 -185 -581 844 -714 -85 -958 -2207 1027 -295 1283
3134 1283 -1335 -68 335 756 1447 -2331 771 39 205 -340 -1488 2334 -31 1900 -1912 -291
3150 -291 1647 2011 990 -2099 839 1510 2364 -1367 75 1823 852 819 -1251 1176 277 1711 -1729
$$ packed form
3030A857k734m91n40K355Pj306K52j22R39j505P4J77J332j936J79J918j287k47
3048a078n3oR16p3n98q6K118j680q51j091L308O51m76k268M25K029j529R02l143
3067b583K552J452l19k039j098K912K24r38j397J847N40o10k82n58J945j094j39
3084D15K89k07O39j680R48j399L466l585K402N5j790O34k637K735J15J359l372
3101a613J353K065j663n55k297M039j336K60j230m24K846j364j85l250M031j21
3117E56N94l121N12K191j22o15k647K467l96J425j558O29q73j249L234j322J578
3134A283k618J267M03M21O91l778L102p32J66n45j148L822k365J931l812J621
3150b91J938L64j021l089K938O71Q54l731J442J748r71l3k070K427q99J434l440
$$ plain form
3167 -1729 -831 -14 1149 698 -1225 612 -145 77 79 -837 -12 -536 -575 -22 899 -2008 -2033 -807 521
3186 521 656 -1232 -1100 -1035 2282 -1960 -2222 -816 -5 -33 -2473 -671 -1630 1766 -900 -1283 -1122 307
3204 307 425 -1743 -227 179 1288 -113 -527 -721 536 2070 -324 1535 976 636 785 1405 1149
3221 1149 252 161 526 2299 1836 543 -171 479 3074 -155 -755 -113 2141 798 -654 -691 391 2547
3239 2547 690 -1129 -1703 1485 916 -124 -1490 -808 1594 710 -1423 -1179 740 384 -1122 -1162 -545
3256 -545 -715 -145 -1233 -839 964 -360 -10 -14 370 -1185 -2184 480 -77 -1409 -1711 -1895 1181 867
3274 867 -814 -2005 -22 1184 221 -1596 -2100 1739 1934 -665 -1150 744 2316 1002 -1194 -104
3290 -104 -188 957 512 -961 722 234 1012 -540 525 477 1783 1702 470 1363 370 1355 -501 1409
$$ packed form
3167a729Q98Q17J163m51j923J837p57K22Kr16Q25n24l9N53R21k907k5J226J328
3186E21J35j888J32O5L317m242k62J406Q11k8k440J802r59L396k666l83J61J429
3204C07J18k168J516M06J109j401m14j94J257J534k394J859n59l40J49O20k56
3221A149q97r1L65J773m63j293p14O50K595l229o00O42K254j343j452l7J082K156
3239B547j857j819n74L188n69j040j366O82K402q84k133K44J919l56j506m0O17
3256e45j70N70j088L94J803j324L50mL84j555r99K664n57j332l02j84L076l14
3274H67j681j191J983J206r63j817n04L839J95k599m85J894J572j314k196J090
3290a04q4J145m45j473J683m88P78j552J065m8J306q1j232Q93r93R85j856J910
$$ plain form
3308 1409 79 -962 1161 705 1586 -775 -390 1313 809 753 -1399 141 1307 1675 -1104 -585 -900
3325 -900 341 1076 -2233 -921 49 169 -1287 -1550 -317 -116 237 -2898 -1301 -611 -447 -118 -1857
3342 -1857 249 -17 -604 -1048 -58 -1055 -1221 -354 -699 759 -1235 73 -863 414 -1009 -1678 513
3359 513 186 1797 -1381 -656 -429 327 -283 -816 174 -255 2318 -1175 -849 -544 1523 1484 -1050 58
3377 58 205 2074 121 -293 283 855 919 -514 1253 -337 1118 232 1021 -513 -1067 36 -615 1879
3395 1879 174 -764 -926 377 1150 -1552 344 -1050 2193 249 -584 -2548 -686 1052 -1537 -943
3411 -943 -1057 596 1033 -1068 -2068 747 1089 -1362 -366 -270 1162 967 -1303 -486 -1604 255 -1402
3428 -1402 700 -685 -237 -188 -210 -725 -1340 -676 -436 589 -744 -345 -1977 -594 -95 469 -1525 -1776
$$ packed form
3308A409j330j041K123m56Q81k361L85J703n04n6k152J540J166L68k779N19l15
3325i00J241P35l309J312R70J20j456k63J233K01L53l135J597O90J64L29j739
3342a857K106k66n87m44R90r97j66Q67l45J458j994J308r36J277j423o69K191
3359E13l27J611l178P25K27P56o10n33R90m29K573l493L26L05K067l9k534J108
3377E8J47J869j953m14N76N72O4j433J767j590J455q86P89j534n54J103o51K494
3395A879j705r38j62J303P73k702J896j394L243j944q33j964J862J738k589N94
3411i43j14J653M37k101j000K815L42k451R96R6J432j95k270Q17j118J859j657
3428a402K102j385M48M9k2n15o15O64K40J025j333L99j632J383M99N64j994k51
$$ plain form
3446 -1776 178 831 -745 -433 -878 1404 511 46 -1804 854 1635 199 -461 -859 1507 385 -100
3463 -100 -127 521 1191 639 24 -29 707 882 -120 -593 792 716 -683 -75 1645 388 -1133 784 1237
3482 1237 863 -1481 -1118 1091 788 -90 -936 -1140 1373 356 -833 -2202 1728 1547 700 -1831 -1282
3499 -1282 44 1365 -1294 -1230 580 779 40 -1467 -859 -100 994 657 -420 -542 -387 467 575 228
3517 228 -783 -532 -832 379 -489 -1017 733 -527 1109 -483 -522 -334 1720 1044 -1527 190 232 1521
3535 1521 1135 -296 159 482 1450 -1382 -1081 -834 1104 605 -384 -1020 807 1346 -998 -200 81 722
3553 722 393 -338 -147 -636 159 -829 358 -154 -414 240 -136 437 -359 319 -1415 879 -274 -602 -260
3572 -260 -168 1963 -625 -613 -706 550 860 -330 206 -328 1329 -637 -418 -1543 324 1392 136 -140
$$ packed form
3446a776J954O53j576L12m45K282q93m65j850K658P81j436o60l98K366j122m85
3463a00k7O48O70n52o15n3P36J75j002m73J385p6j399O08J720j257j521J917M53
3482A237l74k344L63K209l03q78q46k04K513j017j189j369L930j81q47k531N49
3499a282J326J321k659O4J810J99p39j507O08P59J094l37j077j22J55Q54J08l47
3517B28j011K51l00J211q68n28J750j260J636j592l9J88K054o76k571J717M2J289
3535A521l86j431M55L23R68k832L01K47J938m99r89o36J827N39k344P98K81O41
3553G22l29p31J91m89P95r88J187n12k60O54l76N73p96O78j734K294j153l28L42
3572b60R2K131k588J2r3J256L10j190N36n34J657j966K19j125J867J068j256k76
$$ plain form
3590 -140 -401 2061 468 0 588 479 689 -161 990 -857 891 59 -278 418 142 163 -79 1442
3608 1442 -213 873 -1489 385 1369 135 101 -1130 1049 430 -53 -1503 -605 1672 -901 44 -1867
3625 -1867 732 228 464 -1350 -1059 1729 284 -517 -2703 -85 -166 -883 -1201 -860 -163 -159 118 -764 38
3644 38 -1711 -652 -763 -248 508 -1358 -432 -547 37 -776 -224 848 836 276 -2270 566 1352 1104 -704
3663 -704 -1227 510 1355 1160 -1550 576 1310 1689 -125 -991 1781 486 579 161 -137 1474 727 619
3681 619 -179 -27 208 711 -323 524 1404 -376 670 269 445 181 -993 401 995 -858 -1107 519
3699 519 -283 427 -972 -680 -571 69 -151 -2359 -949 731 804 -1143 -1922 -1088 972 -167 -1519 -1240
3717 -1240 214 504 -736 -1850 -682 793 117 -784 -125 -620 233 -471 40 -159 48 -121 788 622
$$ packed form
3590a40k61K462j593m68N88j09K10q50J151j847J748q32l37O96k76K1k42J521
3608A442j655J086k362J874R84j234l4j231K179o19m83j450Q98K277k573R45j911
3625a867K599n04K36j814K91K788j445q01k186K618q1p17l18L41O97MK77q82Q02
3644C8j749J059j11N15P56j866R26j15N84q13N52J072j2n60k546K836P86k48j808
3663g04n23J737Q45j95k710K126P34L79j814q66K772j295R3m18k98J611p47j08
3681F19p98J52K35N03j034Q47Q80j780J046m01J76k64j174J394N94j853k49J626
3699E19q02P10j399K92J09O40k20k208J410J680P3j947p79Q34K060j139j352K79
3717a240J454K90j240j114J168J475o76r01O59m95Q53p04N11j99K07j69R09j66
$$ plain form
3735 622 190 813 -872 874 678 -344 -110 409 1450 429 -907 -205 1209 1399 -775 -330 338
3752 338 1778 1293 -1391 -592 578 1032 -265 -293 -102 936 -473 -293 256 765 488 -478 -56 -386
3770 -386 1030 -94 131 -870 838 348 -105 -368 -308 -83 -640 737 463 -241 -619 -1655 1265 -205
3788 -205 -839 -1194 861 176 172 -1598 -2163 1034 25 86 -2208 -18 526 -356 -579 -1547 980 814 -327
3807 -327 -1382 -974 374 240 -429 -486 1357 799 1105 926 521 1589 -1930 1219 -253 1183 206 -243
3825 -243 118 816 759 -1193 1377 623 1926 -1233 -515 562 93 -1144 -1675 1395 -666 345 -1978
3842 -1978 -476 49 856 2079 -1317 -272 1 136 -1373 -1363 786 -135 1108 -660 76 -1012 -330
3859 -330 1242 235 -5 -1128 -421 600 999 -878 -1168 566 1089 923 -1794 -546 -113 820 -259
$$ packed form
3735F22m32O23j685J746j96j022K34N19J041j021j336P02J414J90k174M45O68
3752C38J440m85k684P99J170M54j297k8J91J038j409J80N49N09k77r66M22l30
3770c86J416j124K25j001J708m90m53k63O0K25n57J377k74p04l78j036K920j470
3788b05o34l55K055o85mj770n65L197j009O1k294K190N44q82k23r68K527j66j141
3807c27j055M08J348j34o69n7J843n58L06j79m05J068l519L149j472J436r77m49
3825b43L61O98n7j952K570p54J303l159P18J077m69j237n31L070k061J011k323
3842a978J502N25Q07J223l396J045K73J35j509J0K149r21J243j768P36j088O82
3859c30J572j007k40j123P07J021L99j877k90J734N23j66k717J248M33R33j079
$$ plain form
3876 -259 -1618 -684 221 792 -973 538 -160 1552 165 -1112 -394 -614 1711 394 -28 -214 -776
3893 -776 158 -1053 398 1192 1018 133 457 -738 143 228 1304 1821 936 15 -700 -501 670 364 -1292
3912 -1292 -145 1489 -691 -2 -1225 916 1830 -2044 67 -399 1215 556 -372 -758 -185 69 -634
3929 -634 -1744 -730 947 -343 -414 -166 92 330 -28 -476 -27 1161 1064 -144 -499 -348 -477 -180 538
3948 538 -227 765 -547 752 545 398 -1001 195 1475 26 -675 459 399 721 517 162 -736 1259
3966 1259 546 -747 -802 38 997 952 -591 -1066 1659 826 491 -1589 -669 675 -795 -606 -128 -48 272
3985 272 111 -828 596 -333 624 1235 -429 87 -894 591 282 780 -1000 -199 4 -248 -49 -342 -586
4004 -586 355 1165 278 -2117 474 331 -955 -983 34 442 -1124 374 -883 946 56 601 24 485
$$ packed form
3876b59j359R34R05N71j765J511o98J712j387j277P18k20K325j317m22j86n62
3893g76R34j211J451P94j74q85L24j195Q81Q5J076N17q85r21p15J99J171l06j656
3912a292J147J634k180O89j223K141R14l874K111m66J614o59r28l86N73K54p03
3929f34j110J014J677j290p1K48K58K38l58m48M49J188r7j208l55J51j29K97P18
3948E38p65R92j312J299k07j47j399J196J280j449p01J134o0L22k04l55q98J995
3966A259p13j293n5Q40R59m5j543m75K725q33l35k080R20J344j470J89M78Q0L20
3985B72j61r39J424r29R57O11j664N16r81J485l09M98j780Q01K03k52J99k93k44
4004e86R41Q10q87k395K591j43j286k8J017M08j566J498j257J829q90N45n77M61
$$ plain form
4022 485 -1010 247 22 -909 -651 -14 642 -402 511 429 -440 478 -496 1163 -676 -610 -112 898 769
4041 769 -606 -495 661 1418 365 -307 422 875 274 -1194 685 -2 1365 -533 -428 1336 342
4058 342 1557 -979 -237 -542 329 -130 1370 623 -616 1422 -1308 61 -232 395 15 -85 603 -1165
4076 -1165 139 -1613 1069 -1096 -1106 -892 -974 223 -1332 -844 -1298 482 251 -291 -546 -331 1341 -776
4094 -776 -900 -1067 586 150 -1010 -593 -633 870 -480 -242 -605 387 1301 -547 158 -381 815 192
4112 192 307 -155 -37 507 -221 1399 28 928 415 727 1170 -658 447 2 634 477 219 -801
4130 -801 -390 1170 742 455 -1135 1588 480 626 -712 -105 2029 157 255 -1062 1034 562 309
4147 309 -1182 -18 282 -327 62 -129 -230 838 -155 -643 -1214 65 -383 55 -524 100 -1035 -887
$$ packed form
4022D85j495J257k25r31K58O37O56j044R13q2q69R18r74J659j839O6M98J010j29
4041G69j375J11J156P57j053o72P29M53o01j468J879o87J367j898J05J764r94
4058C42J215k536P42l05Q71m59J500p47j239K038k730J369k93O27l80j00O88j768
4076a165J304j752K682k165j0K14q2J197j555M88m54J780k31n42k55K15J672k117
4094g76j24j67J653m36j160M17m0J503j350K38l63R92R14j848P05n39J196o23
4112A92J15m62J18N44p28J620j371R00n13L12M43j828J105m45O32j57k58j020
4130h01M11J560m28k87j590K723j108J46j338O07K134j872R8j317K096m72k53
4147C09j491J164L00o09L89j91j01J068r93m88n71J279m48M38n79O24j135J48
$$ plain form
4165 -887 -49 -528 -596 -466 934 329 -78 -477 -772 -424 -33 118 -2444 -41 249 -755 -1196 -869 -211
4184 -211 550 -245 -925 -118 -57 473 809 729 1198 1360 547 -250 330 219 186 330 -318 677 -32 75 830
4205 830 1231 -1140 302 763 1325 690 -954 524 923 669 -206 -568 193 248 617 -1302 -731 -489 711
4224 711 -412 -591 -423 613 -419 -457 253 -365 904 -623 -539 -464 -314 -350 -439 -73 823 -1347 -1160 -483
4244 -483 18 -234 788 -546 262 -849 491 -390 -44 1446 -1092 82 -515 46 -447 -1693 -358
4261 -358 -471 1559 368 -585 -850 1727 919 331 46 752 2889 -373 499 -1021 338 -70 176 -349
4279 -349 -705 962 302 182 -846 383 413 -524 196 -592 341 -1250 -394 239 -181 79 -796 630 -228
4298 -228 -346 -2274 183 76 -258 -709 -685 -6 156 464 -1143 1101 1178 -1098 -541 -1375 -1 -427 152
$$ packed form
4165h87Q38m79o8J30J400o05m07l99k95L48L91J51k562K403K90j004m41L27O58
4184b11P61p95o80Q07O1N30L36q0M69J62q13p97N80j11l3J44o48R95p09J07P55
4205H30M01k371J442M61N62o35j644J478L99k54q75l62P61N5L69j919N71K42J200
4224G11j123j79J68J036j032l8P10o18J269j527Q4P5J50l6q9L66Q96k170J87O77
4244d83N01k52J022j334Q08j111J340q81L46J490k538J174n97N61m93j246J335
4261c58j13K030j191r53k65K577q08n88k85P06K137l262Q72j520J359m08K46n25
4279c49l56J667o60j20j028J229L0r37P20p88R33j591Q56O33m20K60q75J426q58
4298b28j18j928K457j07l34m51K4O79J62L08j607K244P7k276N57q34J374m26N79
$$ plain form
4317 152 -1094 -215 1186 225 -104 -611 1576 -1015 648 579 64 1115 594 1461 1085 1022 426 115 687
4336 687 826 -843 -887 396 1440 789 -197 993 1074 561 1086 -1293 1621 564 504 362 -59 323 1035
4355 1035 166 -964 -120 315 884 -258 -1028 612 -985 -14 -470 372 1117 517 -192 -155 -36 -1708
4373 -1708 -175 -1251 -253 -449 -370 75 -201 154 -962 495 574 976 -801 272 -1367 -884 245 -1815
4391 -1815 -1063 -609 663 659 -1440 548 666 1046 -2250 577 500 1462 114 -95 1713 -52 284 351
4409 351 -1284 -43 799 -320 -219 574 1179 -5 -560 997 391 653 401 305 824 -1209 509 -52
4427 -52 859 682 677 221 681 -172 -845 -517 168 1258 707 -849 148 1125 1226 133 -394 -440 -204 -32
4447 -32 -144 -214 -612 -1055 -612 -303 361 206 152 -693 -1880 -391 531 -1257 -631 324 -359 -438 -739 443
$$ packed form
4317A52j246Q79J401r61l29n07K187k591J663o9n15J051n21Q67l76o3n96l11N72
4336F87J39j669m4J283J044o51r86J190Q1n13N25k379K914j057o0j42m21L82P12
4355A035q69j130Q44M35N69j142p70J640j597R71m56Q42P45o00p09L7J19j672
4373a708J533j076R98j96P9M45k76L55j116J457P9M02j777J073j639M83J129k060
4391a815P52M54J272mk099J988J18L80l296K827p7R62j348k09J808j765L36O7
4409C51j635J241Q42j119J01P93O05j184n55J557o06K62k52r6N19k033J718n61
4427e2R11j77nm56M60q53o73L28O85J090n51j556R97R77J01j093n27m6K36J72
4447c2j12p0l98m43M43L09O64j55n4q45j187J489R22j788O26R55o83p9l01J182
$$ plain form
4467 443 482 -335 -897 1168 -145 -214 -1234 -953 554 -577 -1613 -220 1083 2032 409 -502 -1188 1255
4485 1255 -575 -156 -226 1265 188 291 -457 -1138 965 308 696 -734 434 -265 261 -198 -478 -305
4503 -305 -631 982 141 -644 -883 -103 550 -942 1083 -1585 -276 277 368 -756 -1115 12 321 772
4521 772 -607 -230 432 -1788 -147 -1878 483 329 212 -1160 -1166 284 1158 693 -1989 -620 -1059 411
4539 411 -1329 -1797 -728 -504 978 -1092 62 -694 -1102 875 1055 34 -1046 -523 -950 -296 -1358
4556 -1358 -591 -817 -562 -13 -1588 -712 64 1045 -1412 -990 -1 376 979 -727 -878 495 1450 395
4574 395 149 29 668 936 68 1016 1276 260 25 -840 1361 -222 711 -21 592 36 -296 -311 -21
4593 -21 -254 -870 -621 -39 24 -754 -828 789 -1216 -223 -2126 -1397 -1735 -847 529 173 -945 -662 211
$$ packed form
4467D43L9q17n62K065j313o9j020K81J507j131j036J393J303R49j623r11o86K443
4485A255j830M19p0J491j077J03p48o81K103o57L88j430J168o99N26m59k80J73
4503c05l26J613q41p85k39P80O53j492K025k668J309N53R1j124l59J127L09M51
4521G72j379L77O62k220J641j731K361j54j17j372oJ450Q74m65k682J369m39J470
4539D11j740m68J069K24J482k070J154p56m08J977J80j021j080N23m27O54j062
4556a358P67k26K55N49j575Q76P76R81k457M22R89L77O03j706j51J373R55j055
4574C95k46j20O39K68q68R48K60j016k35q65K201j583R33p32O13n56l32j5K90
4593b1k33o16K49N82O3p78p4J617k005R93j903P29l38Q88J376l56j118K83Q73
$$ plain form
4612 211 -1112 591 -373 -309 604 -1460 -734 -207 -809 279 -300 -1251 74 591 -2223 -186 497 1112
4630 1112 -907 73 -331 7 390 548 47 -1052 980 123 34 162 -948 894 -1264 1839 698
4647 698 -514 329 200 1136 377 786 1137 956 1169 521 -670 -112 302 -141 -108 -750 432 34 -28 -20
4667 -20 -196 -182 366 149 -1288 144 -51 -110 -351 416 97 -688 -85 -1218 -622 -341 -632 -770 -942 -964
4687 -964 -1027 -237 501 -682 -674 -99 278 319 -702 -58 -172 34 677 -1366 -33 -254 284 534 34 357
4707 357 102 227 -264 510 512 567 196 -419 -418 228 34 363 629 809 599 717 55 680 -59 891 -682
4728 -682 -33 -516 -200 144 1221 1151 -333 -678 -720 720 440 -293 76 587 1360 -717 -694 -69 -770 129
4748 129 -463 -214 -506 1124 -228 -252 -286 -206 460 -298 -1221 -798 -776 -1043 83 -11 -96 627 -61 -115 -455
$$ packed form
4612B11j323J703r64O4R13k064P26N27o02J088n79r51J325N17k814K037O83O15
4630A112k019R80m04L38L83J58n01j099K032q57q9J28j110J842k158L103j141
4647F98j212Q43j29R36p59M09L51j81K13o48j191N58M14m43L3o42J182l98o2Q
4667b0j76J4N48k17j437J432j95n9k41P67l19p85O03j133N96K81k91j38j72k2
4687i64o3P90P38j183QN75L77M1j021O44j14K06O43k043J333k21N38K50n00L23
4707C57k55J25m91P74KN5l71o15JO46j94L29K66J80k10J18o62O25p39R50j573
4728f82O49m83L16L44J077p0j484l45m2J440k80p33L69N11P73k077K3O25p01Q99
4748A29n92K49k92J630j352k4l4Q0O66p58r23M23K2k67J126r4q5P23o88n4l40
$$ plain form
4769 -455 -177 253 577 345 -798 296 -28 382 -518 -966 399 488 380 102 883 -322 627 267 -12
4788 -12 494 701 1041 153 293 440 545 340 -93 434 450 1645 -89 610 446 865 640 -208 254 214
4808 214 596 769 496 -290 -943 617 161 1007 -581 -143 -161 181 375 505 -404 -1391 1665 -1126 -574
4827 -574 -139 -1315 383 -687 -649 -1357 -176 -783 -374 -109 -1226 -449 -1127 -233 -500 904 -234 -57
4845 -57 513 -49 343 -757 -492 1013 403 -955 593 231 -102 138 -436 805 586 431 910 598 435
4864 435 873 1275 -530 -507 988 611 440 1405 727 807 567 884 -1078 1076 745 -577 223 832 121
4883 121 530 368 147 294 823 -181 -927 567 -579 -263 838 336 -405 -5 273 1042 -1118 -47
4901 -47 360 -802 194 -233 -85 550 -371 951 -845 -548 863 57 -1130 505 670 -328 -410 -966 -459
$$ packed form
4769d55K78M30L24k32j143J094l24M10r00m48J365Q9j08k78P81j205R49l60k79
4788a2N06K07L40q88J40J47J05k05m33N27J6J195j734O99j64M19k25q48M62m0
4808B14L82J73k73p86o53J560m56Q46j588M38j8L42J94J30r09r87L056k791N52
4827e74M35j176J698j070L8p08J181o07M09K65j117P77o78Q94k67J404j138J77
4845e7N70n62L92j100K65J505o10j358J548l62l33K40n74J241k19j55M79l12j63
4864D35M38M02j805K3J495l77j71R65o78Q0k40L17j962K154l31j322Q00O09p11
4883A21M09j62k21J47N29j004p46J494j146L16J101n02p41M00K78P69k160J071
4901d7M07j162R96m27J48O35r21J322j796K97J411q06j187J635J65r98q2n56N07
$$ plain form
4920 -459 -59 -232 -1018 -596 860 467 -92 -972 49 697 252 -163 396 -48 588 340 -153 577 43
4939 43 466 -83 -243 459 283 -153 -54 851 331 -275 515 576 290 -195 -70 -86 1244 -105 -991 193
4959 193 -342 437 -287 -229 -140 454 -175 57 -787 -623 63 -764 -291 270 -118 -1620 138 777 -832 -153
4979 -153 -629 134 -660 520 -154 -191 525 -1067 -500 -983 937 -851 -1351 -550 -1172 15 106 644 -471
4998 -471 656 -861 -277 533 919 -425 -351 676 105 344 -272 -370 -448 -969 -632 -1014 394 46 -525
5017 -525 875 305 -502 -553 18 -1741 1103 -110 245 942 238 2084 -275 833 -208 -471 1037
5034 1037 -1714 324 -971 418 1752 -376 -197 91 284 -753 -254 -707 -495 946 -201 -1168 -640
5051 -640 -996 579 -669 131 118 146 -130 266 -107 261 -1532 -108 -1173 301 -357 -903 -280 -136 -528
$$ packed form
4920d59M00j73p86M22J456l93n59q80J021O48m45m15N59m44O36k48m93P30n34
4939D3M23n49j60P02j76m36R9R05n20o06P90O1k86m85J25j6J330j349q86J184
4959A93n35P79p24N8Q9N94o29K32q44J64O86q27M73N61l88j502J758O39j609O79
4979a53m76P63p94J180o74l7P16j592N67m83J920j788n00Q01o22J187R1N38j115
4998d71J127j517N84Q10L86j344P4J027n71K39o16r8p8n21L37l82J408l48n71
5017e25J400n70q07n1N71j759K844j213L55O97p04J846k359J108j041k63J508
5034A037k751K038j295J389J334k128J79K88J93j037M99m53K12J441j147r67N28
5051f40l56J575j248Q00j3K8k76L96l73L68j793J424j065J474o58n46O23J44l92
$$ plain form
5070 -528 -961 582 1317 997 -1128 922 -536 1243 -52 -523 399 594 -474 751 -101 -262 -1853
5087 -1853 -379 152 358 409 -925 217 -784 77 572 643 -1012 1211 -742 -103 396 -309 501 19
5105 19 792 -271 -356 -431 -31 823 -118 33 -253 753 -193 -344 -277 -495 -598 -610 -390 311 173 228 669
5126 669 -672 -1155 -433 -1054 -687 -1207 391 -98 34 -220 -282 1178 -778 517 713 205 -865 -581
5144 -581 -632 439 650 -456 -727 -1002 232 -391 -532 488 601 1 729 358 -263 121 566 -545 -1431
5163 -1431 196 524 -72 -627 -503 511 823 -133 544 409 328 41 -528 188 -649 489 -1069 -297 232
5182 232 188 -171 84 68 -340 -163 409 -443 316 818 708 142 86 357 -1031 -343 -19 287 -269 -1599
5202 -1599 -83 402 -419 -327 -633 -520 -823 717 -319 -98 -857 -456 -824 -446 409 -948 -540 -1418 -1047
$$ packed form
5070e28m33J543P35l20k125K050j458J779j295m71R22J95j068J225q52j61j591
5087a853J474N31K06N1j334J142j001Q61M95P1j655K223j953O39M99p05Q10m82
5105A9P73j063q5p5M00Q54r41J51k86J006r46j51O7k18j03j2K20P01j38N5M41
5126F69j341m83P22o21L67n20J598m89J32k54o2J460j956J295J96n08j070K84
5144e81n1J071K11j106k71k75J234o23j41J020J13o00P28l71o21L84M45j111q86
5163a431J627L28n96n55J24J014L12r56O77j35q1k87n69P16q37J138j558P72N29
5182B32m4l59K55j6m08J77N72q52P59N02j10n66n6K71j388O88L24L06n56j330
5202a599J516M85q21R2l06J13l03J540j036K21p59M01l68L78Q55j357M08q78L71
$$ plain form
5221 -1047 -481 590 -131 -764 1148 -953 361 -1229 685 509 -596 58 726 622 -632 853 -98
5238 -98 93 435 -436 -1061 119 -494 804 -216 324 851 389 670 537 649 1343 -45 -921 132 42
5257 42 1447 516 163 -38 345 -367 -397 508 233 -942 -545 582 840 -1426 179 -417 -276 56 245
5276 245 -717 669 -582 -799 286 143 -585 -823 -848 -917 123 437 -297 -108 40 -341 -465 -383 -121 1012
5296 1012 -273 -1300 -1463 92 883 -285 -106 -993 955 653 -239 95 -177 1542 -623 -171 -480
5313 -480 1377 819 552 -585 -902 326 -959 -200 -24 -627 224 563 109 -733 106 -65 65 1326
5331 1326 354 -300 198 -845 -175 185 -281 202 -211 -1457 -224 -247 354 -7 -1081 680 485 274
5349 274 -792 -125 -262 727 -358 -530 663 -350 -168 -1655 -964 371 -962 -421 132 -353 -1020 -1359
$$ packed form
5221a047N66J071p21o33J912k101J314j590J914j76j105O54O68j04j254J485r51
5238i8J91L42q71o25J180o13J298j020N40N27m62K81j33J12O94j388q76J053r0
5257D2J405r31l53k01L83p12l0R05k75j175L97J127K58k266J605n96J41L32J89
5276B45r62J386j251k17J085j43p28k38k5o9J040L14p34J89J48l81j24Q2K62J133
5296A012j285j027j63J555P91j168J79q87J948l02q92L34k72J719k165M52l09
5313d80J857n58k67j137l17J228j285P59J76o03Q51L39m54q42Q39j71J30J261
5331A326r72o54M98j043O70L60m66M83m13j246J233k3O01l61j074J761j95k11
5349B74j066O67j37R89j085j72J193j013J82j487O91J335j333N41N53m85o67l39
$$ plain form
5367 -1359 -1494 595 -910 -162 -525 -486 10 -537 -872 -354 103 914 1103 -705 -139 951 -239 135
5385 135 -526 -8 -1040 399 -511 543 -431 749 1161 -138 -49 -160 -305 -30 924 195 139 420 423 -201
5405 -201 -425 84 682 -1205 725 -483 142 730 -413 -679 -206 -456 -823 -56 347 84 -35 302 -398
5424 -398 302 290 297 909 -491 -1309 648 12 -792 -452 -652 -180 1358 -1682 -700 -698 73 405 -939 145
5444 145 -1550 -258 406 -835 -565 -725 -321 -194 643 -1083 -398 -804 827 425 143 -835 -773 -492 -634
5463 -634 229 -361 498 -585 366 1762 224 1575 -423 326 -745 1065 153 -181 -110 718 967 20
5481 20 85 66 -909 -161 1069 224 -547 -22 118 332 -836 -433 -180 920 53 -633 300 321 1284 669
5501 669 -351 -1302 359 -419 -93 -162 300 -256 149 -613 -961 -52 911 433 514 32 -81 573 -615 -1256
$$ packed form
5367a359j35K089j505P48l63L9M96n47l35N18M57Q11J89j808N66J090j190L74
5385A35o61N18j032J439r10J054r74J180M12j299Q9j11j45K75R54p29n6K81Lo24
5405b01k24N09N98j887J930j208O25N88j143k66M73k50l67P67M03k63j19L37p00
5424c98P00j2PO12j400q18J957o36q04L40k00M72J538l040R82KP71L32j344J084
5444A45j695J292O64j241K70j60M04J27Q37j726O85m06J631m02k82r78O2K81j42
5463f34Q63n90Q59j083R51J396j538J351j998P49j071J810r12l34P1Q28K49r47
5481B0O5j9r75P48J230q45p71N25J40K14j168M03K53J100q67o86R33K1R63o15
5501F69j020r51J661p78L26o9M62n56M05p62l48R09R63m78Q1m82j13O54j188o41
$$ plain form
5521 -1256 215 -657 -531 -1016 -285 -305 814 -715 -177 -631 -207 -860 22 112 -210 75 -102 1232 -268
5540 -268 310 758 302 884 1033 106 -7 504 472 351 -1263 -14 301 -348 -430 -726 841 663 -347
5559 -347 -215 -479 198 223 -253 -655 203 381 -144 217 -521 206 351 -409 182 707 -753 -401 264 -150
5579 -150 574 -919 223 -288 436 -446 -69 -67 1042 588 -1640 150 395 -50 253 294 482 -167 495
5598 495 -566 -236 632 280 311 -526 -750 1527 441 -1468 -4 375 -1091 370 563 233 -257 -252 -811
5617 -811 182 63 196 369 -665 138 -224 197 -373 -277 8 139 321 186 361 398 -515 -148 362 -104
5637 -104 -102 -364 225 434 250 -507 -423 1240 -921 -1771 -846 360 550 788 -187 -174 -244 1867 10 9 295
5658 295 9 107 -363 -453 -480 186 501 -382 -1239 106 520 -363 -933 188 -513 494 -890 155 -284
$$ packed form
5521a256J471q72J26m85P31k0J119j529N38m54M24o53Q82R0l22K85j77J334j500
5540b68N78M48m56N82J49r27j13N11l2j21j614J249L15o49q2k96J567j78j010
5559c47J32k64O77K5m76m02Q58J78n25L61p38P27J45p60N91N25j460L52O65m14
5579a50P24j493J142n11P24q82L77KJ109m54k228J790K45m45L03M1J88o49O62
5598D95j061L30Q68l52L1q37k24K277j086j909J464L79j466J461J93l30m90Nn59
5617h11R93j19J33J73j034Q03l62M21n70R6K85J31J82j35J75L7r13L67N10m66
5637a04Kk62N89K09j84p57Q4J663k161q50R25J206J90K38r75J3p0K111j857jK86
5658B95k86R8m70r0k7O66L15q83q57J345M14q83n70J121p01J007j384J045m39
$$ plain form
5677 -284 157 6 595 -456 -85 -398 930 -755 112 397 1089 1254 476 839 -556 207 -1161 490
5695 490 958 609 -212 970 -266 1629 735 -999 1490 1152 253 -386 155 -213 975 522 -751 1308
5713 1308 144 50 -253 348 406 54 717 112 -19 -274 -122 -709 -728 46 -369 156 -682 249 -317 -610
5733 -610 -993 -842 -199 376 -731 -315 906 -580 37 -6 -413 -483 -147 -535 -147 -367 741 -752 108
5752 108 -824 -113 -457 -903 501 -7 288 -100 334 451 932 113 -100 -736 -554 124 -478 428 626 542
5772 542 84 -192 789 651 445 303 -111 11 12 -315 -84 389 242 135 408 853 -345 172 -145 572
5792 572 -216 -594 -9 0 267 -436 35 -148 163 68 -801 -121 -235 43 77 -829 -317 430 -169 -500 523
5813 523 237 156 -1116 126 259 323 270 -79 103 -601 -74 118 -249 313 436 -203 -156 35 -312 294 -154
$$ packed form
5677b84M41j51N89j051L71l13J328j685Q67K85O92J65p78L63j395P63j368J651
5695D90M68l49q21J182j236J895q94j734K489l38q99o39N41l68J188m53j273K059
5713A308j164r4l03O01N8l52O63o05j31k55J52n87j9P74m15N25q38R31n66k93
5733f10l83J51O43N75j107M16J221j486O17m3m07p0L36l88L88k20J108j493Q60
5752A08r32P11l44m46J404n08K95l88M34J17M81q19k13o36J82O78o02R06J98q4
5772E42m58k76R81j38k06j42m14J22Jl27K31M73j47j07K73M45j198N17l17P17
5792E72p88l78N85RK67p03M71j83L11r5q69O80j14K78L4r06N12P47n99l31J023
5813E23k86q1j272J242J33O4n3l49J82p04N27J92l67N62J23o39M7J91l47O06m48
$$ plain form
5834 -154 -199 -305 -241 -660 156 146 -286 1 -517 -362 570 -545 -649 -392 1071 482 105 -336 663 376
5854 376 782 367 -155 -636 225 -938 386 18 1221 -260 313 -411 411 -735 -1228 844 -264 -423
5872 -423 647 108 -321 -692 -486 661 126 1179 -407 321 -1015 -708 160 -745 208 -597 -565 -466 -390
5891 -390 584 -313 -653 166 -520 336 -1086 -618 -294 -763 692 -76 -305 -1650 -718 403 -252 -350 -561
5910 -561 296 -122 463 755 -61 -248 -836 535 -35 97 584 411 -69 869 -880 1172 140 253 -144
5929 -144 602 545 1291 687 -29 357 -168 -20 -1377 -376 1075 513 863 -44 -82 -117 -1031 -920 -509 -682
5949 -682 472 654 -367 20 -574 -535 90 -64 -734 -379 127 326 -54 1053 -550 -59 86 -73 -472
5968 -472 451 192 -695 -616 -925 490 908 242 -134 -263 -1328 -428 -649 -42 -1734 -437 828 760 -742
$$ packed form
5834a54m5j06O4m19Q16j0m32K87n18J55R32j115j04K57J463n89l77m41R99k87
5854C76M06m15n22m81Q61j163J324l68J203j481N73p24Q22j146m93K072j108j59
5872d23J070n39m29l71K06J147n35J053j586P28j336L07Q68r05R53q05L2R9P6
5891c90R74q97l40Q19o86Q56j422M68L24m69J455p68k29j345R32J121o55r8k11
5910e61Q57m18N85K92q16j87n88J371n70J32M87j73m80R38j749K052j032J13l97
5929a44P46n7P46o04p16L86n25J48j357J001J451n62L50r07l8l5r14J11M11j73
5949f82J154J82j021L87n94L9O25j54o70L55N06J99l80J107j603M91J45j59l99
5968d72R23k59q87P9l09J415M18o66l76j29j065R00k21O07j692J297J265o8j502
$$ plain form
5987 -742 -631 205 -445 975 -579 322 -644 138 325 -623 135 865 -1065 671 -47 726 -347 643
6005 643 106 111 221 -1839 493 285 1501 312 -303 1659 -1029 1001 -634 1250 1405 85 -929
6022 -929 645 286 -883 180 -221 -193 -22 -83 -944 98 363 -1220 -729 -401 607 239 -440 -104 86
6041 86 426 -633 89 17 282 -1446 382 -98 411 -381 38 -671 -202 258 148 -405 301 -498 163 537
6061 537 -106 152 51 174 159 411 304 -304 60 -864 -224 -66 -632 -340 167 346 756 -66 365 327 -69
6082 -69 -36 -729 -290 -139 -32 504 184 -257 348 -23 -211 584 -442 252 190 -134 136 -537 461 -324 -25
6103 -25 -381 -1051 229 39 -78 -621 -91 -127 -499 -706 -546 -821 142 35 84 947 212 647 -361 -448 -514
6124 -514 4 256 251 642 -405 208 -50 308 697 -714 169 -229 1014 506 5 1048 -249 226 -727
$$ packed form
5987g42J11Q36o50J420j554R01r66P82J87r48P58P30j930J736p18P73j073R90
6005F43n37NJ10k060K332k08J216j189o15J962k688K030j635J884J55j320j014
6022i29J574l59j169J063m01K8J71o1q61J042K65j583M91L28J008l68o79L36J90
6041H6L40j059P22p2K65j728J828m80N09p92M19p09M69M60j10n53P06p99O61L74
6061E37o43K58j01J23j5K52j07o08L64r24O40J58n66K92N07J79M10q22M31l8l96
6082f9L3o93M39J51J07N36l20m41O05l71j88P95j026O94o2l24K70o73R98p85K99
6103b5l56o70J280j90j17n43N30l6l72k07J60k75R63j07M9Q63p35M35j008q7o6
6124e14N18K52nL91j047O13k58L58L89j411Q83l98J243n08n01J043j297M75r53
$$ plain form
6143 -727 341 -274 34 164 -368 553 -543 -387 -465 -304 -1142 -150 531 -363 97 229 139 336 -212 318
6163 318 -636 -135 572 190 -908 -146 328 86 -350 243 107 179 -54 138 60 -203 289 492 -319 -270 647
6184 647 -324 -559 -812 409 -977 -110 -1394 -415 -23 243 -1242 -1027 511 163 -277 -299 -962 1126
6202 1126 4 310 105 -991 495 199 -895 -75 -923 -925 1049 -491 512 -165 -114 500 570 -223 -450
6221 -450 -66 -354 -590 -677 -218 461 -173 564 743 746 481 -1353 129 545 248 992 7 232 -511 205
6241 205 -19 -681 306 -125 -884 -74 398 -453 282 -1207 -116 -907 38 322 44 765 -564 83 617
6260 617 -326 283 400 -214 -394 517 -490 -9 -269 -152 149 8 29 94 -3 -50 21 -98 -483 -353 287
6281 287 -330 -16 110 404 185 375 -269 580 243 711 330 -298 721 -958 186 399 52 360 112
$$ packed form
6143g27J068o15L08J30n32R21j096J56p8J61q38R92O81q94M60J32r0J97n48N30
6163C18r54N01P07l82j098P62M74k42m36N93j36P2k33J92p8k63M92K03q11M9R17
6184F47r71k35k53J221j386Q67j284R79L92K66j485K15J538l48m40k2o63K088
6202A126j122L06k05j096J486k96j094Q20q48kJ974j540J003o77N1O14P0p93k27
6221d50L84k88k36q7M59O79o34P37J79Lk65j834J482M16k97P44r85K25p43P16
6241B05k24o62R87m31p59Q10M72q51P35j489J091p91R45K84k78P21j329O47N34
6260F17r43O09J17o14j80R11j007M81k60J17L01j41K1O5r7m7P1j19l85J30O40
6281B87o17L14J26K94k19J90o44Q49l37M68l81o28J019j679J144K13l47L08k48
$$ plain form
6300 112 -67 -868 1350 -604 688 1187 275 760 1013 557 -57 -885 1 442 801 184 -610 -4 -265
6319 -265 -776 280 -589 1161 129 158 -516 -362 996 -424 -100 -2343 292 -248 86 37 -1007 -858
6337 -858 537 -249 331 347 140 -10 -769 -457 281 -53 652 -489 -469 497 -495 -669 -44 696 -649 133
6357 133 442 -141 -104 -832 -688 174 1233 1288 -631 413 713 194 -82 -709 334 359 89 326 -807
6376 -807 36 -298 443 -587 -583 -331 77 -591 -609 430 -297 300 641 478 342 118 621 116 198 -569 1055
6397 1055 -41 -306 95 453 -91 -302 -381 -526 195 177 412 145 -130 31 -362 108 -188 -210 297 -917
6417 -917 -252 570 -68 476 20 -378 -399 545 -596 -355 -117 233 484 -440 652 38 -55 -49 782 -304
6437 -304 112 -5 -106 -439 -19 504 -224 -173 -171 570 -84 -483 215 -372 247 394 323 503 863 154 -329
$$ packed form
6300A12j79q01K218j954J292M99r12M85K53m56o14q28Q86M41L59o17p94O06k61
6319b65n11J056q69J750j032K9o74J54J358j420L24k243K635n40L34m9j044J49
6337h58J395p86N80J6k07j50p59L12P38l34P05j141K0R66r92j74O25P40j345P82
6357A33L09n83L7p28J44Q62J059N5j919J044L00n19k76o27J043K5k70K37j133
6376h07Q43l34P41j030MK52M08o68j8J039p27N97L41j63j36k24N03n05Q2p67J624
6397A055j096k65M01L58n44k11p9j45P21j8K35k67k75J61l93M70k96k2N07j214
6417i17O65Q22o38N44m56l98k1R44j141K41K38L50K51r24J092o14r3OQ31j086
6437c04M16j17j01l33M20N23p28N1KP41o54l99O98n87O19J47p1J80L60p09m83
$$ plain form
6458 -329 520 69 471 -74 -365 645 284 -188 -191 466 -168 -349 -598 -193 -407 -423 -338 39 570 -805 -389
6479 -389 -178 -267 809 -525 -164 598 -189 -632 -666 180 21 1093 561 -84 -106 -503 64 -271 -390 -304
6499 -304 189 441 3 178 -284 171 281 235 -562 61 47 441 480 248 293 583 753 73 -210 65 319
6520 319 589 278 246 -332 10 709 905 381 -195 613 119 854 127 97 -640 -414 100 775 -390 630
6540 630 -149 -106 126 -413 49 -92 1135 -118 116 -478 -157 -42 -50 -914 -1021 -535 -252 270 566 -760
6560 -760 -249 58 97 192 275 305 -146 45 221 306 -1112 -685 843 56 -338 385 -105 -67 -29 -432 -25 101
6582 101 391 -2 -432 928 186 -101 -721 123 -153 253 660 -94 248 -668 -222 -356 196 -70 -179 -234
6602 -234 -597 289 -995 -757 -382 421 -827 461 348 -46 577 -371 14 -305 298 296 -31 -366 82 201
$$ packed form
6458c29Q49m51M02n45k91J010l61m72lO57o34j81k49M05k14j6Q5L77N31j375M16
6479c89K11q9J076j334L61P62p87m43l4Q46j59J072n32o45k2l97N67l35j19Q6
6499c04M93K52m38J75m62M55J10m6p97O23j4L94L9k32M5K90J70o80k83K75K54
6520C19K70l11l2n78L42O99J96n24n76Q08m94P35p27l0p37K26N14O75j165J020
6540F30p79M3K32n39M62j41J227j253K34n94L21J15qq64j07M86K83N22K96j326
6560g60N11L07L9R5Q3L0m51J91J76Q5j418M27J528p87l94P23m90L8L8m03M07J26
6582A01K90l93m30J360p42k87o20Q44k76M06M07p54L42r16M46j34N52k66j09n5
6602b34l63Q86j284K38L75Q03j248J288j13l94O23r48L85l19O03kl27l35M48J19
$$ plain form
6622 201 -111 -287 61 -583 -526 -400 228 -126 89 -675 -124 867 145 570 -818 -30 334 281 -122 327
6642 327 268 533 -798 -250 -448 199 213 -413 -297 -268 125 563 227 314 511 160 -410 -205 373 63 -24
6663 -24 492 192 61 -585 976 579 -270 -240 338 78 399 287 -226 851 -517 -276 10 -154 -199 47
6683 47 178 -125 25 -82 943 -583 -103 -162 514 -31 -592 760 45 -434 -839 1100 200 172 378 367
6703 367 961 277 -180 -115 -435 32 -41 263 -217 -220 -425 -389 -147 -292 -554 17 248 -129 564 109 -50 128
6725 128 208 -803 788 -42 104 495 -138 999 981 274 -23 230 491 -434 394 402 67 -300 -317 590 157
6746 157 645 204 214 152 1210 778 901 830 -1002 522 396 -40 -816 186 -569 -121 763 -371 322
6765 322 -647 138 595 -81 697 -82 479 -497 -335 -1154 614 696 328 235 360 -268 1098 31 -310 -568
$$ packed form
6622B01l12j76L48o44N7J26O28l54K15p64N51R91p22M25j388P88L64n3m03M49
6642C27n9K65j331N48j98O47J4o26J16K9L93M38l36Q7J97l51n70K05N78l10q7
6663b4N16l00j31o46J561l97q49L0N78k60L21j12n13J077j368K41K86j64m5K46
6683D7J31l03J50j07J025j526M80n9O76n45n61J352p15m79m05J939r00k8K06j1
6703C67N94o84m57O5l20M67p3L04m80lk05L6K42j45k62N71K31l77O93m55j59J78
6725A28Q0j011J591q30J46L91o33J137j8p07k97K53K61r25Q28Ql35l67j7R07m33
6746A57M88m41J0o2J058m32J23p1j832J524j26m36p76J002p55M48Q84j134O93
6765C22r69P85M57o76P78p79N61r76J62q19J768Q2l68r3J25o28J366j067l41k58
$$ plain form
6785 -568 239 -228 -995 532 151 924 104 -197 333 798 671 -203 -305 -506 -156 -740 -742 423 -381 179
6805 179 -547 -1037 -26 -34 -361 -728 -1170 253 -502 754 332 471 529 350 552 1886 76 1296 1510
6824 1510 801 448 662 208 838 257 -427 356 -847 104 -711 500 -300 1376 644 -86 -662 -355 211
6843 211 -58 -474 -304 56 -727 -94 650 751 -830 280 -375 961 -441 -418 267 -1678 560 -200
6861 -200 -1702 941 594 197 -1027 1115 -467 -540 -91 -191 119 583 352 -457 155 -22 -586 -320 345
6880 345 92 1189 458 848 -252 -147 308 -293 -659 447 190 1026 -365 467 -252 -24 604 -134 -87
6899 -87 368 399 458 1266 -209 -138 -355 388 573 -479 252 106 -145 -77 -325 -177 887 1665 -346 -400 -300
6920 -300 221 399 -649 -48 541 13 -52 -572 -883 310 321 -252 -506 598 1305 -427 -532 -795 186
$$ packed form
6785e68Q07m67p67J527l81P73q20l01N30M65j27q74j02k01L50n84kJ165q04N60
6805A79p26m90J011ql27l67m42J423p55J256m22J39N8j79K02J334j810J220K14
6824A510p09l53K14m54O30n81o84P83j203R51q15J211q00J676p32p30n76L07N66
6843B11k69m16J70L60p83O33P44J01j581J110o55J336j402K3O85j945K238p60
6861b00j502K643l47l97j224K142j582p3M49j00L10M64k31q09O12j77n64K66O65
6880C45k53J097p31L90j100J05M55o01l66J106k57Q36j391Q32p19K28O28p38M7
6899h7M55L1N9Q08j475P1k17P43J85j052P31j46k51O8k48J48J064P78k011n4J00
6920c00N21J78j048O01N89n28o5n20l11J193J1n73k54J104P07j732j05k63R81
$$ plain form
6939 186 -252 10 636 -62 54 -949 1169 -313 -74 -695 -27 287 -374 -133 220 -3 -176 -90 -670
6958 -670 478 -610 -208 715 -367 -308 -643 -1346 -829 1290 931 -288 283 -179 -374 -42 361 -542 -684
6977 -684 1224 -195 97 86 319 1476 -636 -985 417 433 -54 787 802 -868 1170 400 574 699 1095
6996 1095 -129 180 -637 -376 -840 -755 256 -597 -500 128 -315 -590 -11 -575 574 -788 115 321 -352
7015 -352 -489 330 -1735 37 402 -213 -459 923 268 -96 -1003 -606 -58 -118 -709 -205 -951 -242 -1095
7034 -1095 -550 775 36 116 -491 -302 -421 -395 724 181 284 -27 -35 171 -929 26 850 518 -312 372
7054 372 426 -775 -65 -144 170 460 230 509 21 -371 263 708 -73 183 -431 -466 559 190 -183 185
7074 185 -383 -19 218 -64 -225 80 -482 342 -63 166 -628 -83 419 -756 342 -303 -192 297 310 -165
$$ packed form
6939A86m38K62O26o98J16j003K118j482K39o21O68L14o61K41L53k23j73Q6n80
6958f70J148j088M02R23j082N9l35p03N17K119l59j219N71m62j95L32M03r03j42
6977f84J908j419K92j1K33J157k112l49J402J6m87Q41J5j670K038p70J74J25L96
6996A095j224L09q17K61m64Q5J011q53R7O28m43k75N79n64J149j362R03K06o73
7015c52j37Q19k065J772L65o15k46J382o55l64r07L97N48o0n91N04p46P09q53
7034a095N45J325p39Q0o07J89j19K6J119n43J03l11qK06j100R55Q24l32q30O84
7054C72N4j201P10p9L14K90k30K79m88l92O34M45p81K56o14l5J025l69l73L68
7074A85n68L64K37k82j61L05n62Q24m05K29p94N45N02j175J098o45J11M89J3m75
$$ plain form
7094 -165 256 -462 -51 356 -484 324 -159 -508 -410 -138 303 -771 -1064 -183 248 -94 -286 -822 -176 468
7114 468 506 67 -414 212 -78 -260 16 -138 695 -32 -69 62 318 108 -355 1055 508 -365 52 362
7134 362 393 -107 630 698 2 203 -302 -363 -263 648 198 -513 -359 300 613 191 -1180 -425 -247 188 -130
7155 -130 -372 -218 863 -138 -481 -24 -350 -318 349 -12 -574 -280 63 -106 -213 -202 -579 528 -127 79
7175 79 415 -163 974 241 291 -634 -15 734 786 -768 55 254 480 440 -18 749 -379 307 115 188 50
7196 50 -65 -293 -273 -266 112 -989 407 582 -379 -822 -623 377 527 532 38 296 968 106 1266 318 -86
7217 -86 506 -199 -99 3 1340 127 -955 180 -298 618 43 -931 -725 -1178 -820 450 -341 99 202
7236 202 -420 -414 -1504 62 -753 310 491 -768 -551 -43 -188 196 197 -560 -326 -235 656 1319 -454 -642
$$ packed form
7094a65M21p18M11M07q40Q08m83l49R8K72M41j074k93Q81M31l42j92n36O46O44
7114D68L8m39m81O26k90j82K76j54Q33p27l7J31K56k10m63J410n47q73M17L10
7134C62L1n00P37O8o96K01n05o1J00R11m50p11J54O59L13m22j371P55J78M35l18
7155a30k42J54J081j001l43M57l26L2O67l61n62K94L43j69j07J1l77J107o55K06
7175G9L36n78J137p33N0r25O19P49N2j554Q23J99K26m0m58P67j128O86j92P3j38
7196E0j15k28K0PL78j101J396J75r61m43J99J000J50Nm94K58O72q62J160r48m04
7217h6N92p05J00J02J337j213j082J135m78R16n75r74K06m53L58J270p91M40J03
7236B02o22Oj090J566q15J063J81j259K17N08j45L84Jp57K34R1Q91O63j773j88
$$ plain form
7256 -642 607 164 42 -696 1436 56 503 136 -31 -578 -73 55 726 305 833 -405 71 -186 628
7275 628 1466 -146 -567 -805 70 -522 720 -945 127 -501 453 -150 616 -42 129 1145 -6 296
7293 296 401 -169 179 1277 346 -8 -947 794 696 199 1021 1450 -485 -70 93 483 538 126 89 -46
7313 -46 598 -530 27 -1065 852 -206 -175 -129 658 236 -1262 -753 -217 812 -597 948 -248 312
7331 312 -654 -1053 -294 811 -41 -1575 -115 649 46 886 1042 1044 50 320 1414 835 270 -117 167
7350 167 -82 476 405 947 561 36 425 -93 297 871 311 -446 -488 276 692 -433 -222 681 -50 1435
7370 1435 817 -1428 709 302 -388 855 256 462 -343 -1108 279 -96 -415 771 921 202 1439 1060
7388 1060 -346 -397 -305 491 1820 -619 -188 -481 145 -693 -433 656 -148 -573 1944 -18 1141 208
$$ packed form
7256f42J249m43j22p38K132j380M47l67j67n47N05J28O71m21N28j238M76k57Q14
7275F28Q38j612m21k38Q75n92J242j665J072o28R54o03P66o58J71J016j151L02
7293B96J05n70L48J098r31l54r39J741r8m97Q22M29j935M15J63L90N5m12l7j35
7313d6O44j128N57j092J917j058L1M6P87m22j498N09N36J029j409J545j196N60
7331C12r66l99P59J105q52j534J460P64o03Q40J56Kr94K70J094n79n65l87K84
7350A67k49N58p1N42l86n25L89n18L90N74n60p57m2P64M16j125K11R03p31J485
7370A435o18k245K137m07o90J243n99K06q05p65J387l75l19J186J50p19J237l79
7388A060j406n1R2P96J329k439M31k93O26q38K60J089q04m25K517j962J159r33
$$ plain form
7406 208 -1308 -201 2 592 522 -898 366 1482 444 423 -405 1381 800 321 468 10 -685 -907
7424 -907 86 619 -22 253 125 325 644 -634 -521 -1424 -700 -135 863 -35 -427 275 274 -274 -1914 -1071
7444 -1071 412 793 -27 1860 -459 1223 -316 -633 491 -989 23 1898 66 -710 831 1249
7460 1249 218 1101 582 -518 -78 1030 138 -163 176 551 -1147 -1394 352 254 313 -535 -705 637
7478 637 1155 -999 1420 -270 -417 220 -445 -1033 482 27 -549 892 -482 206 140 521 389 -271
7496 -271 -296 149 58 242 -512 785 12 97 836 812 112 -832 43 720 195 618 450 -357 107 -119 -963
7517 -963 90 -213 252 -478 -122 -92 334 275 774 -247 372 -672 -547 165 -99 -266 -452 706 -191
7536 -191 165 -128 -410 -14 -540 124 181 -818 482 -1034 334 -1202 373 -461 675 9 -587 925
$$ packed form
7406B08j516J107K03N90p0j420J264J116j038k1q28J786n81m79J47m58o95k22
7424i07R93N33o41K75j28K00L19j278J13r03P24N65R98q98l92P02jn48j640Q43
7444a071J483L81q20J887k319J682j539l17J124j480J012J875j832p76J541M18
7460A249j031Q83n19j100M40J108q92l01L39L75j698k47J746r8N9q48j70J342
7478F37N18k154K419j690j47O37o65n88J515m55n76J441j374O88o6L81j32o60
7496b71k5M45r1J84p54J297p73Q5P39k4p00r44Q75O77n25M23j68q07M64k26q44
7517i63J053l03M65p30L56L0M26n9M99j021O19j044J25P12k64j67j86J158q97
7536a91L56k93k82L96n26O64N7r99J300j516J368j536J575q34J136o66n96J512
$$ plain form
7554 925 -730 999 -259 126 301 704 -408 -115 954 -307 97 522 1200 -769 -39 -602 959
7571 959 -716 -81 -15 -119 1127 -450 689 -346 853 919 116 1828 418 -844 -177 256 57 162
7589 162 134 -956 286 688 -89 -1926 127 176 991 -1584 -172 762 -1950 -24 229 570 350 -277
7607 -277 -370 11 -97 -418 -351 247 26 -117 -145 834 -261 -227 105 -401 293 28 259 -642 282 -239 -488
7628 -488 -384 -547 434 -942 -62 194 241 -746 -110 1043 -175 50 23 -89 437 45 404 -241 377 -285
7648 -285 656 -37 -549 -31 -574 494 126 -806 -472 157 699 -75 8 -200 858 -497 -115 -117 469 -36
7668 -36 607 456 -649 -868 -640 -299 275 19 -354 23 8 -348 325 653 564 101 -388 587 -882 199
7688 199 -414 -467 245 -7 194 91 -30 -408 156 664 678 -131 -181 337 362 234 -433 626 207 -86 -647
$$ packed form
7554I25j655J729j258L85J75M03j112K93J069j261M04M25O78j969P30n63J561
7571I59j675O35O6j04J246j577J139j035J199O6q03J712j410j262O67M33j99J05
7589A62k8j090J242M02p77j837K053M9Q15k575J412R34k712J926K53L41k20o27
7607b77r3L81j08l21O7N98k21j43k8R79j095L4L32n06O94k65K31r01R24n21k49
7628d88J04j63R81j376Q80K56M7r87O36J153j218K25k7j12N26l92L59o45O18o62
7648b85R41o93n12N18n43J068l68r32L34O29N42p74Q3k08J058j355L82kN86n05
7668c6O43j51j105k19K28L41N74k56l73L77j5l56O73L28q9m63m89R75j469J081
7688A99o13n3P12k52K01j03j21l78N64N08J4q09n0N18K5j28o67J059m19k93n61
$$ plain form
7709 -647 168 -361 606 1194 -446 203 374 73 22 329 243 783 -11 770 172 -297 -1082 125 377 824
7729 824 755 -284 801 582 88 -189 -723 529 49 141 -373 370 108 -626 452 -288 -445 442 352 651
7749 651 43 1089 843 -299 -119 248 -511 -11 771 -288 368 30 -641 -297 283 -124 -849 -297 444
7768 444 -356 -674 -237 493 -557 -191 457 236 361 157 391 -160 687 -279 -773 60 -707 -590 -454 -649
7788 -649 -87 -616 -9 -159 73 4 -49 259 -560 369 837 -6 -371 291 233 14 -638 -449 693 -402
7808 -402 -899 579 -77 284 -738 100 905 202 562 -309 856 758 -113 -378 35 -407 226 -227 -518
7827 -518 -420 991 187 163 -140 292 149 -16 -23 -630 -479 -438 -518 -659 -59 -122 -304 361 -352 -257 -494 -270
7849 -270 -341 60 492 -424 -892 -158 -23 -385 -267 -242 294 -375 -758 101 -270 632 39 -5 -131 445 -478
$$ packed form
7709f47Q15n29R67N88j640O49J71l01n1L07q6N40p94P81n98m69p85J207K52M47
7729H24o9j039J085k19m94k77n34J252m80R2n14P43k62p34J078p40j57Q87r0K99
7749F51o08J046k46j142J80L67p59N00P82j059O56l38o71L44N80m07p25N52P41
7768D44q00l18M37P30j050L66O48k21J25k04K34n51Q47r66m94Q33p67J17J36j95
7788f49N62n29O07j50K32o9n3L08q19R29M68q43l65O62n8k19o52J89J142j095
7808d02m97J478o56L61j022Q38Q05p03L60q71J165r8q71k65M13m42O33m53k91
7827e18R8J411q04k4l03M32j43j65po07J51M1q0j41O00o3j82O65p13R5k37K24
7849b70p1M01M32r16m68P34J35l62J18K5N36o69l83Q59l71R02n93m4j26N76r23
$$ plain form
7870 -478 537 258 326 61 -703 68 69 -57 -374 120 -112 358 -83 -54 295 -432 141 232 -260 448 -122
7891 -122 397 -3 -28 42 163 -365 547 -219 15 87 -300 422 -695 512 141 -1 6 -258 -13 202 -20
7912 -20 13 -332 525 177 -472 100 48 153 204 -430 -756 221 412 254 751 190 -648 -121 -671 948 -518
7933 -518 256 -253 -381 324 -94 -19 -47 191 -83 162 -1 404 285 -84 44 -378 199 -323 56 122 -165
7954 -165 639 356 207 154 205 318 -214 -338 -174 -179 202 -44 -115 6 245 -157 -319 316 -87 -82 393 385 361
7977 361 51 -739 125 11 142 -572 243 -23 157 -439 -655 45 -879 29 215 180 179 -96 -191 -16 -367
7998 -367 -388 143 -457 54 65 -751 -469 -198 256 208 385 -471 470 135 -57 268 -37 30 -126 403 -544
8019 -544 -538 8 134 128 19 246 20 502 433 -316 30 210 799 -279 95 -275 -311 -70 78 223 -496 714
$$ packed form
7870d78J015k79O8k65p64P71Jj26l17M94k32M70m41K9L49p27N73R1m92P08n70
7891a22N19m00k5P0J21n28R12p66K34P2l87P22j117J207l71j42Pk64K45K15k22
7912b0L3l45Q57l48o49N72n2J05N1o34l26R77J91j58M97n61q38N27n50J619j466
7933e18P74n09j28P05m18P5k8K38k74K45j63M05j19l69J28m22N77n22L79O6k87
7954a65Q04k83j49n3N1J13n32j24J64nL81k46p1J21K39m02j62O35m03NM75qk4
7977C61l10p90Q64j14J31p14Q15k66J80n96k16P00r24R08J86l5jk75r5J75l51
7998c67k1N31o00N11J1q16K82K71M54m8J77q56R41l35j92L25l05O7j56N29r47
8019e44ON46J26oj09K27k26M82o9p49L46J80N89j078L74l70l6K41J48J45p19J210
$$ plain form
8041 714 810 -144 -459 804 -41 264 391 -387 388 537 -522 -342 186 -164 224 -45 -36 487 181 -103
8061 -103 19 204 -468 8 575 860 1032 28 330 700 51 -19 -458 238 475 143 107 628 -766 52
8081 52 85 -661 -469 -113 759 -578 -144 22 -160 -340 358 -223 1077 -36 -900 862 581 26 426
8100 426 499 -831 224 -113 459 143 810 409 -187 -190 -175 240 214 981 -667 -373 153 -351 -674 -561 -516
8121 -516 -350 594 448 -272 -942 -477 870 179 47 354 73 209 194 264 0 -335 396 -83 -173 -94 -393
8142 -393 26 -138 -17 -591 609 -15 -633 509 35 116 68 -180 115 568 334 -236 98 -309 627 408
8162 408 78 336 -325 -235 -421 -401 110 185 -421 775 354 382 312 10 -24 2 2 653 -722 129 -678 -252
8184 -252 279 857 469 379 -454 707 38
$$ packed form
8041G14R6r54l15J263q45L05J27p78P75J49j059J80N28l50L88k69RN23l06k84
8061a03J22J85o72M76N67K85J72j004L02L70o49p0m39O96K37l32l6N21j394Q18
8081E2L3p46J92L56Q72j337M34J66j82j80O98n81J300j113q64J762k81n55M00
8100D26P3j330J055l37N72l16O67m01n96lJ5M15k6P67j648K94N26n04l23J13M5
8121e16J66R44j46p20o70M65J347o91j32L07k81J36j5P0k64l35P31m79r0P9k99
8142c93M19j64J21n74J200o24o18J142m74Q1m8k48K95M53k34n70L34m07R36k19
8162D08l30K58o61R0j86K0N11P5o06J196m21K8p0l02l4K6%O51j375Q51q07M26
8184b52N31N78l88r0q33J161o69
8191C8
$$ Imaginary data points
##PAGE= N=2
##DATA TABLE= (X++(I..I)), XYDATA
$$ plain form
0 0 0 0 0 0 0 0 0 0 0 0 0 0 0 0 -2 64 -64 64 -64 64 -127 128 -130 191 -194 255 -318 323 -383 446 -512 591
32 591 -693 767 -882 989 -1111 1250 -1395 1562 -1741 1939 -2146 2384 -2637 2917 -3215 3550
48 3550 -3915 4309 -4737 5226 -5757 6346 -7002 7742 -8571 9519 -10619 11895 -13406
61 -13406 15230 -17485 20349 -24144 29431 -37415 51057 -81414 335279 -163025 80981
72 80981 388642 35398 497719 -29284 -141448 328827 179340 -24551 -19436 -215590 205286
83 205286 38594 -128801 55116 -141868 28437 75761 -143441 -61324 12881 -151798 -24096
94 -24096 41666 -246451 -83095 -152705 -76038 9780 -244697 -168568 -55916 -25989 -400
105 -400 -212998 -204913 204652 10297 -81952 -40426 -183899 216665 52750 -203473 -32920
$$ packed form
0@%%%%%%%%%%%%%%kO6j28J28j28J28j91K55k58L21l85M49n73O41p06Q29r58J103
32E91j284J460j649J871k100K361k645K957l303L680m085M530n021N554o132O765
48C550p465Q224r046R963j0983J2103j3348J4744j6313J8090k0138K2514k5301
61a3406K8636l2715L7834m4493N3575o6846Q8472j32471M16693m98304K44006
72H0981L07661l53244M62321n27003j12164M70275j49487k03891N115j96154M20876
83B05286j66692j67395J83917j96984J70305M7324k19202Q2117P4205j64679J27702
94b4096O5762k88117J63356o9610P6667Q5818k54477P6129J12652K9927K5589
105d00k12598Q085M09565j94355r2249M1526j43473M00564j63915k56223J70553
$$ plain form
116 -32920 20993 146580 26974 -178825 -2129 110962 45090 101670 -89824 65777 255606
127 255606 -12838 84489 79011 25884 154118 107949 27057 91887 48218 21530 136286
138 136286 22362 45577 13951 17707 212704 24962 -60223 88557 59978 122832 108864
149 108864 -162578 56999 197805 -47142 -8708 -108172 10306 185820 -80586 -107023
159 -107023 -16083 13623 122397 -75104 -152311 123262 43438 -8811 7288 -133701 44624
170 44624 73619 -100179 -34960 -23286 -49829 6958 -51799 -53148 -14236 -73993 10041 24583
182 24583 -50389 -8885 -62858 -870 101262 -83717 -101549 19568 7955 30157 -85237
193 -85237 -146724 36433 58040 -39195 -96466 -88266 94272 51828 -99921 -41734 -25804 81396
$$ packed form
116c2920N3913J25587j19606k05799J76696J13091o5872N6580j91494J55601J89829
127B55606k68444R7327n478n3127J28234m6169q0892O4830m3669k6688J14756
138A36286j13924K3215l1626L756J94997j87742q5185J48780k8579O2854j3968
149A08864k71442K19577J40806k44947L8434r9464J18478J75514k66406k6437
159a07023R0940K9706J08774j97501p7207K75573p9824n2249J6099j40989J78325
170D4624K8995j73798O5219J1674k6543N6787n8757j349L8912n9757Q4034J4542
182B4583p4972M1504n3973O1988J02132j84979j7832J21117j1613K2202j15394
193h5237o1487J83157K1607r7235n7271Q200J82538m2444j51749N8187J5930J07200
$$ plain form
205 81396 62474 -121212 -36783 60677 7460 -7472 -56824 -40167 68500 -10044 -17679 3334
217 3334 -31357 56738 573 -2058 57011 -27513 -8728 84941 12829 -2301 12059 -50130
229 -50130 107399 49724 -81101 677 18969 90260 36130 -100416 -7811 110767 32245
240 32245 5369 -76625 -20074 167864 -19839 -66255 -8598 -547 83935 -15618 -106966 3213
252 3213 52596 -20852 -2515 -77580 -676 46153 -69263 9499 -30087 -30435 12576 -28448
264 -28448 -19950 12125 -58883 -40184 51027 -40798 -16948 -58880 -24387 75242 -34201 -59077
276 -59077 -39605 31302 52697 -24873 -97552 24251 77490 988 -16501 -86757 64356 81066
288 81066 -30471 -35590 -19739 69431 54071 -26140 -43959 52920 29910 28706 -7629 -36981
$$ packed form
205H1396j8922j83686Q4429R7460n3217j4932m9352J6657J08667p8544p635K1013
217C334l4691Q8095n6165k631N9069q4524J8785R3669p2112j5130J4360o2189
229e0130J57529n7675j30825Q1778J8292P1291n4130j36546R2605J18578p8522
240C2245k6876q1994N6551J87938j87703m6416N7657Q051Q4482r9553r1348J10179
252C213M9383p3448J8337p5065P6904M6829j15416P8762l9586l48M3011m1024
264b8448Q498L2075p1008J8699R1211r1825K3850m1932L4493R9629j09443k4876
276e9077J9472P0907K1395p7570p2679J21803N3239p6502j7489p0256J51113J6710
288H1066j11537n119J5851Q9170j5360q0211j7819R6879k3010j204l6335k9352
$$ plain form
300 -36981 77952 -1572 16384 23479 -12158 25796 18350 10763 31813 7346 -47238 59038
312 59038 15255 6319 -4057 -66846 70730 34898 -42192 -35814 -2717 45365 47488 -70851
324 -70851 -58175 72322 11612 13091 -71570 -44066 88410 -547 -53096 -40511 -6406 35392
336 35392 17528 -93431 -11290 37280 -16139 20264 -57074 1859 34236 -22425 4347 -1916
348 -1916 -21203 4003 4707 -22577 32072 -50741 -26677 48628 -6867 2855 -43625 -5622 64221
361 64221 27388 -39705 -19933 33384 64721 16046 -79109 14748 48731 28014 -11764 -76336
373 -76336 18623 66530 -4829 -48073 -12320 25245 53792 -12153 -43038 23956 16700 30731
385 30731 -22565 -35438 26689 -11161 -18600 1245 -39583 -27070 7493 -31680 7720 -14961
$$ packed form
300c6981J14933p9524J7956P095l5637L7954p446p587K1050k4467n4584J06276
312E9038m3783q936j0376o2789J37576l5832p7090O378L3097M8082K123j18339
324g0851J2676J30497o0710J479q4661K7504J32476q8957n2549J2585L4105M1798
336C5392j7864j10959Q2141M8570n3419L6403p7338N8933L2377n6661K6772o263
348a916j9287K5206P04k7284N4649q2813K4064P5305n5495R722m6480L8003O9843
361F4221l6833o7093J9772N3317L1337m8675r5155R3857L3983k0717l9778o4572
373g6336R4959M7907p1359m3244L5753L7565K8547o5945l0885O6994p256J4031
385C0731n3296j2873O2127l7850p439J9845m0828J2513L4563l9173L9400k2681
$$ plain form
397 -14961 -59475 12982 9789 1436 -29157 -54890 27822 33320 -45923 -47737 -39376 7802 44117
410 44117 -80423 -79348 23853 6891 -3345 -48561 -58195 46299 38444 -33097 -28166 -13892
422 -13892 40011 24696 -53654 -9049 11180 -7965 18489 -37694 -25464 35099 -21216 3282
434 3282 29038 -14928 10468 18792 15359 32813 -8998 -10713 38867 24342 15918 -34829 -32063
447 -32063 59785 12848 -34488 -22138 -923 47098 28740 -57227 -21642 58052 36082 4671
459 4671 -44364 3894 50105 3794 -20759 -44064 3690 38276 -22001 -55429 1774 -8108
471 -8108 -3963 12074 -39069 18224 12399 -5248 14597 -3026 2561 -4046 3390 25148 4906
484 4906 -46424 10300 6153 -4213 13138 -57939 18041 59382 -408 -23405 -3073 32610
$$ packed form
397a4961m4514P2457l193q353l0593k5733Q2712N498p9243j814Q361M7178L6315
410D4117j24540J075J03201j6962j0236m5216r634J04494p855p1541M931J4274
422a3892N3903j5315p8350M4605K0229j9145K6454n6183J2230O0563n6315K4498
434C282K5756m3966K5396Q324l433J7454m1811j715M9580j4525q424n0747K766
447c2063R1848m6937m7336J2350K1215M8021j8358q5967L5585P9694k1970l1411
459D671m9035M8258M6211m6311k4553k3305M7754L4586o0277l3428N7203r882
471h108M145J6037n1143N7293n825j7647J9845j7623N587o607P436K1758k0242
484D906n1330N6724m147j0366J7351p1077P5980M1341n9790k2997K0332L5683
$$ plain form
496 32610 54018 7038 -37873 33515 34587 34028 -22134 -47678 51161 27550 -4981 -10138 -5812
509 -5812 23989 52959 -14279 -7467 53236 14157 39603 5014 7669 26674 943 20172 12536
522 12536 2713 437 5191 -3135 41350 -15727 -31165 46980 21579 33071 -10350 -17701 36982
535 36982 45353 -2996 -36641 6903 41221 31540 -51547 -21469 8245 20175 26306 -55114 -7443
548 -7443 43637 23418 -17330 -7440 5541 29807 30101 -29998 7234 -79 14277 -1855 -25661
561 -25661 11833 -10972 -7651 10232 586 -22916 8690 -6405 16313 37665 -38014 2608
573 2608 17545 23387 1634 -39943 -243 31311 13701 -26186 -31300 -12103 49375 -8302 -47041
586 -47041 11458 12968 34376 -4939 -30450 7477 38984 8453 -15135 -4208 5811 26483
$$ packed form
496C2610K1408m6980m4911P1388J072n59n6162k5544R8839k3611l2531n157M326
509e812K9801K8970o7238O812O0703l9079K5446l4589K655J9005k5731J9229p636
522A2536r823k276M754q326M4485n7077j5438P8145k5401J1492m3421p351N4683
535C6982Q371m8349l3645M3544L4318r681q3087L0078K9714J1930O131q1420M7671
548g443N1080k0219m0748R890J2981K4266K94o0099L7232p313J4356j6132k3806
561b5661L7494k2805L321J7883r646k3502L1606j5095K2718K1352p5679M0622
573B608J4937N842k1753m1577L9700L1554j7610l9887n114J9197O1478n7677l8739
586d7041N8499J510K1408l9315k5511L7927L1507l0531k3588J0927J0019K0672
$$ plain form
598 26483 -18585 -6275 -143 -7503 17940 -10643 -5216 14526 -6457 -7326 29629 -2570 -9662
611 -9662 7612 -5315 30388 -11639 -30779 -3051 8977 18663 -27215 -42094 15997 24518 -19366
624 -19366 -20476 -29034 19098 40895 -35809 -31414 2620 17256 6059 -33509 -29484 10129 8332
637 8332 -18471 -27538 -24296 15707 -604 -28576 -1231 -7822 -5409 6328 -13012 -5618 6328
650 6328 -16983 3190 9408 -13223 -10634 -15264 10959 16545 -26293 -12141 7721 14229 17277
663 17277 -29803 -15436 39415 18306 -8563 -16891 -82 38016 15950 -28690 -8613 17749
675 17749 32096 4346 -33140 8378 24160 10879 -957 -12793 5375 29249 440 -9561
687 -9561 12339 -4636 11134 5970 -6698 7641 -11421 -233 12882 6 -9444 -10345 -8981
$$ packed form
598B6483m5068J2310O132p360K5443k8583N427J9742k0983q69L6955l2199p092
611i662J7274j2927L5703m2027j9140K7728J2028R686m5878j4879N8091Q521m3884
624a9366j110q558M8132K1797p6704M395L4034J4636j1197l9568M025L9613j797
637H332k6803r067L242M0003j6311k7972K7345o591K413J1737j9340P394J1946
650F328k3311K0173O218k2631K589m630K6223N586m2838J4152J9862O508L048
663A7277m7080J4367N4851k1109k6869q328J6809L8098k2066m4640K0077K6362
675A7749J4347k7750l7486M1518J5782j3281j1836j1836J8168K3874k8809j0001
687i561K1900j6975J5770n164j2668J4339j9062J1188J3115j2876r450r01J364
$$ plain form
700 -8981 25153 -616 -39506 2740 2354 16558 -7827 -42727 4061 24640 -116 -28239 -21891
713 -21891 5386 34222 -19154 -31890 -1705 7828 21096 -28281 -27274 11900 16968 -5879 -14538
726 -14538 -10042 6944 23134 -18153 967 1210 98 14370 -7671 8838 1536 -3629 4352
739 4352 18509 -1746 -5003 -1405 5496 35321 -15071 -8761 8060 21599 25210 -19240 -11254
752 -11254 20638 32759 -4747 -13739 -11386 28491 24020 -28407 -7968 -2751 27808 4714 -24811
765 -24811 -7510 12920 13636 -10089 -6810 -11195 21915 -5914 -12004 1033 -16973 6238 -9881
778 -9881 -6611 -6645 -11721 -13367 4517 2415 -15933 -4063 -17015 24728 1179 -25636 -5240 35
792 35 21553 -6936 -28635 -14095 24499 -299 -17726 -22762 -6466 34618 -12502 -17769 -8281
$$ packed form
700h981L4134k5769l8890M2246l86J4204k4385l4900M6788K0579k4756k8123O348
713b1891K7277K8836n3376j2736L0185R533J3268m9377J007L9174N068k2847q659
726a4538M496J6986J6190m1287J9120K43j112J4272k2041J6509p302n165P981
739D352J4157k0255l257L598O901K9825n0392O310J6821J3539L611m4450P986
752a1254L1892J2121l7506q992K353L9877m471n2427K0439N217L0559k3094k9525
765b4811J7301K0430P16k3725L279m385L3110k7829o090J3037j8006K3211j6119
778i881L270l4n076j646J7884k102j8348J1870j2952M1743k3549k6815K0396N275
792C5K1518k8489k1699J4540L8594k4798j7427n036J6296M1084m7120n267R488
$$ plain form
805 -8281 10760 23463 -8512 -17066 4651 20592 -5892 1549 -15398 1108 13290 -17421 928
818 928 -7379 -507 -2908 -1678 2014 3258 -6940 -2593 20805 -5438 -422 -14346 -440 23116
832 23116 -10490 -21897 -11889 12960 4741 -13061 -28889 3941 21420 -4393 -14540 -21530
844 -21530 22276 18273 -12597 -14905 -4184 17220 6655 -18034 -21017 10321 3406 -4481 -11444
857 -11444 -9066 11819 -3048 1474 -586 -763 6605 2639 1593 10618 -3616 -14337 12283 4804
871 4804 -4095 -6929 -16084 12201 11395 -13759 -15437 3091 22115 13568 -21454 -7052 20344 9457
885 9457 1722 -18381 -10371 28219 4052 -21938 -9132 -374 11304 281 -20582 306 11864
898 11864 4954 121 -8056 5628 13036 -1416 5999 4018 -8318 3018 -1928 359 4604 -12930
$$ packed form
805h281J9041J2703l1975q554K1717J5941k6484P441j6947J6506J2182l0711J8349
818I28q307O872k401J230L692J244j0198M347K3398k6243N016j3924J3906K3556
832B3116l3606j1407J0008K4849q219j7802j5828L2830J7479k5813j0147o990
844b1530M3806m003l0870k308J0721K1404j0565k4689k983L1338o915p887o963
857a1444K378K0885j4867M522k060j77P368l966j046R025j4234j0721K6620p479
871D804q899k834r155K8285q06k5154j678J8528J9024q547l5022J4402K7396j0887
885I457p735k0103Q010L8590k4167k5990J2806Q758J1678j1023k0863K0888J1558
898A1864o910m833q177J3684P408j4452P415j981j2336J1336m946K287M245j7534
$$ plain form
912 -12930 -10254 14456 7189 -8474 -8721 1426 25163 10370 -8607 -4599 12679 26992 -635
925 -635 -20967 935 23258 5562 -6670 -16268 646 24995 -3775 -10229 -1848 17593 16720
938 16720 -2897 942 7207 14830 10883 3814 -3759 12491 2016 -3727 11129 -8809 1319
951 1319 93 7558 10679 397 -1923 6590 19668 10405 4290 -8999 22928 20740 -8896 -3742
965 -3742 -8619 16737 15977 -11280 -18265 14078 15968 -2439 -5862 -12660 27497 10878 -2362 -2995
979 -2995 -3436 19353 1332 -11972 -3773 8428 -8590 2575 -7219 -12469 9588 -12297 3044
992 3044 1885 -1777 -5766 -1169 8672 469 -5395 -14177 13421 2050 -1099 -16173 -16321 18691
1006 18691 1553 -13650 -15899 9105 13534 3880 -15777 -10151 23118 11468 1354 -18455 8572
$$ packed form
912a2930K676K4710p267j5663k47J0147K3737j4793j8977M008J7278J4313k7627
925f35k0332K1902K2323j7696j2232r598J6914K4349k8770o454Q381J9441q73
938A6720j9617L839O265P623l947p069p573J6250j0475n743J4856j9938J0128
951A319j226P465L121j0282k320Q513J3078r263o115j3289L1927k188k9636N154
965c742m877K5356p60k7257o985L2343J890j8407l423o798M0157j6619j3240o33
979b995m41K2789j8021j3304Q199J2201j7018J1165r794n250K2057k1885J5341
992C044j159l662l989M597R841q203n864q782K7598j1371l149j5074j48L5012
1006A8691j7138j5203k249K5004M429r654j9657N626L3269j1650j0114j9809K7027
$$ plain form
1019 8572 17117 -748 -3788 -13881 9701 10831 621 -13526 4002 5227 1314 6166 -5592
1032 -5592 11337 -1711 7817 6682 -1333 3903 -6753 4086 8580 1391 -19557 1749 5124
1045 5124 7 -1995 -23030 6189 14240 -579 -16956 -9426 9039 10047 -7432 -22844 6899
1058 6899 1351 4909 -15133 -25033 10955 2448 -11633 -12733 -6165 -2060 6922 -13829 -11389 5828
1072 5828 -6561 3074 -8023 -4636 -2379 -9988 -1896 -1365 -6922 -10539 -2783 -3233 6941 -9718
1086 -9718 -17825 7646 8711 1194 -13871 -7999 8005 12015 -6433 -15556 1861 13660 9433
1099 9433 -16890 -7461 8744 9970 2927 -13428 -13 15042 8871 -6067 -3546 5952 12748
1112 12748 2098 -3772 3935 2439 7809 145 -2469 8697 539 -1221 8390 2232 -1862 26
$$ packed form
1019H572Q545j7865l040j0093K3582J130j0210j4147J7528J225l913M852j1758
1032e592J6929j3048R528j135q015N236j0656J0839M494p189k0948K1306L375
1045E124n117k002k1035K9219Q051j4819j6377P530J8465J008j7479j5412K9743
1058F899n548L558k0042r900L5988q507j4081j100O568M105Q982k0751K440J7217
1072E828j2389R635j1097L387K257p609Q092N31n557l617P756m50J0174j6659
1086i718q107K5471J065p517j5065N872J6004M010j8448r123J7417J1799m227
1099I433k6323R429J6205J226p043j6355J3415J5055o171j4938K521R498O796
1112A2748j0650n870P707j496N370p664k614J1166q158j760R611o158m094J888
$$ plain form
1126 26 -325 11542 4846 -10273 -1462 7522 9329 -670 -15604 1118 17131 477 -7180 -9673
1140 -9673 2259 14091 -5217 -18111 -404 7012 2533 -5257 -17872 2667 8135 -7336 -6155
1153 -6155 -7854 2972 3348 -8504 -6299 1265 -3729 -477 -1032 -7262 3999 -9432 -2348 5596
1167 5596 -2338 -5643 -4826 4784 7083 -86 -13074 4705 12167 5945 -3465 -11172 12967 13115 315
1182 315 -11754 -301 15061 11187 -3235 -11566 12232 12089 8177 -8139 -2402 16032 7477 5553
1196 5553 -5374 4341 7841 4210 -3392 418 4382 -2478 5030 -5794 5260 -3871 -5780 6069
1210 6069 -836 1317 -9893 -1450 4311 6561 -12796 -11012 1939 931 2208 -23477 -7559 5825
1224 5825 291 -10378 -17080 -2536 6089 1041 -21071 -3902 963 2802 -2407 -20263 499
$$ packed form
1126B6l51J1867o696j5119Q811Q984J807r999j4934J6722J6013j6654p657k493
1140i673J1932J1832j9308j2894J7707P416m479p790j2615K0539N468j5471J181
1153f155j699J0826L76j1852K205P564m994L252n55o230J1261j3431P084P944
1167E596p934l305Q17R610K299p169j2988J7779P462o222r410p707K4139J48j2800
1182C15j2069J1453J5362l874j4422q331K3798j43l912j6316N737J8434q555j924
1196E553j0927R715L500l631p602L810L964o860P508j0824J1054r131j909J1849
1210F069o905K153j1210Q443N761K250j9357J784J2951j008J277k5685J5918J3384
1224E825n534j0669o702J4544Q625n048k2112J7169M865J839n209j7856K0762
$$ plain form
1237 499 1155 -1625 -9415 -7586 -3162 1899 -2910 -9305 4594 -8108 4385 310 -409 4544 -6581
1252 -6581 2413 7969 7870 -6610 -622 2773 11420 4472 -14358 3428 7150 14556 -4150 -10229
1266 -10229 7743 16786 9764 -8902 1903 7977 17311 -2976 -10165 3472 6153 7516 -11173
1279 -11173 -4604 1620 4949 -1684 -6612 -1150 2101 5001 -7851 4277 -2564 -2720 272 -5226
1293 -5226 1969 -8630 -8100 -5189 -710 -6418 -11122 -9932 1265 6743 -14412 -6327 -2307 7927
1307 7927 7849 -13704 -8672 8032 11302 -6320 -7927 -6042 12041 5884 -11643 -2712 238 10859
1321 10859 3514 -7331 3517 11703 7238 4300 5492 2156 12747 3858 2061 8886 1027 4532
1335 4532 5480 5958 5430 658 -743 11658 8670 -456 1436 1983 16474 8248 -8565 456 10621
$$ packed form
1237D99O56k780p790J829M424N061m809o395J3899j2702J2493m075p19M953j1125
1252f581Q994N556r9j4480N988L395Q647o948j8830J7786L722P406j8706o079
1266a0229J7972R043p022j8666J0805O074R334k0287p189J3637K681J363j8689
1279a1173O569O224L329o633m928N462L251K900j2852J2128o841j56K992n498
1293e226P195j0599N30K911M479n708m704J190J1197N478k1155Q085M020J0234
1307G927p8k1553N032J6704L270j7622j607J885J8083o157j7527Q931K950J0621
1321A0859p345j0845J0848Q186m465k938J192l336J0591q889j797O825p859L505
1335D532R48M78n28m772j401J2401k988r126J892N47J4491q226j6813R021J0165
$$ plain form
1350 10621 9692 -2486 -11383 -4099 10391 3616 -9291 -9642 3207 11397 -1831 -9401 -2385 6896
1364 6896 7193 -2606 -7954 1550 5284 -2042 -5797 -4396 -438 -2011 -1650 -969 -1118 -2189 605 -358
1380 -358 7025 1029 -6280 5943 9559 3892 -2459 -5010 5456 12266 -879 -10108 47 7334
1394 7334 10284 -7712 -7037 9295 10135 7032 -6605 -4441 11942 13227 -5766 -2772 3504 5147
1408 5147 7644 -9159 -3780 1870 2025 -1105 -3235 -925 724 2003 -2787 5889 -3599 -937 2719
1423 2719 -1760 4639 -6683 -6895 2603 4960 -6702 -8801 -3492 2885 6954 -11283 -5686 -326
1437 -326 10089 1785 -12658 603 7599 8961 -5140 -4597 -1934 9352 4006 -11307 -1564 2615
1451 2615 7226 -4951 -2171 1866 3847 5907 -3809 950 1109 4588 -2635 3544 2939 -4805 1165
$$ packed form
1350A0621r29j2178q897P284J4490o775j2907l51J2849Q190j3228p570P016R281
1364F896K97r799n348R504L734p326l755J401L958j573L61O81j49j071K794r63
1380c58P383n996p309J2223L616n667o351k551J0466O810j3145r229J0155P287
1394G334K950j7996O75J6332Q40l103j3637K164J6383J285j8993K994O276J643
1408E147K497j6803N379N650J55l130k130K310J649J279m790Q676r488K662L656
1423B719m479O399j1322k12R498K357j1662k099N309O377M069j8237N597N360
1437c26J0415q304j4443J3261O996J362j4101N43K663J1286n346j5313R743M179
1451B615M611j2177K780M037J981K060r716M759J59L479p223O179o05p744N970
$$ plain form
1466 1165 -2813 4628 -2071 -5816 -5142 4913 5322 -7836 -6495 -1813 13454 -3972 -6688 -4132
1480 -4132 3364 11009 -8401 -11471 -1930 8922 -1431 -8068 -8227 345 8572 -8637 -4035 -4692
1494 -4692 5494 4616 -6724 -2334 658 1233 -1933 1219 -5736 2993 -588 -5319 4546 -3489 -1397
1509 -1397 -4533 4469 1921 -3152 -5360 1822 7267 -1785 -2741 -8844 7492 7981 -6238 -6474 -2191
1524 -2191 9215 2048 -5801 -9018 6395 8239 -3625 -6735 -4770 9794 1754 -3190 -4406 670
1538 670 7390 -240 -3449 -1699 3835 -998 -680 -1376 -457 -154 -2055 4513 807 1210 -2582 1368
1554 1368 5971 2973 -3567 -3203 9116 2853 1441 -6687 -2256 12715 2237 -4592 -6740 6268
1568 6268 9802 273 -8512 -1788 5837 5829 -2512 -9489 4609 7803 -3063 -4115 -2772 4108 4178 -2043
$$ packed form
1466A165l978P441o699l745O74J0055M09j3158J341M682J5267j7426k716K556
1480d132P496P645j9410l070R541J0852j0353o637j59Q572Q227j7209M602o57
1494d692J0186q78j1340M390K992N75l166L152o955Q729l581m731R865q035K092
1509a397l136R002k548n073k208P182N445r052r56o103J6336M89j4219k36M283
1524b191J1406p167p849l217J5413J844j1864l110J965J4564q040m944j216N076
1538F70O720p630l209J750N534m833L18o96R19L03j901O568l706M03l792L950
1554A368M603k998o540L64J2319o263j412q128M431J4971j0478o829k148J3008
1568F268L534r529q785O724P625qq341o977J4098L194j0866j052J343O880P0o221
$$ plain form
1584 -2043 -5162 2185 6 -1077 -1429 -2191 -536 -3502 -2461 1560 -2011 -4412 -2726 -312 3813
1599 3813 -1185 -9245 -1227 3468 569 -5325 -8476 705 6266 -2781 -8760 -3479 5019 6625 -5230
1614 -5230 -6247 2536 7003 1936 -4099 -3977 7295 7001 -2772 -940 1640 6148 3545 -463 2024
1629 2024 1740 4842 2127 2674 3006 2883 441 4070 7664 1109 625 430 9119 4853 -3296 -3284 4432
1646 4432 8228 -411 -6866 -5614 8898 5075 -5860 -6131 -1450 10346 -1560 -7544 -4283 2719
1660 2719 4147 -5351 -9494 -5651 4981 -5858 -6670 -9946 -3087 662 -8148 -4526 -5134 -2280 -4010
1675 -4010 -2023 -5774 -1930 -3673 -7371 1682 -4828 -3465 -7111 -2920 2977 -2812 -7559 -5931 8180
1690 8180 84 -668 -7806 2081 12692 687 -786 -4416 8426 7958 825 -6927 1184 11836
$$ packed form
1584b043l119P347k179j083l52p62J655k966J041M021l571k401J686K414M125
1599C813m998q060Q018M695k899n894l151R181N561r047n979N281Q498J606j1855
1614e230j017Q783M467n067o035J22J1272k94r773J832K580M508k603m008K487
1629B024k84L102k715N47L32j23k442L629L594o555m84j95Q689m266q149J2P716
1646D432L796q639o455J252J4512l823j0935k71M681J1796j1906n984L261P002
1660B719J428r498m143L843J0632j0839q12l276O859L749q810L622o08K854j730
1675d010J987l751L844j743l698R053o510J363l646M191N897n789m747J628J4111
1690H180q096p52p138R887J0611j2005j473l630J2842m68p133p752Q111J0652
$$ plain form
1704 11836 3711 1266 -5488 7684 7910 1453 3198 1514 9247 4685 5011 416 5734 3228 3228 4972
1720 4972 1528 4354 -5180 3618 3136 1013 -1836 -3986 6065 3259 -58 -8375 1831 5139 748
1735 748 -7920 -9745 4850 255 -2758 -11364 -4912 4406 591 -8753 -10804 1531 586 -245 -10171
1750 -10171 -3535 3913 -1642 -2739 -7736 38 -779 -1859 -4839 -1818 -892 -4158 1350 -2929 2881
1765 2881 -2208 -2699 4544 4095 1065 -3225 3208 6314 6785 -3875 -2262 5928 6796 3621 -6857
1780 -6857 2626 9168 6642 -1506 -2745 6057 8886 6167 -4969 3562 6784 6916 928 -3526 4525
1795 4525 4807 3434 -1789 272 2306 3890 519 229 3485 -246 2644 2272 2903 1768 -2401 1185
1811 1185 4177 1955 -4779 -4193 2188 3891 -3526 -8264 -1757 3251 4230 -5829 -8107 2836 6075
$$ packed form
1704A1836q125k445o754J3172K26o457J745j684P733m562L26m595N318k506%J744
1720D972l444K826r534Q798m82k123k849k150J0051k806l317q317J0206L308m391
1735G48q668j825J4595m595l013q606O452R318l815r344k051J2335r45q31r926
1750a0171O636P448n555j097m997P774q17j080k980L021R26l266N508m279N810
1765B881n089m91P243m49l030m290O433L106M71j0660J613Q190Q68l175j0478
1780f857R483O542k526q148j239Q802K829k719j1136Q531L222J32n988m454Q051
1795D525K82j373n223K061K034J584l371k90L256l731K890l72O31j135m169L586
1811A185K992k222o734N86O381J703p417m738O507N008R79j0059k278J0943L239
$$ plain form
1826 6075 -203 -6437 -3548 3741 4777 -5164 -7351 -538 3318 420 -6620 -4817 1547 11 -2321
1841 -2321 -3149 -1098 3099 -49 -1707 1965 109 -1124 866 882 1991 -1134 -4795 1805 1566 413
1857 413 -4110 -3926 6465 5012 -3072 -3905 4092 7039 4195 -3538 -4143 7234 4633 440 -6282
1872 -6282 601 6116 1088 -3978 -3573 4781 3952 1691 -7120 1346 5342 -1915 1849 -2058 1609
1887 1609 765 -1506 -3454 -374 -1131 -3559 1085 -1755 807 -6080 -1942 1990 -19 -1953 -6939
1902 -6939 256 1714 1171 -8306 -3777 3897 2621 -1977 -9329 1900 2928 2440 -6502 -6316 4480
1917 4480 4209 854 -5757 1771 2864 4099 -1033 -3872 3939 -88 1464 -3151 881 882 -581 -59
1933 -59 335 2898 -2335 1220 -429 6074 559 -4356 4144 1668 3864 -4979 -1523 3255 7241 -2099
$$ packed form
1826F075o278o234K889P289J036r941k187O813L856k898p040J803O364j536k332
1841b321q28K051M197l148j658L672j856j233J990J6J109l125l661O600k39j153
1857D13m523J84J0391j453q084q33P997K947k844p733o05J1377k601m193o722
1872f282O883N515n028n066M05Q354q29k261q811Q466L996p257L764l907L667
1887A609q44k271j948L080p57k428M644k840K562o887M138L932k009j934m986
1902f939P195J458n43r477M529P674j276m598p352J1229J028m88q942J86J0796
1917D480k71l355o611P528J093J235n132k839P811m027J552m615M032Jj463N22
1933e9L94K563n233L555j649O503n515m915Q500k476K196q843L456M778L986r340
$$ plain form
1949 -2099 -6741 1411 2619 5581 -7723 -3312 2883 3775 914 -7327 -340 2863 5882 -6951 -4515
1964 -4515 563 1632 1341 -7245 -1135 -991 324 -2374 -2709 -1351 13 -473 -3252 2275 -4422 -2141
1980 -2141 -359 -136 2450 -5315 -1634 852 4404 -2898 -4369 -498 3641 4029 -5522 -1242 254
1995 254 7389 -113 -5029 -105 4403 6623 -4079 -1093 1981 7618 2781 -2673 2206 2846 7434
2010 7434 -1523 1243 2665 3030 3128 670 1761 963 3265 -1212 3774 1333 -956 1025 965 4816
2026 4816 -1934 -2818 -818 3323 1768 -4206 -5061 -9 5126 -4478 -5779 -3843 1237 3392 -6329
2041 -6329 -7632 -726 3447 -2150 -7134 -6574 1170 2791 -4767 -5839 -3270 556 -984 -4782 -5170
2056 -5170 261 -687 -1420 -1118 -856 468 -1138 -568 1427 83 -1798 549 2719 2634 -1189 -2726 3384
$$ packed form
1949b099m642Q152J208K962j3304M411O195Q92k861q241O987L203L019j2833K436
1964d515N078J069k91q586O110J44J315k698l35J358J364m86k779N527o697K281
1980b141J782K23K586p765L681K486L552p302j471L871M139L88r551M280J496
1995B54P135p502m916M924M508K220j0702K986L074N637m837n454M879O40M588
2010G434q957K766J422L65R8k458J091p98K302m477M986k441k289J981o0L851
2026D816o750q84K000M141j555n974q55N052N135r604j301J936N080K155r721
2041f329j303O906M173n597m984N60P744J621p558j072K569L826j540l798l88
2056e170N431r48p33L02K62J324j606N70J995j344j881K347K170q5l823j537O110
$$ plain form
2073 3384 4436 1212 -2589 401 6663 6474 266 -2494 4206 8156 4258 -2336 -480 5183 7224
2088 7224 994 -4422 2740 4774 2683 -896 354 2813 4742 2203 -2302 2588 1701 1533 -18
2103 -18 -415 947 -1085 -1658 -130 1825 -4187 -2727 -3106 1323 -567 -8274 -1616 -477 2208 -4837
2119 -4837 -6916 -1606 3022 71 -7192 -3724 -598 2414 -5065 -7374 -1956 945 1160 -6667 -4902
2134 -4902 -511 3258 -2771 -4223 -505 -272 2663 -3745 -777 226 1448 -418 -1627 1420 -2120
2149 -2120 414 -1431 3105 997 -961 1739 2607 5964 -1821 -325 1650 6770 3416 -1732 92
2164 92 3046 8064 -1436 -1478 506 5374 4538 -2585 -1372 1169 7055 630 -884 489 4199 3165
2180 3165 -2093 159 -2006 5203 515 -1170 27 -417 702 -3215 1985 -1211 43 -2301 227
$$ packed form
2073C384J052l224l801K990O262j89o208k760O700L950l898o594J856N663K041
2088G224o230n416P162K034k091l579J250K459J929k539m505M890q87j68j551
2103a8l97J362k032n73J528J955o012J460l79M429j890p707O658J139K685p045
2119d837k079N310M628k951p263L468L126L012p479k309N418K901K15p827J765
2134d902M391L769o029j452L718K33K935o408K968J003J222j866j209L047l540
2149b120K534j845M536k108j958K700Q68L357p785J496J975N120l354n148J824
2164I2K954N018r500m2J984M868q36p123J213K541N886o425j514J373L710j034
2180C165n258K252k165P209m688j685J197m44J119l917N200l196J254k344K528
$$ plain form
2195 227 1841 -2089 -434 -3236 2628 -1451 -4358 -5010 -386 2455 -4968 -4739 -4824 4458 -718 -3920
2211 -3920 -4148 -1606 5089 -2296 -3222 -2625 3219 1580 -2077 -2804 -777 4471 -3293 -2584 -2474 1732
2227 1732 1966 -865 -25 623 3850 -396 3557 1827 3737 1002 -1126 4842 1227 76 -294 3502
2243 3502 5104 2382 -738 182 7080 2976 596 -3560 4184 5742 1389 -2515 -1995 5437 3504
2258 3504 -350 -2605 193 4583 130 -742 -3101 1987 1867 311 -2398 -1266 1050 -1595 -748 -1104
2274 -1104 -549 -2111 -220 -929 -568 -1186 -3999 294 1219 -1813 -3876 -3308 1908 1126 -2328 -4336 -35
2291 -35 1484 990 -4970 -2929 3400 725 -1992 -3642 -362 4098 1983 -4609 -661 3236 2174 1364
2307 1364 -1973 700 4641 1014 -1431 -491 1292 3098 -250 -1868 1551 -725 -618 746 2190
$$ packed form
2195B27J614l930J655k802N864m079k907o52M624K841p423K29q5R282n176l202
2211c920k28K542O695p385r26N97N844j639l657p27K027N248p764P09J10M206
2227A732K34k831Q40O48L227m246L953j730J910k735k128N968l615j151l70L796
2243C502J602k722l120R20O898m104k380m156P744J558m353l904N20P432j933
2258C504l854k255K798M390m453q72k359N088j20j556k709J132K316k645Q47l56
2274a104N55j562J891p09L61o18k813M293R25l032k063N68N216p82l454k008M301
2291c5J519m94n960K041O329k675k717j650L280M460k115o592L948L897j062q10
2307A364l337K673L941l627k445R40J783J806l348j618L419k276J07J364J444
$$ plain form
2322 2190 880 180 -528 3053 1446 -1300 -1884 1212 3157 188 -3693 -2702 369 2694 -3167 -4475
2338 -4475 -2172 3055 -134 -6164 -2997 249 3780 -2932 -2953 -3114 1783 1494 -3745 -1127 -566 8
2354 8 -2670 -2693 -2291 -681 -1543 -2702 -648 -1535 345 -1753 -68 526 -1513 -769 -367 2807 158 -509
2372 -509 -3159 2805 4980 -1727 -838 -459 5291 2332 -845 -2403 3429 3884 -260 -663 -938 5740
2388 5740 2437 -1428 -1306 1638 3077 516 -1652 -2355 4836 -26 -473 -1137 -267 1189 -747 -463
2404 -463 -2140 890 -2261 -527 -603 -247 -937 -3724 1012 -330 -621 -3295 -2461 3105 -177 -1980 -5935
2421 -5935 1662 324 -1639 -3759 -2273 2945 -694 -1751 -4082 -198 2259 -1182 -2851 -2108 2048
2436 2048 1056 -536 -3381 550 1299 283 510 -2252 2540 -1676 1708 -458 1825 417 -807 1915
$$ packed form
2322B190j310p00p08L581j607k746n84L096J945k969l881R91L071K325n861j308
2338d475K303N227l189o030L167L246L531o712k1j61M897k89n239K618N61N74
2354Hk678k3M02J610q62j159K054q87J880k098J685N94k039P44M02L174k649o67
2372e09k650N964K175o707Q89L79N750k959l177j558N832M55m144m03k75O678
2388E740l303l865J22K944J439k561k168p03P191m862m47o64Q70J456j936K84
2404d63j677L030l151J734p6L56o90k787M736j342k91k674Q34N566l282j803l955
2421e935P597j338j963k120J486N218l639j057k331L884K457l441j669P43M156
2436B048r92j592k845L931P49j016K27k762M792m216L384k166K283j408j224K722
$$ plain form
2452 1915 -363 2328 -3268 203 1714 570 -621 -2297 2157 2450 1661 -1025 -82 2528 3002 264
2468 264 -2857 3226 850 508 -1673 -1946 3796 2324 -1565 -4115 640 1206 2694 -2537 -1043 1441
2484 1441 -332 1838 -2934 186 -2143 -677 -1664 -703 -1240 -3182 442 46 487 -1754 -1882 -929 342
2501 342 -790 -3759 -2670 877 2003 -2669 -2642 862 348 -432 -4520 -2544 2100 1930 -983 -2612
2517 -2612 147 2138 1953 -3331 -2142 2452 1078 -73 -2810 502 710 -408 -62 478 657 -101
2533 -101 953 1133 1780 684 -533 547 1048 1618 -1236 -612 3131 2447 95 -1285 243 3623 543
2550 543 -1755 -209 3335 1790 -713 -2436 268 4329 196 -170 -3413 -142 2846 -445 -1924
2565 -1924 74 1316 133 -290 -1984 628 -15 -1237 759 106 284 -2733 -438 -173 -704 -538 -1267
$$ packed form
2452A915k278K691n596L471J511j144j191j676M454K93p89k686R43K610M74k738
2468B64l121O083k376l42k181k73N742j472l889k550M755N66J488n231J494K484
2484A441j773K170m772L120k329J466r87R61n37j942L624l96M41k241j28R53J271
2501C42j132k969J089L547J126m672K7L504n14p80m088J976M644j70k913j629
2517b612K759J991j85n284J189M594j374j151k737L312K08j118L46N40J79p58
2533a01J054J80O47j096j217J080N01N70k854O24L743o84k352j380J528L380l080
2550E43k298J546L544j545k503j723K704M061m133l66l243L271K988l291j479
2565a924J998J242j183m23j694K612o43j222J996o53J78l017K295K65n31J66p29
$$ plain form
2582 -1267 1190 1573 618 -4231 -305 1184 -354 -2082 -2737 1888 1343 74 -4018 219 2850 1412
2598 1412 -1384 -1455 1303 1379 652 -1745 239 2138 1111 -756 -1960 1339 2011 1564 -1746 -952 1789
2615 1789 -597 1133 -874 2092 223 306 195 884 855 -2650 1111 418 1512 -1403 -1452 1113 859
2632 859 565 -3662 808 646 1962 -2504 -3094 1343 1276 1563 -3746 797 859 1914 -1672 -2918 2005
2649 2005 642 1251 -1914 1154 758 1699 666 -2861 2940 -1574 713 -503 687 908 281 1010
2665 1010 317 2102 -2948 1537 201 2082 1254 -3319 449 675 3741 -1720 -1658 409 2444 1084
2681 1084 -4048 -274 1170 2727 -1799 -2160 951 2297 854 -3497 302 294 3120 -1229 -889 229
2697 229 51 1680 -1574 -248 -327 889 -1350 -115 819 -955 336 -1317 762 -1387 -68 -1803
$$ packed form
2582a267K457L83r55m849L926J489j538j728o55M625n45j269m092M237K631j438
2598A412k796p1K758P6p27k397J984J899j027j867j204L299O72m47l310P94K741
2615A789k386J730k007K966j869Q3j11O89k9l505L761o93J094k915m9K565k54
2632H59k94m227M470j62J316m466n90M437o7K87n309M543O2J055l586j246M923
2649B005j363O09l165L068l96R41j033l527N801m514K287j216J190K21o27P29
2665A010o93J785n050M485j336J881q28m573L768K26L066n461O2K067K035j360
2681A084n132L774J444J557m526l61L111J346j443m351L799qK826m349L40J118
2697B29j78J629l254J326p9J216k239J235R34j774J291j653K079k149J319j735
$$ plain form
2713 -1803 624 1949 -2268 -1318 76 2381 -497 -2841 -1375 797 2004 -1883 -1424 -70 2808
2728 2808 263 -2240 -180 676 2476 -1415 -1287 -875 1844 339 -1010 -665 -234 1678 -219 -186 266
2745 266 31 667 889 786 1226 195 -295 2277 743 -284 -147 54 2442 1517 -1245 -636 2025 1837
2763 1837 -499 -1237 -8 3365 549 -1246 -1237 580 2341 156 -1915 81 1385 780 -1300 -2134
2779 -2134 364 1544 -1246 -1726 -595 83 -1460 -1711 -433 242 -1272 -954 -1553 131 -1023 -3191
2795 -3191 -50 102 -170 -2796 -1613 483 606 -1833 -2707 -942 755 1580 -2468 -1302 1136 949
2811 949 -393 -2128 -433 1247 2785 -1673 -955 1449 2299 797 -1157 552 925 1786 -378 -63
2827 -63 2113 716 1197 -423 1660 -482 97 1392 942 1733 -451 1624 776 2556 315 -451 1054
$$ packed form
2713a803K427J325m217R50J394K305k878k344J466K172J207l887M59J354K878
2728B808k545k503K060Q56J800l891J28M12K719j505j349L45M31J912j897L3M52
2745B66k35O36K22j03M40j031m90K572j534j027J37K01K388r25k762O09K661j88
2763A837k336p38J229L373k816j795RJ817J761k185k071J996J304o05k080q34
2779b134K498J180k790m80J131O78j543k51J278O75j514L18n99J684j154k168
2795c191L141J52k72k626J183K096J23k439q74J765J697Q25m048J166K438j87
2811I49j342j735J695J680J538m458P18K404Q50j502j954J709L73Q61k164L15
2827f3K176j397M81j620K083k142N79J295m50P91k184K075q48J780k241p66J505
$$ plain form
2844 1054 1982 2390 -2317 -244 -296 2259 -66 -1281 -426 1160 1652 -2663 -377 -446 684 154 -2003
2861 -2003 -796 181 1461 -2874 -529 -1009 305 409 -1967 -188 -1560 486 -2186 191 -1115 -120
2877 -120 -757 -906 1517 -1083 -286 -2574 1361 1189 -1453 -466 -1222 3189 -408 -390 -1241 1748 2121 -1419
2895 -1419 -779 -93 3604 -193 -483 -803 1396 2743 -1027 364 -455 2690 296 408 209 1367 1807
2912 1807 -888 1437 -453 2586 163 1014 2178 411 626 -691 2092 385 441 -1487 27 2141
2928 2141 -809 -440 -967 2374 952 -516 -1754 637 2276 -625 -1550 -2807 1188 136 -927 -1180
2944 -1180 -2051 1635 -387 -928 -2089 50 337 -1384 -1480 -1101 1356 -1764 534 -694 -504 -493 -143
2961 -143 322 -199 -94 -1261 1024 661 288 36 -641 1453 1356 -292 -2400 1191 1788 1354 -870 -1380
$$ packed form
2844A054R28M08m707K073n2K555k325j215Q55J586M92m315K286o9J130n30k157
2861b003J207R77J280m335K345m80J314J04k376J779j372K046k672K377j306R95
2877a20o37j49K423k600P97k288L935j72k642R87p56M411l597J8q51K989L73l540
2895a419O40O86L697l797k90l20K199J347l770J391q19L145k394J12j99J158M40
2912A807k695K325j890L039k423Q51J164j767K15j317K783j707N6j928J514K114
2928B141k950L69n27L341j422j468j238K391J639k901r25j257L995j052j063k53
2944a180q71L686k022n41j161K139K87j721r6L79K457l120K298j228J90J1L50
2961a43M65n21J05j167K285l63l73k52o77K094r7j648k108L591N97m34k224n10
$$ plain form
2979 -1380 2645 2084 -174 -1420 725 2089 1657 -1090 -1606 2131 1921 540 -1161 457 980 693
2995 693 -341 -279 1858 873 1523 -236 -581 293 -1140 -11 69 1157 -1421 967 1011 1521 -20 -847
3013 -847 -747 521 375 -2327 -2006 307 2406 -1573 -1737 234 1684 800 -645 -2094 -683 1996
3029 1996 1056 -1692 149 932 2159 -1101 -98 -120 2103 -486 -1021 320 -1268 -233 -778 1125
3045 1125 236 1126 243 1621 1511 -32 -673 29 2269 621 -307 -740 504 2753 -29 -704 -202
3062 -202 1503 1232 -237 -1888 579 3404 -1030 -65 -2243 1837 1895 -1212 -1464 -9 765 -1210 -1400
3079 -1400 -1785 480 785 -608 889 -219 246 -1045 -55 -1510 280 -164 -1806 1244 -1120 -43
3095 -43 -1570 1380 689 902 -1683 -1256 2432 80 353 -1907 -200 1451 -864 177 -2029 1784
$$ packed form
2979a380M025n61k258j246K145J364m32k747n16L737k10j381j701J618N23k87
2995F93j034O2K137r85O50j759l45Q74j433J129Q0J088k578K388M4N10j541q27
3013h47J00J268j46k702L21K313K099l979j64J971J450q84j445j449J411K679
3029A996r40k748J841P83J227l260J003k2K223k589n35J341j588J035n45J903
3045A125q89Q90q83J378j10j543o41P02K240j648r28m33J244K249k782o75N02
3062b02J705k71j469j651K467K825m434R65k178M080N8l107k52J455P74j975j90
3079a400l85K265L05j393J497j108M65j291R90j455J790m44j642L050k364J077
3095d3j527K950o91K13k585M27L688k352K73k260J707J651k315J041k206L813
$$ plain form
3111 1784 1028 -255 -899 1381 1982 683 946 -1685 2035 613 225 131 429 1452 -246 604 -1360
3128 -1360 1355 1095 430 518 -107 117 -1508 1178 -10 956 -4 164 3119 -1178 188 -3103 1811
3145 1811 124 195 -824 -680 2811 -201 269 -2582 1561 2360 -699 -2090 -2015 1089 -772 76 -2281
3162 -2281 833 771 314 789 -2093 950 300 -445 -2583 -869 -339 31 646 -948 676 -1160 -215
3179 -215 1367 -636 -148 -763 133 732 1204 -2165 -183 776 842 -105 -2442 1121 2186 2969 -1014 -1074
3197 -1074 1997 2515 -201 -1111 1914 1002 2137 122 -115 1403 1809 1048 -1575 188 1417 1894 -137
3214 -137 763 1250 77 -111 343 1255 242 -280 -942 1091 78 -1076 -296 178 720 -405 -1006 -896
3232 -896 945 263 -1919 -384 -220 892 -1693 -2163 -2416 -1044 748 -1552 -2503 246 188 -1057 -1497
$$ packed form
3111A784p56j283o44K280O01j299K63k631L720j422l88r4K98J023j698Q50j964
3128a360K715k60o65Q8o25K24j625K686j188R66r60J68K955m297J366l291M914
3145A811j687P1j019J44L491l012M70k851M143P99l059j391P5L104j861Q48k357
3162b281L114o2m57M75k882L043o50p45k138J714N30L70O15j594J624j836R45
3179b15J582k003M88o15Q96N99M72l369J982R59O6r47k337L563J065P83l983o0
3197a074L071N18k716r10L025r12J135k015k37J518M06p61k623J763J229M77k031
3214a37R00M87j173j88M54R12j013n22o62K033j013j154P80M74N42j125o01J10
3232h96J841o82k182J535J64J112k585m70k53J372J792k300r51K749n8j245m40
$$ plain form
3249 -1497 -423 113 700 -987 -821 -863 -1179 424 -1339 -257 203 449 -695 -240 519 -741 -903 1164
3267 1164 598 360 -604 102 1506 1031 -405 -1122 142 1316 601 -376 -1213 2420 1660 307 -1012
3284 -1012 1323 2602 381 -554 -1336 2122 533 1242 -485 575 1559 297 449 -688 60 -651 332
3301 332 -270 603 -1257 -1040 1560 -398 423 -1586 56 302 224 -819 -2054 -377 -741 313 -2411
3318 -2411 -665 469 33 -1564 -3114 -1264 -454 -601 -2006 -1614 1257 65 -390 -2408 641 -255
3334 -255 576 -1860 -1042 772 -138 -980 -1532 825 -1381 -698 -1306 189 796 -390 1185 565 1615
3351 1615 849 249 1389 438 1807 -369 1279 428 2936 -321 197 1775 521 1579 -635 966
3367 966 1641 2322 397 -1547 37 1287 1015 -1874 176 414 754 445 -790 -307 379 1084 -954
$$ packed form
3249a497J074N36N87j687J66m2l16J603j763J082M60K46j144M55P59j260j62K067
3267A164n66k38r64P06J404m75j436p17J264J174p15r77q37L633p60j353j319
3284a012K335J279k221r35p82L458j589P09j727J060R84j262J52j137P48p11R83
3301C32o02Q73j860K17K600j958Q21k009J642K46p8j043j235J677l64J054k724
3318b411J746J134m36j597j550J850Q10j47j405L92K871j192m55k018L049q96
3334b55Q31k436Q18J814r10q42n52K357k206O83o08J495O07j186J575o20J050
3351A615p66o00J140r51J369k176J648q51K508l257N18J578j254J058k214J601
3367I66O75O81j925j944J584J250k72k889K050K38L40l09j235M83O86P05k038
$$ plain form
3384 -954 380 -739 -414 -1252 -1446 434 -1580 -144 -1069 430 351 -1209 -546 -318 -26 -1776 -732
3401 -732 -1781 427 -405 -2439 -491 822 1471 -1104 -1300 -15 1049 289 -2201 -685 -570 933
3417 933 -719 318 -434 536 1040 -74 -2 214 1217 -575 1563 496 -320 983 -412 1044 731
3434 731 -445 596 464 1357 -926 -942 100 1517 854 -49 -1298 29 1874 -1198 -1448 31 1403
3451 1403 8 -1079 -1800 -92 2337 -1024 -966 -1106 975 1544 -697 -1529 -868 437 -663 -346 -912
3468 -912 166 231 489 -37 -400 -491 -917 244 -16 -1136 -72 362 1096 -327 -846 -1292 833 1006 32
3487 32 -1093 -852 563 873 -947 -1476 1164 1598 1248 -978 -253 1912 307 -604 -1090 92 1936
3504 1936 14 179 -192 991 787 -1382 -211 1399 350 149 -212 135 765 585 592 -421 1184 -515
$$ packed form
3384i54J334j119L25q38j94J880k014J436r25J499p9j560O63K28K92j750J044
3401g32j049K208q32k034J948J313O49k575j96J285J064p60k490J516J15J503
3417I33j652J037p52R70N04j114P2K16J003j792K138j067q16J303j395J456l13
3434G31j176J041j32Q93k283j6J042J417o63r03j249J327J845l072k50J479J372
3451A403j395j087p21J708K429l361N8j40K081N69k241q32O61J305j100L17n66
3468i12J078O5K58n26l63r1m26J161k60j120J064M34P34j423n19m46K125J73r74
3487C2j125K41J415L10j820n29K640M34l50k226P25K165j605r11m86J182J844
3504A936j922J65l71J183k04k169J171J610j049k01l61L47O30j80Pj013J605j699
$$ plain form
3522 -515 -1053 -204 25 -245 -2514 -712 200 725 -1527 -1805 -730 -155 -988 -1633 -556 1073 605 -1807
3540 -1807 -1444 148 -109 128 -1488 -457 -794 1112 -1215 -1187 -105 -658 315 -1070 -515 -714 375
3557 375 -551 -244 276 -741 430 -155 1554 -363 -397 797 599 1375 -340 -486 274 2304 -228 -486
3575 -486 98 1559 2420 -1411 -189 20 1687 758 -1445 486 765 2128 -187 67 -531 1036 703
3592 703 -776 262 77 1065 -340 387 -93 113 246 -881 329 -988 -80 -1151 -143 564 -1606
3609 -1606 -92 -770 1319 -1408 -1675 -1271 313 1061 -1319 -559 -1336 1207 -514 -1277 -855 -348 446
3626 446 -357 -1505 -533 1510 -925 -774 -489 138 1968 281 430 -658 757 265 -340 -323 60 -59
3644 -59 101 727 935 1103 729 546 2120 512 128 -80 1490 739 85 -590 544 3113 554 -674
$$ packed form
3522e15n38Q49K29k70k269J802R12N25k252k78J075N75q33o45J077J629m68k412
3540a807L63J592k57K37j616J031l37J906k327K8J082n53R73j385N55j99J089
3557C75r26L07N20j017J171n85J709j917l4J194j98P76j715j46P60K030k532k58
3575d86N84J461Q61l831J222K09J667r29k203J931K79J363k315K54n98J567l33
3592G03j479J038j85R88j405P27m80K06J33j127J210j317R08j071J008P07k170
3609a606J514o78K089k727k67M04J584P48k380P60p77K543j721p63M22N07P94
3626D46q03j148R72K043k435J51K85O27J830j687J49j088J415m92o05J7L83j19
3644e9J60O26K08J68l74j83J574j608l84k08J570p51o54o75J134K569k559j228
$$ plain form
3662 -674 -1420 967 1623 543 -167 -434 2277 783 242 -939 320 1601 -389 -388 -77 694 -995 -113
3680 -113 -1326 -345 291 -339 -545 -1484 259 -731 -687 -846 -851 -1275 -651 -730 -365 -36 -1466 -227 -168 129
3700 129 -1631 -1320 145 196 -350 -1906 -92 835 917 -1082 -1354 845 1238 1501 -786 -574 1146 760
3718 760 158 365 462 1459 247 -555 -397 -287 1163 106 -672 1663 673 211 847 409 1389 -302 474
3737 474 762 469 -188 486 899 725 -282 -1174 179 1390 241 -746 -796 240 1418 -111 -1628 -1417
3755 -1417 838 524 -520 -1068 -605 335 -434 -917 -794 108 611 -1072 122 -862 98 -427 -279 -78
3773 -78 -924 -143 -154 299 -673 -1008 -549 -389 1286 -321 -910 -1185 1236 854 101 -1735 153 1832 452
3792 452 116 216 1173 180 64 -906 452 1532 164 -432 669 1044 1506 209 -274 -1102 1837 1512
$$ packed form
3662f74p46K387O56j080p10k67K711j494n41j181J259J281j990JL11P71j689Q82
3680a13j213R81O36o30k06r39J743r90M4j59nm24O24p9L65L29j430J239N9K97
3700A29j760L11J465N1n46j556J814R27Q2j999k72K199L93K63k287K12J720l86
3718G60o02K07R7R97j212q02J58J10J450j057p78K335r90m62O36m38R80j691P76
3737D74K88k93o57O74M13j74j007q92J353J211j149r87n0J036J178j529j517K11
3755a417K255l14j044n48M63R40p69m83J23R02N03j683J194r84R60n25J48K01
3773g8q46P81j1M53r72l35M59J60J675j607n89k75K421l82p53j836J888J679j380
3792D52l36J00R57r93j16r70J358J080j368n96J101L75M62j297m83q28K939l25
$$ plain form
3810 1512 960 351 1442 -4 466 890 1076 1321 -500 596 558 -577 -261 534 982 -283 -226 -866
3828 -866 -522 307 319 561 -778 1473 58 669 -862 -336 186 -967 -1568 -889 1976 205 601 -1234
3846 -1234 -717 863 854 -249 -1753 1100 852 -261 -186 -1023 -349 -969 910 -737 -554 -623 -872 995
3864 995 271 -447 -877 1181 -56 -265 -263 -703 984 464 596 -846 442 738 1508 337 -985 459
3882 459 1407 1539 -502 -482 750 1855 -137 -134 961 270 1386 -415 -332 1435 411 -8 -126 65
3900 65 245 -639 534 103 -222 -893 692 661 86 -996 262 -363 635 -450 -2412 -878 407 -1130
3918 -1130 -1871 -1588 -816 -800 56 -2137 -1361 -217 -279 -312 -801 645 -266 -191 -1870 -1035 -853 -80 -929 -925
3938 -925 -57 19 -216 -146 395 -38 -462 -144 1262 174 -601 2 1025 940 -332 -461 720 1725 -39
$$ packed form
3810A512n52o09J091j446M70M24J86K45j821J096l8j135L16P95M48j265N7o40
3828h66L44Q29J2K42j339K251j415O11j531N26N22j153o01O79K865j771L96j835
3846a234N17J580rj103j504K853k48j113P5q37O74o20J879j647J83o9k49J867
3864I95p24p18m30K058j237k09Km40J687n20J32j442J288K96P70j171j322J444
3882D59R48J32k041K0J232J105j992LJ095o91J116j801Q3J767j024m19j18J91
3900F5J80q84J173m31l25o71J585l1n75j082J258o25R98j085j962J534J285j537
3918a130p41K83P72J6Q56k193P76J144o2l3m89J446r11P5j679Q35J82P73q49M
3938i25Q68P6k35P0N41m33m24L18J406j088p75O03J023q5j272j29J181J005j764
$$ plain form
3957 -39 -291 852 617 2234 -68 -1234 -974 759 1528 -49 -1750 362 678 32 -814 -148 1831
3974 1831 609 -131 -595 -288 792 466 147 -517 454 -539 701 136 -276 -156 -1222 -650 -582 -1367 -1755
3993 -1755 -620 1058 -264 -696 -872 741 827 -715 -1147 -682 803 -488 -99 -1623 -669 -42 191
4010 191 55 -1932 1261 313 255 -1108 696 999 1436 149 -470 1564 1187 537 -983 521 840 -640
4028 -640 1752 528 985 46 458 1153 34 580 -753 1555 1028 2296 -1148 199 877 286 268 -218
4046 -218 763 43 1331 -524 -1228 588 -739 1 -1858 2153 -572 623 -1373 522 67 440 -898
4063 -898 -1173 -9 -524 695 -518 -579 995 -863 -327 162 169 -544 -304 -158 -40 -440 -1161 1496 -150
4082 -150 327 -414 -979 -204 51 1047 -1684 355 -206 938 -11 -1234 310 796 985 -1696 525 298
$$ packed form
3957c9k52J143k35J617k302j166K60J733P69j577j701K112L16o46q46O66J979
3974A831j222p40m64L07J080l26l19o64R71r93J240n65m12J20j066N72O8p85l88
3993a755J135J678j322m32j76J613Q6j542m32M65J485j291L89j524R54O27K33
4010A91j36j987L193r48n8j363J804L03M37j287o19K034l77o50j520J504L19j480
4028f40K392j224M57r39M12O95j119N46j333K308n27J268l444J347O78n91j8m86
4046b18R81p20J288j855p04J816j327P40j859M011k725J195j996J895m55L73j338
4063h98k75J164n15J219j213o1J574j858N36M89Pp13K40J46J18m00p21K657j646
4082a50M77p41n65P75K55R96k731K039n61J144r49j223J544M86J89k681K221k27
$$ plain form
4100 298 1300 1172 -577 206 624 964 257 -833 -553 489 214 49 1010 -198 518 168 48 -132
4118 -132 -524 270 -64 1025 -437 -598 224 -62 -15 -688 452 482 556 -970 -1007 -775 869 -261 -1101
4137 -1101 -964 56 1519 -1056 -1908 40 301 95 -1345 -490 -1318 834 -45 -681 -450 -439 126 -919
4155 -919 205 -243 -225 -715 198 -566 -402 -114 453 426 -246 -346 -75 629 19 896 135 222 1066 963 -17
4176 -17 375 675 1783 268 -739 768 1397 1417 -204 -288 -46 1204 -436 13 -251 806 -263 467
4194 467 538 -171 555 -209 676 -144 710 189 541 809 105 -681 -110 -568 -65 -306 -1137 -697 -604 733
4214 733 61 -1030 -975 483 461 -648 -1095 -267 353 -414 -1624 -768 -85 129 -1229 -920 30 87 47 -915
4234 -915 183 -750 1035 -759 -281 432 -223 -7 -732 668 326 -195 772 504 227 621 -110 454 1293
$$ packed form
4100B98J002j28j749P83M18L40p07j090K80J042k75j65R61j208P16l50j20j80
4118a32l92P94l34J089j462j61Q22k86M7o73J140L0P4j526l7K32J644j130q40
4137a101J37J020J463k575q52J948K61k06j440Q55q28K152q79o36K31J1N65j045
4155i19J124m48J8m90R13p64J64K88N67k7o72j00K71P04o10Q77p61Q7Q44j03r80
4176a7L92L00J108j515j007J507O29K0j621q4K42J250j640M49k64J057j069P30
4194D67P1p09P26p64Q85q20Q54n21L52K68p04p86N71m58N03k41q31M40R3J337
4214G33o72j091N5J458k2j109m47Q28O20p67j210Q56O83K14j358L09R50N7m0r62
4234i15J098r33J785j794M78P13o55K16p25J400l42n21R67k68k77L94p31N64Q39
$$ plain form
4253 1293 -10 199 687 2 868 -415 458 -317 1225 -323 -475 458 1385 810 -292 826 169 1775
4271 1775 801 95 -47 799 778 -26 685 179 10 -942 -490 -314 -377 256 -595 79 -523 308 -405 -476 267
4292 267 -547 213 -1233 371 -1 323 -335 -11 775 -811 480 -750 -14 -257 -1610 -773 159 1192
4310 1192 -157 -910 -73 1130 1013 1807 -873 623 219 -974 -548 -422 -229 -460 -1239 557 -392 -390
4328 -390 217 425 -278 357 1392 -519 1178 21 -518 -1180 -133 881 437 474 -264 -419 491 -371
4346 -371 -1311 637 1086 -189 -171 -812 -19 88 159 -1027 -58 -496 -1035 -345 -1313 344 554 -1783 -649
4365 -649 -216 1037 285 11 -576 -1517 -755 52 402 -588 -565 -1687 4 -1188 110 -1204 390 -1258
4383 -1258 -596 -211 253 1689 1525 236 -1751 -114 784 1050 -485 -610 -153 520 110 -696 135 521
$$ packed form
4253A293j303K09M88o85Q66j283Q73p75J542j548j52R33R27n75j102J118o57J606
4271A775r74p06j42Q46k1q04P11n06j69r52M52J76o3O33q51O74o02Q31p13p1P43
4292B67q14P60j446J604l72L24o58L24P86j586J291j230P36k43j353Q37R32J033
4310A192j349p53Q37J203j17P94k680J496m04j193M26J26J93k31p79J796r49K
4328c90O07K08p03O35J035j911J697j157n39o62J047J014m44L7p38j55R10q62
4346c71r40J948M49j275J8o41P93J07P1j186R69m38n39O90r68J657K10k337J134
4365f49M33J253p52k74n87r41P62Q07L50r90K3j122J691j192J298j314J594j648
4383a258O62L85M64J436j64j289j987J637Q98K66j535j25M57O73m10q06Q31L86
$$ plain form
4401 521 1050 -1118 -150 1008 1988 60 -631 -85 1506 -147 169 463 767 -257 -543 132 123 495 -393
4420 -393 303 31 -333 74 -1518 -86 -209 -121 -364 -1352 445 -100 80 -572 -890 -562 257 -731 -678 132
4440 132 1451 121 -925 741 1621 1035 -442 -12 -980 953 -456 -917 644 -83 365 -157 81
4457 81 -1039 92 -183 -606 1268 733 702 1258 1634 1038 -394 33 908 1321 511 65 371 1958 545
4476 545 -527 -115 1199 1293 -845 -352 1038 1526 419 1356 -694 1136 880 -548 -840 -601 621
4493 621 -6 -675 1322 249 492 17 172 1001 -254 2177 -236 717 669 143 302 -673 -400 165 -1623
4512 -1623 405 1509 -493 -1056 -1204 -173 232 1324 348 -962 -42 61 -611 21 -648 462 412 -1321
4530 -1321 -661 1516 1082 -836 -454 -1343 234 -287 335 646 579 -1230 139 289 692 765 113 -54 756
$$ packed form
4401E21N29k168R68J158R80j928o91N46J591j653L16K94L04j024k86O75rL72q88
4420c93O96k72l64M07j592J432j23Q8k43r88J797n45J80o52l18L28Q19r88N3Q10
4440A32J319j330j046J666Q80n86j477M30r68J933j409m61J561p27M48n22K38
4457H1j120J131k75m23J874n35l1N56L76n96j432M27Q75M13q10m46L06J587j413
4476E45j072M12J314R4k138M93J390M88j107R37k050J830k56j428k92K39J222
4493F21o27o69J997j073K43m75J55Q29j255K431k413R53m8n26J59r75K73N65j788
4512a623K028J104k002n63j48J031M05J092r76j310R20J03o72O32o69J110n0j733
4530a321O60K177m34j918L82q89J577n21O22L11o7j809J369J50M03P3o52j67Q10
$$ plain form
4549 756 2067 -1252 -300 1236 886 535 -747 843 -336 1110 -206 638 1023 550 1811 -574 -311
4566 -311 502 365 -207 -887 744 212 -228 -125 225 627 217 722 -868 514 -260 180 -215 529 -1577
4585 -1577 336 -1269 -1922 -305 -352 1410 628 -240 493 -183 1443 -488 -1048 -744 1235 -103 -260
4602 -260 -398 -572 -1382 1969 -395 -1047 55 764 999 49 -1270 -715 1346 874 -515 44 -1285 241
4620 241 594 -164 1104 -320 426 257 -594 -399 534 1043 477 88 -306 375 1078 283 554 601 -115 311
4640 311 1191 -359 -425 224 140 -617 -611 -326 290 -283 -372 -357 499 89 826 -471 -466 -220 888 -283 -250 86
4662 86 408 551 -646 -1082 -241 -403 -247 -57 217 6 -488 -217 374 -64 -121 -424 4 -146 94 -298
4682 -298 379 993 -85 -414 -229 135 496 -62 -471 -31 1532 442 -343 -377 514 1385 414 -171 123
$$ packed form
4549G56J311l319R52J536l50l51j282J590j179J446j316Q44L85m73J261k385K63
4566c11Q13j37n72o80J631n32m40J03L50M02m10N05j590J382p74M40l95P44k106
4585a577J913j605o53J617m7J762p82q68P33o76J626j931n60L04J979j338j57
4602b60j38j74q10L351k364o52J102P09K35r50j319N55K061m72j389N59j329J526
4620B41L53p58J268j424P46j69q51J95R33N09n66l89l94O81P03p95K71M7p16M26
4640C11Q80j550o6O49q4p57OK85O16n73q9J5Q56m10P37j297NK46J108j171L3L36
4662H6L22J43j197m36Q41j62J56J90K74k11m94K71N91m38n7l03M28j50K40l92
4682b98O77O14j078l29J85L64L61n58m09M40J563j090p85l4Q91Q71r71n85K94
$$ [...]
8191e
##END NTUPLES=NMR FID
##END=
