##TITLE=1H_SA_SlTHF
 CDCl3, 8 sc, 
 25.9.2020
##JCAMPDX= 6.0         $$ Bruker NMR JCAMP-DX V2.0
##DATA TYPE= NMR FID
##DATA CLASS= NTUPLES
##ORIGIN= UXNMR, Bruker Analytische Messtechnik GmbH
##OWNER= root
$$ XWIN-NMR		Version 3.5
$$ Fri Sep 25 09:35:02 2020 Russian Standard Time (UT+4h)  she@DPX200
##.OBSERVE FREQUENCY= 200.1315066352
##.OBSERVE NUCLEUS= ^1H
##.DELAY= (6, 6)
##.ACQUISITION MODE= SIMULTANEOUS
##.ACQUISITION SCHEME= undefined
##.AVERAGES= 8
##.DIGITISER RES= 18
##SPECTROMETER/DATA SYSTEM= spect
##.PULSE SEQUENCE= zg30
##.SOLVENT NAME= CDCl3
##.SHIFT REFERENCE= (INTERNAL, CDCl3, 0, 15.7039)
##AUDIT TRAIL= $$ (NUMBER, WHEN, WHO, WHERE, WHAT)
$$ ##TITLE= Audit trail, XWIN-NMR		Version 3.5
$$ ##JCAMPDX= 5.01
$$ ##ORIGIN= Bruker BioSpin GmbH
$$ ##OWNER= she
$$ F:/spectra/data/she/nmr/H-F/1/audita.txt
$$ ##AUDIT TRAIL=  $$ (NUMBER, WHEN, WHO, WHERE, WHAT)
(   1,<2020-09-25 09:33:38.46 +0400>,<she>,<DPX200>,
      <created by zg, POWCHK disabled, PULCHK disabled
       configuration hash MD5:
       00 E9 B6 7A A2 85 ED C7 34 08 36 98 17 FE 4E 26
       data hash MD5: 16K
       DC 05 62 A3 66 06 75 02 FE 6F C2 8B 74 49 BF 12>)
$$ ##END=
$$ 
$$ hash MD5
$$ EC 3B D7 E6 5E C8 3D A4 CD 62 80 16 7E 3D 2E 90
##$RELAX= 
##$RELAX= 
##$RELAX= 
##$RELAX= 
##$RELAX= 
##$RELAX= 
$$ Bruker specific parameters
$$ --------------------------
##$DU= <F:/spectra>
##$EXPNO= 1
##$NAME= <H-F>
##$PROCNO= 1
##$TYPE= <nmr>
##$USER= <she>
##$AMP= (0..31)
100 100 100 100 100 100 100 100 100 100 100 100 100 100 100 100 100 100 
100 100 100 100 100 100 100 100 100 100 100 100 100 100 
##$AQSEQ= 0
##$AQ_mod= 1
##$AUNM= <au_zg>
##$AUTOPOS= <>
##$BF1= 200.13
##$BF2= 200.13
##$BF3= 200.13
##$BF4= 200.13
##$BF5= 200.13
##$BF6= 200.13
##$BF7= 200.13
##$BF8= 200.13
##$BYTORDA= 1
##$CFDGTYP= 0
##$CFRGTYP= 5
##$CHEMSTR= <none>
##$CNST= (0..31)
1 1 145 1 1 1 1 1 1 1 1 1 1 1 1 1 1 1 1 1 1 1 1 1 1 1 1 1 1 1 1 1 
##$CPDPRG= <>
##$CPDPRG1= <>
##$CPDPRG2= <>
##$CPDPRG3= <>
##$CPDPRG4= <mlev>
##$CPDPRG5= <mlev>
##$CPDPRG6= <mlev>
##$CPDPRG7= <mlev>
##$CPDPRG8= <mlev>
##$CPDPRGB= <>
##$CPDPRGT= <>
##$D= (0..31)
0 1.2 0 0 0 0 0 0 0 0.06 0 0.03 0 0 0 0 0.0002 0 0 0 0 0 0 0 0 0 0 0 0 
0 0 0 
##$DATE= 1601012017
##$DBL= (0..7)
120 120 120 120 120 120 120 120 
##$DBP= (0..7)
150 150 150 150 150 150 150 150 
##$DBP07= 0
##$DBPNAM0= <>
##$DBPNAM1= <>
##$DBPNAM2= <>
##$DBPNAM3= <>
##$DBPNAM4= <>
##$DBPNAM5= <>
##$DBPNAM6= <>
##$DBPNAM7= <>
##$DBPOAL= (0..7)
0.5 0.5 0.5 0.5 0.5 0.5 0.5 0.5 
##$DBPOFFS= (0..7)
0 0 0 0 0 0 0 0 
##$DE= 6
##$DECBNUC= <off>
##$DECIM= 32
##$DECNUC= <off>
##$DECSTAT= 4
##$DIGMOD= 1
##$DIGTYP= 9
##$DL= (0..7)
0 120 120 120 120 120 120 120 
##$DP= (0..7)
150 150 150 150 150 150 150 150 
##$DP07= 0
##$DPNAME0= <>
##$DPNAME1= <>
##$DPNAME2= <>
##$DPNAME3= <>
##$DPNAME4= <>
##$DPNAME5= <>
##$DPNAME6= <>
##$DPNAME7= <>
##$DPOAL= (0..7)
0.5 0.5 0.5 0.5 0.5 0.5 0.5 0.5 
##$DPOFFS= (0..7)
0 0 0 0 0 0 0 0 
##$DQDMODE= 0
##$DR= 18
##$DS= 0
##$DSLIST= <SSSSSSSSSSSSSSS>
$$ [...]
##$SUBNAM2= <"">
##$SUBNAM3= <"">
##$SUBNAM4= <"">
##$SUBNAM5= <"">
##$SUBNAM6= <"">
##$SUBNAM7= <"">
##$SUBNAM8= <"">
##$SUBNAM9= <"">
##$SW= 16.880792210976
##$SWIBOX= (0..15)
0 0 2 0 0 0 0 0 0 0 0 0 0 0 0 0 
##$SW_h= 3378.37837837838
##$TD= 16384
##$TD0= 1
##$TE= 0
##$TE2= 300
##$TE3= 300
##$TEG= 300
##$TL= (0..7)
0 120 120 120 120 120 120 120 
##$TP= (0..7)
150 150 150 150 150 150 150 150 
##$TP07= 0
##$TPNAME0= <>
##$TPNAME1= <>
##$TPNAME2= <>
##$TPNAME3= <>
##$TPNAME4= <>
##$TPNAME5= <>
##$TPNAME6= <>
##$TPNAME7= <>
##$TPOAL= (0..7)
0.5 0.5 0.5 0.5 0.5 0.5 0.5 0.5 
##$TPOFFS= (0..7)
0 0 0 0 0 0 0 0 
##$TUNHIN= 0
##$TUNHOUT= 0
##$TUNXOUT= 0
##$USERA1= <user>
##$USERA2= <user>
##$USERA3= <user>
##$USERA4= <user>
##$USERA5= <user>
##$V9= 5
##$VALIST= <valist>
##$VCLIST= <CCCCCCCCCCCCCCC>
##$VD= 0
##$VDLIST= <DDDDDDDDDDDDDDD>
##$VPLIST= <PPPPPPPPPPPPPPP>
##$VTLIST= <TTTTTTTTTTTTTTT>
##$WBST= 1024
##$WBSW= 4
##$XGAIN= (0..3)
0 0 0 0 
##$XL= 0
##$YL= 0
##$YMAX_a= 467090
##$YMIN_a= -480809
##$ZGOPTNS= <>
##$ZL1= 120
##$ZL2= 120
##$ZL3= 120
##$ZL4= 120
##$ABSF1= 10
##$ABSF2= 0
##$ABSG= 5
##$ABSL= 3
##$ALPHA= 0
##$AQORDER= 0
##$ASSFAC= 0
##$ASSFACI= 0
##$ASSFACX= 0
##$ASSWID= 0
##$AUNMP= <proc_1d>
##$AZFE= 0.1
##$AZFW= 0.1
##$BCFW= 1
##$BC_mod= 2
##$BYTORDP= 1
##$COROFFS= 0
##$CY= 11.3945322036743
##$DATMOD= 1
##$DC= 2
##$DFILT= <>
##$DTYPP= 0
##$F1P= 16.9975609425685
##$F2P= -3.02152046262296
##$FCOR= 0.5
##$FTSIZE= 0
##$FT_mod= 4
##$GAMMA= 1
##$GB= 0.15
##$INTBC= 1
##$INTSCL= 1
##$ISEN= 128
##$LB= 0.24
##$LEV0= 0
##$LPBIN= 0
##$MAXI= 10000
##$MC2= 0
##$MEAN= 0
##$ME_mod= 0
##$MI= 1.114404
##$NCOEF= 0
##$NC_proc= 0
##$NLEV= 6
##$NOISF1= 3.799351
##$NOISF2= 2.8
##$NSP= 1
##$NTH_PI= 0
##$NZP= 0
##$OFFSET= 15.70392
##$PC= 1
##$PHC0= -10135.76
##$PHC1= 20.0009
##$PH_mod= 1
##$PKNL= yes
##$PPARMOD= 0
##$PSCAL= 0
##$PSIGN= 0
##$REVERSE= no
##$SF= 200.130013532006
##$SI= 16384
##$SIGF1= 3
##$SIGF2= 2
##$SINO= 400
##$SIOLD= 16384
##$SREGLST= <1H.CDCl3>
##$SSB= 0
##$STSI= 0
##$STSR= 0
##$SW_p= 3612.71676300578
##$SYMM= 0
##$S_DEV= 0
##$TDeff= 0
##$TDoff= 0
##$TI= <>
##$TILT= no
##$TM1= 0
##$TM2= 0
##$TOPLEV= 0
##$USERP1= <user>
##$USERP2= <user>
##$USERP3= <user>
##$USERP4= <user>
##$USERP5= <user>
##$WDW= 1
##$XDIM= 8192
##$YMAX_p= 0
##$YMIN_p= 0
$$ End of Bruker specific parameters
$$ ---------------------------------
##NTUPLES= NMR FID
##VAR_NAME=  TIME,          FID/REAL,        FID/IMAG
##SYMBOL=    X,             R,               I
##VAR_TYPE=  INDEPENDENT,   DEPENDENT,       DEPENDENT
##VAR_FORM=  AFFN,          ASDF,            ASDF
##VAR_DIM=   8192,          8192,            8192
##UNITS=     SECONDS,       ARBITRARY UNITS, ARBITRARY UNITS
##FACTOR=    0.000296,      1,               1
##FIRST=     0,             0,               0
##LAST=      2.424536,      0,               0
##MIN=       0,             -480809,         0
##MAX=       2.424536,      467090,          0
$$ Real data points
##PAGE= N=1
##DATA TABLE= (X++(R..R)), XYDATA
0@%%%%%%%%qJ6j6J6j6K4l8M6n6P2q8J04j28J56j86K22k60L01l51M12m76N48o29
$$ 0 0 0 0 0 0 0 0 0 -8 8 -8 8 -8 16 -22 24 -32 40 -48 56 -72 84 -102 120 -140 161 -190 222 -254 294 -335
31c35P18q19R31j056J194j344J507j687J887k106K344k606K894l204L540l910
$$ -335 383 -436 495 -561 633 -711 796 -891 996 -1110 1234 -1372 1522 -1682 1858 -2052
47b052M317m760N243n778O367p011P725q525R420j0426J1569j2883J4408j6203
$$ -2052 2265 -2495 2748 -3030 3337 -3674 4051 -4474 4946 -5480 6089 -6794 7614 -8589
61h589J8354k0987K4302k8614L4487m3023N6739q3478K22394n14530J52126N77801
$$ -8589 9765 -11222 13080 -15534 18953 -24070 32669 -50809 171585 -342945 -190819 386982
73C86982l72207J04017k92074P0406N69966n10996l24909O51499j64873k23284
$$ 386982 14775 118792 -173282 -102876 467090 -43906 -368815 282684 117811 -105473
83a05473J41112j30827K39999J9574n06643M22188K27235n19358J52468J53083
$$ -105473 35639 -95188 144811 164385 -342258 79930 307165 -212193 -59725 93358
93I3358j02070J56615l23284L3368M84751l89165k21151L93132p2810m6080m4491
$$ 93358 -8712 147903 -175381 -142013 342738 -46427 -267578 125554 52744 6664 -37827
104c7827j66711L79457l0911m67938L43967J62578k98661J00114m7450O5401J77179
$$ -37827 -204538 174919 144008 -323930 20037 182615 -116046 -15932 -63382 2019 179198
115A79198l85834J05597L62514l56621m2550K09625q8953R5932j51998j16766
$$ 179198 -206636 -101039 261475 -95146 -137696 71929 -17024 78908 -73090 -189856
125a89856L97744j47102l11735K98187L1747j11951N0526j61929J78505J53117
$$ -189856 207888 60786 -250949 47238 78985 -32966 17560 -144369 34136 187253
135A87253l69851J07515K43350k21533K2880L0764m8757J85133j85171j15577
$$ 187253 -182598 -75083 168267 -53266 -30386 378 -48379 136754 -48417 -163994
145a63994L38006j28362k08558K02693l996j1607q138j80799K37003J06919l58860
$$ -163994 174012 45650 -162908 39785 35789 24182 16044 -164755 72248 179167 -179693
156a79693J09722K02109j31114M60q4628M2947K32825k43790j12572K84225p1561
$$ -179693 -69971 132138 1024 1484 -83144 -40197 192628 -51162 -163734 120491 48930
167D8930j02291M8558m1701J27790l4446j98505J96993O7804k05012O9315N4024
$$ 48930 -53361 -4803 -46504 81286 46840 -151665 45328 113132 -91880 -22565 31459
178C1459j7251L5719j41782O0194J87393j94974o6056J69436k8109k1682m8313
$$ 31459 14208 49927 -91855 -31661 155732 -39242 -105298 64138 36029 14347 -33966
189c3966m2225J82914n1818j91348J50908O1694r9309J9045m1321N9618P5257
$$ -33966 -76191 106723 54905 -136443 14465 76159 -23150 -4105 -45426 14192 89449
200H9449j72402M0397J45542j32022p207O3248m0620N8279o6041m7146J60788
$$ 89449 -82953 -42556 102986 -29036 -36243 27005 -13615 44664 -21377 -68523 92265
211I2265p4018j11557J24010n17l3275O682o7475R7170M2443j58417N3660R4301
$$ 92265 18247 -93310 30700 30183 -3092 3590 -63885 33285 75728 -82689 -29029 65272
223F5272p5441L858j2569j838Q6305q6953m4606J25551m7253o0183O0978j8404
$$ 65272 -10169 -6311 -18880 -20718 65587 -21366 -65972 59579 12326 -47857 13121 -5283
235e283J7396l27p5159Q8319K9789j20408M8725N5845m5373J2507l9057J5477
$$ -5283 12113 11786 -63373 24946 54735 -65673 -16948 38897 -6476 6031 -33026 -17549
247a7549Q7010r4085l1577J00607l5251k2669J4616k9156O0681j1360p6678P5497
$$ -17549 69461 -24624 -56201 44406 9155 -13514 1102 -28054 32627 21267 -55411 20086
259B0086J1385o3285L8285m50p335K3426n1444K4857N4810p4319k639N6600k3509
$$ 20086 31471 -31814 6471 6021 -1314 22112 -29332 -4475 50335 -23984 -26623 29977 6468
272F468m310j3522j0479O3198k6384o2023N7675J6149l2519O902j6870K1914K8130
$$ 6468 2158 -11364 -21843 41355 14971 -47052 10623 26772 -5747 1155 -15715 6199 34329
285C4329n7575Q798M3995l8719O042J4127k3522K3913j1993j7279M2956k7467
$$ 34329 -23246 -14448 29547 -9172 -3130 10997 -12525 11388 -605 -17884 25072 -2395
297b395k4149M6367j4049j4280R187j5642L1266K073m9618K7903K5704k7248J665
$$ -2395 -26544 19823 5774 -8506 681 -14961 16305 18378 -31240 -3337 22367 -4881 -3216
310c216n675O440K4386l2471j0056L6166j1543j3156J0751p771J0460P13k0320
$$ -3216 -8891 -2451 21935 -10536 -20592 15574 4031 -9125 1626 -6145 4315 5028 -15292
323a5292K0588N783k5362J3972P940j3612Q552p466J437J7542k3329k935K4642
$$ -15292 5296 11079 -14283 -311 7629 -5983 2569 -4897 -3460 14082 -9247 -12182 12460
336A2460j3777l910P424r667J4136m578j6363K2349l330j5383J4108l371k450
$$ 12460 -1317 -5227 2197 -7470 6666 2088 -14275 8074 4744 -10639 3469 98 -2352
349b352O035j3212J1365Q813k2233N206J3239n698j978o214K203J6302j1466j3324
$$ -2352 3683 -9529 1836 10649 -11584 -6378 6861 1163 -815 -7029 -4826 11476 10 -13314
363a3314J4939N138o148l515l912Q890P462j4646l09J0359n268J442M0o121P652
$$ -13314 1625 6763 615 -2900 -6812 2078 9540 -5106 -5415 4944 -324 1118 1158 -4963 2689
378B689R69o034N688o203m69J2721q510n264N584n18N981m464j1659J4101N224
$$ 2689 3658 -2376 3312 -2891 -3360 9361 851 -4413 1171 653 6634 2170 -9489 4612 9836
393I836j2558L5J871N924J536j2724K457J1364n963n340J918L284L235p409k755
$$ 9836 -2722 -2687 -816 5108 6644 -6080 -3623 7741 1778 -3562 -1644 1640 4875 -2534 -5289
408e289R061K36q013K530N219j888k558j468M819L313p678j413Q812k585m993
$$ -5289 3772 4008 -4005 -1475 3744 1856 -702 -2170 2649 5962 -1716 -3129 5683 3098 -1895
423a895R62J791N478p546n917J1850n49q705L255R16L091r42j0343R770O545j1933
$$ -1895 -933 858 6336 -1210 -7127 4723 4174 -4531 -1276 -360 2731 1789 -8554 1216 7761 -4172
439d172j40N192J516L84r321K183J2791q953q176P049L638j195m828k812P895
$$ -4172 -4312 880 2396 2780 -6541 -4358 8433 -520 -8696 -1647 1991 796 -4032 -6844 1051
454A051K177r467J552P251j066m029p85L580L496n113l005P667j716m783K219
$$ 1051 3228 -6239 -4687 2564 1498 -2531 -3316 264 3760 -1353 -4358 3309 1593 -3190 -971
469i71k44J844k21n696N067K582p257L086K071k06M20n382M567M350p446K213
$$ -971 -1215 629 408 -5288 -221 2361 -4896 -1810 261 55 475 -4907 -340 4010 -3436 -1223
485a223K321l921N833l853m083P916m391j084O322q615qR380n944q27N99l730
$$ -1223 1098 -2823 3010 -843 -4926 2990 -1401 -2485 3837 -4778 -4786 4594 -1350 -2177 -1578 -5308
501e308J0202k165j3033J0461O589r893J541q38J832Q738j3365l255J8270q300
$$ -5308 4894 2729 -10304 157 6746 -3147 -1606 -2444 -612 8126 -5239 -8494 9776 1476
515A476j0229R988j397M317j882j5012J7342Q125k1489N878R479m840L858j1077
$$ 1476 -8753 1235 -162 4155 2273 -12739 4603 12728 -8761 -2883 6596 1756 5614 -5463
529e463R94J9739j5014j0433J6623k070n497N21m591J1822p32j7620J1577Q592
$$ -5463 -4469 15270 256 -10177 6446 4376 -1121 -600 -5191 6631 5899 -11721 -144 8448
543H448j2398L69K795K357L434j3995L130J7840j3295r368J1735K707r01q463
$$ 8448 -3950 -3581 -786 1571 5005 -8990 -5860 11980 -1315 -10683 1052 3759 2858 -5605
557e605n906K1048q43k3230Q882J1258k825m011j0815J1580J4387k1758k440J6720
$$ -5605 -11511 9537 8694 -14536 -5654 5604 2779 -1232 -12047 -467 13920 -7838 -10278 6442
571F442m791k00m995l089J7246q333j4304J7226p6r751N925m581L731N004j3818
$$ 6442 1651 1451 -3544 -6633 10613 2280 -12024 5202 5126 -4625 1300 -3281 450 5454 -8364
586h364O926R761j5743L572Q766q033M400l363l845J4558q735j0706J6927k515
$$ -8364 -1438 8323 -7420 -3848 4918 -3115 1285 -2078 -5923 8635 -100 -10806 6121 3606
600C606q599O609n224M799M419j4582Q225Q820j5251M530N589o453O780o789k662
$$ 3606 -4993 1616 -3608 1191 5610 -8972 -747 8073 -7178 -2648 2941 -3512 3268 -3521 -6183
615f183J4455j0070o157J3129m675k215L301n793P953p17j0302J0619J507j0363
$$ -6183 8272 -1798 -7955 5174 499 -1716 1585 -4208 3745 3028 -7274 3345 4852 -5511
629e511N382J283j358L033q963M784J0318j3277k258J1856k709k676k577o99J2838
$$ -5511 -129 1154 -204 2829 -6134 -1350 8968 -4309 -6567 5289 2580 -96 -2673 -3372 9466
644I466o773j3043J3537M839r122j173j162Q037M064j7243M413J4258r893l825
$$ 9466 2693 -10350 3187 8026 -1096 -2269 -3431 4606 8670 -8573 -4160 10098 205 -3620
658c620L460R48N620q829m608J5586n388j0052Q329J688m72l438o234J2339L060
$$ -3620 -160 788 6408 -2421 -7029 8557 3169 -6883 1446 3134 2662 -776 -7010 5329 8389
673H389j6663M714J0141m454l546m380O014R824j3797o369J5902j074q085k73
$$ 8389 -8274 -3560 6581 2127 -1419 -5799 215 10039 -3758 -10127 5775 4701 -3384 -3657
687c657P87R297l496j3979J0876Q717j1979l00K814J284M451j0087k43J3224q422
$$ -3657 -2870 6427 2931 -11048 -172 8545 -3434 -3734 -920 364 4815 -5272 -5515 7709 -713
702g13n908R095k629M17k02n687R613m70j1368Q469M101p156K363j520J582N284
$$ -713 -6621 2474 -155 262 60 -5627 3986 3516 -7852 617 4718 -2438 -75 -1595 -13 5271
718E271r008N91R340o210k885M763k004K183j262m607P261n63p126N364J779m157
$$ 5271 -3737 -3146 6194 -16 -2901 1862 -142 2041 779 -3828 3433 2870 -4256 1108 2887 -1270
734a270K112j672J252L165o534K136N732o138p65L833j498J538l278j305P536
$$ -1270 842 -830 422 3587 -2947 -811 4921 -1217 -1982 1851 353 1891 -1387 -2692 4844
749D844m415m952N888P51k057j080j974N941k9q005M612M285l880j518l69L243
$$ 4844 429 -4523 1365 2116 59 -1021 -2995 2946 2917 -5088 -476 3809 -71 -1589 -1958 1285
765A285K776p294j45Q064l406m128J776J805K440l575m347O873J634o905J743
$$ 1285 4061 -3233 -3378 4686 1280 -2848 -1072 733 3173 -402 -4749 2124 3758 -3147 -1404
780a404K547j92k45l681K481M573o139o42N787l048j138M15J65L917m050l960
$$ -1404 1143 951 706 -2975 -494 4079 -2060 -2702 3085 37 -1101 -686 -521 3396 -654 -4614
796d614P505K2n707J271J200L105j490o787M787N443n624k050K110J413K291m750
$$ -4614 2891 2913 -2794 -1523 -323 2782 1292 -5495 -708 4735 -889 -2939 -829 584 2875 -1875
812a875j821O326o30l617J196j35J168J329l521J085J617k355K064j28l479K950
$$ -1875 -3696 2630 2000 -1617 -421 -556 612 1941 -1580 -495 1122 -1233 831 703 -2776 174
828A74J416k531N72j614J616L847m728j779M757j87j359q69j134M777q17n215
$$ 174 1590 -941 -369 -1983 -367 3480 -1248 -3027 1730 1543 184 -685 -1819 2958 2141 -3074
844c074K991J757j681J62j588J033K600m157L08L331k195m26R12l99J402j174
$$ -3074 -83 1674 -7 155 -1433 -400 2200 -1957 -1649 1682 -513 -939 -27 -426 976 -198
860a98j608L536l59k717J464L91O1O47k138O72K374k771K92J788k005J003N49
$$ -198 -1806 1730 1371 -1346 118 509 570 1217 -921 -249 2125 -646 -354 1434 -571 432 981
877I81j164R86r51l27L171k132k199K582M82J23j544k113L754J792n150j49K734
$$ 981 -183 803 -148 -475 2696 564 -1635 947 1429 1552 8 -2105 1649 3441 -1709 -1858 876
894H76N13l2l689j16M877j191l442R18P98J616o34l254J894J783j346K8n50p71
$$ 876 1389 1357 -2332 -2448 2429 1238 -2204 -1286 -488 1128 494 -2760 -866 917 -429 -401 -951 -1722
912a722K281k66j666R50p58R20J437k588m86K545n40rj150j148L770n17k975J400
$$ -1722 559 293 -1373 -423 -1181 -261 1176 -1412 -1898 647 107 98 -1052 -2200 1570 1053 -1922 -522
930e22P02J90O83k836R49L120k424m29P58r09J818p6k433J990j11r85K321k248
$$ -522 180 370 1053 -1783 -834 2286 -138 -567 191 -718 1100 1024 -1409 581 470 -515 1806 -442
948d42o72K965j558l17J007k299J964J635l607J038J228j409J567q53j869K946
$$ -442 -1114 1851 293 -24 983 -1316 648 2283 -1324 -286 942 -467 1100 247 -1622 1324
964A324q73j481K463k341L21K723k805K79J422k227K647j5m004L375P60k258J104
$$ 1324 451 -1030 1433 -908 -587 2136 -669 -390 1032 -1195 1452 1437 -2567 808 1568 -690 414
981D14j372N91K796l555r59L661j525qn7j801L227k98l199K992j00k120K532j359
$$ 414 -958 -367 2429 -1126 -2085 1576 51 43 -14 -1815 1412 1114 -2085 907 807 -1313 1219 -140
999a40j77J490k951K231K306m816L58L230j199Q90k948j077O683k284n306L879
$$ -140 -317 1173 -1778 453 2759 -2057 -1699 1531 332 1222 -1726 -2803 3880 1596 -3710 169
1015A69J106n6L25n174M003M331o545O26L009k211K099j814k370N796k914l363
$$ 169 1275 1219 1544 -3630 373 4704 -1841 -1215 1794 -417 1682 -132 -2502 3294 380 -2983
1031b983N723k502k193L730k352J043J367n537M753L218p464J726L160j346J480
$$ -2983 2740 238 -1955 1775 -577 466 1833 -3704 1049 4267 -3197 -1471 1689 343 1823
1046A823m576m08Q434m550n338N066Q0O05n27n204N438L285p804K316L065k909
$$ 1823 -2753 -3161 5273 723 -4615 451 531 1136 609 -4595 843 4128 -3676 -1360 1705 -1204
1062a204K512k439j067N687m502k057O111l277j098K400l001L391Ln252N115J108
$$ -1204 1308 -1131 -2198 3489 -1013 -3070 3041 -236 -1334 1066 -1935 1456 1459 -3793 1322 2430
1078B430n230L562m69j383L707m379K99N019n089J90L987m402K120J173m109M431
$$ 2430 -2800 762 293 -1090 2617 -1762 -1463 3556 -1533 -1343 2644 -1758 362 1535 -2574 1857
1094A857j277l588N845k142l758N123k222m82L054n254K687L850o370K014K870
$$ 1857 580 -3008 2837 695 -3063 2060 -162 -644 2410 -2844 -157 3693 -2677 -663 2207
1109B207m268L679q68l653N434k650k244N783m421j659N479l425J41J443m374
$$ 2207 -2061 1618 750 -2903 2531 -119 -2363 3420 -1001 -2660 2819 -606 -465 978 -3396
1124c396N679O99p918M533L331l639J241l061J246O773p522k652P816k026j968
$$ -3396 2283 2982 -4936 -403 2928 -711 530 -2531 -1285 5488 -2034 -4686 3130 1104 -864
1139h64K13k588O173l12q257N702L036m859J505r63N52M172o134k80P018m899
$$ -864 -651 -3239 2934 2622 -5635 67 3103 -1756 -251 -1214 -662 3510 -2624 -2904 4114 -785
1155g85j547L520j936K305j507m076O877k42o602M479Q69j510J427m056K648M684
$$ -785 -2332 1188 -748 1557 50 -4026 2851 2609 -3993 486 1355 -155 1272 -2784 -136 4548
1171D548o906O9N228l162N46n84j737N634k794m985O254p7l431K243k220K119
$$ 4548 -2358 -2289 2939 -223 323 -261 -1998 3636 842 -4143 2111 2034 -1397 846 -1374 745
1187G45K490o322K161M520m634N43J169k167M001k249l479N552j561k888L560
$$ 745 3235 -3087 -926 3594 -1040 -497 672 -1495 2506 257 -3222 2330 769 -2119 1441
1202A441k464L95L046m616J599K661m173K740O05l878L818j94l203L539j906q39
$$ 1441 -1023 -628 2418 -2198 -599 2062 -2111 629 1234 -2644 1174 980 -2223 1316 -590 -1429
1218a429L966m046m10M204l236J35J837k943L026j56l907M316J23l530K853n97
$$ -1429 2537 -1509 -1919 2285 -951 -816 1021 -1922 1104 948 -2959 1357 1480 -2050 803 206
1234B06q41K502l421Q10L750m230r2K877k009J019m95k163M248j316l649L908
$$ 206 -635 1867 -1554 -744 3006 -1224 -1316 1561 -448 571 76 -2087 2161 845 -2804 1104
1250A104j93j694J475k107J592K232m625J347L221l242N00L36q84K857k317k277
$$ 1104 911 -783 692 -1415 177 2409 -2216 -869 2352 -890 -390 -54 -938 1919 -398 -2675
1266b675M503j274k338K209j147J000Q87l463K043K236l445J196Q91j744K021
$$ -2675 1828 554 -1784 425 -722 278 1165 -2298 -255 1981 -1464 -268 623 -1121 900
1281I00j101j100K587j733q56K828k132n70K130j597J012P4k403K726Q21l211
$$ 900 -201 -1301 1286 -447 -1303 1525 -607 -1177 953 -644 368 442 -1961 765 1586 -1625
1297a625J513O18p05J352k310N6L063k080r71J644j226J066N82k538J763N72j579
$$ -1625 -112 506 -199 1153 -1157 -1101 1962 -118 -1089 555 -671 395 977 -1561 202 774 -805
1314h05J472o31j293K371n70j138R98j070J258R80k729O01J961j168j24n03k50
$$ -805 667 36 -1257 1114 544 -594 404 -666 592 1572 -1157 -556 1405 237 113 -390 -640
1331f40K402j436j825K066J42o95M23j043R38J047k243Q64J243j527N23J55n84
$$ -640 1762 326 -1499 567 709 14 437 -606 332 1379 -864 0 1243 -284 239 394 -190
1348a90J218j234p06K305j121j176J150l62N26J41j821J226J082j635L82J32k38
$$ -190 1028 -206 -912 1393 272 -904 246 -116 410 551 -1270 -44 1038 -597 -215 -83 -321
1365c21J246r61p43J152l43jO74j489L74J270r85j07j67j99J573n23j952J158
$$ -321 925 -36 -779 373 30 29 703 -786 -412 858 -127 -234 -401 -600 973 450 -1502 -344
1383c44J096l92l34j170R18J759j504j001J088J57N50p30j379J566O34j074R4
$$ -344 752 360 26 -1144 -226 1533 29 -972 116 273 823 93 -1286 280 914 -160 -66
1400f6m52QJ416r15p35N96n7P18k18j449Q14J260o52n22n49O51J439j284j153
$$ -66 -518 -510 906 -9 -744 -148 -205 513 295 -1154 -340 920 268 -254 -803 -152 1287 3 -1150
1419a150J148N68l24m90p73J166P65j411l0N09j87N98k47q43Q80j55j25P11j157
$$ -1150 -2 566 242 -248 -1021 145 910 -501 -531 -22 -209 389 142 -701 179 24 -101 610 -547
1438e47NJ292m53o23%j81J188j72j469O47O00j35m4n85J80Q41o97O2L15p49O20
$$ -547 -542 750 297 -326 -326 -507 681 509 -960 -313 287 152 108 -477 -297 544 -153 -91 224 -525 95
1459I5N22p04j92Q0J99Q86r95j010J352N51p31p45O8J363K72j912M6J502l0m21
$$ 95 617 -87 -279 -199 0 886 -109 -1119 233 784 53 -692 -624 739 1011 -901 -855 647 617 196
1479A96p58R5J248m31r89O86j0j12N70p84j09K13n1R92n89j539J183J162p58p62
$$ 196 -562 -467 781 350 -639 47 37 -75 495 -289 -398 -185 -236 756 167 -1372 -189 973 215 -547
1499e47o94J544J222k104j069J868P50o84j161l53K060J98k096K67J140j49q8
$$ -547 -1241 303 1525 -579 -1648 220 970 286 -875 -1228 832 1030 -1066 -799 341 192 104
1516A04p47K6J430q04m73P28m77N5P80n28j75J12k78J096m08j286Q11R09m18n73
$$ 104 -643 -617 813 9 -464 264 -213 -158 622 94 -81 31 -247 849 441 -845 -34 875 457 -116
1536a16o75J004J347j653o78Q17M67L14r47p75J372L44q36j19j88O32N47r95l67
$$ -116 -791 213 1560 -93 -771 46 513 827 -120 -895 477 821 -15 -134 -322 310 857 -138 -505
1555e05O53N6J32k30p47Q36K91q46L27K4p6L87m98j47P58q26Q4R42q35j38K53
$$ -505 148 204 336 106 -641 195 486 -360 -33 -9 -85 302 -196 -343 415 -411 -327 615 -220 -358 -105
1576a05L3P02p34j226J787N27j589j77L46J170J86k213J29K358n14j341j42O42
$$ -105 -72 630 -104 -1330 457 984 -605 -782 -436 734 920 -1293 -1164 1194 680 -661 -803 -161
1594a61J206q93j523J211J069j037j34N8R5K55l18J74M00r69N7J350n11j015J00
$$ -161 1045 152 -1371 -160 909 -128 -262 -204 -109 146 -172 2 402 -567 -510 840 329 -686 -586
1613e86J030P69j596j105J867J037j445j138N83J885k80k441P02J849l53j222
$$ -586 444 1213 -383 -1488 379 1416 -29 -1167 -584 1301 1021 -1420 -718 1131 778 -444
1629d44o00J068J332j496r57J340J73k89k74k97P07J28q68N66J48p74O25K22n67
$$ -444 -1044 24 1356 -140 -1097 243 416 127 -147 -444 263 391 -477 89 237 -537 88 310 -257
1648b57J20j47J73O59q71m20J201m67k38L27m32L76K59o98N49J9p40R93p2p29
$$ -257 -137 -284 -111 548 -323 -743 458 -9 -247 80 -352 24 283 -415 134 153 -587 406 334 -395
1668c95L15M6K71K65j092K74J261q11m69J68L67O11o21p10R06K77o64K10j0R9
$$ -395 -80 -34 237 502 -590 -316 945 134 -335 -167 200 811 190 -520 386 663 -1 209 199 298
1688B98K08l06O8J47m18L95M70q76j70M61L72J5j090J4J473l95j270K83O23N56
$$ 298 506 200 268 415 -3 392 862 -14 -184 277 649 664 -426 -412 1061 666 -604 -321 302 858
1708H58p61j203J223Q55j223l16M01K19L96r64o1J070o85m40P41l58k43L48k07
$$ 858 97 -1106 117 972 -251 -567 -166 53 449 -515 -576 494 -191 -631 110 -248 -491 -143 -350
1727c50N21m38p87J015N26j085j58N83L78n5j119L46J446p41j005O35N58n6m21
$$ -350 171 -267 -1054 -39 487 -598 -756 -173 205 150 -969 -623 823 82 -923 -288 270 214 -207
1746b07n65J154J83j220M38O47l97p8k07L19O24j112O2J085m51n66K06K92L57
$$ -207 -772 382 565 -655 -217 430 33 -45 -252 67 691 -421 -359 726 275 -291 -85 207 564
1765E64m78o94J145J73q63k7L83L48l59n50L38P36p98l09O18J20l62k71K12M70
$$ 564 86 -608 537 710 -153 -180 203 551 192 -358 -20 716 -82 -391 227 347 -15 -286 -74 396
1785C96k77p28O77L66n73j66O5O07m6r02K28P80m40j66q1P9N52o05k62M58l5q6
$$ 396 119 -609 68 434 -139 -305 -240 367 321 -581 -353 427 -13 -179 -260 -181 371 -234 -496 -38 -73 -159
1807a59K60l97%L51k8J24m25o5P26j1p95J18M49L37l59q19O48P07o13n76M59M19
$$ -159 101 -296 -296 55 27 151 -274 -339 387 376 -419 -301 148 485 126 -693 -45 662 49 -527 -68 351
1829C51j5o83p8Q46q1p25K25M80k37n6k22L32L59p91J49N99l62j69J13O8K04m81
$$ 351 336 -347 -425 421 340 -385 -160 320 83 27 -195 137 496 -295 -146 453 91 -78 35 103 307 -174
1851a74k82R30l28n10J80K37J05k84m45P06L17q76O3M36J20l33l21L72N20n70
$$ -174 -456 474 146 -364 -184 53 158 -126 -571 135 452 -424 -361 75 195 -138 -459 -87 433 -137
1871a37n51P47K63l61l74J6P19L5r12J79P84l33j38j89O6O58l23m79M92r0m0K43
$$ -137 -688 59 322 -39 -413 -397 322 357 -555 -376 408 75 -63 -252 -186 472 149 -330 162 72 32 275
1893B75m89K71J80k44J87k29k09O21k2n70J51Q0L05j13n66K50O17k90n24K92J51
$$ 275 -214 57 237 -7 180 -49 -258 363 341 -229 -78 2 307 194 -372 -122 495 205 -319 -27 124
1914A24L69m84m73O83J86m84KJ59m4J86k88r9L63l06J3L81l71j18L33j63K16k79
$$ 124 493 9 -464 219 405 -79 -77 82 38 224 -64 -163 200 -106 -93 288 -83 -201 132 -31 185 -94
1936i4k49O73k42m17K78J17J7j87k19M71J22o27K4N04L1l25l07L51N73o11m50
$$ -94 -343 330 88 -329 -51 66 83 -104 -323 148 270 -357 -333 171 202 -123 -430 -79 494 -117 -567
1957e67O05K93l11l73J07O35j08q34L88O15k25m57j10N00L53o86l51Q03m4k42
$$ -567 38 331 20 -353 -246 389 281 -553 -165 450 225 -232 -342 158 511 -175 -526 277 233 -9
1977iMq7L10O9l96K64J45m59L89kj75L0j31L37O4n88P0N09j66k58j68K73M49m71
$$ -9 -5 -92 218 287 -109 155 300 -159 230 228 53 83 -48 289 353 -235 -165 344 178 -80 -248 25 474 3
2001Cl23L74K57k72j68l7M00J34n93P2L14o1J1j23k00L68j07k87K41j11l3K96
$$ 3 -320 54 311 39 -129 -166 234 368 -225 -153 161 100 111 -12 -212 156 49 -238 3 -108 -141 155
2023A55k49k02K78r3K26J9m95M34M6k15J8n3L6L22m15j5L79l31J86K2j94J63M7
$$ 155 -94 -296 -18 -111 115 134 -361 73 119 -96 -78 -131 -95 227 -188 -203 176 -155 31 53 -141 22 69
2046F9j82J35K7k23L41j43k78L15J30j39l3j63J43M13n74p5L97l3r0j79k1N09
$$ 69 -113 22 49 -174 167 24 -254 61 191 52 19 -144 -1 412 -162 -237 160 127 37 -142 -163 346
2068C46k32n10M75Q0j98k8j51M34J4o27L08M20l62l1j63K75L61o50j62N91Rl85
$$ 346 114 -396 79 159 -39 -67 -218 216 230 -397 -89 331 -31 -62 -225 50 411 -239 -401 190 199 -186
2090a86j3lL62j07m82M31K81m64%K10j15J04j92O6L43m24j52N66j74l66J74M9
$$ -186 -199 -202 160 53 -429 2 283 -181 -181 29 -86 18 -174 -108 235 -189 -341 225 51 -315 -141 -92
2112i2M54m54n42P42M72p57k77L51N09M1j038J84J019k39o20j06M61N22m64p49
$$ -92 362 -92 -634 108 580 -177 -454 -103 406 447 -591 -407 612 373 -247 -353 108 630 166 -583
2132e83P27L03l07k30PK71K27m15j19M56k67L3J33l02J40J82k39J41o4k83M99
$$ -583 144 447 140 -90 -83 188 415 0 -119 337 70 103 236 -66 74 256 17 158 94 -189 310
2153C10j60k96K58j06J21P4m69K27L86m56J87Ml27M83j78k73L29p0j26K44m80
$$ 310 150 -146 112 6 127 201 -268 -41 345 -111 76 80 -247 236 58 -215 114 44 -82 162 -318
2174c18O5M46l47l6Q9j18K99o2m55M78J37n32K32L5OJ15l87J47N66n34k12M55
$$ -318 -253 193 -154 -190 -101 -219 80 18 -437 41 178 -354 -122 -87 -81 34 -353 -206 360 -174 -386 69
2196F9oN6l63j32P53j01q28L73M42q0j24n75O48N86q56l35O69J23r2m12j77R02
$$ 69 63 119 -244 -376 377 276 -552 -179 263 183 59 -516 132 718 -138 -473 196 319 227 -185 -362 540
2218E40k45n88K11K78n7j7k40J33J97l58J94K77l93n2L03m4j3l26o3P72l20o48
$$ 540 295 -293 -82 196 139 122 -118 15 212 -146 48 325 -68 -120 183 139 126 -200 -263 509 189 -459
2240d59K90L86J02l85n51O11O32q41j37L31J54J41n21j92P48r1l74K12k69K64
$$ -459 -169 217 319 -66 -617 -6 626 -215 -352 -21 133 274 -247 -439 309 218 -156 56 -213 51
2260E1K58n56J50K14k37K63o3l88L86J71l20P5j22J17L40l71j64M39j64q5J21
$$ 51 309 -247 -97 117 -120 143 80 -308 78 249 -71 4 -118 -1 339 -32 -196 243 79 -6 115
2281A15k47K26J85l96K55J7l44L99k8k48J16j61K42K18o28l6O52k84r1j35K2N24
$$ 115 -132 94 279 -117 138 155 -189 210 182 -66 50 -111 131 349 -279 -315 337 53 -38 -173 -151 373
2303C73k70n01L38K00k17J8j64J93J29l05R3J42k32K3K85j60j03k9J21L99m37
$$ 373 103 -398 -60 140 -77 -59 -223 -30 99 -206 -113 29 -203 -180 105 -55 -158 -187 -66 333 -104
2324a04l49M88K96l40k57nN26J62p49N1M00N5q5k63l6O00k47l46K66o8J42J39
$$ -104 -453 35 331 -9 -266 -271 255 417 -332 -281 119 174 89 -174 -210 390 143 -203 63 -5 137 276
2346B76l35oK79o6J35k96k88N33J24l30j67J22K87J57o30r4O24M7k86k69K1M46
$$ 276 -59 -65 214 148 283 -13 -301 232 356 26 -141 -19 268 425 -205 -299 325 372 86 -183 -162 284
2368B84P4n68J19L02j10J25l20j45M20k1j51l1k76K57L37n31o1J89J34J36l83
$$ 284 358 -210 -91 211 101 226 -94 -239 181 160 9 -22 -298 -41 296 -235 -296 -107 27 163 -220
2389b20k07O08k2l73M4L6J84k5k90K9L19k17n8J58l4J9r3J7J38n3j89K38N5k30
$$ -220 -427 181 159 -214 -170 -134 50 25 -265 -236 83 -134 -192 -34 -68 -49 -142 -125 13 -40 -229 9 64 -166
2413a66K3J1K38N6m37P1M31r8j89j22P8M95k82m03K58J23O8m5k80P7L46j84M4
$$ -166 -143 -132 106 162 -275 -204 227 129 -60 -182 -104 391 109 -294 -36 87 155 110 -170 -93 253 69 113
2436A13k21m1M39o8l19o9K22K85o5n42O6N50Pm60j46K90L40j69n26K20L70r9k09
$$ 113 -108 -149 290 222 -97 -166 56 341 276 -266 -200 350 357 -103 -249 41 381 212 -314 -94 276 177 -32
2459c2j71J88L13k79k24K33j8J63p1l66J91K02m4j04j45l5M49j14k69l9J63K11
$$ -32 -203 -15 298 19 -205 28 10 173 102 -264 -73 129 85 -19 -164 -199 250 136 -133 -172 -9 202
2481B02n6m01J53L55j43j43j50J51J77j56o0R7J7n2J16j77M3J4k7R3n5j68J61
$$ 202 146 -255 -102 253 110 -33 -183 -32 145 -11 -71 26 43 -9 107 -70 -27 -13 -40 53 -2 -170 -9
2504iJ92k25j4K1R9J30l06o7K86o9j27Q9j32K69k6k07L4l3M4J81j82q7J26k4J70
$$ -9 183 -42 -56 -35 64 194 -112 -179 107 38 -89 0 -132 137 111 -96 -62 -95 -51 130 -52 -139 -13 -37 133
2529A33j23k86K82J59j72j44J4J54J37k00k37L93m8q6k2o4P2J12j64k0J09j18
$$ 133 10 -276 6 165 -7 -151 -137 17 154 -46 -283 110 62 -24 -46 -110 -38 74 -90 -110 -1 -119
2551a19J33J30k77M0J45OJ01l97R5M96k56k95M0K90J90k56m12M31L24l65j59J
$$ -119 14 144 -133 -93 52 58 159 -238 -143 353 97 -198 -158 132 322 66 -346 85 409 44 -115 -114
2573a14L22J16m07o3L52n1j62j7j0K56j73q1R5J9j79J57R0j41q0l5J62J58m11
$$ -114 208 324 -83 -146 206 155 -7 -24 -34 222 49 -32 63 82 -97 60 150 9 -71 -106 56 214 -197
2596a97ML76r9k38JN3L17k64l11L74Q2k39k0M7J55J27m68K45K17k88m3R5L6N4
$$ -197 -193 183 84 -154 -153 -100 217 -47 -358 16 98 -141 -161 -114 41 168 -300 -55 162 -126 -169 -74 -38 16
2620A6j73l1L28j55k10J76J01n3L0k97J90L36l70N4J01l3R9k2k29J40J38j10N3
$$ 16 -157 -188 140 -15 -225 -49 52 -1 29 -268 -78 258 -112 -58 43 10 109 87 -142 -2 136 26 79
2643G9k54Q2L56k29j19O5O3J54j41l37M11J04k40j6LJ68k3k02Q5J71j94J5M9p8
$$ 79 -175 -93 263 34 -85 -20 43 197 56 -281 130 234 -6 -22 -19 149 126 -76 9 180 -14 1 50 -28
2667b8L1o9R0J99k45k15M37j40k29PP8K61j11l80K78L73m16j14P3J85J13m01p5
$$ -28 3 -66 24 223 -22 -237 200 60 -169 -162 -84 177 66 -314 -36 337 -79 -193 -120 65 178 -223 -298
2690b98N88j95m17K44J03R7j71l15M71J30n38J8L48l8Ol45J88N03m27k83L39J16
$$ -298 290 95 -322 -78 25 122 -49 -364 107 237 -301 -283 65 27 33 -312 -124 379 -48 -331 8 124
2712A24j01r8j70L86J47m98J98J63k13R4P0j20J07j63K5L27k68j79K74P2k22k4
$$ 124 23 -75 -245 141 288 -210 -12 151 -62 32 102 -18 89 -74 -49 278 10 -169 105 177 -45 -69
2734f9p7M68p9n04K21K32j29r0j36J34L62m33j29L08Qn9j01r6K41k2k31J99n2
$$ -69 -146 322 243 -261 -40 192 63 -27 -163 -29 333 -100 -229 79 87 28 -73 -169 72 50 -181 18 -34
2757c4j31K33j02r5O1l2J57j5k59J23K98k95o2Q6P1J28k36j17L26k4k05J65r0
$$ -34 -165 68 -34 -129 -68 -100 57 42 -217 -94 204 -91 -153 -67 4 132 -104 -221 105 81 -124 41 -49
2780d9J26n6j83K24J25l73J54K48j90q0j02K63K09m19j17L72O7k51l1j2K82r4
$$ -49 77 21 -162 62 187 -186 -32 216 26 -54 -156 107 316 -103 -220 152 219 -32 -63 -75 207 113
2802A13l09K34J81k27m8J16MM9k15J45J10j74j07K69Mj24q9J3K91j63l91K77K90
$$ 113 -196 38 219 -8 -56 60 64 113 -102 43 153 -21 -128 141 145 21 -68 -55 236 73 -318 -41 249
2825B49k26j80m3K83J45l65l8K30Jp1p4KR8k3j06J74j16j38K56Rj67o0J46K00
$$ 249 23 -157 -200 83 228 -137 -175 55 56 -15 -89 -87 11 -12 -118 56 -60 -198 58 67 -100 -160 -14 186
2849A86j33l44J85L71j94k35k4L16J06k97j77L25P9j38j77N0K07K4k70J18J16
$$ 186 53 -291 -106 265 71 -164 -188 128 234 -63 -240 85 164 26 -151 -101 106 130 -140 -22 94
2870I4j34J12o6m6Q2o6K5J13j99%L10j40q1o1J05J39j28j75J46J09j43o5J7J71
$$ 94 -40 72 6 -40 42 -24 1 114 -85 -85 225 85 4 -57 48 187 59 -116 30 139 -4 -69 -52 119
2894A19k9j55l2J41j9j03N6M7m5q1L9J50j02j54J20J40j20q3n8K52N4k68l1J59
$$ 119 90 -65 -97 44 25 -78 -22 25 -20 -101 -62 88 -14 -168 -48 92 -28 -111 -169 83 137 -131 -162 -3
2918cP5o3p4j0J52m0j01O8o6P1K0%j13R6m5J78j21k04K50J43j55k23N6L19J4k93
$$ -3 72 9 -65 -75 77 37 -64 4 -62 9 29 29 -84 12 -33 145 24 -180 70 213 58 -165 -109 210 224 -69
2944f9j10L12Q4j80k01J19K32l9k39K9J90nq4j01M7Q5M2j57P9j14N6J37j18l5
$$ -69 -179 133 217 37 -164 -45 187 148 -91 -62 128 123 39 -62 -15 70 112 -45 34 -80 -24 113 -5 -40
2968d0m8J94Qk02j11K21J28j87r5O6J23pk05M9J05M1q1l0J3Q6r7M4qj0l2J08q
$$ -40 -88 106 114 -88 -199 22 150 -37 -132 -66 57 50 -155 -106 -1 40 -41 -71 -58 28 -69 -25 -33 -43 -75 33 25
2995B5j18N8NM9k4j35J01R6j05p1Q4MJ26p5r4J07j4m5M3n3L0M3J1K6r7p2K02J6
$$ 25 -93 -35 -30 19 -5 -140 -39 57 -48 -119 -35 -31 95 20 -74 33 19 -26 17 -36 -6 37 48 74 -23 -95 107 123
3023A23j23m0R8O4K1j61m3K21n1j46j6J61J1q3r7J28L0m5p5M0QK5k6m9O7q3O0
$$ 123 0 -40 58 122 143 -18 -61 160 109 -37 -53 108 119 36 -61 67 97 52 -23 17 25 50 24 -25 42 -41 19
3050A9R6j39n3N7J38r1j01p9K43K3k31k1R7J79j38j64O3K64j37j40kJ08J06j30
$$ 19 115 -24 -77 -20 118 27 -74 -153 90 113 -118 -139 -42 137 -1 -165 -102 162 25 -115 -117 -9 97 -33
3074c3n6J14K4l2m3pN8Kr1M0L5k3J5R3j05J5J3nO3q7k9J46mj43K8R9Pp8q6J06
$$ -33 -89 25 49 17 -26 -33 25 27 -64 -24 11 -12 3 96 -9 6 19 14 77 -10 -39 107 103 -40 -12 87 94 16 -70 36
3104C6L5m4j4PK6l2o5O7K3r4L3Q2Mr5lJ18k4q7J9mK3Ojn7J8M7m7k2N3rMl4m0J4
$$ 36 71 27 13 20 46 14 -51 16 39 -55 -22 60 64 -31 -34 84 60 -27 -8 -12 11 17 16 -41 -23 24 -23 -45 8 -1 3 -31 -71 -57
3138e7K0N8Nj60O7J63q6j01MJ22O3j10j15J69N7j53L9pP6J1j18k0J35m1j2K2J4
$$ -57 -37 21 26 -134 -67 96 10 -91 -87 35 98 -12 -127 42 99 -54 -15 -22 54 65 -53 -73 62 21 9 31 45
3165D5j6N1L9j02R5r1O3rr5J8O2P1p9j45J42J47j41j60J38P4qj57m7K69j17j64
$$ 45 29 80 119 17 112 21 84 75 -20 -2 60 131 52 -93 49 196 55 -105 33 107 99 -58 -105 164 47 -117
3191a17J4J67K1n4j61J72O9j64oJ02n2l8p1j3J66l0q0N6K0k9O1kp0mq3J72j0j02
$$ -117 -103 64 85 31 -130 42 111 -53 -59 43 -9 -47 -118 -131 35 5 -75 -19 1 -28 33 31 -39 -43 -126 46 36 -66
3219f6M8O8k6l3q0N8J56j66k1J18L9q3k3l1J59p9j18J10M1n1j0j0N1O3p1j23J62
$$ -66 -18 50 24 -9 -89 -31 125 -41 -62 56 95 12 -11 -42 117 38 -80 30 71 20 10 0 51 114 43 -80 82
3246H2m1k3Rl4R2l4j05J46l0j10J28Jj21J13k4k6Nj4NP7j70O5M3m6k8j9K3R8n4
$$ 82 41 18 27 -7 85 51 -54 92 62 -48 80 81 -40 73 49 23 28 14 19 96 -74 -9 34 -12 -40 -59 -36 62 8
3275Hj22Q7M6ql6p1J44Oj67O0J32r0l2K4QJ20j35j8J07l8r9J04m3qK9n9Q1L3j28
$$ 8 -114 -27 19 11 -25 -96 48 54 -113 -53 79 -11 -43 -19 -11 109 -26 -44 63 25 -74 30 -13 -21 8 -51 30 63 -65
3304f5k7J39k7o3l9R7J32k36JJ58L1j07n5N7J37p3j81J05J09j04qO8l5N5j08N7
$$ -65 -92 47 20 -43 -82 15 147 -89 -88 70 101 -6 -61 -4 133 60 -121 -16 93 -11 -19 49 14 69 -39 18
3330A8J02q7o0M3k6J0Oj2O9n5j10J89k0k2q0n0P4L6j27K8J41r2m1RM3K7K4j20
$$ 18 120 33 -27 16 -10 0 6 -6 63 8 -102 87 67 45 -35 -85 -11 25 -102 -74 67 -25 -66 -57 -14 13 37 -83
3358h3R1Kq1O2o4JJ03o3m2O7k5K6P0j13L3L6j2j3Nk8P1j2o1O4j7L6k3p3J07j2
$$ -83 8 10 -71 -9 -73 -72 31 -32 -74 -7 -32 -6 64 -49 -16 20 8 -5 0 -28 43 31 -30 34 17 53 30 -43 64 52
3388E2j31Q6P7m2l1l9J18N9j80n7J26O5l7q3J6J24m6j22L3N5k8o9MM2O6r1jQ9
$$ 52 -79 7 84 42 11 -28 90 149 -31 -88 38 103 66 -17 -1 123 77 -45 -12 43 15 -54 -50 -8 58 -33 -34 55
3416E5q0NM9m2k1QN4K6l5j25O2L9K2m8N9k4O1j71Q0N7o4J9l7J8Q1k2j25J17Ml3
$$ 55 -25 -20 29 -13 -34 -26 28 54 19 -106 -44 -5 17 -31 28 4 65 -106 -26 31 -33 -14 -51 -33 48 26 -99 18 22 -11
3446a1k8MN9M7p2J3M6o8L4J7m9K5RpKn1nM2l7J2O6j1Ql6l0L9L6m3J0K6k8K3r1
$$ -11 -39 -35 24 71 -1 12 58 -10 24 41 -8 17 26 19 21 -30 -35 7 -30 -18 48 37 45 9 -21 18 54 11 21 47 19 42 -49
3479d9Q8M5j05j4Q9lk9p0J5R2o0o8O9P4j13O4j2Rl7j0mO6o1rK5j3l1O3o4K6Rm1
$$ -49 39 84 -21 -35 54 51 22 -48 -33 59 -1 -69 0 74 -39 25 13 22 -15 -25 -29 37 -24 -33 -8 -21 -52 11 -53 -27 -18 -59
3511e9N9J4p8p0J84K2p7n0L2R2q5l0KK9O5l3p6R6Kq7P4k6M3J9n6JkK5J6k5k5K6
$$ -59 0 14 -64 -134 50 72 -5 -55 -23 69 -16 -46 -44 -15 50 17 -59 37 39 -48 26 0 43 62 6 7 5 30 46 21 -4 22
3543B2jo3JnR1J6q8qN0O1k0m9m4O4J9j45R0k1N6n8l5P9J4j8o4K6N9M8j24M3j1
$$ 22 21 -42 -41 -46 45 61 -27 -35 15 76 56 7 -37 27 46 -99 -9 -30 26 -32 -67 12 26 8 -56 -30 29 77 -47 -4 -15
3574a5L8j0n0L0j8K5j2rL5m4M0m5rJ1J17p5L1n3l8O4j7n6M7N5m9MqN8J0Mn0po1
$$ -15 23 13 -37 -7 -25 0 -12 -21 14 -30 10 -35 -44 -33 84 9 40 -13 -51 13 -4 -60 -13 42 -7 -3 -11 47 57 61 11 4 -57
3607e7J06l5j9N2oj7Qk3OL5m7j7NJ4M0l3k3O6jk4Jk3k5M1j3J8Rl6l2K9N0q6j8
$$ -57 49 14 -5 47 41 24 32 9 15 50 3 -14 -9 5 45 12 -11 55 54 30 31 8 -17 24 11 29 38 2 -30 -1 49 -37 -55
3640e5O9Q0q5o1O2J6j9m1L7NK0n0kJ3kM4r7P9K1o8j7P0m1L0j6%l4J1oP5j6j03
$$ -55 14 94 9 -52 10 26 7 -34 3 8 28 -22 -24 -11 -13 31 -66 13 34 -34 -51 19 -22 8 -8 -8 -42 -31 -37 38 22 -81
3672h1L9Q7o5j7l0J07L1j38k3Q8R8p3o7J8R5N1j22j7O6L6j5l0q0J20l2Rm3L1L6
$$ -81 -42 45 -20 -37 -67 40 71 -67 -90 -2 96 23 -44 -26 69 120 -2 -19 47 83 68 38 -42 78 46 55 12 43 79
3701G9Pq5l4L4k2M5q1L4K7L2n8j6L2mL3r0K9M8m3O5k1ml6O9o7O8n9K1L8l0j0n4
$$ 79 86 1 -33 1 -21 24 -57 -23 4 36 -22 -38 -6 -10 23 -67 -38 10 -33 32 11 7 -29 40 -27 41 -18 3 41 11 1 -53
3733e3O1J6Jo6P4J5o9k7J7l9J30p1n9R6k0L2J3q6J5N5Rj8kj12J03K7n7j3J01K4
$$ -53 8 24 25 -41 33 48 -21 -48 -31 -70 60 -11 -70 26 6 38 51 -35 -20 35 44 26 24 -88 15 42 -15 -28 73 97
3763I7oj62K9J42l1o5n8O2N9m7o8N6P8l7oo7N6K3n5j3k1K8L4%j01N2L5J3Nm9o4
$$ 97 91 -71 -42 100 69 4 -54 8 67 20 -48 8 86 49 43 -24 32 55 0 -13 -34 -6 28 28 -73 -21 14 27 32 -17 -81
3794h1R6O6j45k4Q4P1m4q1j5Q1mm8j8L7M9l6o2Q9Pm8N2o4L1N6n4O0q2J6L9K2m6
$$ -81 15 81 -64 -88 -4 67 23 -58 -73 8 4 -44 -62 -25 24 -12 -74 15 22 -26 26 -38 -7 49 -5 55 -27 -11 28 50 4
3825Dl8N1J5L4r8l9J14Lj6j2M0k8k3k6M7K9n7J03m6J4k7k3L6L0j38J9J12k4p2
$$ 4 -34 17 32 66 -32 -71 43 46 30 18 58 30 7 -19 28 57 0 103 57 71 44 21 57 87 -51 -32 80 56 -16
3854a6j6P1M3j01r4J17N4o1N7j28M6N0o3K7jj8N9lj17P7j4N5m4m8J3J10k5j07
$$ -16 -32 39 82 -19 -113 4 58 -3 54 -74 -28 22 -41 -14 -15 -33 26 23 -94 -17 -31 24 -20 -68 -55 55 30 -77
3882g7N3j0R6r2j04J43J6J4r2L6P2M0j50L2K9M0mo5Km3J42n7l3m9L5J47p5j22
$$ -77 -24 -34 62 -30 -134 9 25 39 -53 -17 55 95 -55 -23 6 46 42 -23 -21 -64 78 21 -12 -61 -26 121 46 -76
3910g6L5P3L8o4q0R2N7k5q3PO6j5K6j00P8opj1l0J8N9k9j5L3q7P5l8j6O9o5n9
$$ -76 -41 32 70 6 -74 18 75 50 -33 -26 40 25 51 -49 29 23 16 5 -25 -7 52 23 8 41 -46 29 -9 -25 44 -21 -80
3941h0Q9n8K3L7Oo3OJ3M4j8j04PQ3o5L8K6p1R5j7m4P4m1k5R4m6m6M6k9O0Jq9L4
$$ -80 9 -49 -26 11 17 -46 -40 -27 17 -1 -105 -98 -15 -80 -42 -16 -87 8 -9 -53 21 -20 -45 49 3 -43 3 -26 34 35 -54 -20
3973b0R4q8O1m3RR0j15L%P4o9L7o8O0J0m5L6l9K9M0n3j05J26mj4no3P1L9p4l0
$$ -20 74 -14 47 4 13 103 -12 -9 -9 65 -4 33 -35 25 35 -10 26 -13 16 56 3 -102 24 20 6 1 -62 9 48 -26 -56
4004e6J2J19m7r8qQ9J8n8k1J1P4m8J3J9m2L7j9QPo4L4l3N7p8L0R7o7J4l1%L6R
$$ -56 -44 75 28 -70 -78 11 29 -29 -50 -39 35 -13 0 19 -23 14 -5 3 10 -54 -20 -53 4 -74 -44 53 -14 0 -31 -31 5 14
4036A4j0pJ6k9M6k2k5K4M3m1K2Nm6Q3p2k8L5M4Np2K2oLjJ1m7O9j1l2K3M7n9k0
$$ 14 4 -3 13 -16 30 8 -17 7 50 9 31 36 -10 73 1 -27 8 52 57 -15 7 1 4 3 14 -33 36 25 -7 16 63 4 -16
4069a6K9Om1M1J0r4M9j6N7j9n2N7JJ6k0k7K0L7j4q0K6M6L0o1j%J5j8Nnl3O4o7
$$ -16 13 19 -22 19 29 -65 -16 -32 25 6 -46 11 12 28 8 -19 1 38 24 -56 -30 16 46 -15 -16 -16 -1 -19 -14 -19 -52 12 -55
4102e5K7K9J1l8KoK3M7k2J1q0M8qJ5K3j2j3Pj5m3L8K4L8n2MnOJ6n5O9L3m7k7M2
$$ -55 -28 1 12 -26 -24 -30 -7 40 18 29 -51 -3 -11 4 27 15 2 9 -6 -49 -11 13 51 -1 3 -2 4 20 -35 34 67 20 -7 35
4136C5Lk9N6j09N5l2M0k7M8k6k6lN2qo2M2o4J03r4K5L9k6k4j7J8N9nL0p4rN2j
$$ 35 38 9 65 -44 11 -21 19 -8 40 14 -12 -15 37 29 -33 9 -55 48 -46 -21 18 -8 -32 -49 -31 28 23 53 -21 -30 22 21
4168B1m1j0J5K9j1j9m5O1N5j17J9jQ8o5k4qN4kL2m7k1J3N1J5p2PN0k2K3kKL3q3
$$ 21 -20 -30 -15 14 3 -16 -61 0 55 -62 -43 -44 44 -21 -45 -53 1 -1 31 -16 -37 -24 27 42 -30 -23 27 5 28 26 28 61 -22
4201b2nJ7nJ05q2n2N1N9p5k0N7m0J1L5jJ1p8O4m7L4J3m0K5j5j5j7M5Lrk5J4j0
$$ -22 -27 -10 -15 90 8 -44 7 66 -9 -29 28 -12 -1 34 33 44 -34 30 -17 17 30 -10 15 0 -15 -32 13 16 7 -18 -4 -14
4233a4J2l8K2K6Qp9M3k2qP6m3J7LJ4K5m4p8Q0N0k0k8n3R4ql3k2k5P5J1m5m7P0
$$ -14 -2 -40 -18 8 16 -63 -20 -42 -50 26 -17 0 3 17 42 -2 -80 0 50 30 2 -51 43 35 2 -20 -45 30 41 -4 -51 19
4265A9N4j23j2Q8j0jn8L4J0Q4m8n3kj7P2l8m3J8M8Ljk9J7J6Jk9j4K8R4q1o1J6
$$ 19 73 -50 -62 26 16 15 -43 -9 1 85 37 -16 -18 -35 37 -1 -44 -26 22 25 24 -5 12 28 29 0 -14 14 108 27 -34 -18
4297a8N3ql0o9J03L2o5K4q8J4R1p2N4l3K7Rm2m4K2P2n4l4k4J00pj5m2M1kj0K2
$$ -18 35 27 -3 -72 31 63 -2 22 -66 -52 39 -33 21 -12 15 24 -18 -62 -40 32 -22 -56 -80 20 13 -2 -44 -3 -5 -15 7
4328Gn3N9J6K8m0m5L4L2o2L7pm7Q0j3j7l7N3j9k6M0j4P6o8j1K2kRj5n0k0J07q
$$ 7 -46 13 29 57 17 -28 6 38 -24 13 6 -41 39 26 9 -28 25 6 -20 20 6 82 14 3 25 23 32 17 -33 -53 54 46
4360D6k7l1nR2k5k8j0K8k7K5n5j0N9L8n8r3Q8RQm0J0K3rPm7O3Qn3J9m0J2K8K3
$$ 46 19 -12 -17 75 50 22 12 40 13 38 -17 -27 32 70 12 -81 7 16 24 -16 -6 17 8 15 -32 31 39 -14 5 -35 -23 5 28
4393B8p9kL0K0Lk0j2J02k9n5K5o4J16r6O%N4l2O8n1o7J00k1m3m4P7k5L2k9j2N8
$$ 28 -51 -53 -23 -3 0 -20 -32 70 41 -14 11 -53 63 -33 -27 -27 27 -5 63 12 -55 45 24 -19 -63 14 -11 21 -8 -20 38
4424C8ok8m2N2j3mo6L4N9k3J6k4J2K7j1m1oL2J1Jk7J8j9N6l7n0O0Ql1OK8n4M5
$$ 38 32 4 -38 14 1 -3 -69 -35 24 1 17 -7 5 32 21 -20 -26 6 17 18 -9 9 -10 46 9 -41 19 27 -4 2 30 -24 21
4457B1NLQq0L4k8L2k5lj7Q5m4l2rM3M7j20P9l9O4n3n9N7L2M2q5l3Q8N7p4k7L8
$$ 21 26 29 37 -43 -9 -37 -5 -30 -33 -50 35 -9 -41 -50 -7 40 -80 -1 -40 24 -29 -88 -31 1 43 -42 -75 13 70 -4 -31 7
4489GJ1L3l5k8pR4k8qo1J1P3k5k8l6K9K3k9l2O4L1n2j2L0J8L1m1q1N4k9L9p4J8
$$ 7 18 51 16 -12 -19 75 47 39 -22 -11 62 37 9 -27 2 25 -4 -36 28 59 7 -5 25 43 74 33 -48 6 -23 16 -58 -40
4521d0P2n1J7n0R0p6R7r0j5O9nK1ql0J9%j0n2%L9K9j4j8K7l2%J7j9l4O1k0J1m3
$$ -40 32 -19 -2 -52 38 -38 59 -31 -46 23 18 39 31 1 20 20 10 -42 -42 -3 26 12 -6 21 -11 -11 6 -13 -47 14 -6 5 -38
4554c8J0K6j4K7MM7p0K8l3RK2k3j4L6Pm8P5j3l2k7P8k6l4K1mk3K4j5M0j8j2K7
$$ -38 -28 -2 -16 11 15 62 -8 20 -13 -4 18 -5 -19 17 24 -24 51 38 6 -21 57 31 -3 18 14 -9 15 0 40 22 10 37
4586C7Mm1j7J8j6j6K7J7K1n9k5P7l1pk1P8n6K4M5q9L3K6l3qK9j0j2o9N3K1M0j1
$$ 37 41 0 -17 1 -15 -31 -4 13 34 -25 -50 27 -4 -11 -32 46 -10 14 59 -30 3 29 -4 -12 17 7 -5 -74 -21 0 40 29
4618B9l8J0N4p0K7l0J0OM2m9k2M1J7o4J7J4%nOJ9J8l2Mk6J3L0kPk7L6Nl2l7M2
$$ 29 -9 1 55 -15 12 -18 -8 -2 40 -9 -31 10 27 -37 -20 -6 -6 -11 -5 14 32 0 4 -22 -9 21 19 26 -1 35 40 8 -29 13
4652A3j4L2j0Jk3L7m4OlQL8p7O6l9Q1n7l6L4n9N9n7R3q7L1rqpL7mj1l4J2K6K1
$$ 13 -1 31 21 22 -1 36 -8 -2 -5 3 41 -36 30 -9 72 15 -21 13 -46 13 -44 49 -38 -7 -16 -24 -31 6 2 -9 -43 -31 -5 16
4686A6l5m0J2M8K3lLkj1oJ4k7K3n5M8k1l3O3j0L5m4kOJ4j1kj7L5n5K9J3Pk7M0
$$ 16 -19 -59 -47 1 24 21 24 22 11 5 19 -8 15 -40 8 -13 -46 17 7 42 -2 -4 2 16 5 3 -14 21 -34 -5 8 15 -12 28
4720B8j5k4J5NlJLj5J3l0J9J9J5kl1l2M1P1p0j8O1jj2p7j1Q3lo5L1K7l1K5k2m
$$ 28 13 -11 4 9 6 7 10 -5 8 -22 -3 16 31 29 -2 -34 7 78 8 -10 51 50 38 -39 -50 33 30 -35 -4 23 -8 17 -5 -9
4754iJ1j9M2q5O6M1nm5l0L9j0l8M5qN3k7j1j%L8om0qN5r9N3j4J6J8l3J8n4M7L
$$ -9 2 -17 25 -60 6 47 42 -3 -33 6 -4 -42 3 -5 48 21 10 9 9 47 41 1 -7 48 -51 2 -12 4 22 -11 7 -47 0 3
4788Cj0j5jk6RO3j1j1J8j5K7Km2L6m2j4M7m0kK9k0pRL5L5jl3lmj5Po2J4O7o5j0
$$ 3 -7 -22 -23 -49 -40 23 12 1 19 4 31 33 -9 27 -15 -29 18 -22 -24 5 -15 -22 -13 22 57 56 23 20 16 1 8 -54 -40 27 -38 -48
4824d8J5lO2k0n2L2J7J6m0l6K0K4J5Rk2K2J4m4J0l3rO0k0pK8J2k2J7l3L0J4m6
$$ -48 -33 -36 26 6 -46 -14 3 19 -21 -57 -37 -13 2 11 -11 11 25 -19 -9 -42 -51 9 -11 -18 10 22 0 17 -16 14 28 -18
4856a8Oj5L4K3Qk2K4l5j9oK7Rk0L6n2M0K0j3j5l1K0j0J2J3mj0k0K7J3o1J4M6j1
$$ -18 -12 -27 7 30 38 16 40 5 -14 -20 7 16 -4 32 -20 20 40 27 12 -19 1 -9 3 16 12 2 -18 9 22 -39 -25 21 10
4889A0jN9l3m3Pl2P0j8Nl1N1o9j2N5lK3l7L4q1N1j8k5L9j2KoOM6p8j9KK3Qk4O6
$$ 10 9 68 35 -8 -1 -33 37 19 24 -7 44 -25 -37 18 15 38 1 35 -46 5 -13 -38 1 -11 -9 -15 -9 37 -41 -60 -58 -35 -27 -51 15
4924A5j9l0J8L4j2J6L2j20O0L9K0l8m4lP0nNl9oN6k9k5jmK6l0joL0k1M1o2N2j7
$$ 15 -4 -34 -16 18 6 22 54 -66 -6 33 53 15 -29 -32 38 33 38 -1 -7 49 20 -5 -6 -10 16 -14 -15 -21 9 -12 29 -33 19 2
4958BkrK3KJ9Ln3j9M4m1M1j8j1L9n8M7k2M7l5q3M0P2l3j3L4k8O9q2lJ2j9N1o4
$$ 2 0 -9 14 16 35 38 -15 -34 10 -31 10 -8 -19 20 -38 9 -13 34 -1 -84 -44 28 -5 -18 16 -12 57 -25 -28 -16 -35 16 -48
4991d8L5Mjn3J9O5o6J1N2Jk6L8n7L3LK3k0k5kM2M1j31M4K4O1rq5Q6m2L8j5l0j9
$$ -48 -13 -9 -10 -63 -44 21 -45 -34 18 19 -7 31 -26 7 10 33 13 -12 -14 28 69 -62 -18 6 67 58 -27 59 17 55 40 10 -9
5024iL5l7Ql4P7m1M0k1l1K7kl2J4J7kM4p7L9K2l8jj4k%L7n1M7k7K6l7J1jkN4j3
$$ -9 26 -11 -3 -37 40 -1 39 18 -13 14 12 -20 -6 11 9 53 -24 15 37 -1 -2 -16 -18 -18 19 -32 15 -12 14 -23 -12 -13 -15 39 26
5059B6q5N1M8o1rJ3K0lRk6L2rL5o5O1o0KK2K9k6Nl8M1l0K9j0n8K1O6n9L8N2n0
$$ 26 -59 -8 40 -21 -30 -17 3 0 9 -17 15 6 41 -24 37 -23 -21 1 30 4 9 -29 12 -18 11 1 -57 -36 30 -29 9 61 11
5092A1J2j8k0P7Mj02R7j9l8kJ7j9LK5j0m1nM4jn3J8K3L1n7J7K0m2jK6kOK0O5j20
$$ 11 23 5 -15 62 66 -36 61 42 4 2 19 0 3 28 18 -23 -28 16 15 -38 -20 3 34 -23 -6 14 -28 -29 -3 -5 1 21 86 -34
5126c4M8l1k1K7j3J9K3l8j0PN3J8m8J0J8k2J2n2L5p0R2n6K8m3M6M1l6l6N5j0N
$$ -34 14 -17 -38 -11 -24 -5 18 -20 -30 -23 30 48 0 10 28 6 18 -34 1 -69 23 -33 -5 -48 -2 39 3 -33 22 12 17
5157A7K8r9N3L1n4K9j7JK0K7%l3k4P3l2m5P6k7k7k9K3L3K2n6M6m1K4n7K4k7N7
$$ 17 45 -54 -1 30 -24 5 -12 -11 9 36 36 3 -21 52 20 -25 51 24 -3 -32 -9 24 46 -10 36 -5 19 -38 -14 -41 16
5188A6PJk7RQL2Lq5oJ1O4m8l1O3l8l9P8j8jj1N0j02O0K6J6j02L5ML9Mk0K9o4O5
$$ 16 23 24 -3 6 14 46 49 -36 -42 -31 33 -15 -46 17 -21 -60 18 0 -1 -12 38 -64 -4 22 38 -64 -29 -25 14 18 -2 27 -37 28
5222B8Jk8k5JL2M9m4j5k7N2m2O6l7j3m3L4l4O4Oo0K4K8N6p6J5m7N3Rl2m7nP4M8
$$ 28 29 1 -24 -23 9 58 14 -1 -28 24 -18 48 11 -2 -45 -11 -45 19 25 -35 -11 17 73 -3 12 -35 18 27 -5 -52 -57 17 65
5255F5j06Q2l7jJ3l7l2M9k8R4m8J3p0M2m3j5N4J3k0L2j6J0k5mj0K8m8J9P1m3j8
$$ 65 -41 41 4 3 16 -21 -53 -4 -32 62 14 27 -43 -1 -44 -59 -5 8 -12 20 4 14 -11 -15 -25 3 -45 -26 45 2 -16
5286a6k8Q9m1J2krJ1j5n6Q5k3l4M4p5O4MJ0m7oM1K1Jo7J9RO1k6j7k5K2Oql4O6
$$ -16 -44 45 4 16 14 5 16 1 -55 30 7 -27 17 -58 6 10 20 -27 -33 8 29 30 -37 -18 -9 52 26 9 -16 6 12 4 -30 36
5320C6k8K3m3L1j0J2o1L5qM1qrl9M8M5o2j9J3j8M9m7JK5J5Nm9N3l8knk2L6P3j17
$$ 36 8 31 -12 19 9 21 -40 -5 -13 28 20 11 -28 20 65 3 -16 -3 -21 28 -19 -18 7 22 27 -22 31 -7 -9 -14 -36 0 73 -44
5354d4k1L9k5O3K1j04P0J9k1k0J9QJj2k2N5l4qL4k6K3j0rmJ5j4l5J1J6j1J7J5
$$ -44 -65 -26 -51 12 33 -71 -1 18 -3 -23 -4 4 5 -7 -29 26 -8 -16 18 -8 15 5 -4 -8 7 -7 -42 -31 -15 -26 -9 6
5386FpM1m2lj2J4K8k5mpoRQ0q1QJ9n1Nk3O0mk6K1K6K3q5M2L5n5N0l7KM1l7jj6
$$ 6 -1 40 -2 -5 -17 -3 25 0 -4 -11 -17 -8 72 -9 -1 18 -33 -28 -51 9 5 -21 0 26 49 -36 6 41 -14 36 -1 1 42 5 4 -12
5422a2L8j3j1mlM1o5N8k9k7J2j2qk3K2J5K8q2R2J8j5n1M2Ol8LJ6l7N2L4m6ml2
$$ -12 26 13 2 -2 -5 36 -29 29 0 -27 -15 -27 -35 -58 -36 -21 7 -75 17 35 20 -31 11 17 -21 -18 -2 -39 13 47 1 -3 -35
5455c5M7Om0O0o6L2lN1k8l5J6k8qQ0k7K1o2PL5n6L0Rm0P4n5N7o6rN4oKm5L5rJ
$$ -35 12 18 -22 38 -28 4 1 52 24 -11 5 -23 -31 49 22 43 -19 -12 23 -33 -3 6 -34 40 -15 42 -24 -33 21 15 17 -28 7 -2 -1
5490aQl6J5l7M1MjL3r5N2J9qJ1J1J7n0K0rn3M9j9K2Nl7J7O1k5o0K7lk8K9J9j7
$$ -1 7 -29 -14 -51 -10 -6 -7 26 -69 -17 2 -6 5 16 33 -17 3 -6 -59 -10 -29 -7 -2 -39 -22 39 14 -46 -19 -22 -50 -21 -2 -19
5524a9J9j7K6rll4N2J4l0j7J0J0J0j6o8Q7Qp0N3oJ1J0J3l5l0K4N7j01M0O3m0N
$$ -19 0 -17 9 0 -3 -37 15 29 -1 -18 -8 2 12 -4 -72 15 23 -47 6 0 11 21 34 -1 -31 -7 50 -51 -11 52 12 17
5556A7k4L0j3k3j8L2k3L6M4q3N0q0L3O6m7qj2L1k9N1K1k3o6K2kLk6l6M3K9pJ7
$$ 17 -7 23 10 -13 -31 1 -22 14 58 -25 25 -55 -22 44 -3 -11 -23 8 -21 30 51 28 -38 -16 -18 -15 -41 -77 -34 -5 -12 5
5588Ej7qn0O6n2M0J1j8L7m8J5j2K7n8J24qm2j7J1LKoJ9rk1rL1J6n5%L4j9lK9l4
$$ 5 -12 -20 -70 -4 -56 -16 -5 -23 14 -34 -19 -31 -4 -62 62 54 12 -5 6 9 11 5 24 15 -6 -15 16 32 -23 -23 11 -8 -11 18 -16
5623a6M9o0J7N8l3j8l5O2m5KMK5J0k4k2M6j2K0l8LoJ0L8n4M1j0mlJ3l3J2rk4K5
$$ -16 33 -27 -10 48 15 -3 -38 24 -21 -19 -15 10 20 -4 -26 20 8 28 -10 -7 -13 -3 35 -19 22 12 8 5 18 -15 -3 -12 -36 -11
5657a1J1K5r9J21n3LlML2n6N1k2j0K2j1J3o6O3j2jKmqO6m7J6Jorn8LQ1k2J6m5
$$ -11 0 25 -74 47 -6 -3 -6 -2 30 -26 25 3 -7 15 4 17 -49 14 2 1 3 -1 -9 57 10 26 27 21 12 -46 -43 38 16 32 -13
5692a3P0n6M1n2L0k6j1LM7m5L9m3pP9l9l4k1K6M0K0o4nK7Jn5O4l9n0J02m3K5j0
$$ -13 57 1 42 -10 20 -6 -17 -14 33 -12 27 -16 -23 56 17 -17 -38 -12 28 48 -16 -21 6 7 -48 16 -23 -73 29 -14 11 1
5724AJ4j3k7oO7k4j0n4J3N8J3K4k7%k0J4L7j7r2M8k3J5j8O6Oj24P3lM2k2m9L6
$$ 1 15 2 -25 -31 36 12 2 -52 -39 19 32 56 29 29 9 23 60 43 -49 -1 -24 -9 -27 39 45 -79 -6 -9 33 11 -38 -2
5756bj0j1J1O1o5kJ1jqL6OQK4o6L3j3j8k2M5n0R4k1lj9j0n3N0mm8qN8J6mk9J8
$$ -2 -12 -23 -12 49 -16 -18 -7 -8 -16 20 26 34 58 -8 25 12 -6 -28 17 -33 61 40 37 18 8 -45 5 1 -47 -55 3 19 15 -14 4
5791Dk2J1oj1j5P2o8N0k8K6J8o6N8l5K7n2k0N2rN4j2Rn9K8K0j5j1J2L6j3J5n0
$$ 4 -18 -7 -13 -24 -39 33 -35 15 -13 13 31 -35 23 -12 15 -37 -57 -5 -14 40 28 37 -22 6 26 11 0 12 48 35 50 0
5823@N0k4Lk7M1Kn1J5QJ7m0l0j5N6j2J7n1JN2J0l8j9N7k2K6k1O6m1j8JK2k8l4
$$ 0 50 26 29 2 43 45 -6 9 17 34 -6 -36 -51 5 -7 10 -41 -40 12 22 -16 -35 22 0 26 5 71 30 12 13 35 7 -27
5856b7M4K1l8J1J8j6j00J32k6Qo0N4m2K5j1K5j0l9L9J9m8rN0jo4J5N6m3L5l1K2
$$ -27 17 38 0 11 29 13 -87 45 19 27 -33 21 -21 4 -7 18 8 -31 8 27 -21 -30 20 19 -45 -30 26 -17 18 -13 9
5887Ij2L2j6L3q8L6N0j4j0m3O4m7%J0LJ2Qm0N8m5L3nm7QlN6n4j6M9k5M2n3PM5
$$ 9 -3 29 13 46 -42 -6 44 30 20 -23 41 -6 -6 4 7 19 27 -13 45 0 33 28 -19 -11 -14 42 -12 -28 21 -4 38 -15 -8 37
5921C7m2J2jOK2n6K9J3k6pN4l1k1J8jj7M1k6k1M6K3n7J2j2k0M0pj3k1N8k3K4q0
$$ 37 -5 7 6 12 34 -22 7 20 -6 -13 41 10 -11 7 6 -11 30 4 -17 29 52 -5 7 -5 -25 15 8 -5 -26 32 9 33 -47
5954d7M5PKk2J8l4L4m4L2L3m5J2Ml5R4l1o4M0M0Nl2l3K7RpLJ6k4l2O7p1L6K3J3
$$ -47 -2 5 7 -15 3 -31 3 -41 -9 24 -21 -9 -5 -40 54 23 -41 -1 39 44 12 -21 6 15 8 11 27 3 -29 38 -33 3 26 39
5988C9Lmk7k2PPJ4m3Q2p6K8Jom0M4N0m4N0j17M3%J3n0P8j3L3k3q0P2j0J3L1n4
$$ 39 42 38 11 -11 -4 3 17 -26 56 -20 8 9 3 -37 7 57 13 63 -54 -11 -11 2 -48 30 17 50 27 -53 19 9 22 53 -1
6021aoj4mK3j4Q1r1QpJ8N3l0j5J4Nj3MnOPk5j5K8J8p7R8n3Q4j02P3l5N9q1K0j4
$$ -1 -7 -21 -25 -2 -16 65 -26 -18 -25 -7 46 16 1 15 20 7 11 6 12 19 -6 -21 7 25 -52 46 -7 77 -25 48 13 72 -9 11 -3
6056cJ4PJ5k6Mj3NN3j7Ml6K2j3Km5N7n6L5l0L9Mm1J4pk9M0n9J29Jr5M5n5L3N1
$$ -3 11 18 33 7 11 -2 3 56 39 43 7 29 16 18 -27 30 -26 9 -21 18 22 -19 -5 -12 -41 -1 -60 69 70 -25 20 -35 -2 49
6090D9o2K0k0l4%L1L4LK7o6K3rm6L9j2k9Q8n3P3n5l0L1J5m1L3M0p5RK1m1P1m9
$$ 49 -13 7 -13 -47 -47 -16 18 21 48 -18 5 -4 -50 -11 -23 -52 36 -17 56 1 -29 2 17 -24 9 49 -26 -17 4 -37 34 -15
6122a5M4m4O7p5JQ2p9L1Np3J06l9l8L3PK3l8N3k0k1k6j0j6P7m2J9Ll1K1Kj1pQ5
$$ -15 29 -15 52 -23 -22 60 -19 12 17 -56 50 11 -27 6 13 36 -2 51 31 10 -16 -26 -42 35 -7 12 15 -16 5 7 -4 -11 74
6155G4j12M0lj3O4n8%qkJ8l6J9k3N3L2k1l1k9M4K0J0rml3L2pl3Jmmj4O0Oj3j7
$$ 74 -38 2 -1 -14 50 -8 -8 -16 -18 0 -36 -17 -40 13 45 24 -7 -36 8 28 38 29 25 -8 24 17 -16 -15 -19 -23 -37 23 29 16 -1
6190aK9j9Jmj6N4m1LK5m2Lj2K1J3L2k3J6ll3K1k6J2Mqk9M5m5rPk0Q1n5nM6k0K4
$$ -1 28 9 10 6 -10 44 3 6 31 -11 -8 -20 1 14 46 23 39 36 3 24 -2 10 14 6 -23 22 -23 -32 -25 -45 36 -19 -24 22 2 26
6226B6k0k1L2K2m7%m3K8P7r7M8qJ8k2j5J9k2K4J9k2J2o6Q3m4K6j3k1K9l7j6O6
$$ 26 6 -15 17 39 -8 -8 -51 -23 54 -43 5 -3 15 -7 -22 -3 -25 -1 18 -4 8 -58 25 -19 7 -6 -27 2 -35 -51 15
6257A5q6N9N3n7Rl1P7m2MOk6j8L8NO8j11R4n8qM3o7N8k8nj1K9Kl5O8%l6K4n1L1
$$ 15 -71 -12 41 -16 -7 -38 39 -3 1 7 -19 -37 1 6 74 -37 57 -1 -9 34 -33 25 -3 -8 -19 10 12 -23 45 45 9 33 -18 13
6291A3j1Q5n4j8l9P6n7L2l0j1l0J9L5J3m1j4M1k3qJ1M5l1Rn3M3RK4m7k0M1qmj3
$$ 13 2 87 33 15 -24 52 -5 27 -3 -14 -44 -25 10 23 -18 -32 9 -14 -22 -11 34 3 12 -41 2 11 35 -12 -32 9 1 -3 -16
6324a6PL8m1L1Ko1N9J2M8p2k1K4L9J5m9%J4jo2K8L9l1qL8l7RL3l3JK5k8l5J4M7
$$ -16 -9 29 -12 19 21 -40 19 31 79 7 -14 10 49 64 15 15 29 28 -34 -6 33 2 -6 32 -5 4 37 4 5 30 2 -33 -19 28
6358B8m4pqrO6j9n0qR6l4k9p%R8q6NL2j0n4N6k4O1k5%l2P3n4j7j0K5m2j2NM2n8
$$ 28 -16 -23 -31 -40 26 7 -43 -51 45 11 -18 -25 -25 73 -13 -8 24 14 -40 16 -8 53 28 28 -4 69 15 -2 -12 13 -29 -41 -36 6 -52
6393e2L6J6k8O1q4J02r5O7m2j5L9jPL5m1j6K3K4n1N6k7o3Q4j01R1J3l6n6P4j6
$$ -52 -16 0 -28 33 -51 51 -44 23 -19 -34 5 4 11 46 5 -11 12 36 -15 41 14 -49 35 -66 25 38 2 -54 20 4
6423Dm8M1k0JL1m3K9NppK9Pn3L2n7N2oL4n5qON1l6L5jl5N6l1J6l4jM6n1OM4l6
$$ 4 -44 -3 -23 -22 9 -34 -5 0 -7 -14 15 22 -31 1 -56 -4 -10 24 -31 -39 -33 18 -18 17 16 -19 37 6 22 -12 -13 33 -18 -12 32 -4
6459dl2P0j7J3n6M7J1k4rlkm2Q7j0m7l3J12k4l4m6P6ro7m0M4L3K0k0K3k6K4m5
$$ -4 -36 34 17 30 -26 21 32 8 -1 -4 -6 -48 39 29 -18 -51 61 37 3 -43 33 24 -43 -83 -39 -6 14 -6 17 -9 15 -30
6491c0j0L3PL3qJ3m2K2j7nk6L1qpJ0J4L2m4j0l8J22j42O8Ol5L7j3rNOj3Q6q4J7
$$ -30 -40 -7 0 33 25 38 -4 18 1 -4 -30 1 -7 -14 -4 10 42 -2 -12 -50 72 -70 -2 4 -31 6 -7 -16 -11 -5 -18 68 -16 1
6525AkJ1L4k7l9L2l1O3j23J00l7N4K4r6J8L3M7l6l3QP0r2PqJ0L1m8L4k5RJ9l3
$$ 1 -1 10 44 17 -22 10 -21 42 -81 19 -18 36 60 -36 -18 15 62 26 -7 1 71 -21 -14 -22 -12 19 -29 5 -20 -11 8 -25
6557b5JJ7K0j1J4%l7L1J7o9M2rJ1l1K1L3K4m9J2n5O4J0k2pJ7Rk9M%J3KkMl1J3
$$ -25 -24 -7 13 2 16 16 -21 10 27 -42 0 -9 2 -29 -8 25 49 0 12 -43 21 31 9 2 19 28 -1 3 3 16 18 16 20 -11 2
6592Bok2J3M9J0j1j0l0j3l1L9Kj2L4J2lj1l9O4m0nM0pK9m4q1N8J9m2R2p4J5m2
$$ 2 -4 -26 -13 36 46 35 25 -5 -18 -49 -10 -8 -20 14 26 23 12 -27 37 -3 -8 32 25 54 10 -71 -13 6 -36 56 -18 -3 -45
6625d5K8O5m8J5j11P1K4j4mKJ6L3o9Q0p6Q5m1Jlnlm9Q1L6kk2jj2k9N5j0K0k3l1
$$ -45 -17 48 0 15 -96 -25 -1 -15 -19 -17 -1 32 -37 43 -33 52 11 12 9 4 1 -48 33 69 67 45 44 32 3 58 48 68 45 14
6659A4J4n0O7%q9L9n5R7l1Rj5n4Q2j8Pm4M2K2n6M1m7J8jJ4ok6P4p9KM0J4k2M3
$$ 14 28 -22 45 45 -44 -5 -60 37 6 15 0 -54 28 10 17 -27 15 37 -19 22 -25 -7 -8 6 0 -26 48 -31 -29 11 25 3 46
6692D6m0pl8L6m1N6L7j6qj0J4nk1K5k7j4l8K5M3n6j8O2o3L2M2kRj8o1P8K1m9J5
$$ 46 6 -1 -39 -3 -44 12 49 33 25 15 29 24 3 28 1 -13 -51 -26 17 -39 -57 5 -58 -26 16 14 23 5 -56 22 43 -6 9
6725IPPPp2mL4jL0n4N8Mq2O8J0OPoL9m8n7N4n5O5l0K9m6nJ9o6N9L6k4k8P2q9O8
$$ 9 16 23 30 -42 -46 -12 -13 17 -37 21 25 -57 11 21 27 34 28 67 19 -38 16 -39 26 -4 25 -21 -26 -7 -73 -14 22 -2 -30 42 -47 21
6761B1l4l0RL1M5k7rl0J2j3P1k4m3J7JO9r2L7%j5j9M5m5mJ7j1L3J4k7j3k7rM6
$$ 21 -13 -43 -34 -3 42 15 6 -24 -12 -25 46 22 -21 -4 -3 66 -26 11 11 -4 -23 22 -23 -27 -10 -21 12 26 -1 -14 -41 -50 -4
6794dMK9j8m1J4k6K9L9p1L0jL5l8O1m2l2N1Rk1L4n4N2m2l0Pj1L7K0oj8N8m8Oj4
$$ -4 0 29 11 -30 -16 -42 -13 26 -45 -15 -16 19 -19 42 0 -32 19 28 7 41 -13 39 -3 -33 -26 -37 0 20 14 -4 54 6 12 -2
6828bj7K6m9M3MJ3k3jnJ2oLj3mm1L3J1oj3N3k6k0K3o7J01k0N4p4k4Nk5N4K3K2
$$ -2 -19 7 -42 1 5 18 -5 -6 -11 1 -5 -2 -15 -19 -60 -27 -16 -22 -35 18 -8 -28 -5 -72 29 9 63 -11 -35 -30 -55 -1 22 44
6862D4p9QM0nl0P7q3Q1m6Qj4PL5j7p0L9Pn3K9QK2k6J6M2m7M9k4k3j9LN3l1j6j2
$$ 44 -35 -27 13 8 -22 55 -28 53 7 15 1 8 43 26 -44 -5 2 -51 -22 -14 8 -18 -2 40 -7 42 18 -5 -24 -21 32 1 -15 -27
6896b7K9L2p9O3K2L8n3m2K6MNno6R0l5j9nQK8k7j3M8j1J3k4L1n4l8N3rLk7J11
$$ -27 2 34 -45 18 40 78 25 -17 9 13 18 13 -53 37 2 -17 -22 -14 14 -13 -26 22 11 24 0 31 -23 -61 -8 -17 -14 -41 70
6929G0k1n1J8m1J9m8N5k7J9Mk5RL4K0o0J03o9K7l5l9R9Jo3k5K0NOk6L2m8R0n0
$$ 70 49 -2 16 -25 -6 -54 1 -26 -7 -3 -28 -19 15 35 -25 78 9 36 1 -38 61 62 -1 -26 -6 -1 5 -21 11 -37 53 3
6961CML0n4j5P0o8L2oJ9q%K6m2k1M0k4N6l4K1j6K2j1m0K9M8o6MK1M9p7N7M0j19
$$ 3 7 37 -17 -32 38 -30 2 -4 15 7 7 33 -9 -30 10 -14 42 8 29 13 35 24 -16 13 61 -5 -1 20 69 -8 49 89 -30
6994c0PJ4jRj9Nk5k8O7M9q3N7Kn0N8o1PM2%j1O6m3k5k3J10j9p4O2j06K9JL3PM6
$$ -30 -23 -9 -10 -1 -20 -15 -40 -68 -1 48 -35 22 24 -26 32 -29 -22 20 20 9 75 32 7 -16 94 75 1 63 -43 -14 -13 20 27 73
7028G3n8l2kL6n2j5Q3K9k6m9Pk8J3j1P3l2Nl4J7L9n1L3m2K6J2J9m1n5L2K0L3j3
$$ 73 15 -17 -19 17 -35 -50 33 62 36 -13 -6 -34 -21 -32 41 9 14 -20 -3 36 -15 18 -24 2 14 33 -8 -63 -31 -11 22 9
7060I%rJ5k2Rj8J6qL0nj8k5L8j3k8K5j3M2l1J1K0Kl2L6p8N4l7j1O2K2mo0QR%m
$$ 9 9 0 15 -7 2 -16 0 -8 22 17 -1 -26 12 -1 -29 -4 -17 25 -6 5 25 27 -5 31 -47 7 -30 -41 21 43 39 -21 -13 -4 -4 -8
7096hK0j5k7N3k0K5oL1j9m0RL1o0L2K8o2K2klk4P5n9N5J4o9J0M6lrn3M9l6M3j3
$$ -8 12 -3 -30 23 3 28 22 53 34 -6 3 34 -26 6 34 -28 -6 -8 -11 -35 40 -19 36 50 -19 -9 37 34 25 -28 21 -15 28 15
7130A5pqL6r1J11k1J7J7o3qkj2j3qJ0L7j7K0jn1P7l5mj1J3m0O7n4p4Q9R7o9JJ4
$$ 15 8 0 36 -55 56 35 52 69 6 -2 -4 -16 -29 -37 -27 10 -7 13 12 -39 38 3 -1 -12 1 -39 28 -26 -100 -11 86 17 18 32
7164C2k1K0r%j9j8L3j2M1kl9%k0N5j9Q%k3M4l2Jj6Qj8L1k2j8L9m0J4J3Qm9O7n8
$$ 32 11 31 22 22 3 -15 18 6 47 45 6 6 -14 41 22 30 30 7 51 19 20 4 12 -6 25 3 -15 24 -16 -2 11 19 -30 37 -21
7199b1J1MQl6N3l3K8l1J0J6j4K1k3JJ2l4M5Qqj2%j7M6rl5K5j9j5M6l5m8L4P6n9
$$ -21 -10 -6 2 -34 19 -14 14 -17 -7 9 -5 16 -7 -6 6 -28 17 25 17 5 5 -12 34 25 -10 15 -4 -19 27 -8 -56 -22 54 -5
7233eL3l3L1m2%O2m4J7l8K9NK1n9M1JJ3l0j2J5k9M7Km4M1n0M4j3qM5l9Pj9OJ7
$$ -5 28 -5 26 -16 -16 46 2 19 -19 10 15 36 -23 18 19 32 2 -10 5 -24 23 25 -19 22 -28 16 3 -5 40 1 8 -11 -5 12
7267A2J4j0L0o2N2j2l6L1m6N6j6l7M0l3pOk7L6l5NP1j1j7K1J5o5rN8n4K2j2K0
$$ 12 26 16 46 -16 36 24 -12 19 -27 29 13 -24 16 -17 -24 -18 -45 -9 -44 -39 32 21 4 25 40 -25 -34 24 -30 -8 -20 0
7299@k7K3N1m7L9p5MN2pm9K0O3o7l0P6K3o4J5M4oo1j0L3K1J2J5m4om5L5k0L6q
$$ 0 -27 -4 47 0 39 -36 -32 20 13 -36 -16 47 -20 -50 26 49 -15 0 44 38 -23 -33 0 21 33 48 4 -2 -47 -12 -32 4 -4
7332drL7m9J4j0J2k9P7k8Rm2k5M7L4n0M5%m1J1mK2O6Oj31L1k8Q0o2OlJ7jPl0L1
$$ -4 -13 24 -25 -11 -21 -9 -38 39 11 20 -22 -47 0 34 -16 29 29 -12 -1 -5 17 83 89 -42 -11 -39 41 -21 -15 -18 -1 -2 5 -25 6
7367Flno0N9MK1m3K8kn4N7K6o2oJ9J6J2l5RK8j3j3O7l9mlrN9J9o8jl3O0L5p3o4
$$ 6 3 -2 -62 -3 1 22 -21 7 5 -49 8 34 -28 -34 -15 1 13 -22 -13 15 2 -11 56 17 13 10 1 60 79 11 10 -23 37 72 -1 -65
7403f5Q5l9N6K9L3j04l4L9j1M4k6K3MJ3lj3PK3j3J7r3M3n3L9LMj5L6J6k1k3k2
$$ -65 20 -19 37 66 99 -5 -39 0 -11 33 7 30 34 47 44 31 38 61 48 65 -28 15 -38 1 4 8 -7 29 45 24 1 -21
7435b1L2J3m7K5k9J8j9rO9n2K0J2m8N8rlRok2ln0O5n4J02n2J9o5P0no0OPN7m6
$$ -21 11 24 -23 2 -27 -9 -28 -37 32 -20 0 12 -36 22 13 10 19 13 -9 -12 -62 3 -51 51 -1 18 -47 23 18 -42 -36 -29 28 -18
7469a8M9Jm9L9j0OJK6o8K3k6L1om8J26j30M1L0k3O6k7j4LK1l6m9N9K8pl3pj9L0
$$ -18 31 32 -17 22 12 18 19 45 -23 0 -26 5 -1 -49 77 -53 -12 18 -5 61 34 20 23 44 8 -41 18 46 39 6 -1 -20 10
7502A0Mj7mk0N3j4o2K4P6n0l3MLjM2N2o5l2K0k2P1m1J2%j9L7m1K1K1l0L0m3N7
$$ 10 14 -3 -7 -27 26 12 -50 -26 50 0 -33 -29 -26 -27 15 67 2 -30 -10 -32 39 -2 10 10 -9 28 -13 8 29 -1 29 -14 43
7535D3k4j4K8j9j3J3on2M0Qj9N8m9J7Pk5k0J4J4j1K6m3L7J7pJ1o8Q2o6nK1N2m2
$$ 43 19 5 33 14 1 14 8 -44 -4 4 -15 43 -6 11 18 -7 -27 -13 1 -10 16 -27 10 27 20 31 -37 45 -21 -26 -5 47 5
7568EKJ9J4Pl2k6J8j3kO0n0J6j8J4j5K5Rqk3M3l2ok1L1k0jJ7j0j3K6nK0p4O2Q
$$ 5 7 26 40 47 15 -11 7 -6 -8 52 2 18 0 14 -1 24 33 25 2 45 13 7 -14 17 -3 -4 13 3 -10 16 11 31 -43 19 27
7603B7m4J0K3l8Q1m4J2l4N5l9M2l4n3N8J6m5nQJ6l3J5K1Oj7J6Nj8oL3m2mK0j1
$$ 27 -17 -7 16 -22 59 15 27 -7 48 9 51 17 -36 22 38 -7 -12 -4 12 -21 -6 15 21 4 20 25 7 1 34 -8 -12 8 -3
7636cKJ6l7j4O1p1K4L6nNLk5K2J1k8j6K5L6l8j1J0K1n1J2K0j2l5QQ4o0J2j9Qj2
$$ -3 -1 15 -22 -36 25 -46 -22 14 9 14 17 -8 14 25 -3 -19 6 42 4 -7 3 24 -27 -15 5 -7 -42 -34 50 -10 2 -17 -9 -21
7670b1nM3K5p7MPl4N7k5O6m8M6o1O0m2K9n1JO8k2PQMl1J6m3O6j3j1K3p0J7K5l0
$$ -21 -26 17 42 -35 -31 -24 -58 -1 -26 40 -8 38 -23 37 -5 24 -27 -26 42 20 27 35 39 8 24 -19 47 34 23 46 -24 -7 18 -12
7704a2m7P3L2k9pm9j0R5l0n0N6l9JJ5K5rJn2K8K0mOO3j05M2Ql7POJ2j4M7p1O2
$$ -12 -59 14 46 17 10 -39 -49 46 16 -34 22 -17 -16 -1 24 15 16 -36 -8 12 8 14 77 -28 14 22 -15 -8 -2 10 -4 43 -28 34
7738C4k5J5m5K7Lk4P7j3m7KN2o9nL7j4n4K8J2J7k7K6m3N9n3M1k0K6Jj8LQK7m8
$$ 34 9 24 -21 6 9 -15 62 49 2 4 56 -13 -18 19 5 -49 -21 -9 8 -19 7 -36 23 -30 11 -9 17 18 0 3 11 38 -10
7771a0j5L8m1O7j3o1L8K0j5k3MNj4QN0l7J7j3K6o1J3MP7m2p1K3P7j7o0POlOjk0
$$ -10 -25 13 -28 39 26 -35 3 23 8 -15 -11 -6 -20 -12 38 1 18 5 31 -30 -17 -13 64 22 -49 -26 51 34 -26 -19 -13 -16 -10 -11 -31
7806c1O2o3L8Qp7J41k6o3K2l2O2n6KP2m1j1P7k9n0K9k9j8N2o0L8rj6%k2PN4qL
$$ -31 31 -32 6 14 -63 78 52 -11 11 -21 41 -15 -13 59 18 7 84 55 5 34 5 -13 39 -21 17 8 -8 -8 -30 -23 31 23 26
7839B6kK1k5m3MK0Q0m1J7o7lL4o9N1k3kJ8J6j7kK3j9k8NN0m1O7k5n5L6L3pj6o
$$ 26 24 45 20 -23 -19 1 81 40 57 -10 -13 21 -48 3 -20 -22 -4 12 -5 -7 16 -3 -31 -26 24 -17 50 25 -30 6 39 32 16 10
7873A0j2n1L4K3k0M0Mo6K2j0M5j8PoNL4r5MO7M8m9l9PL8J5rj7K2Ml8k3N7n8L1
$$ 10 -2 -53 -19 4 -16 24 28 -38 -16 -26 19 1 8 2 7 41 -54 -50 17 65 16 -23 -16 22 37 28 11 33 37 -1 -24 33 -25 6
7907Fk9pL4J9pl1M7o5M6l3L2j3k2J8j7J8L1j7l4M8o6N6%Kk1Kn6R1l4K6l7M4r9
$$ 6 -23 -30 4 23 16 -15 32 -33 13 -20 12 -1 -23 -5 -22 -4 27 10 -24 24 -42 14 14 16 -5 -3 -59 32 -2 24 -13 31 -68
7940f8J05o2M0k5jM6j8J1q4N5K6j6j1J6J9m4PQ3p9L4J3k9j6PK8p3M4J5Ok8KPj6
$$ -68 37 -25 15 -10 -11 35 17 28 -56 -1 25 9 -2 14 33 -11 -4 79 0 34 47 18 2 9 37 -36 8 23 29 1 3 10 -6
7973fpk9M2k4L2n1M8j2K1mJ6p7K7j0M5k3oj0KL7LK4m1j1N2l3OJ4j2l9L0%k0N5
$$ -6 -13 -42 0 -24 8 -43 5 -7 14 10 26 -51 -24 -34 11 -12 -18 -28 -26 11 14 38 -3 -14 38 5 11 25 13 -26 4 4 -16 39
8007C9o9O0k2M9l5m9j2L4k9N9nK3Qn7Q8r4K8k4MM5n7J5Om6L2P1m6J3n9O2n9K2
$$ 39 -30 30 8 57 22 -27 -39 -5 -34 25 20 43 51 -6 82 -12 16 -8 -4 41 -16 -1 5 -41 -9 62 16 29 -30 32 -27 -5
8039ej1P1q3J3L2j3Pk6mL4k3L4j1l2K4KnO8p1j1K2J4m9J3j0%J9MJ6l3m4P1J6p0
$$ -5 -16 55 -28 -15 17 4 11 -15 -19 15 -8 26 15 -17 7 9 4 72 1 -10 12 26 -23 -10 -20 -20 -1 3 19 -14 -58 13 29 -41
8073d1Q1k0jo3Q1l7j6L1m9L1K2j3k2Qj4N0j7J6j2k9J1L4Km6j1J9lPN2l2J5n1J8
$$ -41 40 20 19 -44 37 0 -16 15 -34 -3 19 6 -16 -8 -22 28 11 27 15 -14 -3 31 33 -13 -24 -5 -8 -1 51 19 34 -17 1
8106Ak0M1K9j4l0j0L1k4pJp1K5L5l5O8k2l7M6m9L9QmJ7l2K5L9kj1n0k1J1L1m1
$$ 1 -19 22 51 37 7 -3 28 4 -3 -2 -73 -48 -13 -48 20 -2 -39 7 -42 -3 5 1 18 -14 11 50 48 37 -13 -34 -23 8 -33
8139c3L9M3o7rL9L8q2pNP8l7k5M5J4l7K8K1mm6jj4L8l7J7j7J6oL6j9n1K6QL7n6
$$ -33 6 49 -18 -27 12 50 -32 -39 -34 44 7 -18 27 41 4 32 53 49 3 2 -12 26 -11 6 -11 5 -1 35 16 -35 -9 -1 36 -20
8173b0K4l4P0p8P3m9l0P1k5nk1k9NN1J3j9%M9
$$ -20 4 -30 40 -38 35 -14 -44 27 2 -3 -24 -53 -48 3 16 -3 -3 46
8191D6
$$ Imaginary data points
##PAGE= N=2
##DATA TABLE= (X++(I..I)), XYDATA
0@%%%%%%%%%qJ6j6J6k4M0m8N6p2Q8j04J20j44J71j95K28k68L12l61M16m78N47
$$ 0 0 0 0 0 0 0 0 0 0 -8 8 -8 8 -16 24 -24 32 -40 48 -56 64 -80 91 -104 124 -144 168 -193 223 -255 292
31B92o22P02p95Q99j012J135j269J418j581J759j955K169k398K650k929L230l560
$$ 292 -330 372 -423 476 -536 599 -670 748 -833 926 -1029 1140 -1258 1392 -1537 1693 -1867
48a867L922m319M757n239N775o375P048p803Q662r655J0812j2177J3819j5837
$$ -1867 2055 -2264 2493 -2746 3029 -3346 3702 -4101 4561 -5094 5718 -6459 7360 -8477
62h477J8382k1703K6234l2797M3138o1769J05049l67945j48852Q78024m33522
$$ -8477 9905 -11798 14436 -18361 24777 -36992 68057 -299888 -448740 429284 -4238
73d238j29989M1058p7644M90524k74875n25645O72445M1386m66393K14959Q258
$$ -4238 -134227 -93169 -170813 319711 44836 -480809 191636 233022 -233371 -18412 -10154
84a0154J9612J48482m37274K07032M18446n36496j1842L77107k00082N7671j03696
$$ -10154 9458 157940 -279334 -72302 346144 -190352 -202194 174913 -25169 32502 -71194
95g1194j13949M64003k24989l92112M54415L8338k36224O5785j07565K11800J12042
$$ -71194 -185143 278860 53871 -338241 116174 154512 -81712 -15927 -123492 88308 200350
106B00350m81214K06704L44783l80534R059J33848p0039J69982k42835o7480M32524
$$ 200350 -280864 -74160 270623 -109911 -100852 32996 -37043 132939 -109896 -177376 255148
117B55148k68374k09833L33187p2225m3290Q21j56154L04095k001m00151K60184
$$ 255148 -13226 -223059 110128 37903 -5387 -4566 -160720 143375 141374 -258777 1407
128A407J69986k42678N2408m2585L9500K03968l05475l0797L47033k03034r9822
$$ 1407 171393 -71285 -18877 -61462 -21962 182006 -123469 -154266 192767 -10267 -110089
139a10089J56045p7842J01752n2243j89042K94523o351l03890K02515Q9887j30353
$$ -110089 45956 -31886 69866 17623 -171419 123104 116753 -187137 15378 105265 -25088
150b5088L5446j08106J12013J79458l32275N913L08424j58432q2541L8356j4109
$$ -25088 10358 -97748 14265 193723 -138552 -132639 175785 17353 -65188 -26832 -40941
161d0941J89037j43698k01149K98639O861k08254R1503P277L6076K9414j90247
$$ -40941 148096 4398 -196751 101888 108749 -99505 -8002 -725 35351 64765 -125482
172a25482J21740J50690k28863J6823J37314o8747J2372o3035p044J89474j37898
$$ -125482 -3742 146948 -81915 -65092 72222 3475 15847 -47188 -54232 135242 -2656
183b656j38362K07546J440r7745R861l1130J21800R083k09867J13677J34040j46576
$$ -2656 -141018 66528 67968 -29777 -19916 -51046 70754 79837 -130030 -16353 117687 -28889
195b8889l331K6969K886Q0042j25567k8724J80867j02631p8596J16762l8551N195
$$ -28889 -32220 -5251 -2365 77677 -47890 -76614 104253 1622 -76974 39788 1237 6432
207F432m06p3846J27764j0140j53916J17622N1461r1667K2649k7974L9521P1642
$$ 6432 6026 -67820 59944 49804 -104112 13510 64971 -26696 -4047 -32021 7500 79142
219G9142j42767O011J39532q0713l9601L9817j9254O0946l9735p9392J19900l960
$$ 79142 -63625 -57614 81918 1205 -38396 1421 -17833 43113 3378 -76014 43886 39926
231C9926j02573O8781J3950k7997K3581n7155M3303O4045j17749J3566R6431o1148
$$ 39926 -62647 6134 20084 -7913 15668 -41487 1816 65861 -51888 -38322 58109 -3039
243c039j3953P146j1924P5468n6747o9358J11421q755o6269L7605j3326K3761
$$ -3039 -16992 -9846 -21770 53698 -3049 -72407 39014 30259 -36010 1595 -11731 12030
255A2030J9315q0901M8821M9714q0508K2337L1961l1748K1473k4586n598O2971
$$ 12030 31345 -49556 -735 48979 -31529 -9192 22769 -8979 12494 -12092 -17690 45281
267D5281n5660l1068P4262j8395k9687J1191j0454M1673l814p0794M7555M0866
$$ 45281 -10379 -41447 32815 14420 -15267 -4076 -14530 27143 23329 -47465 90 40956
279D0956n2070K012O485K510K9539m3263j3433N8213k9357j9575L2487k2545P715
$$ 40956 -11114 -9102 -2617 -107 29432 -13831 -27264 30949 1592 -17983 14504 -8041 -326
292c26R711k7881L2230m047l9941M3697K706l4708J8662n216J0108J3727m6151
$$ -326 9385 -18496 13734 9687 -30254 13443 16149 -18559 103 -5113 4995 18722 -27429
305b7429J4145M1496l3253r082J2309k299J9326k0113k0247L8479k042k6607J4868
$$ -27429 -13284 28212 -5041 -14123 -1814 -4113 15213 -4900 -25147 13332 11290 -15317 -449
318d49L08q83P972j8521J0434J5469k6059N271J8667j7164K615M266p004J5863
$$ -449 -141 -1024 6948 -11573 -1139 14330 -11729 -6458 12209 -4955 -2340 1926 -5078 10785
332A0785j3018j2403K7762p070j5508J4079n836L752N420j9018J5654P406k1992
$$ 10785 -2233 -14636 13126 6056 -9452 4627 -1209 2543 7963 -11055 4599 12005 -9987
345i987J1562N514j0613P879o841J394J3856j9433j200J9354p779o729M20K01
$$ -9987 1575 7089 -3524 4355 -2486 -1092 12764 -6669 -7869 11485 3706 -3023 -2603 -2402
359b402J2447o591j6614J4696Q843j1659l392P09N501O955j2408m732J4062l622
$$ -2402 10045 3454 -13160 1536 10379 -1280 -4672 -3963 1538 8493 -3915 -8647 5415 1793
373A793m411L741n075M258M543q560L103M76m754J1329m822j0047Q836J279j2
$$ 1793 -2618 1123 -3952 306 4849 -3711 -608 -132 -4886 6443 1621 -8426 410 1689 1677
388A677m45j0201R804R813j5228r80P412K056J402r957J47J3019m840q523M672
$$ 1677 1232 -8969 835 10648 -4580 -5560 1852 3908 5310 -4647 -4500 8519 3679 -4844 -172
403a72L226J008n364l846Q590J206q846J085O859k922l469L89L263L033o261k620
$$ -172 3054 4062 -1302 -5148 3442 4648 -4198 -3113 3746 824 -2645 -2256 1007 4040 -2221 -4841
419d841Q820o19p411K983K518K407m063o978J0330K873j1531K768M513j407O03
$$ -4841 3979 3360 -4051 -1068 1450 3857 -206 -7184 3146 6019 -5512 -2744 1769 362 965
434I65p827N081R663j2330k620R123l03j624n029k17J2143o038j1233R086N021
$$ 965 -6862 -1781 7882 -4448 -7068 2055 1752 128 -4901 -5118 7025 987 -10246 -1160 3861
449C861m231l922j427O075L022r364l13Q778j835n421L25L687K393l731l693P081
$$ 3861 -370 -4292 -5719 356 3378 -5986 -6299 2479 644 -4777 -4452 -765 1628 -2103 -5796 1285
465A285R95o731L115K158k91Q90m168K475N111p134O63N230k887K62l052J583
$$ 1285 2280 -4451 -1336 822 531 1421 -2747 -272 4839 -2295 -1632 3598 711 973 -2079 -496
481d96N996o691j090O092m088K336R34o344P370j80n510O541m266m025J0297m081
$$ -496 5500 -1191 -2281 3811 -277 2059 2993 -3351 4019 3839 -1671 4870 604 -3421 6876 2795
497B795n789M589l130M923J600j3126O696J0613j1900j803N254j715O177p497
$$ 2795 -2994 1595 -1535 3388 4988 -8138 -1442 9171 -2729 -4532 722 -993 5184 -2313
511b313p726J7300k769j5810J1177L413m225K138j1770R495J3583k1758n26J7073
$$ -2313 -10039 7261 4492 -11318 -141 3272 -953 1185 -10585 -1090 12493 -9265 -9791 7282
525G282p858j300k096l650J7979q076j6515J8271L515j1783L684q15N316L883
$$ 7282 -576 -1876 -3972 -7622 10357 2281 -14234 4037 7552 -4231 -547 -1362 3954 7837
539G837j6769O618J4189j3842l255Q024p79J469p879j742J7794q939j4280J4377
$$ 7837 -8932 -2314 11875 -1967 -5222 2802 2023 3492 -4387 -6129 11665 2726 -11554 2823
553B823M961o667l907l824J4871L916k4489O054J7796p959o141m353O039J4614
$$ 2823 7784 1117 -2790 -6614 8257 12173 -12316 -6262 11534 3575 -2566 -6919 -880 13734
567A3734j7827r651K1749l209q186J623l805J2504j494j7873J4513P578j5449
$$ 13734 -4093 -13744 8005 4796 -3390 -1767 -5572 6932 5438 -12435 2078 9656 -5793
580e793N306J874k423O989j0192J61J3631j3072l579J4103q214j577L544o423
$$ -5793 -487 1387 -1036 5953 -4239 -4078 9553 -3519 -7098 7005 -1209 -2786 758 -5665
594e665J0300j766j4557J4568M416j4643O960J011j957P343j1251J476J3719j3553
$$ -5665 4635 2869 -11688 2880 7296 -7347 -387 624 -1333 6010 -5241 -3765 9954 -3599
608c599k001J2108p923J734N55p058J2597l959j1814J3641N6q657O107l285K551
$$ -3599 -5600 6508 -1415 319 874 -6184 6413 2454 -9360 4281 4337 -4320 1787 -1498 1053
623A053M276j0776O583O698j1953L021O302m865K376m168l54J1132r873o917J3849
$$ 1053 5329 -5447 1136 7834 -4119 -1098 5204 339 2715 -1453 -1807 9325 -548 -7465 6384
638F384j343p658J379m82Q087k086j4496J1213R283j2551j779L992L505M134j3393
$$ 6384 5041 -2617 -1238 -1720 6367 4281 -10215 998 10281 -2270 -4049 -57 3448 7582 -5811
653e811n31J7410q716r045P744P94J523m187o918J3272k86j4314Q486N179n190
$$ -5811 -6342 11068 2352 -6693 1051 1845 3368 -819 -7737 5535 5249 -9065 -579 4600 -590
668e90j075l661P611N895j5759J109J4487o079n993L56L593Q006r999r160J6075
$$ -590 -1665 -5326 2285 8180 -7579 -6470 8017 1938 -4055 -3699 -106 7900 -2099 -11259 4816
683D816K169j2760J786L408M560r45j2686P300J2527j2770l943Q335q04K089n518
$$ 4816 6985 -5775 -3989 -581 3979 3034 -9652 -2352 10175 -2595 -6538 1797 993 3082 -2436
698b436l586J3041m428j0602J0356P39m997K855m561N104L713j1953N188Q503
$$ -2436 -6022 7019 2591 -8011 2345 3084 -1913 942 -3619 1485 5198 -6755 -1567 6936
712F936r123M6L159j688M870n696k943J0357m146o469O627l62j514J380m555M619
$$ 6936 -2187 -2141 1018 -670 4200 -1496 -4439 5918 1772 -4697 1930 1568 54 1434 -3121 1498
728A498K537q116L482M801n638Q66J292j369L523m406r40P044m864l405N718j162
$$ 1498 4035 -4081 -599 4202 -1436 -570 722 -647 2876 -1530 -2470 4574 -290 -3695 2023 861
744H61r95j90k526O041j524o984N992K588m419j94n66L343J746p734K581O487
$$ 861 -134 -324 -2850 3191 1667 -5317 675 3263 -1156 -1350 -1916 1427 3173 -4561 -1980 4507
760D507m983k389J863J804K121n247k005Q496k052o244L341K466M11k203l866
$$ 4507 -476 -2865 -1002 802 2923 -2324 -4329 4167 2115 -4129 -788 1678 2089 -114 -3980
775c980N358L458p591M98M959j634q88j783Q01M712m440l127O685j732l561K527
$$ -3980 1378 4836 -2755 -2257 2702 1068 180 -1603 -802 3910 -530 -3657 3028 1296 -2265 262
791B62j25K030j768m556O147K266p354J425L250L83o51n605L084O570n816l812
$$ 262 137 2167 399 -4157 1990 4256 -3098 -1673 1577 1960 1309 -4296 -1212 5358 -458 -4270
807d270M219J028M47k949k667O056O11n447J348J715l57J450k654k86L220k230
$$ -4270 -51 977 1424 -1525 -4192 1864 2475 -2972 -1624 91 -266 1184 -1470 -1756 1464 -766
823g66L72J438l225J658K792l399j28O09m7L375l432l098N251N97l196K93k08
$$ -766 -394 1044 -2181 -523 2269 -1130 -1258 -649 -696 2679 -753 -3851 1400 1997 -1199 -906 -1114
840a114K957Q12n667K524L773k753l13O6jK610k665j591M225j853j866J773m99
$$ -1114 1843 2655 -3012 -488 3285 532 219 285 284 2894 229 -1362 2863 1010 -856 917 418
857D18L19j88j940K498Q27l611J279J564q70M23j172k50K667j845j290K689j683
$$ 418 737 549 -1391 1107 1934 -1677 -398 1166 296 719 -453 -703 1964 119 -1171 1518 -165
874a65k74J418j550L65K50j112K215q22l069K928J078j319n56j326K676K276m671
$$ -165 -439 979 -571 -206 44 -1068 1147 325 -2744 184 1262 -57 -613 -1939 737 3013 -1658
891a658j000M386j42j099k074m55M650p10m553J360J934J09l50k950J405K803
$$ -1658 -2658 1728 1586 487 -1587 -2042 2608 1898 -2655 -1295 639 748 398 -2552 -1147 1656
907A656j854q98N28m80J521M32k326R15M13j73J409j951j120K863k19j426O8j073
$$ 1656 -198 -1096 -568 -1048 473 905 -1421 -506 -93 -266 1143 -808 -1928 935 716 -710 -642 -1715
925a715K836N27l855J371J935q88L42j448k18L539j933j878J988o66P00O38k526
$$ -1715 1121 1648 -2207 -836 1099 211 553 -895 -1113 2426 493 -1385 603 -63 637 1275 -1251
942a251J115J517k065J648n78j894L111o20j770J609j118L18K511l321k12K763
$$ -1251 -136 1381 -684 964 386 -1508 1603 983 -787 822 -296 22 2533 -788 -1000 1763
958A763j707M10L62k145K065O35k822K112m86j539L104k018j278K604j578O12
$$ 1763 56 466 828 -1317 748 1383 -1439 673 187 -1352 1752 -266 -1544 1060 -518 94
974I4J702l926J984K663l374O29N04o49K472k219k313M284p72k076J342j470J775
$$ 94 1796 -2130 -146 2517 -857 -228 276 -373 2099 -120 -2433 1851 1079 -997 345 -1125 650
991F50J056l726J959J825l071J795L80j840K154j728J61L156l975j070M654j525
$$ 650 1706 -2020 -61 1764 -1307 488 868 -972 1182 -546 -385 2771 -1204 -2274 2380 855
1007H55j123m53j744N317n70o674L638L187k663M52k922J430N769n996j895N438
$$ 855 -268 -721 -2465 2852 2282 -4392 -754 2433 -230 222 -2700 -1270 4499 -1497 -3392 2046
1023B046k142j06P18l201M364j1n450N102K11m545L871l92j939K796l903J549
$$ 2046 -96 -202 516 -2685 1679 1668 -3782 1320 1531 -3014 857 465 -1474 1322 -2581 -1032
1039a032N262p085m04N938k429l49j219j837P305k059p742N803K317k626N42l605
$$ -1032 4230 -2855 -3259 2679 250 -99 -1318 -3155 4150 2091 -5651 152 2469 -157 385 -3220
1055c220K762N079p380m49O136l564K99N42k732N014j717m592O259r50m141L909
$$ -3220 -458 4621 -2759 -3208 2928 -636 -337 205 -2527 2487 770 -3822 2437 1487 -2654 1255
1071A255j678M82K217n045K788L648o006J725K737l335K981j731k370N682l187
$$ 1255 -423 59 2276 -2769 19 3667 -2339 -614 2123 -1212 1769 38 -2332 3350 163
1086A63k667N416l062r80L779m248J947K013n020M123Q77n707M375O61l651L659
$$ 163 -2504 2912 -150 -1130 2649 -1599 348 2361 -2659 1464 2341 -3366 1009 1670 -1981 1678
1102A678k975n76N577n460q72N422m101O91K350m770L840P57m859N180j356m418
$$ 1678 -1297 -1873 3704 -1756 -2628 2794 -1307 -616 1734 -3036 804 1561 -3298 1882 526 -3892
1118c892N946j308l190L442l057K102L374p805K382O230n097m82O47r72N915m609
$$ -3892 2054 746 -2444 998 -2059 43 3417 -4388 -2006 4224 -873 -1355 -708 -1680 4235 -374
1134c74n339Q724j79n244K039j071K968K118q225L287O235o207k13K195j337L396
$$ -374 -5713 3011 2832 -2412 -373 -1444 1524 3642 -4583 -1296 4939 -1268 -1481 714 -623 2773
1150B773l394l016P645k783m692N219j119n11R66m000M440K416p705K956L961
$$ 2773 -621 -3637 4008 1225 -3467 1752 633 122 1088 -2912 1528 3944 -3761 -805 3156
1165C156l807J148j565L6N269n260k730P051k397k360K056k160L529j48o159N114
$$ 3156 -651 497 -1068 -1032 4237 -1023 -3753 3298 901 -1459 597 -1563 1966 1818 -4341 773
1181G73K562n663K048K99o64L360m858l48O238m053k039L676k212J685L93m548
$$ 773 3335 -2328 -280 19 -645 2715 -2143 -2491 3747 -306 -2345 1331 -881 804 1197 -3351
1197c351M598Q93m956L290J72k249L616l031j045M616l728J77K959m025J949K324
$$ -3351 1247 2140 -2816 474 646 -1603 2013 -1018 -2063 2553 -1175 -998 1961 -2064 -115 2209
1213B209m374K436Q13k951L804j938k626M968j893k296L286k253O01K078m332
$$ 2209 -2165 271 1084 -1867 1937 -1 -2627 2341 448 -1848 1438 -815 -214 1864 -2468
1228b468K574K399m617J855J693k591K194j337j294M370l019k010M196j525q80
$$ -2468 106 2505 -2112 -257 1436 -1155 1039 -298 -1592 2778 -241 -2251 1945 420 -460
1243d60J197k202K593P59m717L187J724l419J417m40k52K749l434p01M564k864
$$ -460 737 -1465 1128 1887 -2830 357 2081 -1338 79 -361 -613 2136 -1298 -1999 2565 -299
1259b99j256K209j273J535m59l144L791N97m048K453K59r16J652k642M37L365
$$ -299 -1555 654 -619 916 457 -2687 1104 1701 -2347 106 365 -551 1101 -1541 -1104 2261
1275B261l180m89K694k041Q39N41j958K256k79k078K640o73j947K663r13o02J259
$$ 2261 -919 -1408 1286 -755 84 625 -1333 923 644 -1434 1206 533 -1414 1249 336 -266 993
1292I93k187J513J946l399N65K177j574Q05q12j007L184j217k220K196k68m46
$$ 993 -1194 319 2265 -1134 -569 1608 34 839 27 -980 2204 987 -1233 963 695 249
1308B49J305k278O85J784k163O86N38j698J700L75k246J216r5RJ259k212k08K594
$$ 249 1554 -724 -39 1745 -418 268 806 -892 808 1183 -1063 153 58 67 1326 -886 -1094 1500
1326A500j128j037N60m65J701o31k413J858J015j578L13k86J7J362j800j00K000
$$ 1500 372 -665 -105 -570 1131 500 -1913 -55 960 -618 -305 -591 -574 788 -1012 -1112 888
1343H88j425k30J046p71O63j91j128J989k31j989J452K00l34M22j317M79J672
$$ 888 -537 -767 279 -492 171 -20 -1148 841 610 -1379 73 273 -61 361 -956 -477 1195
1360A195j716k45J073o41P66l41j099J226L40p87P57q53j08J577q42p49M54r3
$$ 1195 -521 -766 307 -334 432 91 -1008 218 558 -229 528 -325 -433 1144 302 -447 7 -86
1378h6Q61k9k024R44J624j048n04n42N84J623j230j512J508N02k90k45j206J257
$$ -86 775 746 -1278 -334 1290 242 -262 -804 -220 1403 173 -1339 169 671 381 136 -1070 187
1396A87J148j511k49L43k16J104o11j257J014J60O5l0j232M89J492q50r50K54
$$ 187 1335 -176 -425 -82 -298 806 195 -1062 -48 112 177 147 -1085 -596 896 46 -904 -650
1414f50L80J211r98j386J358Q62q25l96k36P06R26j387m43J037j59J57j2q55O77
$$ -650 -270 941 -57 -1443 -85 777 -48 -444 -680 26 952 -435 -878 159 0 157 145 -710 -33
1433c3M96o56N35m97m14J428k38j039L96J34N42J57j528N32J002m72j75k79j1
$$ -33 463 -193 342 -155 -569 859 621 -418 -22 112 654 811 -717 -185 817 345 170 -109 -120
1452a20Q75m58o09P11m49Q0P29p34l97N15J65L36n31j142J288P63j095o80L50
$$ -120 755 297 -312 399 -50 30 759 25 -372 143 308 644 113 -1029 259 1022 -73 -753 -403
1471d03J028K29j752j56J749j67q91l11K43J098l19j185N80N39n29N35m42m23
$$ -403 625 854 -898 -1054 695 528 -363 -674 -431 667 348 -837 -257 282 -247 288 -154 -577
1489e77P02j48L66k12j331R33J452j195p69R7R74J172j871j243K190Q75j303q93
$$ -577 125 -23 343 131 -1200 -267 1185 -10 -779 -682 292 1464 -407 -1650 540 1415 112 -781
1507g81N7J690L18k257J70J653k98n54k21j47J196l43j060Q95r0l80P80l24n09
$$ -781 -724 966 1284 -973 -803 850 552 -2 -223 -370 826 483 -577 318 228 -152 628 304 -205
1526b05M33j57N00L9j368P67J128p94o59p7O88J131j438j112J481L54k07p15o47
$$ -205 228 71 571 610 -758 9 1137 343 -316 -393 295 1426 -12 -1124 357 711 504 -211 -858
1545h58J213N94j285j91L68K41O26j009m30Q52J21l07on55N23O04j060J54L90
$$ -858 355 949 -336 -527 -159 82 708 -301 -731 121 242 -65 -71 -626 -103 501 -559 -405 -15
1564a5k68K92k09l69P11l36m10J014n81n50O65j7K25j74j143J342R53j861j46
$$ -15 -283 9 -200 -569 142 -194 -604 410 -171 -721 -56 -73 152 -22 -1165 177 1130 -731 -877
1583h77R62N95n3j657j23K510m46j857L81P90P91p44j443J067J381j192n51O20
$$ -877 85 680 627 -1030 -1153 1357 911 -946 -565 225 1016 272 -1171 -104 1277 85 -466 154
1601A54k4K26k90q0M99o30k46J266l71j208M44Q49M46j334j058J881J081j810
$$ 154 130 356 66 -14 485 -145 -391 875 504 -704 -260 589 1035 -299 -1357 524 1605 -205
1619b05j018J026J378k56k256N25K247o62j550j08J044J041j199j310J560M71
$$ -205 -1223 -197 1181 925 -1331 -806 1441 779 -771 -879 165 1206 7 -1303 257 728
1635G28q40r0j19N22K97q37J91N89p93L35N43p24L6K13LM54n29o40J164j50p03
$$ 728 -112 -202 -321 201 498 -339 -148 441 -352 -17 526 -198 -162 51 54 508 -21 -661 503 353 -350
1656c50M50j16RM04o71J52N10q22O11M47j101L03L95p5J63o78j33J354o70q91
$$ -350 100 -16 -7 397 -274 -122 388 -434 177 624 -477 -174 221 146 309 -369 -502 852 182 -709
1676g09N71L25J80l73p46Q12N63r71J38K15p5K54l32n5L19l19J39N83q26k59Q47
$$ -709 -138 187 367 -6 -752 60 623 -348 -210 5 -70 184 -148 -203 116 -203 -64 519 -307 -566 281
1697B81P2j87o59m5J275j75j516N09R12L7n25j088J095J106j311o19R09O4J29
$$ 281 353 166 -493 -538 737 562 -954 -445 467 504 -21 -1109 -14 1092 -219 -838 71 135 264
1716B64o09l42J218l41q27P85j5m94M22q2J06m3q06Q01O05j073l10R48J24l43
$$ 264 -345 -687 531 190 -637 148 133 -361 61 -21 85 42 -764 37 642 -431 -741 207 331 -12
1736a2o55P6J421n96j278P83P04l29l67k94P05N54j331J23J047m67l22J40L0N54
$$ -12 -667 -591 830 234 -1044 -261 443 114 -253 -547 158 712 -619 -496 551 84 -238 -98 -68 486
1756D86p38l98J259l42q10L55M23J87m45o16Q58M81j032o8O92P0k57m57K46O76
$$ 486 -252 -650 609 267 -543 -188 235 422 -23 -639 219 700 -332 -400 292 362 105 -352 -106 570
1776E70n64n20P54Q2m18j54J74M04k53o74N01O38p21k26K83M61j40o71L6R15m10
$$ 570 6 -514 240 322 -96 -250 -76 328 75 -599 -98 540 -181 -407 -124 337 197 -474 -438 477 67
1797F7m57L19M1K73k58m11M93M4l01K39j57k13M41r0l5j48j30N65J08q31J14P24
$$ 67 -390 -71 -30 243 -15 -426 67 111 -190 49 -108 -321 120 30 -5 -153 -283 282 390 -441 -327 397
1819C97k6k91n36M19P83o48o02N26N44l59m41j04P73Kq40K14N63k59l01N7J44
$$ 397 371 80 -456 -37 746 98 -504 22 566 207 -234 -338 435 437 -403 -189 374 115 -186 -129 15
1840A5M35o77j82Q15k55m09K39J28K4k33k93P26l0p46K90L06r0k24k64M23L50
$$ 15 450 -227 -409 406 151 -258 -19 109 133 -100 -393 333 303 -443 -153 153 63 -161 -425 -2 348
1861C48p79j54P73l8l88j66K70M63l67o20P25K94m95l06J59N88qp47J6Q79l16
$$ 348 -431 -585 188 150 -238 -404 -134 329 -38 -658 67 361 -134 -440 -281 307 299 -448 -432 447 131
1882A31l74J06J8N17j49n73L88K12k71K29k19j09N10l23Q5K1k37M34J13o60J16
$$ 131 -243 -137 -119 398 249 -324 64 276 5 234 15 -94 416 93 178 199 -38 396 509 -151 -35
1903c5L88p1m2n33J76P07l91n95L37L10Q3l38m73N38L62n35j55L83j23M0j02k31
$$ -35 353 282 240 -293 -117 590 199 -396 -59 251 334 -4 -477 61 423 -112 -267 116 -7 33 -69 -300
1925c00M07j37k32L86j92l05L62o0l6K0l46N73p8n32L55L17k67j16j31L38K99
$$ -300 107 -30 -262 124 -68 -373 -11 -71 -107 -87 -433 140 62 -470 -115 202 -65 -181 -312 26 325
1946C25p00N7M67O8m50j49L76M13m38n33O61L49m38k63J84M53j23o81K94P47l57
$$ 325 -375 -318 149 217 -233 -382 -6 407 -31 -564 97 446 8 -255 -71 382 259 -422 -128 619 262
1967B62n22J01M52K04n58m09Q01J69o50J20j3K25J31m66O9L05l71J84J76l68J32
$$ 262 -260 -159 293 497 -61 -470 331 500 -150 -30 -43 182 313 -153 -84 221 -150 34 210 -158 -26
1988b6oJ82J33n66RN99j14m75KK06L92m13m11L95K78l28j87J79J54J87m84m4M99
$$ -26 -32 150 283 -283 -274 325 211 -264 -262 -56 336 -77 -488 -93 185 -143 -330 -151 3 190 -294 -338 161
2011A61j16k18O7m0J52J15l52J35O7j35L13j76l12L10R3q7R2m27L16L34m51R5
$$ 161 45 -173 -106 -146 6 121 -231 -96 -29 -164 149 -27 -339 -29 64 -23 69 -358 -42 292 -159 -64
2033f4N9k5K28j48k34M51j71j27J76k27R5J89j96k8J90k45J84J8l22J82K50k45
$$ -64 -5 -30 198 50 -184 267 96 -31 145 -82 13 202 6 -22 168 -77 107 125 -197 -15 235 -10
2055a0j7J4N1K80m15k04N02k3k62o2K1L27k4n98M27J99m00J27j20K84K8m86J06
$$ -10 -27 -13 38 318 -97 -301 201 178 -84 -146 -125 202 178 -420 7 206 -194 -67 -187 97 125 -361 -255
2078b55O57l63l10K00Q3L38n42k67P16O9n38L4J47K27k8m70K67M21l38j95L64
$$ -255 402 39 -271 -71 12 350 -192 -459 257 326 -212 -178 -31 196 168 -302 -35 386 48 -147 217
2099B17j03k3m0j08M01l03k26N46j7n59K30K15O3j29n60O35M52p96k24M25M20
$$ 217 114 91 51 -57 344 41 -185 361 344 -215 15 230 293 164 -396 239 691 -105 -329 96 516
2120E16j18p84n5J191l22p83J30M60K71m39o10N39N19n69k30J46K59O1l59j20
$$ 516 398 -386 -441 750 428 -355 -225 235 506 67 -543 -4 515 -54 -284 -138 121 182 -177 -297
2140b97L92j5k75K31k29O6K25k05J7O6k97L91O3m96K52Q1j29J72k97K4N61l79
$$ -297 95 80 -195 36 -193 -127 98 -107 -90 -24 -321 70 133 -363 -111 -30 -159 13 -284 -260 301 -78
2162g8j86L58k83L19J3n09M33R5k49K66k41j36N85k84k53K09kN8O3m00K86L46
$$ -78 -264 94 -189 130 143 -366 67 162 -87 179 -62 -198 387 103 -150 59 57 115 178 -222 64 410
2184D10n37N5K13m5O3j78j06N26l09m89O74o6j60j10j84O24J9q52K13O62k57l02
$$ 410 -127 -72 141 96 159 -19 -125 401 92 -397 277 211 51 -59 -243 381 400 -452 -239 423 166 -136
2206a36k76L95O59p63n37P95K59l83k51j17O84L8p72K08M74k27p8r0lL58k63j53
$$ -136 -412 -17 642 -121 -658 137 396 13 -238 -355 329 367 -405 -197 277 50 -28 -118 -121 237 -26 -179
2228a79L93k80k19M57l6j93j59j9O00q9q36M23M75j85k54l24M39O80p87m26P17
$$ -179 214 -66 -285 172 136 -57 -216 -235 365 276 -560 -137 338 153 -101 -425 14 694 -93 -519 198
2249A98P7n0l72k36O96J34p50K20J43J2K76m53n6L95j20r1K35n21L33K73l96m8
$$ 198 275 225 -147 -383 313 447 -303 -83 60 72 348 -105 -161 234 114 23 258 -263 70 343 -53 -101
2271a01Q5O6K83k81m22N34P2l87K55j88Q1K60l54J7L13m02J96J98m61K10N8o8
$$ -101 -16 50 333 52 -370 164 236 -151 104 -84 -3 257 -97 -80 233 -169 27 225 -236 -26 32 -36
2293c6K90m67j38O99k74l20J29L3L87j81n29L40L27l12q9N0K1K08k61j1J99j43
$$ -36 254 -213 -351 348 74 -246 -117 -84 303 122 -407 -67 260 -52 -141 -91 -70 138 -123 -134 65 -78
2315g8j15K90j06j81P1O5K43k62l92N12L14m16j99R6L71J74o97k8O12m8j80k13
$$ -78 -193 97 -9 -190 -119 -54 189 -73 -465 47 361 -55 -254 -158 213 387 -310 -338 274 226 46 -167
2337a67l6N40j13n18L02N4j3K23l57j48M40q4m0k5k96M63J38m62j27K38K17K5
$$ -167 -203 337 224 -294 8 62 49 272 -85 -233 207 123 83 58 -238 225 363 -99 -226 12 229 254
2359B54m15k40O60Nm38p4Q0L26J11n50n2N21j83n7r9j10L50L1l15J13m5K9M62
$$ 254 -161 -401 259 264 -174 -248 -168 158 269 -281 -333 188 5 -52 -151 -261 89 120 -195 -82 -127 -98 364
2382C64n29j95L50Q5l8k25k07M95J26m83M1J97J37n9k46J00K59q5k45K03K5o2
$$ 364 -165 -360 -10 75 37 -188 -395 100 226 -257 -216 -19 118 59 -187 -87 172 87 -158 45 70 8
2404HL8p1J38k5k06J61K19l43j7R8J42L6l67N0M84j38l28M1Q2L28j25n24L29K15
$$ 8 46 -25 113 88 -118 43 262 -81 -98 0 142 178 -189 -139 345 207 -121 -80 2 330 205 -319 10 225
2428B25j25n1k31R5L65j52k35K1n6L17pm09k6L65J45j68m06P1N38o3m00j49M03
$$ 225 100 49 -182 -87 278 126 -109 -88 -144 173 166 -243 -269 96 241 73 -333 -262 276 213 -187 -336 67
2451F7K05k36m68K49N32l05j71m3J25K83k33k65K52J32l3ol05K11J80o5j38o0
$$ 67 272 36 -432 -183 349 44 -127 -170 -45 238 5 -260 -8 124 91 85 -220 -9 171 106 -32 -92
2473i2J5K87L7m36J53J20R2j12k41R8L53j42k27L0O4J85j15j28N8Q6j03J40q7
$$ -92 -77 210 247 -189 -36 84 176 64 -177 -79 274 132 -95 -65 -1 184 69 -59 -1 85 -18 122 35
2496C5q4J35l4L5l7j28P3J70j85j19O4P9L1j22j68L56jk10k3j1J57M5k88J28O6
$$ 35 -49 86 52 87 50 -78 -5 165 -20 -139 -75 4 35 -87 -255 101 100 -110 -133 -144 13 58 -230 -102 -36
2521c6r6J14j7j85J83Kk6l4k12J74K87k61j41J51P7R5j64k20L52O2j15l4LM6J07
$$ -36 -132 -18 -35 -220 -37 -35 -61 -95 -307 -133 154 -107 -248 -97 -20 75 -89 -309 43 105 -10 -44 -41 5 112
2546A12r1j53K51p0k0J79k59n4K92o1j7j60r8M93j11m80J28L44J7j97k85L33L76
$$ 112 21 -132 119 49 29 208 -51 -105 187 126 109 -51 -149 344 233 -247 -119 225 242 45 -240 93 469
2569D69l99k73K06K31P8m01r0M12K1l07k9R5J06Jk02J23O4j57K3J60j90k3N9Q2
$$ 469 70 -203 3 234 312 -89 -179 233 254 -53 -82 13 119 120 -82 41 105 -52 -29 131 -59 -82 -23 59
2593E9O0k97m3L59l0l06kR8K44j16m03L99J11l16j8J99m1Q1l23J09L44k56j44
$$ 59 119 -178 -221 138 108 -198 -200 -102 142 26 -377 22 133 -183 -201 -2 -43 38 -285 -176 168 -88 -232
2616b32K27K1N0j32j66M44j21l66J95J11Pj2j83Q1K61k42r4K77r4kM9j42J32J56
$$ -232 -5 16 66 -66 -232 212 91 -275 -80 31 38 26 -157 -76 185 -57 -151 126 32 30 79 -63 69 225
2640B25k33O3j16K6L06j90k56J72J23Mj07k13K40J78l72M8J30K2M8j98m5L03j35
$$ 225 -8 55 -61 -35 271 81 -175 -3 120 124 17 -196 44 222 -150 -102 28 50 98 -100 -145 158 23
2663B3j28J76j22l6L9N5O8j29j93L72J1l35Q2J41R0p3l71K06M51m04k84L54Q2
$$ 23 -105 71 -51 -87 -48 7 75 -54 -247 125 136 -199 -117 24 114 41 -330 -124 327 -77 -361 -7 75
2686G5P8l00j07N15k0n10K33K21j03n6l07L95K42n33oM68j27j63j53R8M67l71
$$ 75 153 -147 -254 261 241 -269 -36 185 82 26 -281 114 356 -177 -183 285 158 -5 -158 -60 407 36
2708C6l06L43K00k35o6j20K34J67m39R9L18k08n6N6l9P4n8n8K31j66j87L26P5
$$ 36 -270 73 273 38 -28 -148 86 253 -186 -87 231 23 -33 23 -16 58 0 -58 173 7 -180 146 221
2731B21l23KJ5K40O1n79K20L77k26r2m9J08K88l03k77M10J7j79L3p5J60Lk01J13
$$ 221 -102 -100 -85 155 216 -363 -143 234 8 -84 -133 -25 263 -40 -317 93 110 -69 -36 -111 49 52 -149 -36
2755c6Q5j73J42K0j88J32l5R9K4k39Q2L26j66j66J17K3J48j83j57K71P1k73J33
$$ -36 49 -124 18 38 -150 -18 -53 46 70 -169 -87 239 73 -93 24 47 195 12 -145 126 197 -76 57
2778E7N5o4O4k11K29N6k50M7K56j81r2L8O1J85k62j51L41K5l05L9N6J90r6l08
$$ 57 112 48 112 -99 130 186 -64 -17 239 58 -34 4 65 250 -12 -163 178 203 -102 -63 -7 183 87 -221
2802b21K11J43j27j83J60k9N1k2m0J64j90j08K88L3k11r3Q5K50j10m32L02K67
$$ -221 -10 133 6 -177 -17 -46 5 -17 -57 107 -83 -191 97 130 -81 -174 -89 161 51 -381 -79 188
2824A88k23k35J33J96J34l47j44L93n0q6k9M0J9M3n3N4l7j63L01q2j24l3J80O6
$$ 188 -35 -270 -137 59 193 -154 -298 95 45 -41 -70 -30 -11 32 -21 33 -4 -167 134 52 -72 -105 75 141
2848A41q6k72J40M00k21k27OK17J10k74j55L14J82k67r1P1J57K7k28k5J72p6M
$$ 141 55 -217 -77 323 102 -125 -119 98 208 -66 -221 93 275 8 -83 -12 145 172 -56 -81 91 15 19
2871A9Ln1N7k9K4O1j27p4K66l8j86N5M7J04j17k35K13J65j93j72J59M9P6j85N5
$$ 19 22 -29 28 -1 23 84 -43 -117 149 111 -75 -20 27 131 14 -221 -8 157 -36 -208 -49 0 76 -109 -54
2896e4J50o9j10R1K4l8k3j1J24n3j68J06J67j38j04M2J66P5l63L9K17J17j96q3
$$ -54 96 27 -83 8 32 -6 -29 -40 84 31 -137 -31 136 -2 -106 -64 102 177 -186 -147 70 187 -9 -92
2920i2J6K09qk11M1J51j50J06Kj30J3J61m3k5j24J35K00k18j93J29K28l8k29j35
$$ -92 -76 133 125 -86 -45 106 -44 62 64 -66 -53 108 65 40 -84 51 251 33 -160 -31 197 159 -70 -205
2944b05L42N8k01k21K33J68r1k34N6K53j00r8n7N4O7rp5n7N4L9J57j71r8J02N2
$$ -205 137 195 -6 -227 6 174 83 -151 -95 158 58 -40 -97 -43 24 15 -60 -117 -63 -24 133 -38 -136 -34 18
2969A8N2j38j01J39J85k22n2L1J67jk07L6J51l9q1k7Q0O2m9n6R9k4l9O5Pp0kM8
$$ 18 70 -68 -169 -30 155 -67 -119 -88 79 78 -129 -93 58 19 -62 -89 -9 53 4 -52 47 23 -16 49 56 -14 -16 32
2997C2M8k2q4K0J41j03n8J11k4j9Lj00J68J3j31J05k9l7L8Po6M7j41J46N0j29
$$ 32 80 58 -26 -6 135 32 -26 85 61 42 45 -55 113 126 -5 100 71 34 72 79 13 60 -81 65 115 -14
3023a4o0J45K5q0r0L4K24j32j06l6J32P2j07j33Q6J79j61l3M5N9o6J6mLJ9k4L1
$$ -14 -74 71 96 16 -74 -40 184 52 -54 -90 42 114 7 -126 -40 139 -22 -55 -10 49 -17 -1 -5 -2 17 -7 24
3050B4%j23Q3M5K7j05l3K03k6j83j5J37Q4j24j51J11K21p6k37N4J95rj64j5Q6
$$ 24 24 -99 -16 29 56 -49 -82 121 95 -88 -103 34 118 -6 -157 -46 175 99 -138 -84 111 102 -62 -77 9
3075IR0j14M5k8M5L3m4L8Nn2j9M3pj39J42m8N7q7%J15q3l5k7J41n7Qj47J25L8
$$ 9 99 -15 30 2 47 80 36 74 79 27 8 51 44 -95 47 -1 56 -31 -31 84 1 -34 -61 80 23 31 -116 9 47
3104D7r6L8J7l5O2j6n7J8j4JM7l4Q%j9k2L1o1M8N8Jj4J6rJ5j1q6P4q3R2O4j25
$$ 47 -49 -11 6 -29 33 17 -40 -22 -36 -35 12 -22 -14 -14 -33 -55 -24 -85 -37 21 22 8 24 15 30 19 -67 7 -76 16 80 -45
3136d5j6Q9M2m9lp1J67m2j33P9K6P7r1o3J05M8j34J7P5n1M8j38L8R7l9o7Q7j3
$$ -45 -61 28 70 21 18 -53 114 72 -61 18 44 121 30 -33 72 120 -14 3 78 27 75 -63 -25 72 33 -34 53 40
3164D0n2M4l8j1J3p4J75k3j63QJ61o1q5p0J29J30j41j29R8J30j21m6l2K43p6k10
$$ 40 -12 32 -6 -17 -4 -78 97 74 -89 -81 80 19 -66 -136 -7 123 -18 -147 -49 81 -40 -86 -118 125 49 -161
3190a61R1J65o8r2j3K9J80j93m7J28L8j03J0l1P3K6j56J29on0P1mq0P1o8J07M1
$$ -161 -70 95 27 -65 -78 -49 131 -62 -109 19 57 -46 -36 -67 6 32 -124 5 -1 -51 20 16 -64 7 -61 46 87
3217H7j58J5J33o7q3N1K7M7j7j57K21M0j68K9k5P1P5j64M0J22j27j2LO0M9p5n6
$$ 87 -71 -56 77 10 -73 -22 5 52 35 -122 99 139 -29 0 -25 46 121 -43 -3 119 -8 -20 -17 43 92 17 -39
3244c9Q1k9n0M9k0J7L0o3K1O6n9kL8o8Q9l9n3J2l2J3N3n5l4J83j09m5j3j6J12
$$ -39 42 13 -37 12 -8 9 39 -24 -3 63 4 2 40 -28 61 22 -31 -19 -51 -38 15 -40 -74 109 0 -45 -58 -74 38
3273C8k5j29J57L1j43M0k0O0K2j02l0J95p2p2M2j0P6n2p5Q1N9j23R2M3o9k0j0
$$ 38 13 -116 41 72 -71 -31 -51 9 31 -71 -101 94 22 -50 -8 -18 58 6 -69 12 71 -52 40 83 14 -6 -16
3300a6J06%j92M9J42o7j05O7N2R8j58p5J18R1j73m0L9R5M8j95Q3J15r0k1l4O6
$$ -16 90 90 -102 -53 89 22 -83 -16 36 134 -24 -99 19 110 -63 -103 -64 31 79 -116 -33 82 -8 -29 -63 3
3326CM7j04k7J27k4j35J38n3k1LM0K1l9p4J40P3j67J6K1L2J0p0o5J89l6q9K9M6
$$ 3 50 -54 -81 46 22 -113 25 -28 -49 -46 -6 15 -24 -98 42 115 -52 -36 -15 17 27 -43 -108 81 45 -44 -15 31
3354C1M6o6k5oQ2p1LK9l8O4r8M9N0ln8J26j43mJ11l4l7K1j2N6l8n2N3ljK1j6J8
$$ 31 77 11 -14 -20 62 -9 -6 23 -15 49 -49 0 50 47 -11 115 -28 -32 79 45 8 29 17 73 35 -17 36 33 32 53 37 55
3386E5K2r2j5P7oo2j2O6M0r8n3P7Q6j16m8K3P5Qk01J12J54j03n7O8QL2m3q7J30
$$ 55 77 -15 -30 47 41 -21 -33 33 73 -25 -78 -1 85 -31 -79 -56 19 27 -174 -62 92 -11 -68 0 8 40 -3 -90 40
3415D0l1l5K9m9L6P4n3l3Q6j59R7L0j01j5O0P2M2j24l3J11k4m5m7J61k3n6o8R1
$$ 40 9 -26 3 -46 -10 64 11 -22 64 -95 2 32 -69 -84 -24 48 90 -34 -67 44 20 -25 -72 89 66 10 -58 33
3443C3M0l3q1J05n8O0m3l0N9J5l7L6j14Q8M0o3kl7N6K5Pj20O7J4j1k1M9qL6j25
$$ 33 73 40 -41 64 6 66 23 -7 52 67 30 66 -48 40 80 17 15 -22 34 59 66 -54 13 27 16 -5 44 36 72 -53
3473e3l7J39l0No5j3J37j81L1JJ03j37P4mM8kq4P3%Pk3J1oN2j04O0J4m4J1O4l2
$$ -53 -90 49 19 24 -41 -54 83 -98 -67 -66 37 -100 -26 -30 18 16 -68 5 5 12 -11 0 -6 46 -58 2 16 -28 -17 47 15
3504A5n4N0m2M5m2K3N0j8p6N5K3k9j4k1J9R7l0n6mO4m0j%QOm6JMN4n1M7r5N6o
$$ 15 -39 11 -31 14 -28 -5 45 27 -49 6 29 0 -14 -35 -16 81 51 -5 -9 55 15 14 14 22 28 -18 -17 -13 41 -10 37 -58 -2 -8
3538hK6k4J2j8L2K2r0K9qP2o9m6J31q2M7p8M7O8rj09L0N2m6K5j00Q0J4j5n3M2
$$ -8 18 -6 6 -12 20 42 -48 -19 -27 45 -24 -70 61 -21 26 -52 -5 63 54 -55 -25 27 -19 6 -94 -14 0 -15 -68 -26
3568b6Q4k7o3L4M0K4j33O7M9l3J3n9N1K1K4m8J2k6l0Q8m0KK2m3O3j08M4k8O6n
$$ -26 58 31 -32 2 42 66 -67 0 49 16 29 -30 21 42 66 18 30 4 -26 62 22 24 46 3 66 -42 2 -26 40 35
3598C5m8O7l1K8lj19M7Q4o6K7l3J0L1j8m5OK0N2j4p7K6O0n8K4n8N0K9m4N6r4O8
$$ 35 -13 54 23 51 48 -71 -24 60 -6 21 -12 -2 29 11 -34 -28 -8 44 30 -47 -21 39 -19 5 -53 -3 26 -18 38 -56 12
3629A2m4o4R5j8k7j1J6M5l4m8K5O7m5K3LJ2m3n3R6n0J05r8kN7K6l5q8J7J42k7
$$ 12 -32 -96 -1 -19 -46 -57 -41 4 -30 -78 -53 14 -31 -8 -5 7 -36 -89 7 -43 62 -36 -38 19 45 10 -78 -61 81 54
3659E4q8N7qj3K4m6%K8K4j7No7O3P0o9n3kN1J04j14j07J39J9r7k8L2Q3M5j23p2
$$ 54 -34 23 15 2 26 -20 -20 8 32 15 20 -47 16 86 17 -36 -38 13 117 3 -104 35 54 -43 -71 -39 44 89 -34 -106
3689a06J02Q9p9n4m1Q6N1n2j4lP5k7l4J2L5p1L3o3M9P1n1pl2L0L5l6k4M3JK4l9
$$ -106 -4 85 6 -48 -89 -3 48 -4 -18 -21 54 27 -7 5 40 -31 2 -61 -12 59 8 1 -31 -1 34 -2 -26 17 18 42 3
3720Cl0J5j4P4q7NK6%L5l3j5P2L9o8l6K4m9J25r6L8p2J04j8k4j4LM1k4K3j8j0
$$ 3 -27 -12 -26 48 -39 -34 -8 -8 27 -6 -21 51 90 22 -14 10 -39 86 -10 28 -44 60 42 18 4 7 48 24 47 29 19
3751A9QJ2q8Q8n7O1M2j30NK3M5%o2KR0l4r6l4J12J01j58n3M9J35n4j06QK7J48
$$ 19 27 39 -49 39 -18 43 85 -45 -40 -17 28 28 -34 -32 58 24 -72 -106 6 107 -51 -104 -55 80 26 -80 -72 -45 103
3780A03j23j6K1J8L3%j06O4K3j2pm5J1P7jj08rJ45l9l4q9P7N6jo7k0M0N8k7o2
$$ 103 -20 -36 -15 3 36 36 -70 -6 17 5 -2 -47 -36 41 40 -68 -77 68 29 -5 -94 -17 39 38 -29 -49 -9 49 22 -40
3810d0K8P6lK4q6QR3m0q1L3n5Q9L6k3r4R4k7mk6o9J36n0J4q0N2M3Mn8L7k5l3N
$$ -40 -12 64 61 85 -1 7 100 60 -21 12 -43 46 82 59 -35 59 32 28 2 -67 69 19 33 -47 5 48 52 -6 31 6 -27 -22
3842b2J4q4Q8pj0k5J4j7R6q6JkO1jn7k7qJ52j26J07q7L1O6j33L3KK4L4J0r5M6
$$ -22 -8 -92 -4 -11 -21 -46 -32 -49 47 -39 -38 -40 21 20 -37 -64 -72 80 -46 61 -26 5 71 -62 -29 -27 -3 31 41 -54 -8
3873hL1l2Om6J01J9o4r4O6L1L5m3n1O6M9k7n7K1L9Mqp2N8M3l5jk0J0J08p7l7l6
$$ -8 23 -9 -3 -49 52 71 7 -87 -21 10 45 2 -49 17 66 39 -18 3 42 46 38 -34 24 67 32 31 11 21 129 52 15 -21
3905b1RM2j9r4M9N9k4k1PL8O6n8q8M5j3L4j9j31Q6N4j9J4p2O7K8k0n7J5K1RM0
$$ -21 -12 30 11 -83 -34 25 1 -20 -13 25 91 33 -55 -10 -23 11 -8 -139 -53 1 -18 -4 -76 -9 19 -1 -58 -43 -22 -13 27
3936B7j06N1O5l1M8l8m1O8l8k8R0p5K4J4q1K9N9ql3Q4j00rL8j2J7kk4N5K6j07
$$ 27 -79 -28 37 6 54 16 -25 43 5 -23 67 -8 16 30 -51 -22 37 29 -4 80 -20 -29 9 -3 14 12 -12 43 69 -38
3966c8M7j2J1l7j2lQ0nn3K9ONJ6j18J03K1Kl5j9L1Lk2k5m6J30l9l0m0K6L0K7p4
$$ -38 9 -3 8 -29 -41 -44 36 31 -22 7 13 18 34 -84 19 40 42 7 -12 19 22 0 -25 -71 59 20 -10 -50 -24 6 33 -41
3998d1J1N2O2p2p8k5Q6K6p4K2P3l6j4l9K2O2l3j3J7O9o4L0o3O0p3O2j0J5l4l2
$$ -41 -30 22 84 12 -66 -91 -5 21 -53 -31 42 6 -8 -47 -25 37 4 -9 8 77 13 43 -20 40 -33 29 19 34 0 -32
4028c2M0J7m4L6k3O5n1pL5L1mj04M0%M3l1L3k6nl1Q6n0J6K1m0P8j09K8K6N6q5
$$ -32 8 25 -19 17 -6 59 8 1 36 67 63 -41 -1 -1 42 11 44 18 13 -18 68 18 34 55 15 93 -16 12 38 94 9
4059Ik0J0O4k4k6n0J0L0N6m3j4NkJ7n5jL0K6K6r7K1Q1r9L8k2L6k6n3NO3k5M0n1
$$ 9 -11 -1 63 39 13 -37 -27 3 59 16 2 7 5 22 -33 -34 -4 22 48 -49 -28 53 -46 -8 -30 6 -20 -73 -68 -5 -30 10 -41
4092d1L1M5j8l1nOR2j3o2j6L2L4j7k1n0L8lM2k9J7m0K9ll0mO5K2l2l1j3%K3l0
$$ -41 -10 35 17 -14 -19 -13 79 66 4 -12 20 54 37 16 -34 4 1 43 14 31 -9 20 17 -13 -17 48 70 38 7 -6 -6 17 -13
4125a3L3L4p0L6l6M2Mo7k5O7K6n6nK5j7qL2MQk8j1L1j6k6kO0po9M6p1M3L4K9n5
$$ -13 20 54 -16 20 -16 26 30 -37 -62 5 31 -25 -30 -5 -22 -30 2 6 14 -14 -25 6 -10 -36 -38 22 15 -54 -8 -79 -36 -2 27 -28
4159b8%K5n7N5j8J2QJ8l8l2N2K7Po8N8qK8m3k8M7Qj3M0o5K6J1m2L5QlR8r8l4N2
$$ -28 -28 -3 -60 -5 -23 -11 -3 15 -23 -55 -3 24 31 -37 21 13 41 -2 -30 17 25 12 52 -13 13 24 -18 17 25 22 120 22 -12 40
4193D0mJ3o0l9R5L4n5k9L7m8N5l0j6j7R1j03N4m7N0j3k9JK6l3J2J8K5p3lN6j9
$$ 40 36 49 -11 -50 45 79 24 -5 32 -16 39 9 -7 -24 67 -36 18 -29 21 8 -21 -20 6 -27 -15 3 28 -45 -48 8 -11
4224a1qk6M0N4q9N1n7L4qKj5O0j4m1j6%R3r1K1jK1qN8j8l7m6J9R3q9K5j7J37q0
$$ -11 -19 -45 -5 49 -40 11 -46 -12 -20 -18 -33 27 13 -28 -44 -44 49 -42 -21 -22 -1 -9 49 31 -6 -52 -33 60 -29 -4 -21 116 36
4257C6ok7J05o4l3j6M2L5o6M5j06J75m5m9lk5J25j06qp5R3k6l2K7kpNN1n3L6M6
$$ 36 30 3 108 44 11 -5 37 72 6 51 -55 120 75 26 23 -2 123 17 9 -66 27 1 -31 -4 -6 -13 -8 43 -10 26 72
4288G2j08QK6K1L6j16L0J2N2km1k7O4n3O6p0qM1K2%Mk6L5p3J0P5j00M8M8o7NK8
$$ 72 -36 -28 -2 19 55 -61 -31 -19 33 31 -10 -37 27 -26 40 -30 -38 3 25 25 29 3 38 -35 -25 50 -50 -2 46 -21 -16 12
4320A2L7o3L5p1N4J9rm1M1Mj4O6m1L3n5O0n8M8o4L2P3p6o4Q4J5m0L8o4L8N8j04
$$ 12 49 -14 21 -50 4 23 14 -27 14 18 4 70 29 62 7 67 9 57 -7 25 98 22 -42 42 57 17 55 -9 29 87 -17
4351a7M0n4P2K1o9N7nmL8j01NO0l5k8J9RO2m8j7l0P2Oo4j9m0R6L7q1l2Q0K3n6
$$ -17 23 -31 41 62 -7 50 45 41 79 -22 -17 43 8 -20 -1 8 70 22 5 -25 47 53 -11 -30 -70 26 63 -18 -50 30 53 -3
4383ck4KN8m0jQj1Q9n2k3rLK0Jj3L9k1J4J2m3k7M2M0k8n4P6pj7J4l6M9j0r8N5
$$ -3 -27 -25 33 -7 -8 0 -11 78 26 3 -6 -3 17 18 5 44 23 37 49 6 -21 21 61 33 -21 55 48 31 45 9 58 48 -50 5
4417EM0j8J0k3J7M8J3k5l7l7P3n7J8o9L1J1O0o8p6J20l8j7m8PK0M7k6l7OO0N7
$$ 5 45 27 37 14 31 79 92 67 30 -7 66 9 27 -42 -11 0 60 -8 -84 36 -2 -19 -67 -60 -40 7 -19 -56 -50 10 67
4448F7n2ql4N2l8K7p9LJ03j1N1r6l3L1M7o6k8O4k6k4M5nj1Q0k8O0p4M5oj4l2J1
$$ 67 15 7 -27 25 -13 14 -65 -62 41 30 81 -15 -48 -17 30 -36 -64 0 -26 -50 -5 -10 -21 59 31 91 17 62 56 42 10 21
4480B1M7j21M2J1Q9n0l6%J9K9jj06Q0k6NLNmRL9r0L1Q6q6k6JM4J8Rl7momJ1l6
$$ 21 68 -53 -11 0 89 39 3 3 22 51 50 -56 24 -2 3 6 11 7 16 55 -35 -4 82 -4 -30 -29 15 33 42 5 1 -5 -9 2 -34
4515c4N5k4K8l4l2P1l7L3k7J0k0K3n6l0R2j3M3r8O9l1l3P3o1J6M2njj8k1ML8M
$$ -34 21 -3 25 -9 -41 30 -7 26 -1 9 -11 12 -44 -74 18 5 48 -50 19 -12 -45 28 -33 -17 25 20 19 1 -20 -16 22 26
4547B6K1l9j4oK9J5j9M4Onl8O5o2lJ9n8k3M6j4J02p6l4N1j5nJ4NJ1m5J5m0K7L4
$$ 26 47 8 -6 -12 17 32 13 57 63 58 20 85 23 20 39 -19 -42 4 -10 92 16 -18 33 18 13 27 32 43 -2 13 -27 0 34
4580C4K9q8M9nn2jMO0Lj04Q3Nj8j2K6l8K3kk5M1k7j3N1l5k3Q9q3nL0J0j3J3k2
$$ 34 63 -25 24 19 -33 -34 -30 30 33 -71 12 17 -1 -13 13 -25 -2 -4 -29 12 -15 -28 23 -12 -35 54 -29 -34 -4 6 -7 6 -16
4613a6L1k7J2l4J4PL0J4m6N6j5K7k4n1N0K0j3oNK3j9po3M9j6M8j01Q6j6j3k8j8
$$ -16 15 -12 0 -34 -20 -13 17 31 -15 41 26 53 29 -22 28 48 35 29 34 57 38 31 -32 17 1 49 -52 34 18 5 -23 -41
4645d1M7l1K6m0O1k2Lj4k8L7pM6n7O2l7J3J1k2m3O2m4QN0n1O6l6L6n5J5qK4l5
$$ -41 6 -25 1 -39 22 0 3 -11 -39 -2 -9 37 -20 42 5 18 29 7 -36 26 -18 -10 40 -11 55 19 55 0 15 7 31 -4
4677dn0qQL8l2R0l5k0JMk6K4M8r5M5k2M7OL4n3mKO%J6L1n8K4k3k2N8k%Qjk9K1
$$ -4 -54 -62 -54 -16 -48 42 7 -13 -12 -8 -34 -10 38 -57 -12 -34 13 19 53 0 -4 -2 4 4 20 51 -7 17 -6 -28 30 28 28 36 35 6 27
4714B7ln7L2J7M2o3JLK6j6kLj2mj9k3P1Lno9KP4l7Qk4L5nM1l5m0O4l7J5n9Q3M
$$ 27 24 -33 -1 16 58 -5 -4 -1 25 9 7 10 -2 -6 -25 -48 23 26 21 -48 -46 28 -9 -1 -25 10 5 46 11 -29 35 -2 13 -46 37 41
4750D1k3Lo0Q2Rq3Rl1O0K6o1N1Nl1pJ1M3q1P6k8j0j9N0j5k6j2M6J8Ok3J7m9j4
$$ 41 18 21 -39 43 52 -31 -22 -53 7 33 -28 23 28 -3 -10 1 44 -37 39 11 1 -18 32 17 -9 -21 25 43 49 26 43 -6 -20
4783b0L4L9j5jJ2r5M1j5K0j7M8p3L8j0N3l1k1Mj2j5J6J6j4Nl4mM2jJ3krJ6m6N6
$$ -20 14 53 38 37 49 -46 -5 -20 0 -17 31 -42 -4 -14 39 8 -13 -9 -21 -36 -20 -4 -18 -13 -47 -51 -9 -10 3 1 -8 8 -38 18
$$ [...]
8191H4
##END NTUPLES=NMR FID
##END=
