##TITLE=1H_SA_Sl.ONFOH3
 CDCl3, 108 sc, 
 18.11.2020
##JCAMPDX= 6.0         $$ Bruker NMR JCAMP-DX V2.0
##DATA TYPE= NMR FID
##DATA CLASS= NTUPLES
##ORIGIN= UXNMR, Bruker Analytische Messtechnik GmbH
##OWNER= root
$$ XWIN-NMR		Version 3.5
$$ Wed Nov 18 13:48:04 2020 Russian Standard Time (UT+4h)  she@DPX200
##.OBSERVE FREQUENCY= 200.1315066352
##.OBSERVE NUCLEUS= ^1H
##.DELAY= (6, 6)
##.ACQUISITION MODE= SIMULTANEOUS
##.ACQUISITION SCHEME= undefined
##.AVERAGES= 108
##.DIGITISER RES= 18
##SPECTROMETER/DATA SYSTEM= spect
##.PULSE SEQUENCE= zg30
##.SOLVENT NAME= CDCl3
##.SHIFT REFERENCE= (INTERNAL, CDCl3, 0, 15.7039)
##AUDIT TRAIL= $$ (NUMBER, WHEN, WHO, WHERE, WHAT)
$$ ##TITLE= Audit trail, XWIN-NMR		Version 3.5
$$ ##JCAMPDX= 5.01
$$ ##ORIGIN= Bruker BioSpin GmbH
$$ ##OWNER= she
$$ F:/spectra/data/she/nmr/H-F/1/audita.txt
$$ ##AUDIT TRAIL=  $$ (NUMBER, WHEN, WHO, WHERE, WHAT)
(   1,<2020-11-18 13:46:25.00 +0400>,<she>,<DPX200>,
      <continue with go, POWCHK disabled, PULCHK disabled
       configuration hash MD5:
       00 E9 B6 7A A2 85 ED C7 34 08 36 98 17 FE 4E 26
       data hash MD5: 16K
       05 2B 74 6D 1F 01 81 24 4B A3 87 1C 3E 52 DE 42>)
$$ ##END=
$$ 
$$ hash MD5
$$ 0C 36 47 5D 47 33 33 98 71 CD 3C 24 B8 D2 66 FD
##$RELAX= 
##$RELAX= 
##$RELAX= 
##$RELAX= 
##$RELAX= 
##$RELAX= 
$$ Bruker specific parameters
$$ --------------------------
##$DU= <F:/spectra>
##$EXPNO= 1
##$NAME= <H-F>
##$PROCNO= 1
##$TYPE= <nmr>
##$USER= <she>
##$AMP= (0..31)
100 100 100 100 100 100 100 100 100 100 100 100 100 100 100 100 100 100 
100 100 100 100 100 100 100 100 100 100 100 100 100 100 
##$AQSEQ= 0
##$AQ_mod= 1
##$AUNM= <au_zg>
##$AUTOPOS= <>
##$BF1= 200.13
##$BF2= 200.13
##$BF3= 200.13
##$BF4= 200.13
##$BF5= 200.13
##$BF6= 200.13
##$BF7= 200.13
##$BF8= 200.13
##$BYTORDA= 1
##$CFDGTYP= 0
##$CFRGTYP= 5
##$CHEMSTR= <none>
##$CNST= (0..31)
1 1 145 1 1 1 1 1 1 1 1 1 1 1 1 1 1 1 1 1 1 1 1 1 1 1 1 1 1 1 1 1 
##$CPDPRG= <>
##$CPDPRG1= <>
##$CPDPRG2= <>
##$CPDPRG3= <>
##$CPDPRG4= <mlev>
##$CPDPRG5= <mlev>
##$CPDPRG6= <mlev>
##$CPDPRG7= <mlev>
##$CPDPRG8= <mlev>
##$CPDPRGB= <>
##$CPDPRGT= <>
##$D= (0..31)
0 1.2 0 0 0 0 0 0 0 0.06 0 0.03 0 0 0 0 0.0002 0 0 0 0 0 0 0 0 0 0 0 0 
0 0 0 
##$DATE= 1605692341
##$DBL= (0..7)
120 120 120 120 120 120 120 120 
##$DBP= (0..7)
150 150 150 150 150 150 150 150 
##$DBP07= 0
##$DBPNAM0= <>
##$DBPNAM1= <>
##$DBPNAM2= <>
##$DBPNAM3= <>
##$DBPNAM4= <>
##$DBPNAM5= <>
##$DBPNAM6= <>
##$DBPNAM7= <>
##$DBPOAL= (0..7)
0.5 0.5 0.5 0.5 0.5 0.5 0.5 0.5 
##$DBPOFFS= (0..7)
0 0 0 0 0 0 0 0 
##$DE= 6
##$DECBNUC= <off>
##$DECIM= 32
##$DECNUC= <off>
##$DECSTAT= 4
##$DIGMOD= 1
##$DIGTYP= 9
##$DL= (0..7)
0 120 120 120 120 120 120 120 
##$DP= (0..7)
150 150 150 150 150 150 150 150 
##$DP07= 0
##$DPNAME0= <>
##$DPNAME1= <>
##$DPNAME2= <>
##$DPNAME3= <>
##$DPNAME4= <>
##$DPNAME5= <>
##$DPNAME6= <>
##$DPNAME7= <>
##$DPOAL= (0..7)
0.5 0.5 0.5 0.5 0.5 0.5 0.5 0.5 
##$DPOFFS= (0..7)
0 0 0 0 0 0 0 0 
##$DQDMODE= 0
##$DR= 18
##$DS= 0
$$ [...]
##$SUBNAM2= <"">
##$SUBNAM3= <"">
##$SUBNAM4= <"">
##$SUBNAM5= <"">
##$SUBNAM6= <"">
##$SUBNAM7= <"">
##$SUBNAM8= <"">
##$SUBNAM9= <"">
##$SW= 16.9725356469052
##$SWIBOX= (0..15)
0 0 2 0 0 0 0 0 0 0 0 0 0 0 0 0 
##$SW_h= 3396.73913043478
##$TD= 16384
##$TD0= 1
##$TE= 0
##$TE2= 300
##$TE3= 300
##$TEG= 300
##$TL= (0..7)
0 120 120 120 120 120 120 120 
##$TP= (0..7)
150 150 150 150 150 150 150 150 
##$TP07= 0
##$TPNAME0= <>
##$TPNAME1= <>
##$TPNAME2= <>
##$TPNAME3= <>
##$TPNAME4= <>
##$TPNAME5= <>
##$TPNAME6= <>
##$TPNAME7= <>
##$TPOAL= (0..7)
0.5 0.5 0.5 0.5 0.5 0.5 0.5 0.5 
##$TPOFFS= (0..7)
0 0 0 0 0 0 0 0 
##$TUNHIN= 0
##$TUNHOUT= 0
##$TUNXOUT= 0
##$USERA1= <user>
##$USERA2= <user>
##$USERA3= <user>
##$USERA4= <user>
##$USERA5= <user>
##$V9= 5
##$VALIST= <valist>
##$VCLIST= <CCCCCCCCCCCCCCC>
##$VD= 0
##$VDLIST= <DDDDDDDDDDDDDDD>
##$VPLIST= <PPPPPPPPPPPPPPP>
##$VTLIST= <TTTTTTTTTTTTTTT>
##$WBST= 1024
##$WBSW= 4
##$XGAIN= (0..3)
0 0 0 0 
##$XL= 0
##$YL= 0
##$YMAX_a= 548338
##$YMIN_a= -326607
##$ZGOPTNS= <>
##$ZL1= 120
##$ZL2= 120
##$ZL3= 120
##$ZL4= 120
##$ABSF1= 10
##$ABSF2= 0
##$ABSG= 5
##$ABSL= 3
##$ALPHA= 0
##$AQORDER= 0
##$ASSFAC= 0
##$ASSFACI= 0
##$ASSFACX= 0
##$ASSWID= 0
##$AUNMP= <proc_1d>
##$AZFE= 0.1
##$AZFW= 0.1
##$BCFW= 1
##$BC_mod= 2
##$BYTORDP= 1
##$COROFFS= 0
##$CY= 11.3945322036743
##$DATMOD= 1
##$DC= 2
##$DFILT= <>
##$DTYPP= 0
##$F1P= 15.9154993809931
##$F2P= -4.1035820241983
##$FCOR= 0.5
##$FTSIZE= 0
##$FT_mod= 4
##$GAMMA= 1
##$GB= 0.15
##$INTBC= 1
##$INTSCL= 1
##$ISEN= 128
##$LB= 0.24
##$LEV0= 0
##$LPBIN= 0
##$MAXI= 10000
##$MC2= 0
##$MEAN= 0
##$ME_mod= 0
##$MI= 1.114404
##$NCOEF= 0
##$NC_proc= 0
##$NLEV= 6
##$NOISF1= 3.799351
##$NOISF2= 2.8
##$NSP= 1
##$NTH_PI= 0
##$NZP= 0
##$OFFSET= 15.70392
##$PC= 1
##$PHC0= -11039.94
##$PHC1= 1.200901
##$PH_mod= 1
##$PKNL= yes
##$PPARMOD= 0
##$PSCAL= 0
##$PSIGN= 0
##$REVERSE= no
##$SF= 200.130013532006
##$SI= 16384
##$SIGF1= 3
##$SIGF2= 2
##$SINO= 400
##$SIOLD= 16384
##$SREGLST= <1H.CDCl3>
##$SSB= 0
##$STSI= 0
##$STSR= 0
##$SW_p= 3612.71676300578
##$SYMM= 0
##$S_DEV= 0
##$TDeff= 0
##$TDoff= 0
##$TI= <>
##$TILT= no
##$TM1= 0
##$TM2= 0
##$TOPLEV= 0
##$USERP1= <user>
##$USERP2= <user>
##$USERP3= <user>
##$USERP4= <user>
##$USERP5= <user>
##$WDW= 1
##$XDIM= 8192
##$YMAX_p= 0
##$YMIN_p= 0
$$ End of Bruker specific parameters
$$ ---------------------------------
##NTUPLES= NMR FID
##VAR_NAME=  TIME,          FID/REAL,        FID/IMAG
##SYMBOL=    X,             R,               I
##VAR_TYPE=  INDEPENDENT,   DEPENDENT,       DEPENDENT
##VAR_FORM=  AFFN,          ASDF,            ASDF
##VAR_DIM=   8192,          8192,            8192
##UNITS=     SECONDS,       ARBITRARY UNITS, ARBITRARY UNITS
##FACTOR=    0.0002944,     1,               1
##FIRST=     0,             0,               0
##LAST=      2.4114304,     0,               0
##MIN=       0,             -326607,         0
##MAX=       2.4114304,     548338,          0
$$ Real data points
##PAGE= N=1
##DATA TABLE= (X++(R..R)), XYDATA
0@%%%%%%%%%%%%%%%%%%%qJ16k16K16k16K16k17L20m27M32m74N82o52P55q64R72
35E35j114J231j402J589j771J971k194K437k706L003l322L671m053M468m924N424
51B843n975O585p256Q007q844R776j0829J2034j3429J5056j6991J9338k2268K6041
65A4088l1113L8393n0080P3597k64029L78662k83090j18592J02211j86654M20899
76I4292l9657k64631J31457R9328L0383J31210l19576J51101P7131j5127O8645
87A44556j82373L6354R5447M1651j00509k0011l0077R3824O2041j88688Q3716
98C5931n6121N9065J9895r6701o14K5103l7218M4148K0679j61573J62779r6698
110h1325K9763R7926k05889J35368K159k8077J6577l9537n377P3810o3512Q746
$$ plain form
0 0 0 0 0 0 0 0 0 0 0 0 0 0 0 0 0 0 0 0 0 -8 108 -108 108 -108 108 -109 211 -216 216 -258 324 -328 427 -437 535
35 535 -579 652 -750 839 -932 1039 -1155 1282 -1424 1579 -1743 1928 -2125 2343 -2581 2843
51 2843 -3132 3453 -3803 4204 -4640 5136 -5693 6341 -7088 7968 -9023 10315 -11953 14088
65 14088 -17025 21368 -28712 44885 -219144 159518 -123572 -242164 -139953 -326607 94292
76 94292 54635 -209996 -78539 20789 51172 182382 -137194 13907 91038 75911 144556
87 144556 -37817 -1463 93984 135635 35126 15115 -14962 78862 140903 -47785 35931
98 35931 -20190 38875 58770 -37931 -38545 -13442 -50660 -6512 14167 -147406 15373 -81325
110 -81325 -51562 46364 -159525 -24157 -21998 -50075 -33498 -73035 -78412 -4602 -68114 -59368
122e9368M1855j33991J45417o4267J7605K6760j00937Q3320L2269K953q4779M1230
134e1933J0526P7888m7185p8239Q5568k5993O9980o7734l5548L3382N8591k7741
146A562k0395j5202n2022J64687r9431j3317n75k2612J21919o6678n2327P045
158d7346O7390O247J6603r4489N0433O5977o2616Q3047j04106M1776L8911j1587
170E0240J381m2570N994J5480N9878q6925J1915l2930O0543L4703j09274L7187
182E622o217M3296k3156j6226m0966N9291J0288n5049M8240q2397P6996j3768
194E954j6725R654m5554L3484J0251j0007m2747M9925m9256N4057k7722n3082
206h1768P9134n8445M4910j9124n397j441Q128P504N722L814m5425P7848n0942
$$ plain form
122 -59368 -17513 -151504 -6087 -70354 -52749 -25989 -126926 -43606 -11337 -8384 -93163 -51933
134 -51933 -41407 36481 -10704 -88943 -3375 -29368 40612 -27122 -62670 -29288 29303 1562
146 1562 -18833 -34035 -86057 78630 -20801 -34118 -34693 -57305 64614 -2064 -54391 -47346
158 -47346 20044 26291 42894 -51595 -1162 64815 2199 85246 -18860 22916 61827 50240
170 50240 51621 9051 15045 30525 90403 3478 15393 -17537 43006 77709 -31565 5622
182 5622 -595 42701 19545 3319 -37647 21644 31932 -23117 25123 -57274 19722 5954
194 5954 -10771 -1117 -46671 -13187 -2936 -12943 -55690 -5765 -55021 -964 -28686 -81768
206 -81768 -2634 -61079 -16169 -35293 -40690 -42131 -34003 -26499 -20777 -16963 -62388 15460 -35482
219c5482L7005j6953k9717P2548k9894l103j0511L9937k9389L6282l3607O618
231C734M1097o3606N9556m5111L1491j042k8818J5611J4333p104j9980M0114o2442
244b2167P3356l2053k1828L3862l6592N1836l1922p089k1250L8749j0387o33k9390
257a5508j5839Q0718o9996K6305l1551P184M3642k5061k1957q665M5170l0492
269a6050L4420n8130J6908K1936j4070L1766o9179M0032N685Q650k2409k166m826
282b7433K1673K8773p7043N1912k7771L0216k467l3230K7396j3572K6494k6145
294b1197J7275k2172M2266k4860j440L0298n4467O1046l3366J0458M045k946l822
307A118P21J4058j9809L7982n2771M8846k1014K898K1276m9105M9574j3426J90
$$ plain form
219 -35482 1523 -15430 -45147 27401 -2493 -5596 -16107 23830 -5559 30723 -2884 3734
231 3734 44831 -18775 40781 -4330 27161 26119 -2699 12912 27245 20141 161 40275 -22167
244 -22167 51189 19136 -2692 31170 -5422 46414 14492 7403 -13847 24902 14515 13882 -15508
257 -15508 -31347 49371 -20625 5680 -25871 -18687 24955 -106 -22063 -30728 14442 -16050
269 -16050 18370 -39760 -22852 -916 -14986 16780 -52399 -12367 -6682 1968 -20441 -22607 -27433
282 -27433 -5760 23013 -54030 -2118 -29889 327 -2140 -35370 -7974 -21546 4948 -21197
294 -21197 -3922 -26094 16172 -8688 -10128 20170 -34297 26749 -6617 3841 7886 4940 1118
307 1118 1839 15897 -3912 34070 -18701 30145 9131 12029 33305 -15800 33774 20348 20538
320B0538j8922K1201j9878K5463m924m1478M8773m3453M4347k7255j0512J6490
332A0390j0077J9972j8813j962k1492N7518m3042J1725m809k6587O0985l9902
344f094Q717j9394J6070N388M987k1752j0000L0049k6048M5727o7746J5218K5558
357F80j4789J7564l9911J1670Q436L1591m3983J5951p514J5202K8375n4954L8150
370F468k8181L4967K723k2940o104J0529K1395j9221J9075n2877N3189Q75j6093
383C805L581k5867M7548j5155K734k5692K3652m252J6887r899k8976N1205l8828
396G43L3395j6211p505J7136l522L347j7616J6572k1789L3734l8420J3576K006
409A5446k3045L4266m3333K9047q630k086j3698K0573m902j4927K1879l2911M5192
$$ plain form
320 20538 1616 22817 2939 28402 23478 -18000 30773 -12680 31667 4412 -6100 10390
332 10390 313 20285 1472 -490 -21982 35536 -7506 4219 -590 -27177 33808 -6094
344 -6094 2623 -16771 -701 4687 9674 -12078 -22078 7971 -18077 27650 -40096 -24878 680
357 680 -14109 3455 -36456 -24786 -16350 15241 -28742 -12791 -20305 -5103 23272 -31682 6468
370 6468 -21713 13254 15977 -6963 -13067 -2538 18857 -364 18711 -34166 19023 19898 3805
383 3805 7386 -18481 29067 13912 16646 -9046 14606 10354 27241 17342 -11634 39571 743
396 743 34138 17927 10422 27558 24036 27383 9767 26339 4550 38284 -136 13440 15446
409 15446 -7599 26667 -16666 12381 3751 1665 -12033 8540 3638 -11289 10590 -22321 22871
422B2871k9929L345J199m75J7469k4448R752j0159K5313l5138K5894j1729j3954
435a9989L1773l9347L0042j9600M972k627J0649r613o790J4782j1191L1682m2432
448b7689L2874j0770j614K2990k7653K1676j1683J2193j4857K0564k1749O215
460D97J7422k1472K0097l4624L6195j2284k311K27n212J7805q366O473k8037M7635
474C4045k6496J06J3762k0830K8121k2040J7333j1637Q493j5397J3848n479m459
487I370J2124l7651M8457l6929J427R743j4028J3196j3425L910j3013K2454k8620
500b2985K0599q242o808J7884k5990L2813l0280J2667J254M430j2128J093J2722
513b971k0045L2382m1667K5046J752q932N554j2360K2931j6544R507j2451K5739
$$ plain form
422 22871 -7058 -3713 -2514 -2989 14480 -9968 -216 -10375 14938 -20200 5694 -6035 -19989
435 -19989 11784 -27563 2479 -17121 -12149 -14776 -4127 -13740 -20530 -5748 -16939 14743 -27689
448 -27689 5185 -5585 -7199 15791 -11862 9814 -1869 10324 -4533 16031 -5718 497
460 497 17919 -3553 16544 -18080 18115 5831 3520 3747 -1465 16340 7974 14447 -13590 34045
474 34045 7549 7655 21417 587 28708 6668 24001 12364 20857 5460 19308 13829 9370
487 9370 21494 -16157 32300 -4629 -3202 6541 -7487 5709 -7716 -3806 -16819 5635 -22985
500 -22985 -2386 -10628 -17436 448 -25542 7271 -23009 -10342 -9088 -4658 -16786 -15693 -2971
513 -2971 -23016 9366 -32301 -7255 -5503 -14435 -8881 -21241 1690 -14854 -5347 -17798 7941
526G941k0965J2809R992k3144M0703m0728K9807J950p292r25M745J0815j1503
539A4205P943k3797M0156k7989L718O34j4530L4559l2652P267m882J4551j5664
552C519R577r803r327L1766l1537K2293k2102J0220J1634j0231o28j0791J9085
565A3675r498J2412m0574L4507J114k3936J4969l0076L6366j4665o246q828J4243
578f537K25p408j88r937L5972l6386K1367j0818m507K0911j7342J0613j4025J6071
592a989j4060J9970j7643J111J5758j3778K0965l4903K5621j74q2n205l138Q827
606A280k646J5637l1551L3717j4502O903J1556k0120K1747j4328K1146j2613J552
619A7778r606J7598l961j0703J2281k6891L8458k5905l095M239O01P571j8846
$$ plain form
526 7941 -13024 -215 9777 -13367 27336 -13392 16415 18365 11073 10148 14893 25708 14205
539 14205 22148 -1649 38507 10518 14236 14870 340 34899 2247 9514 4632 19183 3519
552 3519 13096 3293 -6034 25732 -5805 16488 -5614 4606 16240 6009 5381 -5410 13675
565 13675 4177 16589 -23985 10522 11636 -12300 2669 -27407 8959 -5706 -11952 -20780 -6537
578 -6537 -6312 -13720 -13908 -23845 12127 -24259 -2892 -13710 -18217 2694 -14648 -4035 -18060 -1989
592 -1989 -16049 3921 -13722 -12611 3147 -10631 10334 -24569 1052 878 796 -4409 -7547 1280
606 1280 -1366 14271 -17280 16437 1935 8838 20394 274 22021 7693 28839 16226 17778
619 17778 8172 25770 21809 11106 23387 -3504 34954 9049 5954 10193 10794 18365 -481
632d81J2826j3197J6394k1600J3205l474m627R830k5724K7292j6112L462p887
645a0093J1755n716l907Q418k1703K8493k4593J3774q143m475J0982j4126J5099
658d235j6832P867o206K1354k2476N888R755j5352K9346k8839J3828j528Q020
671E90k658m851Q203j0706J7446j5203K1971k4802J0625J0288j0716J3531k0363
684f645J6826k835J2322k3598Q457J0894p658J3370k9654K6698j2515J1967o155
697A1474r424J0764m200Q658j6262J7142k4403K2493m003j3457J2693j9735K2943
710A4683j6737P526j1477O614J837k682L515j9010K4832k3434K2132j1482j2019
723a5702J0972l272J2222k1248J0882j5106K6794j3657q309O888q897K7834k7848
$$ plain form
632 -481 12345 -852 15542 -6058 7147 3673 -954 8876 -16848 10444 -5668 -2206 -10093
645 -10093 1662 -4054 -7961 457 -21246 7247 -17346 -3572 -11715 -16190 -5208 -19334 -4235
658 -4235 -21067 -13200 -19406 1948 -20528 -14640 -4885 -20237 9109 -19730 -5902 -7430 590
671 590 -2068 -6919 1284 -9422 8024 -7179 14792 -10010 615 10903 187 13718 -6645
684 -6645 10181 7346 19668 -3930 4527 15421 7763 21133 -8521 18177 5662 17629 11474
697 11474 2050 12814 8614 17272 1010 18152 -6251 16242 12239 -1218 11475 -8260 14683
710 14683 -2054 5472 -6005 609 2446 -236 3279 -15731 9101 -14333 7799 -3683 -15702
723 -15702 -4730 -8002 4220 -17028 -6146 -21252 5542 -8115 -16424 -9536 -18433 9401 -18447
736a8447R880o301R384J904k806l593q501K3360k0634K2819k0382L584J1596o062
750d199J2734k1269J6484l101J4048j7088M256J392j032K0377l0448K0488j2429
763B13J3393j407n043O43k922J7343j8540J4164k0301J8662k777q456J0492k0155
777d691J9586j1884O233r927R063p407j16J2121k0452J9525k2812K0553n649n607
791a464L142j2174J8011q158L558k1170K1266q803K612K146k1649K6017j3270
804i936J1867j7372N169L838J748J469j5549J5057j5256K6935k1654P52P856p100
818a2176J6991j5352R156j0744J8570q578M290l453o664K1831j7213J6622k3642
831a0362J1838Q579l936j050q983J5241r402J7522k6287J4653L590l360J0559
$$ plain form
736 -18447 -8567 -14868 -5484 -3580 -6386 -9979 -18480 4880 -15754 7065 -13317 -9733 1863 -4199
750 -4199 8535 -12734 3750 649 14697 -2391 1865 3257 2225 22602 -7846 12642 213
763 213 13606 12199 7156 7799 4877 22220 3680 17844 -2457 16205 13428 4972 15464 -4691
777 -4691 14895 3011 9244 -683 8380 973 857 12978 -7474 12051 -10761 9792 4143 -1464
791 -1464 1678 -10496 7515 -643 2915 -18255 3011 -5792 -3180 -1034 -22683 3334 -9936
804 -9936 1931 -15441 -10272 -6434 -4686 -3217 -18766 -3709 -18965 7970 -13684 -12932 -5076 -12176
818 -12176 4815 -10537 -1381 -12125 6445 -2133 2157 -1296 -7960 13871 -3342 13280 -10362
831 -10362 1476 10055 6119 5069 -3914 11327 1925 19447 -6840 7813 11403 8043 18602
844A8602k2279K0169j1544J2263j0065O15k061K981P043k1150K1528k1369J4826
857I559n496m720M993q281J0153j2345J4355j5982J0417r661O823L715j6498J8055
871E087k0467J8187p260k273k709L304M840j1696J4755j9647J8009r978N864M62
885c522j1514J5240j2642J5193j5951Q343o189J4708l632j5222J7431j3496K2330
898A1077j4897J74j076Q818P613j3261O173r227K2661j3379M276r573J00K1832
912B1311j9218K990j0174J8571n974L083j1884P96K0081j6778J0911j7374J8565
925A4906n412l147L174p614J1034j0920J2364j7449J5411r807j024R432j4081
938c133J2545j4751J2265j2882P944l274l082K116q937J6099j9853J6111j3188
$$ plain form
844 18602 -3677 16492 4948 17211 7146 7761 5700 8681 15724 -5426 16102 -5267 9559
857 9559 4063 -657 4336 -3945 6208 -6137 8218 -7764 2653 -7008 -185 3530 -12968 5087
871 5087 -15380 2807 -4453 -6726 -9435 -6131 -1291 -12987 1768 -17879 130 -9848 -3984 -3522
885 -3522 -15036 204 -12438 2755 -13196 -4853 -11042 3666 34 -15188 2243 -11253 11077
898 11077 -3820 -3646 -4722 4096 11709 -1552 4621 -4606 18055 4676 8952 -621 -521 21311
912 21311 2093 5083 -5091 13480 7506 10589 -1295 -499 19582 2804 13715 -3659 14906
925 14906 9494 6347 9521 1907 12941 2021 14385 -3064 12347 2540 1516 10948 -3133
938 -3133 9412 -5339 6926 -5956 1988 -1286 -4368 -2252 -11189 4910 -14943 1168 -12020
951a2020O273N718j1245O740q226J5736j4942R610j1254P578L078q713J0813j8373
965a9227K0651j0583P021m388j517O142L60R406k2437K0066r627J2958q049q361
979g585J6182o007J2222k0325J1023j753J1139r913l162J0237j1420J9158k0855
992a059J1039n189K433L291q008O749j0668J5789j3152R176r997M612Q159j5659
1006b484J5176j4768J1178q281N622n689K221K845j1303J5590j6973J2372j2704
1019g198P212L243j0589P384q738J0649j1187J0654j3332J1026j073j3002J7133
1032B182j4864J3792j2764R684k825j502K427m408J1927j5289J4242j6108J5870
1045B364k822q738R696p408J2462j2579J1379q954J0331m016k479R586j3288J8153
$$ plain form
951 -12020 -5747 -29 -11274 -4534 -12760 2976 -11966 -2356 -13610 -6032 -2954 -11667 -854 -19227
965 -19227 1424 -9159 -2138 -6526 -8043 -1901 -1541 7865 -14572 5494 -4133 8825 776 -7585
979 -7585 8597 2590 14812 -5513 5510 3757 14896 4983 1821 12058 638 19796 -1059
992 -1059 9980 4791 7224 10515 2507 9256 -1412 14377 1225 10401 404 5016 13175 -2484
1006 -2484 12692 -2076 9102 821 6443 754 2975 5820 -5483 10107 -6866 5506 -7198
1019 -7198 14 3257 -7332 52 -8686 1963 -9224 1430 -11902 -876 -1949 -14951 2182
1032 2182 -12682 1110 -11654 -1970 -4795 -6297 -3870 -8278 3649 -11640 2602 -13506 2364
1045 2364 -458 -9196 500 -6908 5554 -7025 4354 -4600 5731 1715 -764 8822 -4466 13687
1059A3687j6098J2601n704j180N574m379M660r558J7166j6921J2367q649K337
1072E903Q861j3631J0534j1265J6139j3767K319J15L717J104j3483J3892j3895
1085c457J6655j3827K35L053l530O742j2568J1635j3817J3319r007K833l767n325
1099a0826J4612j6373J1869j3152R394o54k162k668l754J5436j4894J1128j4011
1112a6055J4380l318l683O351j1210J5337r285O823p696Q066k538L85M811j2616
1126a0248J7636j0837R361j0483M791N389m941O634j2885J7495r020Q681j2411
1139h38N235J0427j1558P945j2589J4010n926K565p119L386O691q251P451j6141
1153d712J5466p693N989m151p393J0250n573O790j4546J0493o682P176l335j1224
$$ plain form
1059 13687 -2411 10190 4486 3306 8880 4501 9161 -397 16769 -152 12215 3566 5903
1072 5903 14764 1133 11667 402 16541 2774 5093 5208 8925 10029 -3454 10438 -3457
1085 -3457 13198 -629 -394 2659 -871 5871 -6697 4938 -8879 4440 -4567 -1734 -5501 -10826
1099 -10826 3786 -12587 -718 -13870 -4476 -5130 -7292 -9960 -13714 1722 -13172 -2044 -16055
1112 -16055 -1675 -4993 -8676 -2325 -13535 1802 -7483 -660 -8356 -290 -2828 -2443 2368 -10248
1126 -10248 7388 -3449 5912 -4571 220 5609 668 7302 -5583 11912 2892 11573 -838
1139 -838 4397 14824 3266 11211 -1378 12632 6706 9271 2152 5538 12229 3978 11429 -4712
1153 -4712 10754 3061 9050 4899 -2494 7756 2183 8973 -5573 4920 -1762 5414 2079 -9145
1167i145J2058p870J2468j6034N779k601M007l35q479R106j0479J5165j3103L286
1181f177k220l75Q976r474M851j0082J4825p697M220n013J269J0735j3294J1559
1195B103j3398J4238m812j589Q4j043P716q922J2934j4418J2483n911K962N135
1209G562r305J1080j0708J2641r905M517m320M923K441j1064J4242j3534J2468
1222A1038o886J014J98j096N814r190Q538j0758J0654q910L844k677n780J2796
1236H599j4126Q762q212P398n036K296j24o380J1111j3127R247j1367J0216l366
1250d109m226N791o801R826j1379P583o576Q991n274m241R825j0587J4320j3210
1264a0067P189m795M090K247n796O299p723J3441j2511Q956o053L749O730r597
$$ plain form
1167 -9145 2913 -4957 7511 -8523 -2744 -5345 -1338 -1673 -10152 -1046 -11525 3640 -9463 -6177
1181 -6177 -8397 -8772 204 -9270 -4419 -14501 324 -7373 -3153 -8166 -6897 3838 -9456 2103
1195 2103 -11295 2943 -1869 -3458 -3374 -4417 3299 -5623 7311 -7107 5376 -535 2427 7562
1209 7562 -1743 9337 -1371 11270 1365 5882 1562 6485 8926 -2138 12104 -1430 11038
1222 11038 4152 5166 5364 4268 10082 892 9430 -1328 9326 416 4260 1583 -4197 8599
1236 8599 -5527 3235 -4977 2421 -2615 -319 -443 -6823 4288 -8839 408 -10959 -743 -4109
1250 -4109 -8335 -2544 -9345 481 -10898 -3315 -9891 -900 -6174 -10415 -590 -11177 3143 -10067
1264 -10067 -2878 -7673 -3583 -1336 -7132 -833 -8556 4885 -7626 1330 -4723 -974 5756 -3841
1278c841Q442r389J2170q436O243n001J204M881o075J0325j4194J3640o864N377
1292H482q49o163P529l369P438j3283Q957n928O260j072r892Q526o470J2518j4209
1307a525L302r76M084J084p882M772r878J8468j4348J941j486L22O635j1621M595
1322b513q616J2952q071J816m214m7P726j0713R913j2499R096j422Q8j308l303
1337a1115P519o020J0076j3358Q764l265M200J304q002J0235o878R779q386M633
1351e14k520L536L007q254J1170j2182J1861p337L339R51k461N973o594Q313p636
1366F52Q297q413O333p02m892Q331j0971J0803p384L820o427K590M152l765K981
1381E405j1628J4340r346M772o390O5Q463r041M433r309J0596p660O736n798j164
$$ plain form
1278 -3841 4601 -4788 7382 -1054 5189 188 1392 6273 198 10523 -3671 9969 3105 8482
1292 8482 7633 1470 8999 5630 13068 -215 8742 2814 9074 8002 -1890 6636 166 12684 -1525
1307 -1525 1777 801 4885 5969 -1913 2859 -7019 11449 -2899 -958 -2444 -2122 4513 -7108 -2513
1322 -2513 -11129 1823 -6248 -4432 -8646 -8693 -967 -11680 -1767 -14266 -5170 -6592 -6504 -7812 -11115
1337 -11115 -3596 -9616 460 -12898 -4134 -7399 -3199 -1895 -9897 338 -6540 3239 -5147 -514
1351 -514 -3034 502 3509 -4745 6425 -5757 6104 -1233 2106 3057 596 6569 -25 8288 652
1366 652 8949 536 6869 6167 1275 9606 -1365 9438 2054 5874 -553 2037 6189 2424 5405
1381 5405 -6223 8117 -1229 3543 -2847 -2782 5681 -3360 1073 -8236 2360 -5300 1436 -4362 -5526
1396e526P055q770R406j1130Q117l022J984j20m735M213n739R546j1421Q285n413
1411g270J712L974n230O758r264R981o319O537k975j872L624j510P844j4372J0294
1426A912k828N087j875m486N786l033R226j1835Q071n158N134L41o462O555p772
1441a337J1121p379L252n896M819K069k695L993j2517J5128p440L599m735J76
1455B158O874o750N336j1592J0688o133L936n350k138O770q846R637j1164N606
1469i68k597M674l613n239P664o946R765j2185P084l103J783J075p976J0424n708
1484e866L917p751Q157l292J103J459o120J0701r435P016p183N888j21k455M845
1499H63o113P083o152R074q269N549m3l195P765q561P636n825Q358o619M60K778
$$ plain form
1396 -5526 1529 -7241 2165 -8965 -848 -3870 -1886 -2006 -6741 -2528 -8267 1279 -10142 -1857 -7270
1411 -7270 -5558 -1584 -6814 -56 -9320 661 -5658 879 -2096 -3968 -344 -1854 5990 -8382 1912
1426 1912 -916 4171 2296 -2190 3596 563 9789 -2046 6025 867 6001 6342 -120 6435 -1337
1441 -1337 9784 2405 5657 -239 4580 6649 3954 7947 -4570 10558 3118 6717 1982 2158
1455 2158 9032 2282 7618 -3974 6714 581 4517 -833 -2971 3799 -5047 4590 -6574 -968
1469 -968 -3565 1109 -2504 -7743 -79 -7025 2740 -9445 -2361 -5464 -3681 -2606 -10582 -158 -5866
1484 -5866 -1949 -9700 -1543 -4835 -3732 -2273 -8393 2308 -7127 -111 -7294 -1406 -1527 -3982 863
1499 863 -5250 1833 -4319 4755 -3514 2035 1992 -1203 6562 -1999 5637 -188 8170 1551 2011 4789
1515D789k852P058j0499R093q415P126k020l107M781m655N804p001O873q886P252
1530E341j360j676J460o749J1109q573M685o325M650J119l730J782n490R848j1074
1545d983N211l296J098K572p714O075o724Q538q500M856l425K494J944o862Q623
1560i3r068Q738m063N03o25J039M470o103M677p696J1150o303J834n70l397Q394
1576B887p556P155o813P461l597J814r54k652P917q698R801q014M833j281R26
1591C229K321n288O211n309Q024q323M638k273k20M678q739P585o919N566n503
1606c22K778j73k843L216o783J0110j0367O300n131L547J846p089M520m907O950
1621A652n995K990m530J841L833n252L598p649R786m763J418l765r82O685l665
$$ plain form
1515 4789 1937 8995 -1504 7589 -826 6300 4280 1173 5954 1299 7103 102 6975 -1911 5341
1530 5341 3981 2305 3765 -2984 8125 -448 4237 -2088 2562 3681 -49 1733 -3757 6091 -4983
1545 -4983 228 -3068 -1970 602 -7112 -1037 -7761 777 -7723 -2867 -6292 -3798 -1854 -8716 -93
1560 -93 -9161 -423 -4486 -3983 -4608 -3569 901 -5202 -525 -8221 2929 -3374 -1540 -2110 -5507 2887
1576 2887 -4669 2486 -4327 3134 -463 1351 397 -2255 5662 -3036 6765 -1249 3584 2303 3229
1591 3229 5550 262 6473 1164 9188 865 5503 3230 3010 7688 -1051 6534 -385 5181 -322
1606 -322 2456 2283 -560 2656 -4127 5983 -4384 1916 -3215 332 2178 -4911 -391 -5298 1652
1621 1652 -4343 -1353 -5883 -4042 -209 -5461 -1863 -9512 274 -4489 -3071 -6836 -7818 -1133 -4798
1636d798L059j0735J1400l855K978l671k363R693n701O407r078P558k318K443
1650A019Ol840N886o698J1070j0615N311n46k05M012o558N565n543Q135o726L004
1666C277j209N39L874o570Q320j0072Q333m030K173j70k054L807n689P607r170
1681a034N582l798K222N48m723O070r615Q439p013N850n343o64L409o288Q616
1696B258j0792P817m248M213l653l050N135k982N845r313O205m553N648j351m659
1711g480N292n540P898o691L603m341M929R58m748N563q228J0324n311M664m311
1726c419J485M959m327M318n594P694n786O074l301j585N626o792Q977q079N602
1741E852m316M626j530k785K705m380Q767q785M820m534K539J370m221M067m170
$$ plain form
1636 -4798 -1739 -12474 -1074 -4929 -1951 -5622 -7985 1708 -3993 2414 -6664 894 -1424 1019
1650 1019 1025 -2815 3071 -3627 7443 -3172 2139 1593 1388 5400 -1158 4407 -1136 6999 273 3277
1666 3277 2068 2607 6481 -89 8231 -1841 6492 2462 4635 4465 2411 6218 529 8136 -1034
1681 -1034 4548 750 2972 3520 -1203 4867 -4748 3691 -3322 2528 -2815 -3479 -70 -6358 2258
1696 2258 -8534 -717 -4965 -752 -4405 -7455 -2320 -5302 543 -8770 -2565 -7118 -1470 -2821 -7480
1711 -7480 -2188 -7728 170 -6521 -2918 -7259 -2330 -1372 -6120 -557 -8785 1539 -3772 892 -3419
1726 -3419 -1934 3025 -1302 3016 -2578 5116 -670 5404 2103 518 6144 -648 8329 250 5852
1741 5852 1536 6162 4632 1847 4552 172 8939 154 4974 440 2979 4349 128 4195 25
1756B5N412n686M765l970L89L285n825O998q797P374p178L852p09l028K308m576
1772e361N916o361O482p396L726m57j544L645o684O338m243N158n411J353K045
1787b794k082N424p864Q593o749N196j054j592L130m134O251o520O089n827M516
1802E83p83r81L937p935R186n021M468m154L227j32o10L993o394P483o019P032
1818G880n090J392R85l275O471q482N317n209O957m513q8N81m736O943o794N554
1834C893n237K907J83k472K678o535O465n459N567p120K829J262l541N393o958
1849f145N666n364N302m857J245o4k316M879p333P257p304O130j947j552L863
1864b540l644N635n981O861o902N567k408J06M435n128O928p370Q371n065K250
$$ plain form
1756 25 5437 -249 4516 546 935 4220 -1605 5393 -3404 3970 -3208 644 -65 -3093 -785 -5361
1772 -5361 555 -5806 676 -6720 -2994 -3451 -4995 -1350 -8034 -1696 -5939 -781 -6192 -4839 -2794
1787 -2794 -4876 548 -7316 1277 -5472 -276 -1330 -2922 208 -3926 2325 -4195 1894 -3933 583
1802 583 -200 -1181 2756 -5179 4007 -1014 3454 -700 2527 2395 1785 5778 -616 6867 848 7880
1818 7880 2790 4182 5167 1892 8363 -119 5198 -11 6946 2433 2345 2926 -1810 5133 -1661 3893
1834 3893 -1344 1563 1746 -726 1952 -4583 1882 -3577 1990 -5130 -2301 -1039 -4580 813 -6145
1849 -6145 -479 -5843 -541 -5398 -4153 -4217 -6533 -1654 -8987 -1730 -9034 -2904 -4851 -6403 -2540
1864 -2540 -6184 -549 -6530 331 -6571 -1004 -3412 -3306 1129 -3999 2929 -4441 3930 -1135 1115
1879A115j927L5N960o449O370q099Q235l790J338m91k245N412n618O982p472M539
1895C895j533K94J931m002N261o433P941o116K317k08n78O92l780N185p073O738
1911D531n607K627j521k079L745o047P038p500M727k814K301j683k368N316n419
1926d753N834p014L992k380J590R39m234N761n698O397n230L397k539O91L382
1941A35o614O778p040O458l018K432k834N52O062p111O246p308Q190m040J632
1956E20m93m31M804n292O101o327O295k666J9J776m136O470n966N115n481M406
1972D714k048r28K054m543O125o810N723n105M182l77l553M368o034P069n858
1987a021M066n016K789J788n469N082p170Q258o414L164m372Q07J029k613M849
$$ plain form
1879 1115 -812 -777 5183 -1266 5104 -2995 5240 1450 2788 2297 52 5464 -154 6828 -644 3895
1895 3895 2362 2656 4587 585 5846 -587 7354 1238 3555 3347 2769 3461 -319 4866 -2207 4531
1911 4531 -1076 1551 30 -2049 1696 -4351 2687 -4813 -86 -2900 -599 -2282 -4650 666 -4753
1926 -4753 1081 -5933 -1941 -4321 -2731 -1792 -6026 -265 -5963 434 -4796 -1399 -3938 -3247 135
1941 135 -6479 299 -6741 -283 -3301 -869 -3703 -3151 2911 -4200 2046 -5262 2928 -1112 520
1956 520 27 -404 4400 -892 5209 -1118 5177 2511 2530 4306 170 6640 674 5789 308 4714
1972 4714 2666 1738 3792 -751 5374 -1436 4287 -818 3364 2987 -566 3802 -2232 4837 -1021
1987 -1021 3045 -1971 818 2606 -2863 2219 -4951 3307 -3107 57 -4315 -3508 -2479 -5092 -243
2002b43o359N514m990M422l452q02M386m494O129o317N552l425K988r41j490L514
2018hm612Q021q415N617k816K250N26k461K957m006P157o809L427k582K376K686
2034C308m579N934n798O174m905L440j537J103L060n742N809n698P831o984L277
2049D693j129j452M043p874O849o158O100m698K148p69k167N040p323N358l623
2064i62L473l190P27N03m025O043m717M532p504N842j427p25R05l389L909l881
2080c886N407p217L213L65p87L260o975N615m679O629m102j739M605j963M342
2095B088o498N668l704O150m627J6L751k131M760p435P618n974L651j345q39K506
2111C655m198N735o509Q675o730L741k59k223L768n107O335m499M734m310J189
$$ plain form
2002 -243 -6602 -1088 -6078 -1656 -5108 -5910 -1524 -6018 111 -6206 -654 -4079 -1091 -2032 -3522 -8
2018 -8 -4620 3401 -5014 603 -2213 37 563 -1898 1059 -2947 4210 -2599 828 -1754 622 3308
2034 3308 -1271 4663 -1135 5039 134 3574 2037 3140 6200 458 6267 569 8400 1416 4693
2049 4693 3564 2112 6155 -1719 5130 -1028 5072 374 2522 1753 -414 4626 -2697 2661 -962
2064 -962 2511 -679 48 551 -3474 2569 -2148 2384 -5120 722 -705 -1430 -525 -3914 -5 -3886
2080 -3886 1521 -5696 -2483 -2118 -2905 355 -6620 -1005 -5684 945 -3157 -4896 -291 -2254 2088
2095 2088 -4410 1258 -2446 3704 -923 -907 2844 713 5473 -1962 5656 -318 3333 1988 1149 3655
2111 3655 -543 5192 -1317 7358 628 4369 4110 1887 5655 548 6883 2384 7118 2808 3997
2126C997K13k000M585o607N518o072M652k480j101J777k800M540o584N651p232
2141c943N412l167n57K575m102O211p418M796m071M685k353j315L157m644N990
2156A256p994O016k337J960j011k423M664m589N438n525L673l174J775N43k770
2171d498O917p560P183n356L832p74N74K591n038M894m696P337n020K441l65o90
2187A772L434m943N492n946N310l908K943j320k941O053n344M775n585M358j398
2202B752M36jl400N709n180M337n519L297j239q52K209n015N085m793M629n470
2218c015K421M20j326J481m652N975o662N864m743J532N93j599L117n035N640
2233A1n564M626l489J329J718k649M756m430M415m564M218j969N94K260m878O225
$$ plain form
2126 3997 4210 2210 6795 188 5706 -366 4286 1806 705 2482 -318 4222 -2362 3289 -3943
2141 -3943 1469 -1698 -2255 320 -3782 2429 -4989 -193 -4264 421 -1932 -3247 -90 -4734 1256
2156 1256 -6738 -722 -3059 -1099 -2110 -4533 131 -4458 980 -4545 -872 -4046 -2271 -1728 -4498
2171 -4498 2419 -5141 2042 -3314 518 -256 318 2909 -2129 2765 -1931 5406 386 2827 2462 1772
2187 1772 5206 263 5755 -191 5119 1211 4154 2834 -107 5946 602 5377 -208 4150 2752
2202 2752 3188 3187 -213 5496 316 4653 -866 2431 1192 340 2549 -2466 2619 -2174 2455 -3015
2218 -3015 -594 -174 -1500 -19 -4671 1304 -5358 506 -4237 -2705 -2112 -3711 -594 -5629 11
2233 11 -5553 -927 -4416 -3087 -1369 -4018 738 -3692 723 -3841 377 -1592 -998 1262 -3616 2609
2249B609n922O162m444J520P35l44K133m335N634m014M115m600L029M80j791M849
2265E816o187O002m612L647k523R98P62j954L998o967O990n270M026k795l38J407
2281C000l409N319p150N910m009K707j755j138K030l277N875o900M013l293J575
2296e02P79k384J300l565N235m406K221k201J582N60l137K734l723N040l816L450
2312h33l485K024J265l834N457n791O151m453L447j423j923M898l555L943n101
2327c213N274l035L360j097k110K987k736N263n824M778j790L99j35k004L636
2342C753l111M373n623M570j723m28K850n076M762m110M359m599K982j744N4J930
2358C219m193M148m875M952m020m7J193j556K379m521M386n547O590m452j04J281
$$ plain form
2249 2609 -3313 2849 -1595 -75 660 316 2449 -1886 3748 -266 3849 -751 2278 2758 967 5816
2265 5816 -371 5631 1019 4666 2143 3141 3903 1949 5947 -1020 5970 700 4726 1931 1593 3000
2281 3000 -409 4910 -2240 3670 -339 2368 613 -525 1505 -1772 4103 -2797 1216 -2077 -502
2296 -502 277 -2107 -807 -4372 863 -3543 -1322 -3523 -1941 -1381 -4518 -1784 -5507 -467 -4283 -833
2312 -833 -4318 -2294 -1029 -4863 594 -5197 954 -3499 -52 -1475 -3398 1500 -2055 1888 -3213
2327 -3213 2061 -974 2386 1289 -821 2166 -570 4693 -1131 3647 1857 2256 2121 117 3753
2342 3753 642 5015 -608 3962 2239 1811 4661 -415 4347 237 4596 -3 2979 1235 1289 3219
2358 3219 -974 3174 -1701 3251 -769 -816 377 -1179 1200 -3321 1065 -4482 2108 -2344 -2448 -1167
2374a167k197M067o294N058n265O145k315q07P88k065N511n872M027l880L695
2389e71o64j771K301l690O319m776L484l075J230L22l52K786l921N575m634M323
2405B886l571J781J221j085M215o221M790k998L932m331K153J825k830M464n711
2420E20M323l257K349j328o85K191m279L898m389M772m020J665J095k614J525
2435A766l079M998n088M640l274q05J639k113L068l341K844l884L274j765q31
2450a951O46k357M164n764N705n062L657m45k537J456j556M994m796L769l875
2465c952K441N42r47K854m050N686m441L333l172J026J131q21L412n502M912m132
2481a680L614k633Q32K199l015L735l259M407k817K510j662M00J603l882N076
$$ plain form
2374 -1167 -3364 703 -5591 -533 -5798 347 -1968 -2775 -1987 -4052 1459 -4413 -386 -4266 -571
2389 -571 -1235 -3006 -705 -4395 1924 -2852 632 -2443 -1213 -891 -1243 1543 -2378 3197 -1437 2886
2405 2886 -685 1096 2317 1232 5447 -774 4016 1018 4950 619 2772 4597 1767 6231 520
2420 520 4843 1586 3935 2607 1922 4113 -166 3732 -657 4115 95 1760 2855 241 1766
2435 1766 -1313 3685 -1403 3237 -37 -842 797 -1316 1752 -1589 1255 -2629 645 -1120 -1951
2450 -1951 -1305 -3662 502 -5262 443 -4619 -962 -1407 -3944 -2488 -4044 950 -3846 -77 -3952
2465 -3952 -1511 -969 -1916 938 -3112 2574 -1867 1466 -1706 -680 451 -370 3042 -2460 2452 -1680
2481 -1680 1934 -699 133 2332 -683 3052 -207 4200 1383 3893 2231 2631 4234 352 5428
2496E428n413M528k922J506n67J5N07k843M443m933M136k851l21Q97l027M930
2512C513m986L603m181L413k250M29l17j652L859m499L834m058K396K25j371R74
2528a068k451L893m258L433l777K111L96j923L492n161N023k642L419l416J213
2543a716M85k09K406m468M905l580M115k397k16K101k276L906l584M334m719L217
2559B304o43p91K340l133L167k966L832l317K000j99j230J953k991M189l736L663
2575D442k976J131J407l706K846l816M411k885J755j641R0R78k679L518n718M368
2591A525l667K609j668N45L1k159L346l350L075k538K049j876j298L515m452M673
2607C60l835L718j841p28J246j662L206n566N124m258M221j576j107K652k859
$$ plain form
2496 5428 15 4543 1621 3127 2560 2575 3082 239 4682 -251 3885 1034 713 1610 -1417 3513
2512 3513 -1473 2130 -2051 1362 -888 -459 -776 -2428 1431 -3068 766 -3292 -896 -671 -2042 -1068
2528 -1068 -3519 374 -3884 -451 -4228 -2117 -1721 -3644 -152 -5313 -290 -2932 487 -2929 -1716
2543 -1716 -1231 -1440 966 -3502 1403 -2177 1938 -459 -675 1426 -850 3056 -528 3806 -913 2304
2559 2304 1661 870 3210 77 3244 278 4110 793 2793 2594 1364 3317 326 4515 779 4442
2575 4442 1466 2597 4004 298 3144 -672 3739 854 2609 968 1058 2036 -643 2875 -2843 1525
2591 1525 -2142 467 -1201 -656 -625 -2784 562 -2788 287 -2251 -202 -2078 -3376 139 -4313 360
2607 360 -3475 243 -1598 -2326 -1080 -2742 464 -5102 22 -4236 -15 -1591 -2698 -46 -2905
2622b905M625m926M364k593J921n57j33J727k841M655l767L489k936K995j118
2637B000p90K315l403M001m638M945l878O45J844k405L724m423L527l842L926
2652C548k295K37Q67k780L998m623L876l320J419j609O78R66l403N215n516M033
2668A291l593K404j148j189K282m380L789k818K392k154K262k357O39K491m107
2683d196L260l318M007j979M41Q24k603M489m798M050l570L338m21j072K210l212
2699b550M821m064L672m163J811J684j243J573k586M320l566M585m072J320P69
2714B311m53J907m558M274l266K660j073L78Q4j736L382m395L581k485K495j338
2730A768j507J822k630L214l802M035m001L196r73k607K841l597M383m947L052
$$ plain form
2622 -2905 1720 -3206 1158 -1435 486 -71 -204 1523 -1318 3337 -430 3059 123 3118 2000
2637 2000 1210 3525 122 4123 -515 4430 552 1197 3041 636 4360 -63 3464 -378 3548
2652 3548 1253 1490 2357 -423 3575 -1048 2828 -492 927 -682 -4 962 -2441 2774 -2742 1291
2668 1291 -2302 102 -1046 -2235 47 -4333 -544 -3362 -970 -3124 -862 -3219 -2580 -89 -4196
2683 -4196 -936 -4254 -247 -2226 -1785 -961 -3564 925 -3873 177 -3393 -55 -476 -1548 662 -2550
2699 -2550 2271 -1793 1879 -2284 -473 1211 -32 1541 -1045 3275 -291 4294 222 1542 2311
2714 2311 1858 3765 -793 3481 215 2875 1802 2180 2264 528 3910 -485 3096 611 3106 1768
2730 1768 261 2083 -547 2667 -1135 2900 -1101 2095 1122 -1485 1356 -2241 2142 -2805 247
2745B47j553k44O29l80J414l864L515k753K800k450O95J150j937K422l596L952
2761D7l074K422j203o50J723j982L862l733L446k714Q54j05Q88r2j008K575k246
2778i90L498l098J157O12j272L222l240M649l963K911j336O60O89j479J190l194
2794A6M425m128K557j052k57K000k642K292l672L530k502K344j202m69K378m516
2810h98M611m674L925k360n11M21q54J995m036M352m596K910j381o91J221k609
2826c175M524n433M590l798K037o74J13R00j909K707l578M458l579J696n59l76
2842b056J861l574M023l735L659l109K426j84q69L253l720L919k701L629k865
2857d3R49q72M93K798l600L485l314L017o04K7J090j910L109n331L977k569K130
$$ plain form
2745 247 -1306 -1550 -921 -1301 113 -3751 -236 -2989 -189 -2639 -1944 -794 -2731 -309 -3905 47
2761 47 -3027 -605 -1808 -2458 -735 -2717 1145 -2588 858 -1856 -1002 -1107 -219 -311 -1319 1256 -990
2778 -990 2508 -590 567 1179 -93 3129 -111 4538 575 3486 2150 2810 3499 2020 3210 16
2794 16 4441 313 2870 1818 1561 3561 919 3211 -461 3069 567 2911 1709 1240 3618 -898
2810 -898 3713 -961 2964 604 93 514 -340 1655 -2381 1971 -2625 285 -1096 -1787 -566 -3175
2826 -3175 1349 -4084 506 -3292 -1255 -1929 -1816 -916 -2825 -118 -3696 762 -2817 -1121 -1680 -2056
2842 -2056 -195 -3769 254 -3481 178 -2931 -505 -689 -1558 1695 -2025 1894 -807 2822 -43
2857 -43 906 34 527 3325 -275 3210 -104 2913 2309 2336 3426 1516 4625 -706 3271 702 2832
2874B832n64q33J337l488M015l519M155l731J303p4j488K464l917M564l921K356
2890A491k262K91J438k002K424l419K943l488K141n2j470J705k787L461l014K714
2906A14l228K751j035k013K136k164L949l752L780k517P11Q39j047K208k850L344
2922A226l082K892j429N95M86j399L406l657L940l844L092p52k74M94k184K749
2938B259k325L810l243J800M05o41J009l106L747l680K861j842J288K38j240J931
2954C271m660M781l254K376k053p99J863k531L135m865M322k783J763j483J308
2969C91M1k217L799m852L079l033K788j170J1N75k620L009k939L048k104Q56k94
2986a632j473L120l609L647k965K895k121R41J020j068L395l766L066k986J403
$$ plain form
2874 2832 2268 1435 2772 -716 3299 -220 3935 204 1507 1433 -55 2409 -1508 3056 -865 1491
2890 1491 -771 -480 958 -1044 1380 -2039 904 -2584 -443 -495 -1965 -260 -3047 414 -2600 114
2906 114 -3114 -363 -1398 -3411 -1275 -3439 510 -3242 538 -1979 -1268 -429 -1476 732 -2118 1226
2922 1226 -1856 1036 -393 202 688 -711 2695 -962 2978 -866 2226 1474 1200 1694 -490 2259
2938 2259 -66 3744 501 2301 2706 2065 3074 -32 3715 35 2896 1054 2342 2580 1340 3271
2954 3271 -1389 3392 138 2514 461 -338 1525 -1006 2129 -2736 1586 -1197 566 -917 391
2969 391 432 -1785 2014 -2838 241 -2792 -4 -1174 -1163 -588 -3208 -199 -3138 -90 -2194 -1338 -1632
2986 -1632 -3105 15 -3594 53 -2912 -17 -2138 -1197 -177 -1245 2150 -1616 1450 -1536 -133
3001a33j57L34J473k778L695k808K797k272K370j905K89J805l526M416l765L728
3017C563k405P38P16k014K328m032M446l349L213j752j489K529k210K599k644
3032B37K386l134J967q77n00J181k853L335l913L210k240J828k190j01J595l254
3048c323L092k923K913j418Q50r57p47L466l888L011k700K301j437O5Q86j976
3064b785K368l291M044l091L695k869R49J047j104K948l354K843k101J798j301
3079b04O02J483k921L519l876M679l089J828k96j720K696k742L993m377L509k429
3095F55J060J194k860L234m260M392l582K831j638j31J716m201L678l321L029
3110A796j645J183j828n31J668k229L447l770L051l484J408O95o56J512l865L335
$$ plain form
3001 -133 -290 44 1517 -1261 2434 -374 2423 151 2521 616 905 2710 -816 3600 -165 3563
3017 3563 1158 1896 2612 598 2926 -1106 3340 -9 3204 1452 -37 2492 282 2881 237
3032 237 2623 -511 1456 579 79 1260 -1593 1742 -2171 1039 -1201 627 -1563 -1664 -69 -3323
3048 -3323 -231 -3154 -241 -1659 -809 -1766 -2513 953 -2935 76 -2624 -323 -1760 -1695 -809 -2785
3064 -2785 -417 -3708 336 -2755 940 -1929 -980 67 -1037 1911 -1443 1400 -701 1097 -204
3079 -204 398 1881 -1040 2479 -1397 3282 193 2021 1725 5 2701 -41 3952 -425 3084 655
3095 655 1715 2909 49 3283 -977 3415 -167 2664 1026 895 2611 -1590 2088 -1233 1796
3110 1796 151 1334 -494 -1025 643 -1586 1861 -1909 1142 -2342 -934 -239 -895 617 -3248 87
3126H7k158K183k073J082n64j408K629k843K655k232K579k142J168Q70j928K031
3142f4k171K803k372L314k323k32K458k925K424k339L876k861J600m27o06J266
3158A421k478M680m517L702k030L37N40j272K141k985L681k764K112j695J64J855
3174B892k497K385l126L660k621J495j168m07K146l930M157n069M010k445O10
3189I2q26j053L235l956L368j978M20o02Q4Q46j667J701k748L849l607K398j573
3206b017J131N45k702K988l078K445k231K979j755R4J121k598L589l162K786j361
3222a226J494j331JK534k813L199l549L916j489r4k15j109L907m088L912l880
3238h31K816j028J35J150k587L456l040K317j724J380p96r87J742j946K696k934
$$ plain form
3126 87 -2071 112 -1961 -879 -1443 -2851 -222 -3065 -410 -2642 -63 -2205 -1037 -167 -2095 -64
3142 -64 -2235 568 -1804 1510 -813 -1045 1413 -1512 912 -1427 2449 -412 1188 761 155 1421
3158 1421 -1057 3623 -894 2808 778 1115 1655 383 2524 -461 3220 456 2568 873 1037 2892
3174 2892 395 2780 -346 3314 693 2188 1020 613 2759 -1171 2986 -2083 1927 -518 92
3189 92 -734 -1787 1448 -2508 860 -1118 -698 -1300 -1216 -370 -2037 -336 -3084 765 -2842 -444 -2017
3206 -2017 -886 -341 -3043 -55 -3133 -688 -2919 60 -1695 -1601 -480 -3078 511 -2651 135 -1226
3222 -1226 268 -1063 -1062 1472 -1341 1858 -1691 2225 736 642 427 -682 3225 -863 3049 -831
3238 -831 1985 957 1092 2242 -345 3111 71 2388 664 2044 1248 261 2003 57 2753 -181
3254a81L585l653J685N21k275J992j466J115k850K493k272L33J191j368J560l748
3270c338M204k923J811j143M99k07k163L428l504L677k388K118j822m3P64j736
3286b766L167k876K874k130Q00l27m10K319k230K726l330L231j981J599l69j037
3302g40J926j536K833l577J889j342P42J236k639L355k256K414j151J181j591
3317G44M77K008l596L225k232K305l045Q3J733p00J775k308J791l962K990j330
3333d2J046j27j072K311l398K941l679K909j163%k99r53J662k567K794k736J234
3350a139Rj35J492k607K414k521K648k581J519j554M69J727k978L926l434K790
3366D5j468J082k01q33K025k143J940k415K916j841J719q67j813K708j749L490
$$ plain form
3254 -181 3404 -249 1436 1957 -318 1674 208 1323 -1527 966 -1306 -973 218 -1150 410 -3338
3270 -3338 866 -2057 -246 -1389 -890 -1097 -3260 168 -3336 341 -2047 71 -1751 -1794 -1030 -2766
3286 -2766 401 -2475 399 -1731 -931 -1258 -1668 651 -1579 1147 -2183 1048 -933 666 297 -740
3302 -740 1186 -350 2483 -1094 795 -547 195 1431 -1208 2147 -109 2305 1154 2335 744
3317 744 1221 3229 -367 2858 626 2931 -114 -31 1702 1002 2777 469 2260 -1702 1288 -42
3333 -42 1004 877 -195 2116 -1282 1659 -2020 889 -274 -274 -573 -1526 136 -2431 363 -2373 -1139
3350 -1139 -1130 -1265 227 -2380 34 -2487 161 -2420 -901 -2455 -1986 -259 -3237 689 -2745 45
3366 45 -1423 -341 -542 -1375 650 -1493 447 -1968 948 -893 826 -41 -1854 854 -895 2595
3382B595k165R97j113k56J908j634L305l729L546k434R29k27j061K059k187K633
3398C166l176L083k964J295m86L68Q78k393K708k639K064k427O07P67j825K856
3414A882m341L708k604K529k222M63J208k542K847k948K542l205K027m33j023
3429b112J728k357L998m404K249j111J228L83j857J486j917L716l418J872j035
3444a551J182Q98k078J319k614M614k441O92j520J921Q46j974K435l207K854n89
3460G87Q61j616J029J85j851L037l720L622j830j8Q52j492K465k670K706k123
3476B24J817j583Q35Q59j614J278k507K566j711R68j337P60r2j077K311l429K484
3493G52k008L92P9j202K082j722K298j705J310k099lJ324j326K438k708J995j806
$$ plain form
3382 2595 430 1427 314 58 1966 332 3637 -92 3454 1020 1949 1722 661 2720 533 3166
3398 3166 -10 3073 109 1404 918 1286 2164 -229 2479 -160 1904 -523 84 851 -974 1882
3414 1882 -2459 1249 -1355 1174 -1048 -585 623 -1919 928 -2020 522 -2683 -656 -1089 -2112
3429 -2112 -384 -2741 1257 -3147 -898 -2009 -781 -398 -2255 -769 -2686 1030 -2388 -516 -1551
3444 -1551 -369 529 -1549 -230 -2844 1770 -671 21 -1499 422 1268 -706 1729 -1478 1376 787
3460 787 1648 32 1061 1246 -605 2432 -1288 2334 504 486 1338 -154 2311 -359 2347 224
3476 224 2041 458 1293 2152 538 1816 -691 1875 164 1132 -205 555 463 -614 1697 -1732 752
3493 752 -1256 -864 -785 -1987 95 -1627 671 -1034 276 -1823 -1826 -502 -1828 610 -2098 -103 -1909
3510a909J966q67P58j321P53L18j573K170k406K179j77j20P45j355K309k031K119
3527A558k524Q75L18J087P27k181K456k286K216k220R67J5l7J67j279K459j523
3544G95J014o80r3Q23j200J503j905K259k494J830j087j15N04k579L313k373K583
3561B098k216M90L51j743J175j204K565l149J578k193J130Q50j027J626j767J354
3577h2k600K334j016k92O96l43J095k680L486l007K380j611J96J106j876K534
3593C20k134L099k314J140j283Q20J370k880L335l919K734n21P03J27q33J270
3609A034r65J744j734J778j853K296q69j536K815l177L407k096J15M16j106J081
3625A350j312J802j845J913k384J300Q2r51J862k104P86j769J820j747J690j23
$$ plain form
3510 -1909 57 -810 -52 -1373 -620 -302 -1875 295 -2111 68 -109 -229 516 -839 1470 -561 1558
3527 1558 -966 -91 227 1314 2041 -140 2316 30 2246 26 993 1008 971 1138 -141 2318 795
3544 795 1809 1129 1036 1859 659 2162 257 2516 22 1852 765 650 1154 -1425 1888 -485 2098
3561 2098 -118 372 723 -1020 155 -1049 1516 -1633 -55 -2248 -1118 -268 -1295 331 -1436 -82
3577 -82 -2682 -348 -1364 -1656 -960 -1303 -208 -2888 598 -2409 -29 -1640 -1444 -338 -2214 320
3593 320 -1814 1285 -1029 111 -1172 -352 1018 -1862 1473 -2446 288 -233 470 597 -236 1034
3609 1034 69 1813 79 1857 4 2300 1431 -105 2710 -467 2940 844 959 1375 269 1350
3625 1350 38 1840 -5 1908 -476 824 906 -45 1817 -287 499 -1270 550 -1197 493 370
3641C70j244R23o04J447k552J465j395J890r18j352R30j384K782j823M95l52N99
3658g23o89o73K142j725J968k396J135q17P99J097j994K480j976J419j409J217
3674a45J96j175J806j209K275k756K496q15k7N33j607J914j521J531k319J851
3690A028p68P38l83o79K204j745K378k028J335j904M92J604k012J742k412K364
3706A954k123J025m99k23K439m073K374j691K000j788N59n34j193J909j901J826
3722F1j706J416j695P79M08r69J111j474J768j448J208m3q38R42k430K879k886
3739b917J766p47J907j145l31J166j430K523k066J724j070J10O76n51Q67n30J188
3756A140j486J408Jj503K446k363K197k666L533j935P91j270p12J659j626K785
$$ plain form
3641 370 -874 49 -555 892 -1660 -195 -1590 300 -618 -1970 -1040 -2424 358 -1465 -970 -1322 -723
3658 -723 -1412 -2085 57 -1668 300 -2096 -961 -1778 -979 118 -1876 604 -1372 47 -1362 -145
3674 -145 51 -1124 682 -527 1748 -1008 1488 673 646 1179 -428 1486 -35 1496 -823 1028
3690 1028 260 998 615 -64 2140 395 2773 745 2080 176 668 2272 260 2002 -410 1954
3706 1954 -169 856 357 134 2573 -1500 874 -817 1183 -605 -46 -580 -1773 136 -1765 61
3722 61 -1645 -229 -1924 -1145 -737 -1706 -595 -2069 -301 -1749 -541 -584 -1422 -480 -2910 -31 -2917
3739 -2917 -1151 -1898 9 -1136 -1467 -301 -1731 792 -1274 450 -620 -510 166 -385 482 -48 1140
3756 1140 -346 1062 1063 -440 2006 -357 1840 -826 2707 772 1563 293 -419 1240 -386 2399
3772B399k372J783o53j14k23q58J311j678K358k602K067l49n19j5m73J277j174
3789A65N76k530K409q43p09R43j266J232j771Q47j146J250q5p56J522k038K374
3806A74j934J510j373P28n80K99Q73j395J608k078K219j130O95o22m76J137j194
3823a539K032k116J967n79N61q8r92J765j373K600k579J330j023O48P1K17P39
3840A641j026P48k061J551n97M69Q00j863K969k959K044j485L25N86n45J037k406
3857g72J278j081J409j467L57K13j011K382k922L038k966J428m1k4P31k332K497
3874G17k451K012j696J090k38o90J616k687K013j137K012k153P92l11m8J578k416
3891a997K425l443L125k83o96J489j965L584k822J463j891Q07n4L04J498j436
$$ plain form
3772 2399 27 1810 1157 1043 820 -38 1273 -405 1953 -649 1418 1069 550 535 62 1339 165
3789 165 741 -1789 620 -223 -932 11 -1255 -23 -1794 -947 -2093 -843 -928 -1684 -162 -2200 174
3806 174 -1760 -250 -1623 -895 -1475 -1176 -303 -1698 -90 -2168 51 -1079 -384 -1006 -1482 -345 -1539
3823 -1539 493 -1623 344 -235 326 238 -754 1011 -362 2238 -341 989 -34 614 685 902 1641
3840 1641 615 1363 -698 853 256 725 1525 -338 2631 -328 1716 231 556 1142 597 1634 -772
3857 -772 506 -575 834 -633 -276 -63 -1074 1308 -1614 1424 -1542 -114 -155 -179 552 -1780 717
3874 717 -1734 278 -1418 -328 -566 -1256 360 -2327 -314 -1451 561 -1592 -800 -1111 -1159 419 -1997
3891 -1997 428 -3015 110 -173 -869 620 -1345 2239 -583 880 -1011 -204 -258 46 1544 108
3907A08J403j465Q39j353J658q54m5J872j059O10j844K053r55j25P73k01M01j667
3925A49K352l340K732r83l21k25L3R74k218K210j894m1l22K90J520k282K166q91
3943i1N95j693M13j193o9K507j841K144l002K400k155J727j004r76K457j746J780
3960B53j958J831j750O70R98j370K045j590R61j180J794j164q80K217k251K023
3976F49j221J961q58o32R3R6J668k331K640j950J190p32O40l93j062R06o92K458
3994B430l491K118q22K74L96o08J160k098K186j517M27m31J384J5j389R52j734
4011g48J967j488R85j315n79K186j314M19j797K164j302P49M6j773L002k850J695
4028D7j858J999j327L98o26j074L481l143L523j960n10O26r70J594k529K647k019
$$ plain form
3907 108 1511 46 885 -468 1190 336 291 2163 1104 1714 -130 1923 968 843 1616 1415 1816 149
3925 149 2501 -839 1893 910 589 364 397 1371 -847 1363 -531 -572 -894 -604 916 -1366 800 -91
3943 -91 504 -1189 -776 -1969 -2038 469 -1372 772 -2230 170 -1985 -258 -1262 -2238 219 -1527 253
3960 253 -1705 126 -1624 -954 44 -1326 719 -871 90 -1090 704 -460 -1340 877 -1374 649
3976 649 -572 1389 531 -101 -8 88 1756 -575 2065 115 1305 573 1213 820 -242 664 -28 2430
3994 2430 -1061 1057 235 509 905 297 1457 -641 1545 28 455 24 1408 1423 34 986 -748
4011 -748 1219 -269 716 -599 -1178 1008 -306 113 -1684 480 -822 -73 -27 -1800 1202 -1648 47
4028 47 -1811 188 -1139 -741 -1367 -2441 1040 -2103 1420 -540 -1050 -424 -1394 200 -2329 318 -1701
4045a701J731j049J103j255k30J790j244J702j484J976j890J732o06j31J744k148
4061D0K261l066J628q03J33J300j011J070j478J401j661J896r87k99J427k716
4077h65K602l162M014l412J136l7n81J665j579Q75k328K323j122J67p54Q87J521
4094A350j125N07k701J942j119j38R01q60P2j646L530l130K082j345N66J956k864
4111b022K079j235J126p90Q57j031J087m95p18J357k163L413j505o85J171r20
4127d74K582k538J523j553J040k25L89O09j671J623r74J155j400J196j02r94L79
4144E65M58Q45k082J213r72J546j044q37K488k874K153j331K095k723P32N17Q9
4161H38L90j770Q04j231J628r96o2J01j431J408j219K389j670J37m4j8K54j529
$$ plain form
4045 -1701 30 -1019 84 -1171 -1401 389 -855 847 -637 1339 -551 1181 575 444 2188 40
4061 40 2301 -765 863 60 193 1493 482 1552 74 1475 -186 1710 723 424 1851 -865
4077 -865 1737 -1425 2589 -823 313 276 -305 1360 -219 656 -1672 651 -471 -304 -1058 -171 1350
4094 1350 225 732 -1969 -27 -1146 -1284 -383 -1243 -1171 -2817 713 -2417 -335 -1680 -1114 842 -2022
4111 -2022 57 -1178 -52 -842 15 -1016 71 -424 -1142 215 -1948 1465 -40 -725 446 -474
4127 -474 2108 -430 1093 -460 580 355 744 1353 -318 1305 331 1486 86 1282 1180 186 565
4144 565 1023 1868 -214 999 27 1573 529 -308 2180 -694 1459 128 2223 -500 232 749 838
4161 838 1228 -542 262 -969 659 -337 -399 -298 -1729 -321 -1540 849 -821 -684 -728 -746 -492 -2021
4179b021K897k639K778l127K221j514K49Q12j426J765j715J294p67O65J009j600
4195a119J283p50J446k173K188j809J140R9o43Q86j178R01j094K191j877P95J238
4212A524j122J469j012M22j100K047j050J66l0p91K76l13J247j975J231j422J4
4229d19J153r93J374k037N13N17O43J17j960J175j484K284j729P39p09J17k83
4246i82m51J212r53J223r35j85n12J018l04q88J463j813J448k82M65p96q49K081
4264d0j476K207k703J035k45R68n67R83Q24j498J036j746J590m20l18R42j147
4281e75J587k292K506o60j55j52o4J011o06P23j599J792j400J337j483N43J529
4298B042j816N55j137N80J65P89n73q00Q30j144J859k145J414n44Q54N45k651
$$ plain form
4179 -2021 876 -1763 1015 -2112 109 -1405 -1156 -344 -1770 -5 -1720 -426 -1193 -528 481 -1119
4195 -1119 164 -586 860 -1313 875 -934 206 305 -338 548 -630 271 -823 1368 -509 286 1524
4212 1524 402 1871 859 1281 181 2228 1178 1344 1314 523 799 486 1733 -242 989 -433 -419
4229 -419 734 -259 1115 -922 -409 108 751 868 -1092 83 -1401 883 -846 -107 -816 -699 -982
4246 -982 -1433 -221 -1174 49 -886 -1071 -1583 -565 -869 -1757 -294 -2107 -659 -941 -476 -1272 -2121 -40
4264 -40 -1516 691 -2012 -977 -1222 -254 -821 162 986 -512 524 -1222 368 -52 -370 572 -575
4281 -575 1012 -1280 1226 566 411 259 195 1206 600 1323 -276 1516 116 1453 -30 513 2042
4298 2042 226 781 -356 224 389 1178 605 -195 635 -509 1350 -795 619 75 929 1474 -1177
4315a177J600j591J881q34o01N09k28K63p61J189j866J329o88R41j92P5Q25j939
4333a265N06p67J495j50n78P29j223J108n52J529j829N63N38J57K70m42j26j517
4351a554K637k491J517N9L90M94j383J552j936J558q98J225n60k97J811j936J373
4368A561j553K072j885P75J242k189J297j043O26j772K392j492j34J226k408K134
4384H49j625J282n15M72r08P69O43j817J389k492K312j435J851q66j013J520j690
4401a274R31j370K643k365J580j257n3M60r63K381j402O65j185J012J51p59J228
4418D23j354R73p64J299j012K11N89o33N03q33J876j250J05N57n28K016j865P99
4436A112j895K082l72O20j196l73Q79j790K272j520J651j32j155R49p11P00j293
$$ plain form
4315 -1177 423 -1168 713 -121 -722 -213 -441 -178 -939 250 -1616 -287 -975 -34 -226 -151 674 -1265
4333 -1265 -759 -1526 -31 -181 -759 -30 -1253 -145 -697 832 -997 -434 104 261 531 89 -37 -1554
4351 -1554 1083 -1408 109 168 558 1052 -331 1221 -715 843 -55 1170 610 313 2124 188 1561
4368 1561 8 2080 195 970 2212 23 1320 277 903 -869 1523 31 -103 1123 -1285 849
4384 849 -776 506 -9 463 -445 324 967 -850 539 -1953 359 -1076 775 -91 -1104 416 -1274
4401 -1274 -343 -1713 930 -1435 145 -1112 -1165 -705 -1668 713 -689 -24 -1209 -197 -46 -805 423
4418 423 -931 42 -722 577 -435 -224 365 -268 235 -598 1278 28 133 690 162 2178 313 1112
4436 1112 -783 1299 927 1547 351 -22 857 -933 1339 -181 1470 1338 183 1132 421 1121 -172
4453a72J789k195J562m76o84Q49r06J053j774J393p74O43k18l17L47j047M90l69
4471h06M12J24l74Q06j786J053j131Q28q20P71m97N53J240j525J893k368J225
4488d02QN7k59M98O40j530J533j016J334n89K13n66j62M71j227K595j449J191
4506A340j534R66j507J774Q20r40l50m49J781q73L2j64j184J285o16J459k069
4523b29J877j375K75m54o97J845j185J253k426J432k01r1J51N6N70q81O03n60
4541c7J043j852R69k1r93J066j032L24p18L20J06k64O58o55J722j882Q12j818
4559b252K197K12j139L57l16J004r28J137q89k15N91o88J605j479J016L35r87
4576d39kQ22o11q29K501k314J681n15m24J681j282P73q04J283j863O79J090j323
$$ plain form
4453 -172 1617 -578 984 508 -176 673 -233 820 -954 439 -335 308 90 -227 120 -927 -437 -806
4471 -806 -394 -270 -644 162 -1624 -571 -1702 -874 -1694 -923 -1420 -867 373 -1152 741 -1627 -402
4488 -402 -394 -337 -596 -98 542 -988 545 -471 863 274 487 -79 -241 230 -997 1598 149 1340
4506 1340 -194 772 -735 1039 1859 919 569 120 1901 1028 1060 896 -288 997 381 1840 -229
4523 -229 1648 273 548 94 -603 1242 57 1310 -1116 316 115 24 175 231 801 -80 523 -37
4541 -37 1006 -846 123 102 -891 175 -857 -533 -1251 -931 -825 -1089 -431 -1086 636 -1246 -434 -2252
4559 -2252 -55 157 -982 -625 -941 63 -865 272 -617 -832 -241 -929 676 -803 213 548 -439
4576 -439 -441 381 -230 -1059 1442 -872 809 294 -130 1551 269 1042 238 1521 -342 337 1427 104
4594A04L24n06J400r14R15r15M04r19K97L90n56L77j324J071o03K9M03k71J719
4613A425k755J131J18O98o71K91l00r68J017m49L75j89n7n92K79M59j271J441
4631a8j101J390p91P7N27j213J663j699J695j320R81o45R6P61r25J153j242J150
4649E39j184J063m70N15L21q18J051j168P30K24n3m04p04P90j69J026j551J246
4667I84o39J217j141J60M4n04J280k407Q48N81j122K20L15J142q69O60j385M26
4685a90m82J091p88J73J268k215J233n61P39p84M2J242q96Lj020O52l39Q67p5
4704d0p70N48r52N87m00Q06j673K080l42L47M92j853K225k396K135n60J52j061
4722f75M92J051j211k55O82J33j53P12Q57j531L87J88M6o44R66j057q9p13n02
$$ plain form
4594 104 428 -78 1322 408 1323 408 812 -107 190 580 24 401 -923 148 -455 -426 -23 -294 1425
4613 1425 -1330 -199 -81 617 -54 237 -63 -1031 -14 -463 -88 -277 -334 -926 -647 -188 -1459 -18
4631 -18 -1119 271 -520 -443 84 -1129 534 -1165 530 -790 191 -454 -358 403 -522 631 -611 539
4649 539 -645 418 -52 463 784 -34 1017 -151 579 803 750 346 -358 432 263 1289 -262 984
4667 984 345 1562 421 581 625 121 1401 -1006 -158 423 -699 -479 -164 978 109 769 -616 -190
4685 -190 -672 419 -369 -196 1072 -1143 90 -471 268 -516 -474 768 -128 -125 -1145 -493 -832 35 -40
4704 -40 -810 -262 -1214 -627 -1027 -221 -1894 186 -156 191 683 -1170 1055 -1341 794 234 386 -675
4722 -675 -183 868 -343 -598 84 217 64 776 1633 102 489 677 723 79 1045 -12 -101 -814 -1316
4741a316J885J60M68j214Q57p01K70L74r19O58q70R94q44j1J84J586%j932R60
4760E89m87O74j717L37N33o2J72j575K480k480J498o41p08J523j540J860k027
4777a571J305j142P97l6Q80r87k42Q18j681K643j942R11j148J85J264j66R35p87
4795C6R72j412Q02L1j265J528j087J446j499P36J5J97j38m13R61r55R20m54p1
4814C50L02Q8p5n65J044j533J392m87L77n11o83J439j500J786j143Q35q42l01
4832b7J23j041K419j748Q55r71Q13k09j052N40n78O19m78M17L0L23j76l60R99
4851D98j059N42r33Q57j072Q46m23l36Q69o22J300j775J217p00l83J437j178J055
4869A40j290J242j102J439Q7j50j98j56k43o92K595k800K073J58p54K70q88J326
$$ plain form
4741 -1316 569 729 1197 -17 840 139 409 783 -136 522 -348 646 -198 -209 -25 1561 1561 -371 589
4760 589 102 776 -941 -604 -71 -133 39 -1536 944 -1536 -38 -679 -1387 136 -1404 456 -1571
4777 -1571 -266 -1408 -611 -647 233 -754 -996 -178 -1859 784 -1158 -247 -1395 -1210 54 -112 823 36
4795 36 1008 -404 398 429 -836 692 -395 1051 -448 288 303 500 362 -51 910 -45 875 421 350
4814 350 652 740 665 100 1144 -389 1003 516 893 382 -301 1138 -362 1424 281 1116 274 -27
4832 -27 96 -945 1474 -274 581 -390 423 214 -838 -298 -876 -257 -735 -318 -288 35 -141 -501 498
4851 498 -561 -19 -952 -95 -1167 -321 -744 -1080 -211 -833 467 -1308 -91 -791 -1174 263 -915 140
4869 140 -1150 92 -1010 429 516 366 168 12 -231 -923 1672 -1128 945 1103 349 619 -269 1057
4887A057l67m5q76P13L00j112J969k297J294K45k42J07O6L35j012N81j164Q84
4905D36l95j10j22Q32l73p19m2O10L68p30M23l17q99J684p44K47r80P98J24q13
4925g22L16l70J049j331M65J07M78n83j39R1N52J83j97M58m78O32o30m91M99n20
4945f31Q69k197K291m95R59p41n05K96j11N57j018J117N37l23j077Q34J120j595
4963a13O02k23K38L23o30L76n07M86k092K261n52J270j114j9N7l58Q00q73J321
4982A253j849J197n3r60M21J73K04m07P58j552J69K19o19J433j181Q43k201J911
5000b41o78J046p84N4O84j253J984j917R20K67o02J437j341R42p34j11N2L03j08
5019h0L3m9j63P26o32K32m59K15K99l98N28M83r28P54K02l54m53N65q25J533n50
$$ plain form
4887 1057 690 645 -231 482 782 -330 1639 -658 636 881 639 746 812 1147 135 716 -448 436
4905 436 41 -69 -191 641 268 -451 -493 117 485 -245 178 -139 -1038 646 -98 149 -831 -33 91 -722
4925 -722 -406 -776 273 -1058 -593 -486 -8 -591 -730 -639 -87 96 -101 357 -121 511 -119 -610 -111 -631
4945 -631 238 -1959 332 -163 796 55 -450 -154 -265 292 -726 391 928 605 -472 362 1482 -113
4963 -113 489 266 504 827 197 573 66 552 -1540 721 169 1439 325 306 363 5 805 -68 1253
4982 1253 -596 601 548 -412 9 182 386 -21 737 -815 -646 -427 -1046 387 -794 49 -2152 -241
5000 -241 -919 127 -657 -603 81 -1172 812 -1105 -185 82 -520 917 -424 518 -216 -327 -275 28 -80
5019 -80 -47 -96 -259 467 -165 67 -392 -177 122 -276 252 735 -193 561 763 409 -44 521 -304 1229 679
5040F79M30j749K047l33n33K50n33N09j162J564j268O71q55M26L46k047J722l62
5058a98R47r24J00k11Q25J318k463J481j790R71L52j663R35K03m5o91K16R65m27
5077i9r03M41l24N65N36j378K312j264J93o55l8P10p63R44j853K325j568J294
5095D75l51q94J134lK61j161J379p84m75O89R25j121j27P22j194J385j276J277
5113H61p5l80J053k625R37J59N36m50J93O04p79L79p49J316n80N22j518L5J141
5132E80j446J535p85P33p56n54K36N54K80j666J373j097J255K74K17j346J64J382
5150I33k207J418M23j459M69K72Q06j425L35k18O19k33k63j02J150p03j39O72
5168C48p67J743j159L48p16n58J368q20J801j814Q08p19M25l00P72J118k870J964
$$ plain form
5040 679 1109 -640 1407 1074 541 791 258 767 -395 1169 -99 572 -283 143 489 -1558 164 -198
5058 -198 749 -175 -75 -286 539 1857 -606 875 -915 56 408 -1255 -320 -117 -162 -853 -637 328 -99
5077 -99 -1002 -561 -885 -320 216 -1162 1150 -114 79 -576 -614 96 -667 277 -1576 749 -819 475
5095 475 124 -770 364 361 622 -539 840 56 -419 270 1195 74 -53 669 -525 860 -416 861
5113 861 786 406 1459 -1166 -229 -70 466 16 209 813 34 413 -336 980 400 922 -596 -561 580
5132 580 -866 669 -116 617 -139 -693 -457 97 377 -1289 84 -1013 242 516 733 -613 -449 933
5150 933 -1274 144 567 -892 -423 -151 655 -770 -435 -653 -34 -267 -530 -632 518 -185 -324 348
5168 348 -419 1324 165 513 -203 -761 607 -213 1588 -226 582 -137 288 -12 760 1878 -992 972
5186I72r73K05N59j268J174o27Q14j861K112j218K58L93m96J140j755J798k265
5203a038J972n67k90k8j366J707k82Q96j022R38j574Q79n4j14L79j296M33m97
5221i24P98K7l21J211k514J205l30J12N1N96m06L79J015j908J386j484K79K87
5239e41O10m01J135q37M82L75k62P78j754K60R60j435J718j325J030r96O66j34
5257C29RM12o29R28r51J850j387k11p99J022O58j487J650j732P97K59pm20J32
5276D23l38n61J551j216N79j51J10r66J32L66j121J053L54m53p31J474j229L90
5294c34L92p12K87J071j267k08k10J68r1L70K04l75l25Q92j118J028r08j1K221
5313A074p38m6j875J897o19K76K85l05J562j950o84O48P55K5M87L1l24J79p72
$$ plain form
5186 972 -1 204 763 -505 669 42 856 -1005 1107 -111 147 540 44 1184 -571 1227 -1038
5203 -1038 934 367 77 49 -1317 390 108 1004 -18 920 -654 225 171 57 436 -860 -427 -924
5221 -924 -126 -99 -420 791 -1723 -518 -848 -736 -685 -89 -495 -116 899 -1009 377 -1107 -828 -541
5239 -541 69 -332 803 -34 448 823 561 1339 -415 -155 805 -630 1088 -237 793 -203 463 329
5257 329 338 750 121 1049 98 1948 561 350 -449 573 1231 -256 1394 -338 459 718 711 291 423
5276 423 85 -476 1075 -141 438 287 397 -569 -437 -71 -1192 -139 215 -238 -969 505 -724 -334
5294 -334 58 -654 -367 704 -563 -771 -981 -813 -904 -534 -330 -705 -1030 -138 -1256 -228 -1136 -1147 1074
5313 1074 336 290 -1585 312 -307 -31 254 -51 1511 -439 -1123 -475 280 305 792 823 499 678 -94
5332i4J153k89o14p01J134N73q37j19j81P42o84r7J92p31N91j01R5o24M57j2M01
5353B54O06r03M90m44O41r65k31J017r17K66n8M54j276J082M83q22K98j91R3k13
5373c36N26l52L85n28J53n34l71J575j098J141j781J988j393k05O14r39O71j39
5391f23P58n18N94o70J46M51j189Q33J24N50K92p97M22m47Q19k38R40j445P78
5410G80l55j019J983j126O32j831J546r31m15J496j87J38j432O08n78J142q16
5427c65M29P68n60J66q37j53l6Q02q17J87O48o79L62l26Q57j461Q99r73Q84l77
5447e82L74N92j179j16J424m44n08n50N68l87R59k58P7r61R46R0j6K33p13J006
5467E55j173Q70o91l95K59L4J130q92J192j543J072J00p16P06n68J638j669Q72
$$ plain form
5332 -94 1059 770 156 -545 589 1162 325 206 25 767 83 -14 178 -553 38 -63 32 -592 -135 -147 254
5353 254 860 -43 447 3 644 -321 -552 465 -452 -186 -244 210 -1066 16 499 -323 -25 -216 -123 -336
5373 -336 190 -162 223 -305 -152 -686 -1057 518 -580 561 -1220 768 -625 -830 -216 -1155 -484 -623
5391 -623 135 -383 211 -459 -313 138 -1051 -218 -94 456 748 -49 373 -74 745 507 1447 2 780
5410 780 425 -594 1389 263 895 -936 610 -321 -736 760 573 711 -721 -113 -691 451 -365
5427 -365 64 832 272 438 -399 -552 -588 214 -603 -416 232 -447 -85 -411 446 -1015 -116 -1089 -205 -582
5447 -582 -208 384 -795 -911 513 69 -439 -989 -421 -808 151 -107 -30 -991 -45 45 29 262 -451 555
5467 555 -618 252 -439 -834 -575 -541 589 -303 889 -654 418 518 -198 508 -60 1578 -91 781
5485G81o67j00R03j33M37j501P84j9M16J70p96N7k19O92R3j26j122O10l89K70
5505A41q3J0N20p88J030q18L76j96k03P03j210N17j54k45j8L82j188J919k36k048
5525a589J124O95q16Q79p55j70j4P00p57K87m88O01J21r80M05P86J089j968J148
5544B98q38Q25L95n30P13p89L95k0m5j248N70P33K98o53k16R87j542J542m76M18
5564H17j034K63J418j914J460n90N92p89n38L01j04L58k94J15K45N19j479O11
5582d3o37P77J198k116J606j431M11j81p36J170j699J107L42N27j022R84p55J44
5600c54P71p26M00r02K74K91n81K62K47m80J79Q15k56M50q23m64N74j08R35m97
5620Go0o23R16j11J72k54r3O09n45L67j03k58j79L39o18O67J91q37J673r76n23
$$ plain form
5485 781 114 14 917 784 1221 -280 504 485 901 1071 275 332 113 805 898 772 -350 260 -129 141
5505 141 58 68 588 -200 830 12 388 192 -11 692 -518 -1 -155 -400 -418 -36 -1224 695 459 -1589
5525 -1589 -465 230 -586 293 -462 -632 -646 54 -703 -416 -904 -303 -182 -1162 -757 29 1118 -850 298
5544 298 -540 285 680 150 863 74 469 449 404 -844 -274 459 757 104 -112 875 -667 875 399 817
5564 817 -217 46 1464 -450 1010 420 1012 223 -315 -14 -118 240 -54 61 306 825 -654 -43
5582 -43 -680 97 1295 -821 785 -646 -235 -416 -1152 18 -1681 -574 -232 295 -727 257 -498 -354
5600 -354 417 -309 91 -811 -537 -246 -827 -565 -318 -798 -619 196 -60 390 -433 -897 -323 -431 504 7
5620 7 -53 -676 240 129 301 47 -46 563 18 385 282 24 -155 184 -434 233 424 -413 1260 284 -239
5641b39N25m79J360j303K73k50N13J46K8l39n36N73o55M75l26l7N84q03R92l50
5661A52R06j700L49N59m01M97j10n81n28J307q05L72j129M96k8L75l11r43J615
5680I2n03j43M99l96j1L24l42n77J074o98J354j002j63J393j490J069j153J320
5698F47q89K88N78k83p33J37J218n97K38l13L06P99r19L64n55m08J30l69M50N82
5718F71n69j8J097j522P54n9K13k3q00P55q92M48j053R50l25J60J102l92Kj080
5738e81L86j115J501o73J737q88j119J054m78R32j610N20q2k36J88N19L17j167
5756g95J153j193J161o19M04P2j13K83j364P79R52k1j030N99l61j50j21M62M49
5775E47J46j265K65N45kj213R12k34J333n65j446R35L20l6O89N77o69j423O61
$$ plain form
5641 -239 286 -193 1167 -136 137 -113 400 546 574 235 -301 272 -383 92 -234 -271 313 -490 502 152
5661 152 1058 -642 -293 266 -135 362 252 -329 -857 450 -355 17 -1112 -616 -644 -269 -580 -1523 92
5680 92 -411 -554 -55 -451 -462 -138 -480 -1057 17 -681 673 -329 -492 901 -589 480 -673 647
5698 647 -242 46 624 341 -392 -255 963 366 604 291 597 1396 477 841 286 -122 8 -361 89 671
5718 671 102 84 1181 -341 413 354 567 544 -256 499 -393 55 -998 -48 -373 -213 889 497 499 -581
5738 -581 -195 -1310 191 -482 1255 367 -752 302 -176 756 -854 -334 -416 -652 -464 55 372 -795
5756 -795 358 -835 326 -293 111 183 70 353 -1011 -232 720 699 -331 268 -93 -243 -364 98 547
5775 547 693 -572 -307 238 236 -977 -65 -299 1034 469 -977 -42 278 242 931 1508 839 -584 77
5794G7Q7N42l74o01J218j106K87N06m04j34M3n69L30n51M13j63K18n6J08O09j945
5815a465J143k3O68J30j125J39O11j091J452J27j103J173r44l99J126j544N94
5832e31k14J383j047j01L72l66R60q24K68o26J745r42O02o20l55JJ29R66l28j69
5852C03L39o35P53n34M3m42J013r98R16l66o10r4p45J623l62r3q22N96j264J771
5872C92L69P6n39J021n76j073O46l83j216J633K85q37J076o06j169P26K54n02
5890d23K78k7j67m24J098o10k91n4J51kJ73O00j224J381n42n51N84r74R39j021
5910a106J000j62Q60n48k68K85j64M46p66L36M37N11K03j611J189j96O6o05J34
5929D1k16K48N22p96J395o28k36p80J524j638R17q08O08R56r13J198j037M58o70
$$ plain form
5794 77 164 706 332 -269 949 -157 130 636 232 98 141 -428 -98 -649 -236 -399 -181 -237 -129 480 -1465
5815 -1465 -322 -345 323 453 -672 -533 78 -1013 439 566 -537 636 -308 -707 419 -1125 -531
5832 -531 -745 638 -409 -510 -138 -504 456 -368 -100 -726 1019 77 679 59 -296 -295 -166 800 472 303
5852 303 642 7 760 226 269 -173 840 -158 758 392 -218 -312 -1057 566 204 111 -711 -115 -1379 392
5872 392 761 837 298 1319 743 -330 316 -67 -1283 350 635 -202 874 268 -901 -175 79 -423
5890 -423 -145 -172 -339 -763 335 -275 -566 -620 -469 -471 -298 302 -922 459 -83 -634 -50 -1024 -85 -1106
5910 -1106 -106 -268 592 44 -224 61 -103 343 -423 -87 350 861 1064 -547 642 446 512 -93 41
5929 41 -175 73 595 -201 1194 566 330 -450 1074 -564 353 -455 153 1109 196 1394 357 815 145
5948A45k76M44k62k9j18n19N96J584j936J022r18m86J47K49J052q55j75m88J418
5967E95j09o05m52N63O36q81m62P33j423K028p02m02J056l33o39l38R16j013P73
5986e9j25K8n34R61M9l37Q12j646J771K63j356n79P86n85R26M0L42o51j62M00
6006C44L21p64N47o54J452j565Q70j82o00L18L07M19N68j160l69M47o00O09P83
6025A091p23q51L65O88K9r11L20p3l51j3R81p43J190r07N7k32L76o36L52m60K52
6046a99j00P1O0p41Q61R11m34l69j110P32o58P08m95o19J414k40m68Q00N50j075
6066d01M47Q14n35j47j30K10o11j85M80q98J515p29L89k32M95o77k43P38j92k80
6086a72J9R51q15L77o08j35P19J2L58m27J67q27N37O34m46q73O85O93j290J059
$$ plain form
5948 145 -131 313 51 22 -96 -615 -19 1565 -371 651 -267 -753 -606 -357 695 -160 -335 -823 595
5967 595 486 -119 -571 -8 628 -253 -715 18 -1405 623 -79 -481 575 242 -397 -735 181 -832 -59
5986 -59 -184 -156 -690 271 320 -17 795 -851 920 1183 -173 -752 34 -551 375 415 757 106 -56 344
6006 344 665 -99 448 -206 1246 -319 551 369 -231 87 394 813 1381 221 -148 299 -301 308 1091
6025 1091 368 -483 -118 570 599 -312 8 -65 -416 -429 552 -191 999 92 149 -83 293 -343 9 -451 -199
6046 -199 -299 -228 -168 -909 -48 863 429 60 -1050 -318 -976 -268 -763 -1382 32 -208 -676 124 674 -401
6066 -401 46 860 325 178 48 258 -353 -538 -58 -956 559 -170 219 -13 482 -195 -438 300 108 -172
6086 -172 -153 798 -17 360 -248 -383 336 348 706 279 446 -381 156 790 344 -529 156 849 -441 618
6106F18j182J30K73L27l96M4J82O11m85m80l7j62N99J50o78R82p30J47L5L29j129
6127h52k36J479p53J136q51r24O56J148r2j038J503j888J223l64q36K75J41K40
6145c3K31j24J47m39J283r42n60j94L90k22R42n21N30l81M40j088N40J388j393
6164fJ038p69L81p60P39l00j63J45o67J073p72R0j03r4L23L12j33r12J027r20
6184d71J28k25R62J18n73p1K83r1o05M56N12j90K56q59j7J111j058P60k01k54
6204b9M98j94m69J057j148P51m20L0n62M63j27l53J014j273Q84J48j042M29K18
6223a25J054j150N55j48j33O18r01L94r24J779j188m02Q59o8N08n72M44q17J2
6242b05L05k07k67Q28Q23j421L59o52J69L0q8K53j6R65l87o29Q50n67j448J607
$$ plain form
6106 618 -564 -434 -161 166 -230 -186 -4 607 122 -358 -395 -557 42 192 -486 496 -234 -87 -52 277 -852
6127 -852 -1088 391 -362 774 -77 -1001 -345 803 711 -327 1176 -712 511 147 -689 -414 -273 -33
6145 -33 198 74 221 -218 1065 123 -437 -631 -241 -463 479 -42 488 107 547 -541 -1 1387 -6
6164 -6 1032 263 644 -116 623 323 160 305 -362 711 -61 29 -74 -168 155 467 334 -578 449 -471
6184 -471 -343 -568 394 512 -61 -132 151 60 -545 -89 423 233 489 -370 -387 724 -334 426 225 -29
6204 -29 469 275 -194 863 -285 466 46 76 -486 -23 -150 -503 511 -762 122 270 -772 -343 -125
6223 -125 929 -221 334 186 53 671 -230 164 -760 1019 -169 -571 288 220 728 156 600 -217 -205
6242 -205 100 -107 -374 454 1277 -144 215 -437 -268 -238 -326 -73 -89 876 489 -140 710 143 -1305 302
6262C02j124O37N11j399Q61o47P72j2k67O1O4QR73n78r24M2o0R87j305Q01K34
6283f3k88n83P20P2k4m0N67j52J62m22j4K70r6K4r07J484r91L29K79l17P6J47
6305B33P76j67R2o97k84J516j191k52K68k98O34m38J01J74n66k5J70k82J06J45
6325A5j3k31K95k52P90o38K3J62o69Q05j158J071n20O05K50o51m32L41O36j431
6345a002J328r7q74j88M43m78M13J02n03L61J74J093j130J11J063n70l13M81m5
6364C69p65M85m69j89J07J225Q2q81J05Q05j850J768p35l2k02l45J038r93O20
6383A43J8K88j619J559j402J882m14k50p0l87M42k77k04j06K81J13Q91p01r93
6402h06J53J342l08m25m3O49j927J309N0O46n24k0k3O02o51L21o29N86j15n66
$$ plain form
6262 302 -822 -185 326 -1073 -212 -859 -87 -99 -366 -305 -241 -233 740 162 -762 -720 -780 207 -1098 -297 -63
6283 -63 -351 -934 -214 -142 -166 -206 361 209 371 -51 -65 205 109 133 -774 710 -281 48 327 10 86 233
6305 233 1009 842 934 237 -47 1469 278 26 294 -4 630 192 293 467 -99 -124 46 -236 -130 15
6325 15 2 -229 66 -186 604 -34 -11 151 -518 287 -871 200 -320 285 535 -116 -548 -207 429 -1002
6345 -1002 326 229 -645 -833 -390 -868 -455 -353 -856 -495 -321 772 -358 -247 816 246 -67 414 369
6364 369 -396 89 -380 -569 -462 763 845 -36 69 874 -976 792 57 25 -177 -522 516 -477 143
6383 143 161 449 -1170 389 -1013 869 455 205 135 -252 190 -87 -291 -397 -116 -3 888 187 -806
6402 -806 -653 689 381 -44 -87 562 -1365 -56 -6 640 116 96 73 675 24 345 -284 302 187 -379
6422c79J066o88p25P27L2r87N18O77j21j309M61P75N62K69j762Q94l95M65K32
6441C12l98J75l82P36n20M3L99o47k32M49P32p10j042Q35M13Q70q19q27R37L89
6461G13p51K08J029j077R04l78j272j15L79M89k94N6J12L19n59J69J87m87K7m42
6481g83J458j554M35Q30r96P12n72O99n88M75Q26r51p0l69P58M53o40m25r1j61
6501e54m94J261q21R41L30r72q27J065M61j97j38O28r02L98M05k12M81j329M38
6520c8J200j976J291n36n0L08L36j92M32l79j89Q6l89P0J073j501R82j047Q32
6539C13p09J058k64m52L8o21L67N67n02M65l94Q10j104n15J027j52l89P37L50
6558F30o63K41k26K97p46J368j164K36K21p93L01J90j65J013r29R6l01N46j5R32
$$ plain form
6422 -379 687 -1 -726 1 33 -954 -436 241 120 -1189 -728 47 609 878 -884 10 -385 80 312
6441 312 -86 89 -293 443 -77 -34 365 -282 -514 -65 667 -43 -1085 -250 163 1033 214 -613 324 713
6461 713 -38 170 1199 122 1026 648 -624 -739 -360 129 -165 -109 3 322 -237 -68 119 -368 -341 -783
6481 -783 675 -879 -444 386 -610 102 -470 229 -359 116 942 -9 -79 -448 310 763 123 -302 -393 -554
6501 -554 -1048 213 -608 333 663 -309 -1136 -71 390 193 55 683 -219 179 584 372 853 -476 -38
6520 -38 1162 -814 477 -59 -109 199 535 343 775 396 207 293 -96 -26 1047 -454 528 -519 313
6539 313 -396 662 398 -54 -16 -637 -270 297 -205 260 -134 676 -428 -943 84 -68 -457 280 630
6558 630 -33 208 -18 279 -467 901 -263 -27 194 -599 -298 -108 -273 740 -189 -93 -394 152 137 1069
6578A069j087m83R82p27M77j26K8j157O56L62k90J36N40m41Q87r2j256R83r75
6597e14L16o02J026m21R36q88L63p59l0O01J264K8j107L8j129J186J46j88L40
6616F06j58r33P26p6l41p75J362L47M10j647P89j74M0m95J450j464l9N13K72m09
6636Dm62R15j57o51m75l7Q85Mo37j89P11k97J61K00l13M87J0OK88m96K30J742
6658A929k180p91P85J91pn39j1P89k12K39k10R65j426J710j028p64J032p20l43
6677e91P21q69P68J04n34J51M14n62k30L58R38o27k35N44o0jp87J489r23j11J95
6698A52n30j043J925r47L64N75m0j60k08o70J897k244O66m34K17l64R8J601n59
6717B96o16L52l55m57Q46o98P59j97K87o69M7J26j42j45L6O40k02r22M18N35M63
$$ plain form
6578 1069 -18 -501 481 -246 231 105 133 -1024 -368 -6 -296 -160 380 -61 826 734 -522 461 -514
6597 -514 -198 -800 226 -195 741 -147 216 -543 -573 28 1292 1320 213 251 -878 308 454 266 606
6616 606 448 -485 241 165 -176 -951 411 758 1168 -479 310 136 176 -319 1131 -333 -372 141 413 4
6636 4 -458 457 300 -351 -826 -863 22 26 -611 -800 -89 -386 -225 -25 -338 149 159 165 453 -43 187 1929
6658 1929 -251 -1042 -257 -66 -73 -612 -623 166 -46 193 -17 948 -478 1232 204 -560 472 -248 -591
6677 -591 130 -739 29 133 -401 -250 164 -398 -628 -270 668 41 -194 350 290 289 -498 991 68 -43 152
6698 152 -378 -1421 504 -443 -79 496 456 296 88 -582 1315 -929 -263 -697 -480 -844 -746 855 296
6717 296 -320 32 -323 -780 66 -632 127 -70 217 -452 -405 -279 -421 -566 -530 110 -92 -1014 -596 -61 402
6738D02l81p0Q10o15l54M75J92j066J253J73q30K8m08M55l61O27j213M98Q64p62
6758b83k14M15k23o86N29o7J206o81L31J26k85L26l81N2q03P21J55p36K52J85
6778f1O67l08m63M00o58n30Q38J04j6Q06n63q54M22j11l4k65P86o42K87R9k73
6799c69K59o01J277r6o16O06j14l2r5k95O56J8q39K34L94l99M36j212R53Q50k36
6820G79m79k56m28N49l12K36K0m44J239k201K042o80M2O27j162R56p27P39n58
6839a8O38k20J55p85Mj30j051K895j816Q72j133M86k05N11N40q58Q41j899J524
6858C51j043K96L57J79k70n7O8M95m17P10j112J88l60J005p79m05R43q9p78P63
6878D5m43J370p22l21J85j8O47j219J262j246J533o77n48Q68j385L60O68k25q24
$$ plain form
6738 402 21 -49 761 146 -208 267 459 -607 646 819 -11 17 -391 64 -297 330 -883 -385 479 -283
6758 -283 -497 -82 -305 -991 -462 -529 677 -4 327 453 168 494 113 165 -638 83 238 -498 -246 -61
6778 -61 606 298 -165 235 -423 -953 -115 -11 -27 779 216 -638 -216 -327 -361 -626 160 -482 -195 -96 -369
6799 -369 -110 -711 566 470 -146 460 346 314 219 -76 580 598 -241 -7 387 -12 424 -788 165 1015 779
6820 779 300 44 -384 165 -147 89 109 -335 904 -1297 745 65 107 734 -428 528 -199 540 -18
6839 -18 620 400 555 -230 -226 -356 -1407 1488 -328 544 -589 -103 -308 203 743 -115 726 -1173 351
6858 351 -692 -396 -39 140 -130 -187 -119 376 -41 669 -443 -255 -615 390 -389 -794 149 60 -718 45
6878 45 -398 972 250 -71 114 96 743 -476 786 -460 1073 396 -152 716 -669 -309 359 134 -690
6897f90M56R62j58J12j044J059M18p37o6p32M13q51J331m37L96n04K65j18J28
6916B03K43k09N26k10o01N75q46J40O4n5NJ7L18j21R2j005Q6J665r49P11j181
6937e32P07p50K61L45L65j51o09J77p86J857q10k70M50m29l19L0J138r48R01j395
6957g68M82L99k34k98O54l74L75O88n14m02M06M64q97l11N65n54q3J188n03q21
6977e38L81o65J238j27L33k15j022J421l01q58O91o10j38N08K25m09J77j90N11
6996D12O05j285P46q69R49j964J956j81l04J42n74n20o9O15j42Q73q32J183r79
7015b38m99O59K47k24J040j196N57K41j09q12k13J03N70L62j248P42Q30j036p6
7034c00m47R11j84J00j3k99m47P61O5o49P18K97q89j95O00n36J082j176P98N0
$$ plain form
6897 -690 -234 728 570 682 -362 697 1115 378 312 -420 -7 -858 473 36 432 -72 193 75 203
6916 203 446 237 763 553 -48 527 -319 -179 -115 -170 -165 -148 170 49 141 -864 -778 887 -62 649 -532
6937 -532 175 -575 -314 31 396 245 -364 -187 -973 884 74 -196 254 -175 -494 -464 674 -274 627 -768
6957 -768 -286 113 -121 -419 235 -139 236 924 410 8 414 878 -19 -330 235 -319 -402 786 283 -538
6977 -538 -157 -822 416 289 622 407 -615 806 505 -353 338 -272 -410 98 323 -86 91 -99 412
6996 412 1017 -268 478 -391 558 -1406 550 369 65 207 -367 -887 -956 -341 -483 390 -442 741 -238
7015 -238 -737 -78 169 -55 985 -211 346 587 478 -334 -547 -444 126 488 -760 -18 812 -224 -300
7034 -300 -747 164 -20 80 67 -232 -679 82 147 -502 216 513 -376 -571 29 -507 575 -601 197 247
7054B47j41k44m62O91O4P78k27k20J94Q4o07jn9k49Q23j88o6n74K78n7P44p98
7076A0r52J626p01L80l55N31J05k16j94p26N78q80Q78L71p43l60Q85k71L27l14
7096b1k46L21l64k18J78n89K16J056j61K59j76p4n25N71l32N33Q7j027O33k80
7116a59L18N61j046N8J009n2k62j56m6R13j728R86p98J38L44l18Q03K03K96j112
7136d8O78r90R01O34j285l9O53q24L58N46p26O12l39n89J82N19q8m63l1o47O95
7157b91m05Q21J58q72J208q45j69k59j71N12P05j40p71J364p75k82L00K52N56
7176H96j010J108j160M8K90m1j8n26J341j129J97j165J680p88R17j126N5J422
7194I91r77k15l54N42n00P80j50r6q44J014K19j135J544q63O65l32r91N88N08
$$ plain form
7054 247 106 -138 -600 91 155 933 706 486 680 764 157 156 97 -152 671 483 417 -157 121 64 808 10
7076 10 -942 684 -17 363 8 539 644 428 234 -492 86 -794 84 455 -288 -648 237 -34 293 -21
7096 -21 -267 54 -310 -528 -350 -939 -723 333 172 431 255 181 -344 227 -105 428 515 -512 121 -159
7116 -159 159 720 -326 -268 741 689 427 271 225 1138 -590 396 -402 -264 80 -238 565 768 1064 -48
7136 -48 630 -360 541 1175 -110 -149 504 -320 38 584 -142 470 131 -458 -276 243 155 -308 -339 -986 -291
7157 -291 -696 125 283 -589 619 -226 -395 -654 -825 -313 392 252 -519 845 70 -212 88 340 896
7176 896 -114 994 -166 -118 172 131 113 -413 928 -201 -4 -1169 511 -277 640 -486 -431 991
7194 991 14 -201 -555 -13 -513 267 117 21 -823 191 410 -725 819 -44 621 289 -702 -114 394
7213C94k87l20P31J27p93R1k51N40p06J197j110q6P28k89m11K14l80o58J305l20
7233b84J84J24j17N41k53j63N20j093Q87m38O70l87q4m53J138k55j30q47O0Q47
7253D67L66r60o99J064J71j120J50j34M98j02R06q97M13j071J338K91j072K22
7271a69o0M06n52M09J52Qj95P87m23l37L87n62Q47o86l08J38m63J075M19k6j441
7292e94P77l86L03p45j56J189m90R20q63k93K96K33m83m2J23l3l26K73P06j565
7312a156J716l06l35L08m28Q7R9K40ko5j161J035o32P70K67p86P97l98q36O89
7332i7l10Q62p35n36l09J778m7n95M65n07K8k12Q47m38k18M22j74k61J44k00N70
7353D77k17k50o45J175o55M38j010R09J03n13j48NP96n93N27K12j270M14J91j97
$$ plain form
7213 394 107 -213 518 645 -148 -57 -308 232 -474 723 -387 -473 255 -34 -445 -231 -611 -1269 36 -284
7233 -284 -100 24 -93 448 195 32 552 -541 346 -92 578 191 107 -346 792 537 407 -440 -380 467
7253 467 833 -127 -826 238 409 -711 -561 -695 -197 -299 607 -290 123 -948 390 681 -391 -169
7271 -169 -229 177 -375 34 186 194 -1 786 363 26 413 -149 698 12 -296 -158 -621 454 873 847 -594
7292 -594 183 -203 100 -645 -801 388 -102 818 -45 -338 -42 191 -292 -334 -211 -244 -570 -297 409 -1156
7312 -1156 560 254 -81 227 -201 -114 -15 225 223 158 -1003 32 -600 170 437 -349 448 50 -786 -97
7332 -97 -407 455 -280 -816 -1125 653 606 11 476 -31 -3 -215 632 194 -24 398 224 -37 107 -93 477
7353 477 260 10 -635 540 -115 323 -687 222 325 -188 -336 -331 465 -128 399 611 -659 -245 -54 -251
7373b51K08M40m38N30m12k5Kl36Nl80R04j125Q20L27J92j475J033m87J98K7m68
7394g11J376n43p66J066j035J403r23K31K6Q7o8l95P31m88k36l61O07R90o36O31
7414I86j066M67m6k4p29O58j36qq25j4J666j614k64J240k79M27m36K95k33j05
7434d0N46n43J53K77j37M5j10J30O44j310o77J014M74j501J687j085k69M57q13
7453a058J006m5m05O80K32k07L42n06n80o7O55r3P29j298M80j70K69l33J020q05
7473a54O79n92o0L3r42J811r68J71M89J78m26o30jJ091o59k52J58p36J514q41
7493a37j27O4J64K8L54L87r51M60j19J43P6j156o5Q79N22k5m95N41o69m23L87
7514a62O41k76J32Q2j906J534N20j100P12r20R06j166J210m55k56O47K56k96m32
$$ plain form
7373 -251 -43 397 -41 489 77 52 54 -282 -277 -657 247 -878 -58 269 461 -1014 19 -468 -270 -243 -711
7394 -711 665 122 -644 422 -613 790 -133 98 124 211 143 -252 479 -9 -245 -606 1 991 355 986
7414 986 -80 387 341 317 -412 246 110 102 -723 -737 929 -685 -949 291 12 439 3 298 65 -40
7434 -40 506 -37 116 393 256 301 191 321 965 -345 -1022 -8 466 -1035 652 -433 -702 -245 -1058
7453 -1058 -52 -97 -502 178 410 203 545 39 -541 -608 47 -46 683 -615 -135 -305 -36 -369 651 -154
7473 -154 525 -67 -127 -94 -1036 775 -193 -22 467 645 219 -411 -412 679 20 -232 -74 -810 704 -137
7493 -137 -264 -200 -36 -8 346 733 -218 242 123 266 342 -814 -879 0 522 497 2 543 -126 -549 -162
7514 -162 479 203 335 417 -1489 45 565 -535 177 -743 163 -1003 207 -248 -504 143 399 103 -329
7533c29J149p87J35j354J601M09j17r69M25q87j4O05J18P72j004p6n60J185Q2
7552C84j601J338O7j01L10m49N63l89P7l28Q14K85j454K45N89K58l68O54p3j037
7572b16K01n1l85R14k08J26j023J122j075k40J447j457K08L75n78M58J074j208
7590e16J109o87k92m84N36L80M5p4M61j99j447J363K68n61r15O94P6K14j97k53
7610d79k0K55K80o90J204j366O16J6K37p83P7J122p82P47m60M32n96n40M27P06
7630D03k00m3j48m17l7P4R48m41O61j848M22P39L52l29m1L79O43n04o85l62J30
7651c04m77K63L59M34L02K1m67N2M66j82p45J244j510O89j553J187L72k24O88
7670F15o03K54n72M43J95l80M67o51q8r1J318r24K02o97L71l60M30k80m60J314
$$ plain form
7533 -329 820 33 168 -1186 415 824 707 -262 163 -724 -738 -133 -15 757 -247 -323 -883 302 384
7552 384 -1217 121 188 87 397 -52 511 122 199 -129 685 970 -484 -239 350 608 240 894 821 -216
7572 -216 -15 -66 -451 463 255 381 -642 480 -595 -835 612 -845 -637 -262 -840 -382 692 -516
7590 -516 593 -94 -386 -870 -334 46 91 17 478 279 -1168 195 463 -98 -1013 -319 -243 -29 -226 -479
7610 -479 -499 -244 36 -654 550 -816 -200 -184 53 -730 -653 469 -313 434 -26 406 -190 -730 -303 403
7630 403 203 160 12 -405 -442 -368 580 139 800 -1048 -626 113 465 136 95 474 1117 613 -72 -434 -304
7651 -304 -781 -518 -159 275 577 598 131 183 649 467 -278 966 -544 145 -1408 -221 151 -73 615
7670 615 12 266 -306 137 332 -48 419 -232 -320 -411 907 -17 185 -512 -141 -501 -71 -351 -811 503
7690E03j72o25J35J749j084m60p4k67R63l90j301J903p1n97o58N44j92J70k57
7709a81N65o59l53J328j094k27j65J150q59N27M61l8j077O50QL03J90j689O43
7728e17l09p1J113%OJ86M22p62j64K84K04o22o06J548p50k29J79M58p07N60J75
7749C98j023J02l78J99M53M50j015J97J033p45q79J205K33r71J353o19Q4n06K23
7768b06j4O9o59J047K60m59J96j212P37J74K30P57n40k91L5k75M15j359J297J155
7788A357j227k40j48M35m00J159r31o0p39J190n76K06P80j175J218n12l43K35
7806B29j054J462o33L70K60n76n14Q22K21j575O16o70K112j571N24l87J125j607
7824h46K8J140j106N76j189J766q33K188k536J607k79j044K33l87J16J125j647
$$ plain form
7690 503 331 -294 -159 1590 506 46 -28 -295 668 278 -1023 880 809 212 -446 98 -94 76 -181
7709 -181 384 -275 -628 700 -394 -621 -786 364 -495 32 493 455 -622 28 36 339 529 -1160 -517
7728 -517 -826 -897 216 216 222 408 830 68 -96 188 392 -230 -836 712 -38 -267 -88 370 -337 223 398
7749 398 -625 -523 -901 -702 -249 201 -814 -617 416 -329 -1208 -3 230 -741 612 -7 77 -429 -206
7768 -206 -220 -151 -810 237 497 38 234 -978 -241 -67 163 920 380 89 124 -151 264 -1095 202 1357
7788 1357 130 -110 -258 177 -223 936 5 -55 -794 396 -180 26 806 -369 849 337 -6 229
7806 229 -825 637 4 374 634 58 -456 366 587 -988 -372 -1042 1070 -501 23 -364 761 -846
7824 -846 -818 322 -784 -208 -1397 369 -464 1724 -812 795 516 -528 -295 -682 -566 559 -1088
7841a088J335j051P77Q82p63l48j32K04M24m39l08J204j71j76m23O91q72q9J84
7860a59m81P04L84n99Q87r87m3j42N08j55K09k15N65j05m86K7M87k51K35m99L58
7881B42l86j52m45J357q36j72M77l81O5L57o47O34N99j623J249p66P67p06q3l76
7901h26M19m74Q48N0k23P62j587J166p85J371q82o7j84K33J68J99o91K25j76J174
7921G20p59Q5j67K89K5k34m7k56j11J84J128q94q82K107j906l12Q93J257j312
7940a92L82P81j508L3J291j096L65J4j26R09k66m91j64k20L52l9q27J284Q3J55
7960G20j291M86K71L59l31J87o73n13L20M22Q1m19J37q24J123M57n13M44j168
7979g25Q86r92J158n46r5o55M53Q40p47M7J56n1m83R13l57O52l85m1L0q60M07
$$ plain form
7841 -1088 247 -804 -27 855 92 -256 -388 -184 240 -199 -507 697 526 350 -73 618 -254 -343 -159
7860 -159 -640 64 448 -151 736 -251 -294 -436 72 -83 126 -89 476 371 -115 -88 399 148 383 -116 242
7881 242 -144 -296 -741 616 -220 -392 85 -296 -231 126 -521 113 712 -911 338 -428 339 -367 -450 -826
7901 -826 -407 -881 -33 17 -206 556 -1031 135 -650 721 -161 -228 -412 -179 -11 188 -503 -278 -454 720
7921 720 -39 46 -121 168 193 -41 -88 -344 -455 -271 857 -37 -919 1188 -718 -1030 -137 1120 -192
7940 -192 190 971 -537 -504 787 -309 56 70 -56 853 587 96 -68 -288 64 25 -802 482 565 720
7960 720 -571 -85 186 545 214 401 -272 -785 -465 -43 38 -381 -244 -1068 55 512 -1 443 -725
7979 -725 161 -831 327 -219 -314 -969 -516 324 -423 -376 -220 -271 -754 159 -198 454 69 28 58 -802 -395
8000c95O67j340K07J417q79J9O58o02P31J8P8j04l39P1K33N79n88p65k24R42L74
8021G58q98N60n74M0L82q1n05O39q42n11J661j196Q24j082J137j108q8J051q41
8040f74R03L30j85r37j46P03m29O92j28P33m70m66q86Q24o39J192M35j093L1J88
8060b2k48l73O42k23J31n45N27n18M46m76Q70m15mJ6J51p7O31L30j046l62M20
8081a45P93r48J20n96N90J402p87k30Po7n24J309q59j99M04p66J379r9o24n43
8101c83Q24M68j511O68n24O83k61j171J425n93L47O56p32r61R36O72p26L64r25
8120g44L27j9k77R44k44j12K35l56k55j94M71J18K45L50o02K74J9o82R62K01r28
8141b67j5j06N05R33j937J532j756J566p96L25N75o62n69J423k140J153K04M95
$$ plain form
8000 -395 272 -1068 -861 556 -323 -304 354 -248 483 501 579 475 136 207 440 1019 431 -334 -558 384 758
8021 758 -140 420 -154 -114 268 187 -318 321 -521 -1032 629 -567 257 -825 312 -796 -884 167 -674
8040 -674 229 559 374 -563 -709 -6 -435 257 129 862 392 -74 -960 -136 -775 417 852 -241 -210 -22
8060 -22 -270 -643 -1 -224 -93 -638 -111 -629 -183 -659 211 -204 -208 -192 -41 -118 513 843 -203 -565 -145
8081 -145 648 -300 -180 -776 -186 1216 429 199 206 139 -385 924 65 -134 270 -496 883 784 160 -383
8101 -383 441 909 -602 66 -458 225 -36 -1207 218 -375 -28 628 -104 -1065 -129 543 -183 181 -744
8120 -744 -417 -436 -713 231 -13 -125 110 -246 -501 -695 -224 -106 139 489 -113 161 180 -502 460 661 -267
8141 -267 -282 -388 117 1050 -887 645 -1111 455 -341 -16 559 -103 -672 751 -1389 -236 -32 463
8159D63J67j47j37r73Q13m30nl78J050k27j03J198j249O99l27J81o12N80k81P30
8179A012k81j41m16m01O63R8L93j217L90k55k33m39
$$ plain form
8159 463 630 483 346 -627 186 -244 -249 -627 423 196 93 1291 42 741 414 595 -17 563 282 1012
8179 1012 731 590 174 -227 436 534 927 -290 100 -155 -388 -827
8191h27
$$ Imaginary data points
##PAGE= N=2
##DATA TABLE= (X++(I..I)), XYDATA
0@%%%%%%%%%%%%%%%%n1J59k16K16k16K16k85L93m32M45n53O49p57Q68r76J175
32F35j306J433j630J848k081K346k644K947l276L649m044M479m957N472o042O664
48C493p342Q092q917R815j0810J1920j3160J4560j6145J7962k0056K2511k5452
61a3529K9019l3455L9175m6843N7694p4311J03359j68615N83291P2553n93035
72d4697L85589k44126K64871k287l58045N0059K18244j33595Q7625k35926J3870
83A582K41133j42666M4596j24189k2320J43255l2077r5327p5212N4248j237R0172
95H1958k03129L4387O2929l2706P3266j09649R407M8425l472j7085N5533j41309
107a41445P2851N4270j31129J69027j81430N4474J18848r8955M7263j3627J1646
$$ plain form
0 0 0 0 0 0 0 0 0 0 0 0 0 0 0 0 0 0 -51 108 -108 108 -108 108 -177 216 -216 229 -324 325 -432 436 -540 635
32 635 -671 762 -868 980 -1101 1245 -1399 1548 -1728 1921 -2123 2356 -2601 2871 -3171 3493
48 3493 -3849 4243 -4674 5141 -5669 6251 -6909 7651 -8494 9468 -10588 11923 -13529
61 -13529 15490 -17965 21210 -25633 32061 -42250 61109 -107506 475785 548338 -44697
72 -44697 340892 96766 361637 359350 1305 51364 269608 136013 223638 -12288 1582
83 1582 242715 100049 144645 20456 -1864 141391 109314 13987 -61225 -6977 -8214 81958
95 81958 -121171 -86784 -23855 -56561 16705 -92944 -83537 -35112 -38584 -55669 -136 -141445
107 -141445 -68594 -14324 -145453 23574 -157856 -103382 15466 -83489 -36226 -49853 -38207
118c8207O4931j797o0605R9180j07799O8696M4457j08621Q9715j14902N7761M6588
130C9397l9591o0793J8927O4840K30Q893j14579J09152Q198K266j0574o9198P4788
143C1956L0574q987o7715M0652m5896J13357j8346j14461R3705m8428R5419m2673
155E9157q9092L8656N3754k787l6693m3260j5022J17988r7056L5217k7761l3294
167d0193J04455n5442J2547l7041K4105J7231L8309o0503l2764M1952r574O2370
179F5452j25717J7892L6509k109o300m5443K987J3950N6138r1438M6649k7908
191e9338J5065N7350p4868M3496l6448L3918J9684r404l0515L8936M481j0879
203h522M3957q7924R0811k0715r496K8306m3094K8892j0861K3074k2823J8845
$$ plain form
118 -38207 26724 24927 -35678 63502 -44297 24399 68856 -39765 49950 -64952 -7191 39397
130 39397 -194 -60987 -42060 22780 23010 31903 -82676 26476 34674 36940 26366 -42832 31956
143 31956 62530 53543 -14172 26480 -19416 93941 75595 -38866 54839 6411 101830 59157
155 59157 -29935 8721 62475 59688 22995 -20265 -35287 82701 -14355 20862 -6899 -40193
167 -40193 64262 8820 21367 -15674 8431 25662 63971 3468 -29296 12656 3082 65452
179 65452 -60265 -42373 -5864 -7973 -14273 -59716 -56729 -42779 13359 -78079 -31430 -59338
191 -59338 -44273 13077 -61791 -18295 -54743 -20825 -1141 -10545 -41060 -2124 2357 -8522
203 -8522 35435 -52489 38322 17607 8111 36417 -6677 22215 11354 34428 11605 30450
215C0450m4711M8478k318l5534M4686o4881P3489j8615k6136O554K4087o069j0903
228A8577J8887m4312O8244o3191K4779O400k6526M0216n6278K7973J575J908l5919
241a7667L7924l1696J1756L2277q0024O6611l3700K4866n668l1560J2480J3341
253a060J9023l8605J2147l4999P7311m0599k8135L1585l1999O1689l9569j6522
265b9733o352M7326j9835m039o278k6730O8914m3015K9228m1814R813M5782k6165
278b898J638j9698K8254o791L9581o6612J9551L0595k6202L7570n5862L8047q457
291H716J0900j0721m741N770L693J7782m6301N4717n0935L0065R707l7024L6092
304B7720k5589J3023j5908K4625k4792K2060k1797j114L2537m8711M8250n0386
$$ plain form
215 30450 -14261 34217 31899 -3635 41051 -23830 49659 31044 4908 11462 35549 29480 18577
228 18577 37464 -6848 61396 -1795 22984 29384 2858 43074 -13204 14769 16344 18252 -17667
241 -17667 20257 -11439 317 32594 -47430 19181 -14519 10347 4679 -26881 -14401 -1060
253 -1060 17963 -20642 -8495 -43494 33817 -6782 -34917 -3332 -35331 26358 -13211 -29733
265 -29733 -36085 11241 -8594 -12633 -18911 -45641 23273 -19742 9486 -32328 -22515 23267 -2898
278 -2898 -1260 -20958 7296 505 40086 -26526 -6975 23620 -2582 34988 -20874 17173 8716
291 8716 19616 8895 4154 9924 13617 31399 -14902 39815 -11120 18945 28652 -8372 27720
304 27720 2131 15154 -754 23871 -921 21139 -658 -1772 30765 -17946 30304 -20082
316b0082K9154J1793k6761J831J840J0036j4630K7392n8366M6434j2325n873J8308
329H751m7841M2378k0255J3902j6946l528q875L2097o626l8936M2756m4966N6820
342H731j7507k3029J7287m415K6757j6623K108k3478M6822k3785J6587j8159k7637
355c6341O9553l9954J7550k7098M639K0864J1486k3353j5696L3314j9702M2164
367C7426n5821J8265J3846q395L3447m5111J2793L780L0180k6304R837k0966J2349
380A5326M1986n4486K2262k5069L4688k555k5308l078J853K0161k0179J4505m4093
393b3987M6891j4472j1978K3603l8760L5062j3662N922j8535J5466q757J0099
405F892k946k5457L9730m0406L4077k2519j318J9803k5248P365l126J7758l5006
$$ plain form
316 -20082 9072 20865 -5896 -4065 -2225 7811 -6819 20573 -37793 8641 -3684 -9557 8751
329 8751 -39090 3288 -16967 -3065 -20011 -23539 -32414 -317 -6943 -45879 -3123 -48089 8731
342 8731 -8776 -31805 -14518 -18933 7824 -8799 -6691 -30169 16653 -7132 9455 -8704 -36341
355 -36341 33212 -6742 10808 -16290 -11651 9213 20699 -2654 -18350 14964 -4738 37426
367 37426 -18395 -130 13716 5321 38768 -6343 6450 10230 40410 14106 23943 2977 15326
380 15326 57312 2826 25088 19 34707 32152 6844 3766 5619 25780 5601 20106 -23987
393 -23987 22904 8432 -3546 20057 -18703 16359 2697 8619 -9916 5550 -3207 6892
405 6892 3946 -21511 18219 -22187 11890 -10629 -11947 7856 -17392 -10027 -13153 4605 -30401
418c0401K9033k2535J6808N070l0248L4711j8439K7551k1725Q376M725J1952o695
431H183n380K7224l8165M3479k6595N652R561j7920J7102r018Q477k1691K6183
444B7092j5613J8368j9094l409K9890l4910L8375l0923J1690L301k804Q49j199
457B1613O216k1011L7674l2032J2686j4378O571J7427l3558J7844j8532K0982
469B1502j6337K024k0206K0958O499l9525L8113l1364K2146q716k067P267p416
482g122N875p236J8676k4220K5523l0440K3527L609l7897L9727k5296J3330j1145
495a3089K287o870J0820n043j0808K3713l0951L0478k2302J7022k044j2378K6737
508G572j3290R316j4475K8347j8303J9930r822r640L7785l2767J7814j4013J8791
$$ plain form
418 -30401 -1368 -23903 -7095 -2025 -32273 2438 -16001 11550 -10175 -1799 2926 14878 8183
431 8183 2803 30027 -8138 35341 8746 14398 23959 6039 23141 14123 22600 909 27092
444 27092 11479 29847 10753 7344 37234 2324 40699 9776 21466 24767 21963 22812 21613
457 21613 27829 6818 44492 12460 25146 10768 17339 34766 1208 19052 520 21502
469 21502 5165 7189 -13017 7941 14440 -25085 13028 -18336 3810 -4906 -6973 294 -7122
482 -7122 -1247 -8483 10193 -14027 11496 -18944 4583 8192 -29705 10022 -15274 -1944 -13089
495 -13089 -10802 -17672 -6852 -11895 -22703 1010 -29941 537 -21765 -4743 -6787 -19165 7572
508 7572 -5718 3598 -10877 17470 -833 19097 9275 -365 37420 4653 22467 8454 27245
521B7245p763n258J123K887L617k1300L2739l6757K8523j3574q757L0576k9999
534C302J2629o488J6908j7353O205j0861J6660K268l1724L0473k8046L2097k0073
547E997j2407J4381k272l61j4951J4918k5553L3842k1854l023P367j6495L1234
560A0823k4419N106q365J9743n481O53j3185M177L6722m6970K3897j6446J7387
573C642P924k7028J1645J43J3680k1311J0787j2742K9011j7034r517K4099k8280
586a4981L4332j9483P416l627N568K733j639P749k2745L4346k0984J3098j6068
599E715J438K2957k3497Q377j3270J6863j0313J0361k1649Q726J5883k9261K7073
612A9403k8744J7645n638K016K733j3770Q675r61J4570k7000K1580j9110J8628
$$ plain form
521 27245 19482 14224 15347 18234 21851 551 33290 -3467 25056 11482 2725 33301 3302
534 3302 15931 9443 26351 8998 15203 4342 21002 23270 -8454 22019 -6027 26070 5997
547 5997 -6410 7971 5699 5338 -9613 5305 -20248 13594 -8260 -11283 -3916 -20411 10823
560 10823 -13596 -8490 -16855 2888 -2593 -1940 -15125 -10948 25774 -21196 2701 -13745 3642
573 3642 11566 -15462 -3817 -3674 10006 -11305 -518 -13260 15751 -1283 -10800 13299 -14981
586 -14981 19351 -132 7284 3657 9225 11958 10319 18068 -4677 29669 8685 21783 5715
599 5715 7153 30110 6613 14990 1720 18583 8270 18631 -3018 5708 21591 -7670 19403
612 19403 -9341 8304 2666 4682 7415 -6355 2320 1359 15929 -11071 10509 -8601 10027
625A0027Q38l1658K7705j3845J3483k1092Q395l361L287l364j0121J9931k2406
638b2181K2056k4295J8128K637j5222J1055l686J1596j9234K0896k0692J9265
650C23k190j1896J9349k0186K4248j5869J1125n860K58N368L501r2j9927L2503
664B0655k5178K0243j1411p802K0779j2090J1521j6210J5563j0826J2821n555
676A2510P65J690j5899L0827k6412J2764j3617M397Q744n065o109j2679L0792
689B2708k2957J2181j8987R013R571j4610J2037k1416J6742p015N366j2725P008
702c084l316l551K0398l3326K1583j3356J1054M57j2567Q682r349J6191j4959
715a5143J0931j5868J6802m232m033J4362k7630K4894n110P551j3296K973L594
$$ plain form
625 10027 10865 -20793 6912 -6933 6550 -14542 -6147 -9508 -6221 -9585 -19706 225 -22181
638 -22181 -125 -24420 -6292 -3655 -18877 -7822 -11508 88 -19146 1750 -18942 323
650 323 -1867 -13763 5586 -14600 9648 -6221 4904 -956 -698 4670 8171 8079 -11848 20655
664 20655 -4523 15720 4309 -3493 17286 5196 16717 507 16070 5244 18065 12510
676 12510 13275 14965 -934 29893 3481 16245 2628 7025 15769 10704 4595 -8084 22708
689 22708 -249 11932 -7055 1958 11529 -3081 8956 -12460 4282 -2733 2633 -10092 -3084
702 -3084 -6400 -9951 10447 -22879 -1296 -14652 -3598 -3141 -15708 -7026 -16375 -184 -15143
715 -15143 -4212 -20080 -3278 -7510 -11543 2819 -24811 83 -5027 2524 -10772 -7799 -4205
728d205L358J0755k7484K2523j1178J8690j2047q160J4259o886J4909j4125P792
741H201j3201K2322j0356o97N507j9684K9431j6875R621j5240P161P881l354J73
755A0890j3415J8821j3789K0559k4427M084J0987j1183J2636j9933J0452q446
767b764J6040j2679q61M53l909J7120k6252J8460j5142R318J528q821M634q372
781a1247R874j6281K0088k0403R200j883m273J6164k3290J6207j2495J6374n554
794g519k195n574O289J3536j9540J8526k2815K0491j094n475M549j1230K1061
807I010j0112Q603j7463J5297k865M547L045k2752K7363j5951J5812j1531q96
820B107K835K971O492j5280J3502j6363K5365j4126J269n11q863K5550j8943M351
$$ plain form
728 -4205 -847 9908 -17576 4947 -6231 12459 412 -7748 6511 -375 14534 409 8201
741 8201 -5000 17322 6966 6269 11776 -7908 21523 4648 14269 -971 6190 14071 10717 10890
755 10890 -2525 16296 2507 23066 -1361 2723 13710 2527 15163 -4770 5682 -2764
767 -2764 13276 597 -264 189 -3720 13400 -12852 5608 -9534 -216 1312 -7509 -2875 -11247
781 -11247 -1373 -17654 2434 -17969 -8769 -10652 -14925 1239 -22051 -5844 -18339 -1965 -7519
794 -7519 -9714 -15288 -8999 4537 -15003 3523 -19292 1199 105 -5370 -821 -12051 9010
807 9010 -1102 7501 -9962 5335 2470 7017 10062 -12690 14673 -1278 14534 3003 2107
820 2107 4942 7913 14405 -875 12627 -3736 21629 7503 8772 8261 -602 24948 6005 10356
834A0356j0912J4023o108K871q123r381K3819k0665J3529j9868J0428L661o177
847b547M406j3149J2663r511J5107k1180J3259l439q018J5880k1359J6320j2529
860a4097R515q112M994j112o675J0107j0348J8805k2988J5517n772J217J1013
873B064j6601J1101n153J2417j5444J3083q105L586R082j2843J6151j9492J9242
886I088n300L694j779n339P745k620J1221k5800J9800n470N122N21j7405J5172
900H650l491J3619j9528O744l379J2306r04j4203J1133j4027K6157j9051n454
913a428K020N960M930j4417N606j2570K4242j6841k94k729J934J1066k0329J2720
927a30j1873J3066q949K502k805j899J0443j7272K0457j6411R110m390P69M518
$$ plain form
834 10356 -556 13467 7359 10230 2107 -7274 16545 -4120 9409 -10459 -31 3630 -2547
847 -2547 1859 -11290 1373 -8138 6969 -14211 -952 -4391 -12409 3471 -17888 -1568 -14097
860 -14097 -4582 -12694 -7700 -8812 -15487 -5380 -15728 3077 -19911 -4394 -10166 -8949 2064
873 2064 -14537 -3436 -8589 3828 -11616 1467 -6638 -3052 6030 -6813 9338 -10154 9088
886 9088 3788 7482 5703 364 8109 5489 16710 -9090 10710 5240 10362 10883 -6522 8650
900 8650 5159 18778 -750 5994 2615 14921 14017 -186 10947 -3080 23077 4026 -1428
913 -1428 592 6552 11482 -2935 2671 -9899 14343 -2498 -2792 -5521 -3587 7479 -12850 -130
927 -130 -12003 1063 -7886 -5384 -8189 -10088 355 -16917 3540 -12871 -3761 -8151 -7382 -2864
941b864q139J1498j3192J1346j2852J6044j1939J210P082j2390K1907k0603J0821
954b071n248J0924m432m481O444p057J7448j8438J3845j1592R066M516j0923R000
968G001j0942J4790p794J0307j8361Q715J0511j0370R406k2668K1935o360L291
981I461q532k792J2318o002M522j8314K0445j3629R035m599q172J4328j4024J3632
995G677j5289R672r301O788j756o275P018j2465K0246k1488J0686m420p97N028
1009d676o703Q396j0529J3367j6803J5661n685k239O534j1043J7759j7938J0982
1022b917n788O833l208j232N052p606J5788k0438J8378q722J326L674n956J1954
1036G138j2498J1256q074J2440j0389M093K000m797J5197k0405J4107n580N062
$$ plain form
941 -2864 -11003 495 -12697 -1351 -14203 1841 -10098 -8888 -1806 -14196 7711 -12892 -2071
954 -2071 -7319 3605 -827 -5308 1136 -5921 11527 -6911 6934 -4658 4408 8924 -1999 7001
968 7001 -3941 10849 3055 13362 -4999 3716 14227 3857 13263 -9405 12530 6170 9461
981 9461 929 -1863 10455 4453 8975 -9339 11106 -2523 6512 1913 -6259 8069 -5955 7677
995 7677 -7612 2060 -7241 -453 -2209 -8484 -1466 -13931 6315 -15173 -4487 -8907 -9704 -4676
1009 -4676 -11379 -2983 -13512 -145 -16948 -1287 -6972 -9211 -2677 -13720 4039 -13899 -2917
1022 -2917 -8705 -1872 -5080 -6312 -1260 -8866 6922 -13516 4862 -3860 -2534 1140 -4816 7138
1036 7138 -5360 5896 -2178 10262 -127 3966 5966 1169 16366 -4039 10068 4488 9550
1049I550m714K68K878m528J0090j5989J6836j3404Q421j519o205J0768j3906J2940
1063A1486r288M324q234J0329m943n703J0012j4933J8005j7893P305l709J747
1076a495L194j3005J2786o604P400j5800J2701n190J53M827j4781J4976r735J0142
1090d31j2217Q074l158K98O334j2286J2112j2386J8596j1216j98M728n531J3456
1104F175j2159N181q121J7527j0415O36L521m531J3962j6298J2426j0364J0740
1117H280j347m650N622l783P970j1641J3044j3991J0937k7p633O073j0576J6640
1131A4918j2581O571r305O807R47o559L807r796J9288j6488M104l877K581M056
1145D473r436N536r667J6365j3858M095m875K484O229j0683J0294j5664J4396
$$ plain form
1049 9550 4836 5104 7982 3454 13544 -2445 14391 987 9408 7889 1684 12452 -1454 11486
1063 11486 2198 6522 -1712 8617 3674 -2029 7983 -6950 11055 -6838 467 -3242 -1495
1076 -1495 1699 -11306 1480 -5124 2276 -13524 -823 -6013 -5860 -1033 -15814 -838 -10573 -431
1090 -431 -12648 -4574 -7732 -7434 -1100 -13386 -1274 -13660 4936 -6280 -6478 -1750 -7281 6175
1104 6175 -5984 -803 -8924 8603 -1812 -1176 2345 -2186 11776 -4522 7904 -2460 8280
1117 8280 6933 2283 7905 4122 12092 451 13495 -496 10441 10414 2781 8854 -1722 14918
1131 14918 2337 8908 -397 6410 7357 798 4605 -5191 14097 -2391 1713 -2164 417 4473
1145 4473 -4963 573 -9094 7271 -6587 -2492 -7367 -4883 1346 -9337 957 -14707 -311
1158c11n906K729o132J044P214p686R652j7190J4693l690L562m335n815J3118
1172I47q719Q974j2525J1333n301O329r60r375J3095r441J3295j1317M181k456
1186a940M908M794j0482P890q460J7397j3841M827j492k00R702j2823Q836p312
1200A804J1178r997N787k657l248J1398j4143J2558j3335J0084n043J192J519
1213G097o489Q270r249J0925j5549R840m457K30L385r444R153j0018R092r169
1227f383M994l229Q28K890r035J0641j4305J4501q945N46K148l694O973r294Q070
1242c294q252J2168j0328L110L031m333R658j2835J1973p811P036m133K13L036
1256g61k476Q796j3985J5404j0095P560j878l495P025o119R862j1634Q416m206
$$ plain form
1158 -311 -6217 -3488 -9620 -8576 -1362 -9048 604 -16586 -1893 -5583 -2021 -6356 -12171 947
1172 947 -7772 1202 -11323 10 -5291 1038 78 -9297 3798 -5643 7652 -3665 516 -1940
1186 -1940 2968 7762 -2720 5170 -3290 14107 266 5093 3601 3401 13103 280 9116 1804
1200 1804 12982 2985 8772 6115 2867 14265 122 12680 -655 9429 4386 5578 7097
1213 7097 608 8878 -371 10554 -4995 4845 388 618 4003 -5441 3712 -6306 2786 -6383
1227 -6383 -1389 -4618 -3790 -900 -9935 706 -13599 902 -8043 -7497 -5349 -9043 -2070 -11364 -3294
1242 -3294 -11546 622 -9706 -6596 -3565 -7898 1760 -11075 898 -6913 123 -4010 -3797 -761
1256 -761 -3237 5559 -8426 6978 -3117 4443 2565 -930 6095 -24 9838 -1796 6620 2414
1270B414O988l809l863Q092j0442J5292j4019O365k930K553K089o441O822r161
1284e0J0979j0449O480p518K790N642r845R568j3314R363l196M595q125n75O429
1299B774o645R274j7810J2460l298L610m929p458J1126n481O152j2267O681k660
1313h471P290j776j1447J2745p068J2655j2030K805k86M947L488j0511O337o638
1327g960J4572j2287N766j859j511R645r412O586q140J0931n109M406m531k509
$$ plain form
1270 2414 9402 5593 1730 9822 -620 14672 653 7018 4088 6641 8730 2289 9111 -50
1284 -50 10929 480 6960 -558 2232 7874 -1971 7597 -5717 3646 450 5045 -3080 -3655 2774
1299 2774 -3871 5403 -12407 53 -3245 365 -4564 -12022 -896 -6377 -225 -12492 -5811 -8471
1313 -8471 -1181 -2957 -14404 -1659 -8727 3928 -8102 -5297 -5583 -636 2852 -7659 -1322 -7960
1327 -7960 6612 -5675 91 -1768 -3279 6366 -3046 3540 -4600 6331 1222 5628 1097 -1412
$$ [...]
8191h62
##END NTUPLES=NMR FID
##END=
