##TITLE=1H_SA_Sl.Me.1
 CDCl3, 8 sc, 
 26.8.2020
##JCAMPDX= 6.0         $$ Bruker NMR JCAMP-DX V2.0
##DATA TYPE= NMR FID
##DATA CLASS= NTUPLES
##ORIGIN= UXNMR, Bruker Analytische Messtechnik GmbH
##OWNER= root
$$ XWIN-NMR		Version 3.5
$$ Thu Aug 27 11:02:23 2020 Russian Standard Time (UT+4h)  she@DPX200
##.OBSERVE FREQUENCY= 200.1315066352
##.OBSERVE NUCLEUS= ^1H
##.DELAY= (6, 6)
##.ACQUISITION MODE= SIMULTANEOUS
##.ACQUISITION SCHEME= undefined
##.AVERAGES= 8
##.DIGITISER RES= 18
##SPECTROMETER/DATA SYSTEM= spect
##.PULSE SEQUENCE= zg30
##.SOLVENT NAME= CDCl3
##.SHIFT REFERENCE= (INTERNAL, CDCl3, 0, 15.7039)
##AUDIT TRAIL= $$ (NUMBER, WHEN, WHO, WHERE, WHAT)
$$ ##TITLE= Audit trail, XWIN-NMR		Version 3.5
$$ ##JCAMPDX= 5.01
$$ ##ORIGIN= Bruker BioSpin GmbH
$$ ##OWNER= she
$$ F:/spectra/data/she/nmr/H-F/1/audita.txt
$$ ##AUDIT TRAIL=  $$ (NUMBER, WHEN, WHO, WHERE, WHAT)
(   1,<2020-08-27 11:00:44.07 +0400>,<she>,<DPX200>,
      <created by zg, POWCHK disabled, PULCHK disabled
       configuration hash MD5:
       00 E9 B6 7A A2 85 ED C7 34 08 36 98 17 FE 4E 26
       data hash MD5: 16K
       EC 68 C9 46 5E B6 55 6E 5E 77 8F DA 10 8D 12 15>)
$$ ##END=
$$ 
$$ hash MD5
$$ 67 53 22 74 A6 8B CC AE A5 9C B4 E2 11 76 F2 CB
##$RELAX= 
##$RELAX= 
##$RELAX= 
##$RELAX= 
##$RELAX= 
##$RELAX= 
$$ Bruker specific parameters
$$ --------------------------
##$DU= <F:/spectra>
##$EXPNO= 1
##$NAME= <H-F>
##$PROCNO= 1
##$TYPE= <nmr>
##$USER= <she>
##$AMP= (0..31)
100 100 100 100 100 100 100 100 100 100 100 100 100 100 100 100 100 100 
100 100 100 100 100 100 100 100 100 100 100 100 100 100 
##$AQSEQ= 0
##$AQ_mod= 1
##$AUNM= <au_zg>
##$AUTOPOS= <>
##$BF1= 200.13
##$BF2= 200.13
##$BF3= 200.13
##$BF4= 200.13
##$BF5= 200.13
##$BF6= 200.13
##$BF7= 200.13
##$BF8= 200.13
##$BYTORDA= 1
##$CFDGTYP= 0
##$CFRGTYP= 5
##$CHEMSTR= <none>
##$CNST= (0..31)
1 1 145 1 1 1 1 1 1 1 1 1 1 1 1 1 1 1 1 1 1 1 1 1 1 1 1 1 1 1 1 1 
##$CPDPRG= <>
##$CPDPRG1= <>
##$CPDPRG2= <>
##$CPDPRG3= <>
##$CPDPRG4= <mlev>
##$CPDPRG5= <mlev>
##$CPDPRG6= <mlev>
##$CPDPRG7= <mlev>
##$CPDPRG8= <mlev>
##$CPDPRGB= <>
##$CPDPRGT= <>
##$D= (0..31)
0 1.2 0 0 0 0 0 0 0 0.06 0 0.03 0 0 0 0 0.0002 0 0 0 0 0 0 0 0 0 0 0 0 
0 0 0 
##$DATE= 1598511643
##$DBL= (0..7)
120 120 120 120 120 120 120 120 
##$DBP= (0..7)
150 150 150 150 150 150 150 150 
##$DBP07= 0
##$DBPNAM0= <>
##$DBPNAM1= <>
##$DBPNAM2= <>
##$DBPNAM3= <>
##$DBPNAM4= <>
##$DBPNAM5= <>
##$DBPNAM6= <>
##$DBPNAM7= <>
##$DBPOAL= (0..7)
0.5 0.5 0.5 0.5 0.5 0.5 0.5 0.5 
##$DBPOFFS= (0..7)
0 0 0 0 0 0 0 0 
##$DE= 6
##$DECBNUC= <off>
##$DECIM= 32
##$DECNUC= <off>
##$DECSTAT= 4
##$DIGMOD= 1
##$DIGTYP= 9
##$DL= (0..7)
0 120 120 120 120 120 120 120 
##$DP= (0..7)
150 150 150 150 150 150 150 150 
##$DP07= 0
##$DPNAME0= <>
##$DPNAME1= <>
##$DPNAME2= <>
##$DPNAME3= <>
##$DPNAME4= <>
##$DPNAME5= <>
##$DPNAME6= <>
##$DPNAME7= <>
##$DPOAL= (0..7)
0.5 0.5 0.5 0.5 0.5 0.5 0.5 0.5 
##$DPOFFS= (0..7)
0 0 0 0 0 0 0 0 
##$DQDMODE= 0
##$DR= 18
##$DS= 0
##$DSLIST= <SSSSSSSSSSSSSSS>
$$ [...]
##$SUBNAM2= <"">
##$SUBNAM3= <"">
##$SUBNAM4= <"">
##$SUBNAM5= <"">
##$SUBNAM6= <"">
##$SUBNAM7= <"">
##$SUBNAM8= <"">
##$SUBNAM9= <"">
##$SW= 16.880792210976
##$SWIBOX= (0..15)
0 0 2 0 0 0 0 0 0 0 0 0 0 0 0 0 
##$SW_h= 3378.37837837838
##$TD= 16384
##$TD0= 1
##$TE= 0
##$TE2= 300
##$TE3= 300
##$TEG= 300
##$TL= (0..7)
0 120 120 120 120 120 120 120 
##$TP= (0..7)
150 150 150 150 150 150 150 150 
##$TP07= 0
##$TPNAME0= <>
##$TPNAME1= <>
##$TPNAME2= <>
##$TPNAME3= <>
##$TPNAME4= <>
##$TPNAME5= <>
##$TPNAME6= <>
##$TPNAME7= <>
##$TPOAL= (0..7)
0.5 0.5 0.5 0.5 0.5 0.5 0.5 0.5 
##$TPOFFS= (0..7)
0 0 0 0 0 0 0 0 
##$TUNHIN= 0
##$TUNHOUT= 0
##$TUNXOUT= 0
##$USERA1= <user>
##$USERA2= <user>
##$USERA3= <user>
##$USERA4= <user>
##$USERA5= <user>
##$V9= 5
##$VALIST= <valist>
##$VCLIST= <CCCCCCCCCCCCCCC>
##$VD= 0
##$VDLIST= <DDDDDDDDDDDDDDD>
##$VPLIST= <PPPPPPPPPPPPPPP>
##$VTLIST= <TTTTTTTTTTTTTTT>
##$WBST= 1024
##$WBSW= 4
##$XGAIN= (0..3)
0 0 0 0 
##$XL= 0
##$YL= 0
##$YMAX_a= 618085
##$YMIN_a= -507000
##$ZGOPTNS= <>
##$ZL1= 120
##$ZL2= 120
##$ZL3= 120
##$ZL4= 120
##$ABSF1= 10
##$ABSF2= 0
##$ABSG= 5
##$ABSL= 3
##$ALPHA= 0
##$AQORDER= 0
##$ASSFAC= 0
##$ASSFACI= 0
##$ASSFACX= 0
##$ASSWID= 0
##$AUNMP= <proc_1d>
##$AZFE= 0.1
##$AZFW= 0.1
##$BCFW= 1
##$BC_mod= 2
##$BYTORDP= 1
##$COROFFS= 0
##$CY= 11.3945322036743
##$DATMOD= 1
##$DC= 2
##$DFILT= <>
##$DTYPP= 0
##$F1P= 16.9975609425685
##$F2P= -3.02152046262296
##$FCOR= 0.5
##$FTSIZE= 0
##$FT_mod= 4
##$GAMMA= 1
##$GB= 0.15
##$INTBC= 1
##$INTSCL= 1
##$ISEN= 128
##$LB= 0.24
##$LEV0= 0
##$LPBIN= 0
##$MAXI= 10000
##$MC2= 0
##$MEAN= 0
##$ME_mod= 0
##$MI= 1.114404
##$NCOEF= 0
##$NC_proc= 0
##$NLEV= 6
##$NOISF1= 3.799351
##$NOISF2= 2.8
##$NSP= 1
##$NTH_PI= 0
##$NZP= 0
##$OFFSET= 15.70392
##$PC= 1
##$PHC0= -9971.146
##$PHC1= 9.20092
##$PH_mod= 1
##$PKNL= yes
##$PPARMOD= 0
##$PSCAL= 0
##$PSIGN= 0
##$REVERSE= no
##$SF= 200.130013532006
##$SI= 16384
##$SIGF1= 3
##$SIGF2= 2
##$SINO= 400
##$SIOLD= 16384
##$SREGLST= <1H.CDCl3>
##$SSB= 0
##$STSI= 0
##$STSR= 0
##$SW_p= 3612.71676300578
##$SYMM= 0
##$S_DEV= 0
##$TDeff= 0
##$TDoff= 0
##$TI= <>
##$TILT= no
##$TM1= 0
##$TM2= 0
##$TOPLEV= 0
##$USERP1= <user>
##$USERP2= <user>
##$USERP3= <user>
##$USERP4= <user>
##$USERP5= <user>
##$WDW= 1
##$XDIM= 8192
##$YMAX_p= 0
##$YMIN_p= 0
$$ End of Bruker specific parameters
$$ ---------------------------------
##NTUPLES= NMR FID
##VAR_NAME=  TIME,          FID/REAL,        FID/IMAG
##SYMBOL=    X,             R,               I
##VAR_TYPE=  INDEPENDENT,   DEPENDENT,       DEPENDENT
##VAR_FORM=  AFFN,          ASDF,            ASDF
##VAR_DIM=   8192,          8192,            8192
##UNITS=     SECONDS,       ARBITRARY UNITS, ARBITRARY UNITS
##FACTOR=    0.000296,      1,               1
##FIRST=     0,             0,               0
##LAST=      2.424536,      0,               0
##MIN=       0,             -507000,         0
##MAX=       2.424536,      618085,          0
$$ Real data points
##PAGE= N=1
##DATA TABLE= (X++(R..R)), XYDATA
$$ [...]
2557D471n280n591K949O691j81n862l679M605N778k029o360j284N707M115l978
$$ 4471 -809 -6400 -3451 3240 3059 -2803 -6482 -1877 3901 1872 -4488 -5772 -65 4050 72
2572G2n756J686N609J547n198l551K867N034l36n664j513M039L971k215m788K19
$$ 72 -5684 -3998 1611 3158 -2040 -5591 -2724 2310 1974 -3690 -5203 -1164 2807 592 -4196 -3977
2588c977M414K453l766l499J688M535M77m121j944K422L840j637l668m95K996
$$ -3977 437 2890 -876 -4375 -2687 1848 2325 -1796 -3740 -1318 2522 885 -2783 -3278 -282
2603b82K209k359k845P38L274M97k818j690J548K702o45k400o46K301J092j284
$$ -282 1927 -432 -3277 -2539 735 1232 -1586 -3276 -1728 974 329 -2071 -2717 -416 676 -608
2619f08j771J77J834L53j345j412J519P50J00j242m25R05J57k5n98K04M51O1k68
$$ -608 -2379 -2202 -368 -15 -1360 -2772 -1253 -503 -403 -1645 -2070 -1165 -1008 -1033 -1631 -1427 -976 -915 -1183
2638a183N1O4m84K08j21N32n95o38M28P37l14j075o11Q41J622r31j559j70J775
$$ -1183 -1132 -1068 -1552 -1344 -1465 -933 -1528 -2166 -1738 -1001 -1315 -2390 -3001 -2160 -538 -1469 -3028 -3198 -1423
2657a423J473j618j692O86K672M35k637j605K179K979j030l077r73L635K299j859
$$ -1423 50 -1568 -3260 -2574 98 533 -2104 -3709 -1530 1449 419 -2658 -3631 4 2303 444
2673D44l442L53M508J488l412l249K350M551L33m982k393L955M043j603n690p02
$$ 444 -2998 -2645 1863 3351 -61 -3310 -960 3591 3924 -1058 -3451 504 4547 2944 -2746 -3448
2689c448N015L071l367n784J444N572J952n827l972L567N660l86o404k250M888
$$ -3448 1567 4638 1271 -4513 -3069 2503 4455 -1372 -5344 -1777 3883 3497 -2907 -5157 -269
2704b69N289l079o173n61O197L666m758n050J273O875J308n227l911L613O150
$$ -269 5020 1941 -4232 -4793 1404 5070 312 -4738 -3465 3410 4718 -509 -4420 -807 5343
2719E343n02n810k703N328M830k053o101m69N801K639l513m859Q77N264K010m456
$$ 5343 4841 -969 -3672 1656 6486 4433 -1668 -2137 3664 6303 2790 -2069 -1192 4072 6082 1626
2735A626m217K403N055Q18n116k832L173L850m72m538j601K787L350j515l713
$$ 1626 -2591 -188 4867 5685 569 -2263 910 4760 4288 -250 -1851 936 4286 2771 -942
2750i42j311L034K560j415l082j169L558J614j240l016k86K987K143j693l445
$$ -942 -2253 781 3341 1926 -1156 -2325 1233 2847 1607 -1409 -1695 1292 3435 1742 -1703
2765a703O4K984K097k052l780q0L698K306k748l889L76M645J625l309m048J417
$$ -1703 -1639 1345 3442 1390 -2390 -2470 1228 3534 786 -3103 -2727 1918 3543 234 -3814 -2397
2781b397N249J175m929m289L346N808k16n762l744M878N513j337p303j800O265
$$ -2397 2852 4027 -902 -5191 -1845 3963 3747 -2015 -5759 -881 4632 3295 -4008 -5808 457
2796D57M974l398p390L19P384L894n928o554K487Q283J262p604n208M455Q287
$$ 457 5431 2033 -5357 -5038 2346 6240 312 -6242 -3755 4528 5790 -1814 -7022 -2567 5720
2811E720r75q382l774O749P079l315q771j245Q226M902n234p941J039Q852K914
$$ 5720 4745 -3637 -7411 -662 6417 3102 -5669 -6914 1312 6214 980 -6961 -5922 2930 5844
2826E844p062o557L404Q300O02p820n175N685P366j424q469k459O582O152l518
$$ 5844 -1218 -7775 -4371 3929 4531 -3289 -8464 -2779 4587 3163 -5306 -7765 -1183 4969 1451
2841A451p786k61O835M944n551n870Q47P034K575n400n040K393O287J100n368
$$ 1451 -6335 -6596 239 5183 -368 -6238 -5391 1643 4218 -1182 -6222 -3829 2458 3558 -1810
2856a810l808L106N568j26m967l076L880M684r04m861k143L570M617j623m899
$$ -1810 -5618 -2512 3056 2930 -2037 -5113 -1233 3451 2547 -2314 -4457 -887 3730 2107 -2792
2871b792j423M054L832j900m971r09L744M303k773n301l03M614L521l307n398
$$ -2792 -4215 -161 3671 1771 -3200 -4109 -365 3938 1165 -4136 -4439 175 3696 389 -5009
2886e009j83O319K639m405n578J464O550K173n850n089K804P064N87o855m415
$$ -5009 -5192 1127 3766 -639 -6217 -4753 1797 3970 -1880 -6969 -4165 2899 3486 -3369 -7784
2901g784M741P107j109q067k869O566O587k993q350r51Q045N194n286p678J264
$$ -7784 -3043 4064 2955 -5112 -7981 -1415 5172 2179 -6171 -7122 923 6117 831 -6847 -5583
2916e583Q844L224p474o362L495R159P88q436n274O167Q418j853q895l254Q081
$$ -5583 3261 6485 -989 -7351 -3856 5303 6091 -2345 -7619 -1452 6966 5113 -3782 -7036 1045
2931A045O547m111q687l08Q402M648n783p735K395Q132K243p158n960L723P674
$$ 1045 7592 3481 -5206 -5514 2888 7536 1753 -5982 -3587 4545 6788 -370 -6330 -2607 5067
2946E067J59p694l698N028O413j959o723k124N933N221l318o408m16O027L759
$$ 5067 5226 -2468 -6166 -1138 5275 3316 -3407 -5531 402 5623 2305 -4103 -4519 1508 5267
2961E267m239n485Q89N651K266l898m812J888N284J480m326l576K296M692Q59
$$ 5267 1028 -4457 -3568 2083 4349 451 -4361 -2473 2811 4291 -35 -3611 -1315 3377 4236
2976D236m365l162K462M796j23m108k640K424M225M9m630k844L281M219p04m843
$$ 4236 -129 -3291 -829 3967 3844 -264 -2904 -480 3745 3794 -836 -3680 -399 3820 3116 -1727
2992a727k184M135L756j505n346j221M550L827k566n919n7N356L507m265n769
$$ -1727 -3911 224 3980 2475 -2871 -4092 458 4285 1719 -4200 -4257 1099 4606 341 -5428
3007e428J060O219K735n570m690K497O715R09o435m107M316O771j294o729k901
$$ -5428 -4368 1851 4586 -984 -5674 -3177 3538 4447 -1988 -6095 -1779 4992 3698 -3031 -5932
3022e932N746O009k977p341j184P169M022m559o669J170P067K735n745o138L174
$$ -5932 -186 5823 2846 -4495 -5679 1490 5512 953 -5716 -4546 2521 5256 -489 -6627 -3453
3037c453O862O28o958m010M604O231j519p312j877N453N126l288o307j89O311
$$ -3453 3409 4037 -2921 -6931 -2327 3904 2385 -4927 -6804 -1351 3775 487 -5820 -6009 302
3052C02L174m275n085J388N990J527m614l965K481N274K76m938k797L585M144
$$ 302 3476 -799 -5884 -4496 1494 3021 -1593 -5558 -3077 2197 2473 -2465 -5262 -1677 2467
3067B467q87m397j478M023L002j558l877k5K984K615j899l299L21K753J723j855
$$ 2467 1580 -2817 -4295 -272 2730 1172 -2705 -2730 254 2869 970 -2329 -2008 745 2468 613
3083F13k764K65K714J264j726k128j03K651J261j656k237J04L114R54j547k942
$$ 613 -2151 -1886 828 2092 366 -1762 -1865 786 2047 391 -1846 -1742 1372 2326 779 -2163
3099b163O55K789R79k144l033J055L076P42k908k618J793L355K38l821k011K741
$$ -2163 -1508 1281 2260 116 -2917 -1862 1214 1956 -952 -3570 -1777 1578 1816 -2005 -4016 -1275
3115a275L627j085l931j337L502L306j965m291m28M462K149k993l880R62M734
$$ -1275 2352 1267 -2664 -4001 -499 2807 842 -3449 -3877 585 2734 -259 -4139 -3177 1557
3130A557J371l653l290K629M535rm319j889L513L797j268m970l22L743K804k684
$$ 1557 2928 -725 -4015 -1386 3149 3140 -1179 -3068 445 4242 2974 -1996 -2318 1425 4229 1545
3146A545m209Q32M099J452l670k802J511M033J27l729j605K301L187j210l327
$$ 1545 -2664 -1832 2267 3719 49 -2753 -1242 2791 2918 -811 -2416 -115 3072 1862 -1465
3161a465q40K944J946k183k591J13K734O47j593k237J020K379p2j488j001J359
$$ -1465 -2305 639 2585 402 -2189 -2076 658 1305 -288 -2525 -1505 874 802 -686 -1687 -328
3177c28J305K33j607m19J220P55m76r93J94M33J46k55j35M8O4J88O7L05m89m7
$$ -328 977 1210 -397 -816 404 1159 683 -310 -116 317 463 208 73 121 185 373 440 745 256 209
3197B09j14Q72J73r50m16M85J407m74j491l96J265J073r16j687K07J863N30r04
$$ 209 95 967 1140 190 -226 259 1666 1192 -299 -695 570 1643 727 -960 -753 1110 1640 736
3215G36j867J024K237K24k219j528J850J923k62k550n66J811J707r92l162O35
$$ 736 -1131 -107 2130 2354 135 -1393 457 2380 2118 -432 -998 813 2520 1528 -1634 -999
3231i99K102P92j979j741R61K096L17k306j414J845J843o79k544k00J729J235
$$ -999 1103 1895 -84 -1825 -864 1232 1549 -757 -2171 -326 1517 838 -1706 -1906 -177 1058
3247A058j618j689M41J860N52j851r77O78J713m25j276j82J140P28n41p77J11
$$ 1058 -560 -2249 -1808 52 604 -1247 -2224 -1546 167 -258 -1534 -1716 -576 152 -389 -1166 -1055
3264a055J187k03j76p93N78Q32p08m18M96O00k54q67M62N91J7q98l62J044P75
$$ -1055 132 -71 -247 -1040 -462 370 -338 -756 -260 340 86 -781 -319 272 289 -609 -971 73 848
3283H48p66j136n2J477O09j780j093P75J937n72j627j207J867J822j100k453l62
$$ 848 82 -1054 -1106 371 980 -800 -1893 -1118 819 247 -1380 -2587 -720 1102 2 -2451 -2813
3300b813K435J356j780k269O87K915N77k608j691K023K732l83l100p18K457K021
$$ -2813 -378 978 -802 -3071 -2384 531 1108 -1500 -3191 -1168 1564 1181 -1919 -2637 -180 1841
3316A841j127l079K54L137J206k228k611J236L151O47l041j721J940K986l76l026
$$ 1841 714 -2365 -2111 1026 2232 4 -2607 -1371 1780 2427 -614 -2335 -395 2591 2215 -811
3332h11q36K298K288j638k474m15K816Q64j683k238M83K526J96j625j557Q94K044
$$ -811 -1647 651 2939 1301 -1173 -1588 1228 2092 409 -1829 -1346 1180 1376 -249 -1806 -912 1132
3349A132J13j745j331J589J368j31j692q49J394J087l84j391l63N86J154m96r13
$$ 1132 1245 -500 -1831 -242 1126 995 -697 -1546 -152 935 551 -840 -1203 -617 537 41 -872
3366h72m04M86J500k54m53p37M34J550J76j144j114R11J460oj919j074R91K020
$$ -872 -1276 -790 710 456 3 -734 -300 1250 1426 282 -832 79 1539 1533 -386 -1460 -469 1551
3384A551l03k204r72J465K294o91k660K8K246K133k069k475p7L542J000k811k729
$$ 1551 1248 -956 -1928 -463 1831 1140 -1520 -1492 754 2887 818 -1657 -1734 1808 2808 -3 -2732
3401b732J270L518k7l549j928K335L241n24l602j373L893K662j488m298L50M044
$$ -2732 -1462 2056 2029 -1520 -3448 -1113 2128 1604 -1998 -3371 522 3184 1696 -2602 -2252 1792
3417A792J871k764l675J162L975R40l927k699K255L917o12l784j505L359L335
$$ 1792 3663 899 -2776 -1614 2361 3301 -626 -3325 -1070 2847 2235 -1549 -3054 305 3640
3432C640j574l839l56L631K566k540l536N18L659R82l187k834J245L305l39k621
$$ 3640 2066 -1773 -2129 1502 4068 1528 -2008 -1490 2169 3151 -36 -2870 -1625 1680 1341 -1280
3448a280k045K060K742m64k790q71K526K072p35k769k82J936J429r48k177r3J974
$$ -1280 -3325 -1265 1477 1013 -1777 -2648 -122 1950 1215 -1554 -1836 100 1529 581 -1596 -1689 285
3465B85J061j698j391J44J917J000j091r79j6K232Q69j106j419J04J835P14j144
$$ 285 1346 -352 -1743 -1599 318 1318 227 -752 -768 1464 2333 1227 -192 -88 1747 2461 1317
3482A317k162K57J566Q54j891k171O09K221O78k361j824Q25K643M94k429j958
$$ 1317 -845 -588 978 1832 -59 -2230 -1621 600 1278 -1083 -2907 -2082 561 1055 -1374 -3332
3498c332J907K562o09l185j327K665K196j619l263n84L455J703k049k840N81M039
$$ -3332 -1425 1137 528 -2657 -3984 -1319 877 -742 -4005 -4589 -1134 569 -1480 -4320 -3739 300
3514C00J332k944k648K239L981N74l827j898K800L503j087l932r34L215K557j974
$$ 300 1632 -1312 -3960 -1721 2260 2834 -993 -2891 -91 3412 2325 -1607 -2541 674 3231 1257
3530A257l868L31L940J678k782l281J465L805O45l500k243J932L235j067l215
$$ 1257 -2611 -2280 1660 3338 556 -2725 -1260 2545 3190 -310 -2553 -621 2614 1547 -1668
3545a668j625K650K609j786l191n56K945J701k042k003K95K731J147k084j923
$$ -1668 -3293 -643 1966 180 -3011 -3567 -622 1079 -963 -2966 -2671 60 1207 -877 -2800
3560b800J351K470M01k322j089J744J505o38j606p58J480J512o82j549mJ244J164
$$ -2800 -1449 1021 1422 -900 -1989 -245 1260 622 -984 -1742 -262 1250 568 -981 -985 259 1423
3577A423k20j328j71J432R13n63j088l32Q79O78o9j653m89P61R24j63j977j5J208
$$ 1423 1203 -125 -296 1136 2049 1486 398 66 945 1623 1554 -99 -588 173 1097 934 -1043 -1058 150
3596A50J460q78j489l79J915R40p87k168L56J701R73j788j663O32K070L14k067
$$ 150 1610 732 -757 -1136 779 1719 932 -1236 -880 821 1794 6 -1657 -1025 1045 1359 -708
3613g08j469J364J984l2k358j002K314J824p93k732j5K461J421j910k192R29K684
$$ -708 -2177 -813 1171 1139 -1219 -2221 93 1917 1124 -1608 -1623 838 2259 349 -1843 -914 1770
3630A770K69k536j791J535K423p9k657q45K028K224j329k195m26K587J495j973
$$ 1770 2039 -497 -2288 -753 1670 1591 -1066 -1911 117 2341 1012 -1183 -1609 978 2473 500
3646E00k190O72K643J59k359j501J514J793n41j952p07J748J448j092j895L91
$$ 500 -1690 -1018 1625 1784 -575 -2076 -562 1231 690 -1262 -1969 -221 1227 135 -1760 -1369
3662a369J712Q69j311j247Q82J209L10j335n41J017J025p00j240l7R96Q01o72
$$ -1369 343 1212 -99 -1346 -464 745 1055 -280 -821 196 1221 521 -719 -756 240 1041 369
3679C69o87L78J069k00o05j33J74O08l51n45J28K24n5l07k69J49J99m11J09k56
$$ 369 -318 60 1129 929 324 191 365 973 622 77 205 429 374 67 -202 -53 146 -265 -156 -412
3699d12J16q6k19q9L03J12n18k91L23O32m28l09k29O08J78l60m70M57N71k14m19
$$ -412 -296 -382 -601 -690 -387 -275 -793 -1084 -761 -129 -557 -866 -1095 -487 -309 -669 -1139 -682 -111 -325 -744
3720g44k51N65P33k98o65MR93L52p86o54M62J030n19n73n80R76Q47p28j149L81
$$ -744 -995 -430 303 5 -660 -656 337 689 -97 -751 -289 741 222 -351 -931 45 892 164 -985 -604
3740f04R69j2p76m97L13J057l61j165j00J035M49j178o27J86J589l82j080o85
$$ -604 365 353 -423 -920 -607 450 89 -1076 -1176 -141 308 -870 -1497 -1311 278 -104 -1184 -1869
3758a869R13J234p61j014j69J538N34r20j393Q21J586J32j461p52J516J113l16
$$ -1869 -956 278 -483 -1497 -1666 -128 406 -514 -1907 -1086 500 632 -829 -1581 -65 1048 732
3775G32j928J34J661P33r56j373M32J647N27j989o26J247J416n04j883n03J684
$$ 732 -1196 -1062 599 1332 376 -997 -565 1082 1609 -380 -1006 241 1657 1153 -730 -1233 451
3792D51J556j542j703N30J849L90j700j340Q36J910M2k011p75J176J755q71j787
$$ 451 2007 465 -1238 -708 1141 1531 -169 -1509 -673 1237 1279 -732 -1507 -331 1424 553 -1234
3809a234l61K050Q57j118j737L41K214K39j328j049Q28J285M37j832o22J199J185
$$ -1234 -1595 455 1312 194 -1543 -1202 1012 1251 -77 -1126 -298 987 1424 -408 -1030 169 1354
3826A354l2j496j74J074O21j63j351N5Q04Q61m40j061l8M64J018n95q89m87N96
$$ 1354 1322 -174 -348 726 1347 1184 -167 -112 692 1553 1113 52 14 478 1496 901 12 -475 121
3845A21O81l20q74n52J006Q20m14j213j96R88P44o08j411M4J289O75q84j547M4
$$ 121 802 482 -392 -944 62 882 468 -745 -941 47 791 183 -1228 -1184 105 780 -104 -1651 -1607
3864a607J957O34j614j463O53K126M37j883j399J442K018j99k235j013J962J694
$$ -1607 350 984 -630 -2093 -1440 686 1123 -760 -2159 -717 1301 1102 -1133 -2146 -184 1510
3880A510n61k696k16K617J574j600k740R21K631R94k329k250J374K827J66l100
$$ 1510 949 -1747 -1963 654 2228 628 -2112 -1191 1440 2434 105 -2145 -771 2056 2222 -878
3896h78j778K212K913j249l350k87K623K251k002k729J22K790J593k257k732J087
$$ -878 -2656 -444 2469 1220 -2130 -2417 206 2457 455 -2274 -2152 638 2231 -26 -2758 -1671
3912a671K787L57k551k077J640K871o38k621j146K414K011p97k832q6K386J954
$$ -1671 1116 1473 -1078 -3155 -1515 1356 718 -1903 -3049 -635 1376 579 -2253 -2339 47 2001
3928B001j458k540M74K279J312j741j778M10K335L07j806j536J002J942J53k070
$$ 2001 543 -1997 -1523 756 2068 327 -1451 -1041 1294 1601 -205 -1741 -739 1203 1356 -714
3944g14q35R36J821j09j772r50J337J547r4k074q11J043J557m78k259p68J449
$$ -714 -1549 -613 1208 1099 -673 -1623 -286 1261 1167 -907 -1718 -675 882 404 -1855 -2623 -1174
3961a174J844p62k293k72J582J907j258j959M4K257J491j566j840o2K739J240
$$ -1174 670 -92 -2385 -2657 -1075 832 -426 -2385 -2341 -84 1407 -159 -1999 -2061 678 1918
3977A918j904k430Q95K993L88k238k034J479L016J76l096j374K310K824q67l295
$$ 1918 14 -2416 -1521 1472 1860 -378 -2412 -933 2083 2259 -837 -2211 99 2923 2056 -1239
3993a239p53L052K173j989l509K96L121J310k876k664P77L533M77l398k128K108
$$ -1239 -1992 1060 3233 1244 -2265 -1969 1152 2462 -414 -3078 -2301 1232 1709 -1689 -3817 -1709
4009a709L476k86l414j658K879L050j175l671p44L380K318k089l369L80L693J200
$$ -1709 1767 1481 -1933 -3591 -712 2338 1163 -2508 -3252 128 2446 357 -3012 -2632 1061 2261
4025B261k283k840J216L654M80k378k014K030K723k66k879j053K022K419j011
$$ 2261 -22 -2862 -1646 2008 2488 110 -1904 126 2849 2583 -296 -1349 673 3092 2081
4040B081k436r14K225J861j406k444l87K513J162j219k407N77K379O57j508j774
$$ 2081 -355 -1269 956 2817 1411 -1033 -1420 1093 2255 1036 -1371 -794 1585 2242 734 -1040
4056a040L05K174M84j681j859Q46K053K11k119j536J240K017J84k109j280J576
$$ -1040 -735 1439 1923 242 -1617 -771 1282 1493 -626 -2162 -922 1095 1279 -830 -2110 -534
4072e34K071m62j862q76J612J872o04k220q13K014J839j198k480P9K029J748j458
$$ -534 1537 1075 -787 -1663 -51 1821 1217 -1003 -1816 198 2037 839 -1641 -1562 467 2215 757
4089G57k781M22K553J537k297k315J164L027O12k917j775J404K794k89l172j038
$$ 757 -2024 -1602 951 2488 191 -2124 -960 2067 2679 -238 -2013 -609 2185 1896 -1276 -2314
4105b314K216K614j163l162j034L527J957j795l204L59L401J118k473k899J508
$$ -2314 -98 2516 1353 -1809 -2843 684 2641 846 -2358 -1999 1402 2520 47 -2852 -1344
4120a344L009N50k732k253J743L042o88k850j042K321K321j348k687l67K785J563
$$ -1344 1665 2215 -517 -2770 -1027 2015 1327 -1523 -2565 -244 2077 729 -1958 -2325 460 2023
4136B023j387k544L63K699J046k319j834R26K622L37k325j592J382K109l37j816
$$ 2023 636 -1908 -1545 1154 2200 -119 -1953 -1027 1595 1932 -393 -1985 -603 1506 1169 -647
4152f47j034J748J581n44k099o23K088J131q05j832k40J824Q60o79j987P3J593
$$ -647 -1681 67 1648 1104 -995 -1618 470 1601 796 -1036 -1276 548 1408 729 -1258 -1185 408
4169D08Q60j239j315M89J299J016j183j519L03J227R77j414j109O22J349M56j174
$$ 408 1268 29 -1286 -797 502 1518 335 -1184 -881 346 1323 -91 -1200 -578 771 1227 53
4186E3j622J268J572j4j525j287J122J847j85j994j029J917J577q86k176m66K222
$$ 53 -1569 -301 1271 1257 -268 -1555 -433 1414 1229 -765 -1794 123 1700 814 -1362 -1828 394
4203C94J274j343k175J81K077R63j635j709N43K589L17k273j391J377K234n01
$$ 394 1668 325 -1850 -1669 408 1371 -264 -1973 -1430 1159 1476 -797 -2188 -811 1423 922
4219I22k174r46J974J778p39k345j86K156J241j446k085N15K295Q74j873j580
$$ 922 -1252 -2198 -224 1554 815 -1530 -1716 440 1681 235 -1850 -1335 960 1834 -39 -1619
4235a619P68K170O6k145j083J439J837o94j765o84J612J423p35j871k28K039N87
$$ -1619 -851 1319 1385 -760 -1843 -404 1433 739 -1026 -1710 -98 1325 590 -1281 -1509 530 1117
4252A117j113j299K31J659J24q84j273Q40J108J90j273m05N43J335n67j073k51
$$ 1117 4 -1295 -1064 595 719 -165 -1438 -598 510 700 -573 -978 -435 900 333 -740 -991
4269i91Q32Q13k62p15j97M82O25j71p30j61N55M62l51m94k8J62O48j05q30P4N38
$$ -991 -159 654 392 -323 -520 -38 587 416 -314 -475 80 542 191 -303 -331 -169 479 374 -456 -382 156
4290A56L29j2p62o7M44P11n81q41n8Q70K38o56p72K20R70L00p56r81N56J388j8
$$ 156 485 473 -289 -356 88 799 218 -623 -681 189 427 -229 -1001 -781 189 489 -267 -1248 -692 696 678
4311F78r63p48Q04J315o22j155m70R47J133o52j236j11J263N13r53j377R40J067
$$ 678 -285 -1033 -229 1086 464 -691 -1161 -214 919 267 -969 -1080 183 696 -257 -1634 -694 373
4329C73N02j204q89R84Q12j54j040l37P32J066q57j094j66J182N64j229m68K33
$$ 373 875 -329 -1218 -234 578 424 -616 -953 -221 845 -12 -1106 -1272 -90 474 -755 -1223 -990
4347i90J113J01j105l18Q95R16k29j026K03O08L41p81l78J74M79L82r02k35M33
$$ -990 123 224 -881 -1199 -304 612 383 -643 -440 168 509 -272 -650 -476 3 385 -517 -752 -319
4366c19P13k93m71j5N08K43k47l61P9P64j67l01l50L18O3k08l19P2J27J90n23
$$ -319 394 101 -370 -385 123 366 119 -242 -163 601 434 133 -217 101 164 -44 -363 -291 -164 26 -497
4387d97M2L66L95k29l53J01M16j41k87l90O23J87o6m33Q1N93l63j01n41L04N47
$$ -497 -455 -89 306 77 -276 -175 241 100 -187 -577 46 233 167 -266 -185 408 45 -56 -597 -293 254
4408B54m1n72kN22K39j1q75K97M17J85j4o16J25N74l47k79j94M19J39r6m72K05
$$ 254 213 -359 -361 161 400 389 -486 -189 228 413 399 -217 -92 482 135 -144 -338 81 220 124 -348 -143
4430a43J56K73k12k15K08K81mj25j33K09K8p4k02j9K86k22k30J59KK3j28o5L15
$$ -143 13 286 74 -141 67 348 344 219 86 295 323 249 47 28 314 92 -138 21 23 46 -82 -147 168
4453A68L1k30n6k61L92J09l11q8rN01l8o23k51L77L86j63p91p8P80P66p37p57
$$ 168 199 -31 -87 -348 44 153 -158 -246 -255 246 208 -415 -666 -289 97 -66 -857 -935 -155 611 -126 -883
4475h83M95R15k02n78l76P81P24m18q18l19J039N92p46q75K97Q64Q27j511n89
$$ -883 -388 527 325 -253 -629 152 876 458 -360 -679 360 952 206 -669 -372 492 1319 -192 -781
4494g81O56J053qj170j26N98Q32j38j497K8Q23M39m45q39L16Q37M41r48p05M99
$$ -781 -125 928 920 -250 -376 222 1054 916 -581 -553 270 709 264 -575 -259 578 1019 71 -634 -135
4514a35Q95j07q76n80P22P01jj045j2P25N84n19n30k28O79K62m57p65M14O09K87
$$ -135 760 653 -223 -803 -81 620 619 -426 -438 287 871 352 -178 -406 273 535 78 -687 -273 336 623
4535F23l72o89L36j5L92m29k20J75N27j08l52k65J07M56k17j43m65J09N81nk55
$$ 623 251 -438 -102 -117 275 -154 -374 -199 328 220 -132 -397 -290 166 -51 -194 -659 -550 31 26 -229
4556b29l49J02O24r3l71k38M27O04m6o33n16P50M93R8q73n17J022O41n03p88l62
$$ -229 -578 -476 148 55 -316 -554 -127 477 431 -202 -718 32 525 623 -250 -767 255 896 393 -395 -757
4577g57J169N28j117o06J12J151K44r22n18K20J279r4j111r86J047J014l57j239
$$ -757 412 940 -177 -783 -671 480 724 -198 -716 -496 783 689 -422 -1408 -361 653 296 -943
4595i43l75R63J228q31j357K55J027O58r05j204K62J585J92j313p29Q59J250k18
$$ -943 -1318 -355 873 42 -1315 -1060 -33 625 -280 -1484 -1222 363 555 -758 -1487 -628 622 404
4613D04j265n26J286R26o66j092j97J446P90j105q45K08J412J98r19p82N86R37
$$ 404 -861 -1387 -101 825 159 -933 -1130 316 1106 1 -844 -636 776 974 55 -727 -141 796
4631G96M2p63m94K78J171j80j303j8P86N39j75r35j28Q43K27j49o62m5N89J38
$$ 796 838 75 -419 -141 1030 850 -453 -471 315 854 679 -256 -384 459 686 537 -125 -170 419 557
4651E57m02l04K67j53M61l03m63kM30J94M0o91k05P16K69l73m02%N21N10n98n53
$$ 557 155 -149 118 -35 426 123 -340 -342 88 282 322 -369 -574 142 411 38 -364 -364 157 667 69 -484
4673d84j28R60M05q20n81L18R94J25q90n35M82J210l21q39k60O41R31m73j108
$$ -484 -612 348 753 -67 -648 -330 664 789 -101 -636 -154 1056 735 -104 -364 277 1208 735 -373
4692c73j56R54O70m60j015j4J111N28j218o49M79J210j35j275m61J037Q06l73
$$ -373 -529 425 1095 635 -380 -394 717 1245 27 -622 -143 1067 932 -343 -804 233 1039 666
4710F66j308k10J220O56o24j264K54J041L25p52p85J30J202J45q04n42N56R13
$$ 666 -642 -852 368 1024 400 -864 -610 431 756 4 -781 -651 551 696 -108 -650 -94 819
4728H19m61n50j19P44O06n46q01P5P56J96l05r15M59P52k9k83o02P05J16J62o83
$$ 819 358 -192 -311 433 1039 493 -308 -233 523 719 414 -501 -42 710 681 398 -204 501 617 779 96
4749I6p0L43K58j03l32j95M28k4k67j40l7K24L8q5l9k8R8K62j81j90q8J2L89J74
$$ 96 26 369 627 524 192 -3 425 401 134 -6 -43 181 219 134 95 67 165 427 246 56 -32 -20 369 543
4773E43l09l33J86N0M97n77k97K30O99m21m97m2M32M00l49l70j69O01L58k47o65
$$ 543 234 -99 87 137 634 57 -240 -10 689 268 -229 -271 161 561 212 -158 -327 274 632 385 -280
4794b80K54K84K90n85o71L60R33l00o26m00N64N75j19q71j79N05O04j79n76j3
$$ -280 -26 258 548 -37 -708 -348 585 285 -341 -741 -177 398 279 -592 -771 -266 338 159 -417 -430
4814d30L94L31l31n76L45N17N5o91J0M49N43o57m75J91L77L64m44o24M49P48k19
$$ -430 -36 295 -36 -612 -267 250 305 -386 -376 73 616 -41 -516 -325 52 416 -28 -652 -203 545 326
4835C26m71P2r1N31k08m63j93N37Q1j24o03K57L19Q4l90k01L62Q7O2m02L49l8
$$ 326 -145 -73 -164 367 159 -304 -497 40 121 -3 -606 -349 -30 54 -336 -537 -175 -88 -26 -428 -79 -117
4857a17rk3j08J48j13J91k06m0N06k71j7j93M11Q7j45k0k59N39K9M7o09K95O51
$$ -117 -126 -149 -257 -109 -222 -31 -237 -277 229 -42 -59 -252 159 246 101 81 -178 361 390 437 -172 123 774
4880G74p2l56j14r6K43J54o94L2O03J18n34j67J20O10p2l37k34P6M86j86m64q8
$$ 774 702 346 232 136 379 533 -161 -129 474 592 58 -109 11 621 549 212 -22 54 540 354 -110 -198
4902a98K30L07m88j64l3M54L69m71k27J70K97j32j12k43K50L05k64k85K67J21
$$ -198 32 339 -149 -313 -346 108 477 6 -221 -51 246 114 2 -241 9 314 50 -235 32 153
4922A53K18l04j54J41J76k42j9N4OM9J46j32oM6p9J7J95j84o8J46J80k05J03k48
$$ 153 371 67 -87 54 230 -12 -31 23 29 78 224 92 86 132 53 70 265 81 13 159 339 134 237 -11
4946a1j51M32K20k28m40k4M30J30m29k77J04L14L51l17p36P50K61k82l36l73M56
$$ -11 -162 270 490 262 -178 -202 228 358 -71 -348 -244 70 421 104 -632 118 379 97 -239 -612 -156
4967a56Q12n18o07k17P88L84o08p40N02P55L7q40m89Q01P09k65q38J69L93O39
$$ -156 656 138 -469 -686 102 486 -122 -862 -360 395 432 -408 -897 -96 613 348 -490 -321 72 711
4987G11n48n58J44O06M53n91p17K36R92K1q95o25P56N90k66n51k40N70O41n08
$$ 711 163 -395 -251 355 808 217 -500 -264 728 749 -146 -771 -15 575 309 -242 -482 88 729 221
5007B21o05m5L08P27n84p43L62P69N5n37o99O32J26M33p20l41N77K82J17m26l55
$$ 221 -384 -429 -121 606 22 -721 -359 410 465 -72 -771 -139 -13 420 -300 -641 -64 218 335 -91 -446
5028d46L40N67n0m23j94N2N42J73q03J24K01K14k17j94l33K08P60j15o72pnR94
$$ -446 -106 461 411 -12 -206 -154 388 561 -242 -118 83 297 80 -114 -447 -239 521 406 -266 -273 -278 716
5050G16n71n01l46P19L13k42n11k27O58M28n24p62K60J136p1p19l96K77Q48j21
$$ 716 145 -356 -702 17 330 88 -423 -650 8 436 -88 -850 -590 546 475 -244 -640 -363 485 364
5070C64o16m60M02J072k96j122k25N60J029o03j055M54P85N61p08j181M54J016
$$ 364 -252 -712 -310 762 466 -656 -881 -321 708 105 -950 -496 289 850 142 -1039 -585 431
5088D31M46p83j240O40J480k38j285l02P92J056m77p64m64J015P96n86j110pJ183
$$ 431 877 94 -1146 -506 974 736 -549 -851 -59 997 520 -244 -708 307 1103 517 -593 -600 583
5107E83O20q10j070M79P48N31o29j077M77P59K24r06n19P21O53M0j137m65J010
$$ 583 1203 393 -677 -198 550 1081 452 -625 -148 611 835 -71 -590 131 784 824 -313 -778 232
5126B32L45l8r44r7P09N54n23n86J39M34N24m88p68J50O44M8l47j91Q1L57L63
$$ 232 577 539 -405 -502 207 761 238 -348 -209 225 749 261 -507 -357 287 335 -12 -203 -122 235 598
5147E98n38l93R6P89J69p01k92J26N82M06r52m99O64O83k81o93o8L66Q39p2j137
$$ 598 60 -333 -237 552 721 20 -272 -146 436 842 -110 -609 55 738 457 -236 -304 62 901 829 -308
5168c08j41M92Q57m09r42Q4N37M58l29j190M24R65K19o51p34L13R30Oj002k10
$$ -308 -449 43 900 491 -451 -367 170 628 299 -891 -467 498 717 66 -668 -355 575 581 -421 -631
5188f31K66R49L15j463j17N54J014m64r59m59R80Q22n05j260J31J147M26r75o34
$$ -631 -365 584 899 -564 -681 -127 887 423 -536 -995 -15 807 302 -958 -827 320 746 -229 -863
5207h63N61R51pq53o79N49J275k05j402k07R62O94n31q78l61J080P01m66o86j41
$$ -863 -302 649 642 -211 -890 -341 934 729 -673 -880 82 776 245 -633 -994 86 787 321 -365 -506
5227e06J037L65o28r52O09Q82j31q66k82K79P25m8p12l39N81N08j48o11j96P07
$$ -506 531 896 268 -684 -75 807 676 -190 -472 -193 532 484 -228 -567 14 522 374 -237 -433 274
5247B74L11k17o52%M63J47q9p19N2N06L38m81m58K17M97K06m20n33Q9M42N17m70
$$ 274 585 368 -284 -284 179 326 237 -482 -430 76 414 -67 -525 -308 189 395 -25 -558 -469 -27 490 20
5269B0o25J65Q35K77q96o67P70N86J24r41o40Q63P49k34q12q4M80M89j04j039
$$ 20 -605 -440 395 672 -224 -891 -121 465 589 -352 -992 -129 620 386 -426 -510 -30 459 355 -684
5289f84J24R06M61m86j283M72J279j18r28n77K56J009M8n83o97P09O79o7r57q0
$$ -684 -560 346 807 321 -962 -490 789 671 -257 -834 -578 431 479 -104 -801 -92 587 520 -437 -517
5309e17N62N87n09p27k59R05P03o32r74M61O25J98p84n33N97J077r2r25m93O89
$$ -517 45 632 123 -604 -863 42 745 113 -861 -400 225 423 -361 -894 -297 780 688 -237 -730 -41
5329d1Q70n64o49k42N26N26j40q09o9P75M01n86m72L06L76K88l79m95J91L67K26
$$ -41 829 265 -384 -626 -100 426 286 -523 -592 183 584 -2 -474 -168 208 496 117 -378 -187 180 406
5350D06n62k21K69M18k30J42m93K89L51j6m62l03L70M16j56k52j82M59N5J3n96
$$ 406 -156 -377 -108 310 80 222 -271 18 369 353 -109 -412 -42 374 218 -34 -216 243 298 311 -285
5371b85J68K45K51j55m30j89M57K65k74l57PP97l28J40n44oL84K11m15l81L53
$$ -285 -117 128 379 224 -206 -395 62 327 53 -304 -297 500 172 312 -232 -238 146 357 -58 -439 -86
5392h6M74L00p57j02Q2N18j68n64m0L70M14l64m66J60N82qm0m18k29R76j56p17
$$ -86 388 688 -69 -171 -89 429 261 -303 -343 27 441 77 -389 -229 353 345 305 -113 -342 634 478 -239
5414b39j57L65M81m97k66l17M26N37l18o39R2N64M77l91n47J58N61J82o30j82
$$ -239 -396 -31 450 -47 -313 -630 -204 333 15 -624 -532 32 509 118 -429 -271 290 472 -158 -340
5434c40N27J66j63l68k63R2N77On73L6K72K78j22k66J58K31K78k56m59M58L93
$$ -340 187 353 190 -178 -441 -349 228 234 -339 -303 -31 247 125 -141 17 248 526 270 -189 269 662
5455F62o06r2k03J47K54l8l28j73K53M04j17n33K46J12J18M9k83L17k75L45j88
$$ 662 56 -36 -239 -92 162 124 -204 -377 -124 280 163 -370 -124 -12 106 155 -128 189 -86 259 71
5476G1l21K81J17rj25M6p2O0j55K00j3j32K2JL20l74r6L09J7L5j33k5J39K00j48
$$ 71 -250 31 148 139 14 60 -12 48 -107 93 80 -52 -30 -29 291 -83 -179 130 147 182 49 24 163 363 215
5501B15l78L29Q3j24oj31n0K0L28k36k80J32L06k43O8k59M70j2l09k90R8M03j2
$$ 215 -163 166 249 125 119 -12 -62 -42 286 50 -230 -98 208 -35 33 -226 244 232 -77 -367 -269 134 122
5524A22j72l95L53J84j33q5J3M61Mj58m67J14N57m18j8l15L73n6O8m25K72R4K94
$$ 122 -50 -445 -92 92 -41 -126 -113 348 352 194 -273 -159 398 -20 -38 -353 20 -36 32 -393 -121 -27 267
5547B67k04k65R7K78O5m02J1K30K84Q5m69l35K25K65j52p8J24M49j47l90l51J62
$$ 267 63 -202 -105 173 238 -164 -153 77 361 446 -23 -358 -133 132 -20 -98 26 475 328 -62 -413 -251
5569b51M90p5k10j60L07K45j62l83J29K8M63l98l31J68M38k58M2m60M64J12j21
$$ -251 239 164 -46 -206 101 346 184 -199 -70 -42 421 23 -308 -140 298 40 82 -378 86 198 77
5590G7j83K7K66j67N6k85O2n0K83n1M1k66L55M2O2k00K3O8k00k0J01m4L0J48j25
$$ 77 -106 -79 187 20 76 -209 -147 -197 86 35 76 -190 165 207 269 69 92 160 -40 -60 41 -3 27 175 50
5615E0k15K29m1m4J76J07k60K13l2k19J20N7k3K6j59J76k81J10J64j04k09R9J95
$$ 50 -165 64 23 -21 155 262 2 215 183 -36 84 141 118 144 -15 161 -120 -10 154 50 -159 -60 135
5638A35jk30k06K54K50p3k45j33L11J20K3m18k06O08J4m12k47L0P55j57l41k94
$$ 135 134 -96 -302 -48 202 129 -116 -249 62 182 205 -213 -419 189 203 -209 -456 -426 329 172 -169 -463
5660d63j26Q54j49n43J12J32N33j64m38M2K10L40n75Ln07Q89J57m22j83J41M99
$$ -463 -589 265 116 -427 -315 -183 350 186 -252 -210 0 340 -235 -232 -739 150 307 -115 -298 -157 342
5681C42nn15j02k3O31j75n14p4M69K68l16l38j51N44M68m83p21M47N14j39l25
$$ 342 337 -178 -280 -303 328 153 -361 -435 34 302 -14 -352 -503 41 509 26 -695 -248 266 127 -198
5702a98p1k9L89J33l07m9j87P55k52k99l38M56L16l05k0j07K49J90l64j47K65
$$ -198 -269 -298 91 224 -83 -132 -319 436 184 -115 -453 3 319 14 -6 -113 136 326 -38 -185 80
5723H0j9K01j91j67k14J60L74j15m99J39K41K84k77n3j58K20J27r4l54J70L09
$$ 80 61 262 71 -96 -310 -150 224 109 -390 -251 -10 274 -3 -56 -214 6 133 39 -315 -145 164
5744A64j65r8Q8j09M09j81k16j28J96L92j82n48J57R0N14l60j94l14N83J62n05
$$ 164 -1 -99 -11 -120 289 108 -108 -236 -40 352 170 -378 -221 -131 383 23 -171 -485 98 260 -245
5765b45J52j32K52L21k79l12L8L29K13k68l17k0N98j41k22k19K56K82j83m00j33
$$ -245 -93 -225 27 348 69 -243 -205 124 337 69 -248 -268 330 189 -33 -252 4 286 103 -297 -430
5786d30P70J93m85l51L06K43J22m08j44rO38k29m52k26M47L81k08k89k88L70K90
$$ -430 340 533 48 -303 3 246 368 -40 -184 -193 445 216 -236 -462 -15 366 158 -131 -419 -49 241
5807B41l80q5K14J30Ok01p4J58N1q5L69p52N16Q8j49k24l3R7J48J70j10k06m4
$$ 241 -139 -224 -10 120 126 -75 -149 9 60 -25 344 -408 108 196 47 -177 -210 -113 35 205 95 -111 -155
5830a55M80l28L4k65L71l9L06n25m8J27K93k12K3k04K27M57o23Pk40M01L93j49
$$ -155 325 -3 31 -234 137 98 404 -121 -169 -42 251 39 62 -142 85 542 -81 -74 -314 87 480 331
5852C31m15J42K78J59l38j85K6L88m06J85l80R3K27L05m71q0k5L22M4l40l56N05
$$ 331 -84 58 336 495 157 -28 -2 386 -20 165 -215 -122 105 410 -61 -141 -166 156 200 -140 -496 9
5874IL45j97m83p1N41M9k5o30L53L52J96m01o69M60N37k11l07k74K45L70J22o37
$$ 9 354 157 -326 -397 144 193 168 -462 -109 243 439 38 -631 -171 366 155 -152 -426 -181 189 311 -326
5896c26J64n6N91k52l63p2M09L69m23j34M4K56nl59l09J40O16k33m56J94K66P1
$$ -326 -162 -218 373 121 -242 -314 95 464 41 -93 -49 207 202 -157 -466 -326 290 57 -399 -205 61 132
5918A32M9m99J78Q0J44J04l23L3J83N0l35qJ56O2J93l93N3J08j99J84J0n8J24
$$ 132 181 -318 -140 -60 84 188 -135 -102 81 131 -204 -212 -56 6 199 -194 -141 -33 -232 -48 -38 -96 28
5941B8J18r5qk8j33j62M03k39Q8P4J16k0k00n4o5M30l1n8l21R7K8J42k23j1R8
$$ 28 146 51 43 15 -118 -280 123 -116 -28 46 162 142 -58 -112 -177 253 222 164 -157 -60 -32 110 -113 -124 -26
5966b6K44j05n5j02p3N34n50J94k15J78K2j02j04o5J73L59l31k49M18j74K32k4
$$ -26 218 113 58 -44 -117 417 -133 61 -154 24 46 -56 -160 -225 -52 307 -24 -273 145 -29 203 179
5988A79k73K54J22k71on0k9J70k24j27j0L49J67j15m27J09J61J77j51k06L50J86
$$ 179 -94 160 282 11 5 -45 -74 96 -128 -255 -265 84 251 136 -291 -182 -21 156 5 -201 149 335
6010C35j88k30j2K37L0j38J9j26k29L10o0l58L45J01j41K73j08j09L9j24j80K40
$$ 335 147 -83 -95 142 172 34 53 -73 -302 8 -52 -410 -65 36 -105 168 60 -49 -10 -134 -314 -74
6032g4Q8p7m9J38j84L12pk21J83j17k8j04P6j43L34k20J39o7M4K8j36r2R8j73
$$ -74 14 -63 -112 26 -158 154 147 -74 109 -8 -36 -140 -64 -207 127 -93 46 -21 23 51 -85 -177 -79 -252
6056b52J14J68k04L34k20l3r1K45K8l2J40l53L66j25j54L6p7L36k38L0p1K27j29
$$ -252 -138 30 -174 160 -60 -93 -184 61 89 57 197 -156 210 85 -69 -33 -110 226 -12 18 -53 174 45
6079D5J26k72K9J8L16k95k43J45RM22j33k70j41L22J4pl09R2j3P5n2k07L81J88
$$ 45 171 -101 -72 -54 262 -33 -276 -131 -122 300 167 -103 -244 78 92 85 -224 -132 -145 -70 -122 -329 52 240
6103B40n5m1n9N8j81pjj61K65j15P8r9K08m8q6m1p8K67m75J70J1K29m4k01jL27
$$ 240 185 144 85 143 -38 -45 -46 -207 58 -57 21 -78 130 82 -4 -45 -123 144 -331 -161 -150 79 35 -166 -167 160
6129A60l82K2K49j22K33l21K57j52%J6L2l1m5j0l4N4K5j10K48j68J5P5R1K53k04
$$ 160 -222 -200 49 -73 160 -161 96 -56 -56 -40 -8 -39 -84 -94 -128 -74 -49 -159 89 -79 -64 11 102 355 151
6154A51m84L44j4R1k26k9M2j17N25p02J71K35L00r4l28j01K07K84k09k47q1N81
$$ 151 -333 11 -3 88 -138 -167 -125 -242 283 -419 -248 -13 287 193 -135 -236 -29 255 46 -201 -282 299
6176B99k45j11Ok35P45l05l21n4N10j70o3k44K5Q8K9J67k42j19M86j47O2m48K56
$$ 299 54 -57 -51 -286 459 154 -167 -221 289 119 56 -188 -163 -75 -46 121 -121 -240 246 99 161 -287 -31
6199c1L05j9o8m01L86Q9j16j55j83J75M10j93k88j65M93m9n9k09K1M6L3O7k16
$$ -31 274 255 187 -214 172 261 145 -10 -193 -18 392 199 -89 -254 239 190 131 -78 -57 -11 22 89 -127
6222a27OK22j15%k4J06J60k96J1n3K2J28J3j68K5J12J76k06R8m87L30rM23k79
$$ -127 -121 101 -14 -14 -38 68 228 -68 -57 -110 -88 40 53 -115 -90 22 198 -8 90 -397 -67 -76 347 68
6246F8k05J92K36l04n0j44J24J33O8l50L3J08L55j10k20l4L61K19o48pj41L34
$$ 68 -137 55 291 -13 -63 -207 -83 50 118 -232 -199 -91 264 154 -66 -100 261 480 -168 -175 -316 18
6268A8K07l93j0J32K61R8m68j85L91N18l73l69p5M12J26k41j76J05L03n0O9n62
$$ 18 225 -168 -178 -46 215 313 -155 -340 51 569 196 -173 -248 164 290 49 -127 -22 281 231 300 -262
6290b62K34J43J09j01l30M4L27j07Pl18J23K65j30j51j20L26N5O1l29J89j67L95
$$ -262 -28 115 224 123 -207 -163 164 57 64 -254 -131 134 4 -147 -267 59 114 175 -154 35 -132 263
6312B63j41l03K02K00j82N3k03OO7j49K4J72P9J31Kj16m47M16J80j74j47o3K38
$$ 263 122 -181 21 221 39 92 -111 -105 -38 -187 -163 9 88 219 221 105 -342 74 254 80 -67 -130 108
6335A08l7J59l80j15P6J89J32j84P6J58K8N3m05L39j09K57l50K6o8Q5K46j66l77
$$ 108 71 230 -150 -265 -189 0 132 -52 24 182 210 263 -142 197 88 345 -5 21 -47 38 284 118 -259
6358b59J79m6M47k95k00j30O31j19k22k97QN38k35j61j48L40O5J99m52M4K96r7
$$ -259 -80 -126 321 26 -174 -304 327 208 -14 -311 -303 235 0 -161 -309 31 96 295 -157 -113 183 86
6380H6q2j32J49j06K19k02k25J16L42J20l06j93K33K13k95O3r5J22K08j80m9p2
$$ 86 4 -128 21 -85 134 -68 -293 -177 165 285 -21 -214 19 232 -63 0 -95 27 235 55 6 -66
6402f6J87pk74J40j79L26l7j78j76J92N9J04k75J50J05J11P3m42J13K75ml21o4
$$ -66 121 114 -160 -20 -199 127 90 -88 -264 -72 -13 91 -184 -34 71 182 255 -187 -74 201 197 -124 -188
6425a88j54L92j1r1P2l5P9q3J03j72L00k74M52k31j90j17N4L33J24n24J82M4M9
$$ -188 -342 50 39 -52 20 -15 64 -19 84 -88 212 -62 390 159 -31 -148 -94 239 363 -161 21 65 114
6448A14m4Lj20K23P5j23n7j10o9R5R1k53J80N7jj04RR8J43o8j47k44N4L42r9k8
$$ 114 70 73 -47 176 251 128 71 -39 -108 -13 78 -175 5 62 61 -43 -34 64 207 139 -8 -252 -198 144 45 17
6474A7j15L05J0k69j37R3J23j38J31j59L0R3Q8j89J04J56r6J11l81J78L14j30
$$ 17 -98 207 217 -52 -189 -96 27 -111 20 -139 -109 -16 72 -117 -13 143 47 158 -223 -45 269 139
6496A39o5j59K01Q1j23j64nJ54J1k3p3R1M1Q3j10k19K68k12L01p7l76J51L77L4
$$ 139 74 -85 116 197 74 -90 -95 59 70 47 -26 65 106 189 79 -140 128 -84 217 140 -236 -85 292 326
6520C26k56j95K18p6r3O9l44L35Q5j65J7j59K2J59J70j83J3M7k9M4P3j92J36q0
$$ 326 70 -125 93 17 -76 -7 -351 -16 69 -96 -79 -238 -216 -57 113 -70 -57 -10 -39 5 78 -114 22 -58
6544e8N7q6q1K63r6N9Po1J35K6j03j09M6L58o28J29P6q1Q3J10m1K01j32j92J10
$$ -58 -1 -87 -168 95 -1 58 65 4 139 165 62 -47 -1 357 -271 -142 -66 -147 -64 46 5 206 74 -118 -8
6569hj30J97j14M1j7J17j55Mk3J00Qk9k41M60k43k44K70Kk1K15j98l1J71kj54
$$ -8 -138 59 -55 -14 -31 86 -69 -65 -88 12 20 -9 -250 210 -33 -277 -7 -5 -26 189 -9 -40 131 129 -25
6594b5j41K60L29m16j27J13l61N62J29k33l36J46Q3J60j61Q3J9O2k7m58M76q5
$$ -25 -166 94 423 7 -120 -7 -368 194 323 90 -246 -100 -17 143 -18 65 84 146 119 -339 137 52
6616E2j3r8Q1rJ03J0o4j26k1K39l50K84j27J1p8j3L71k87o8P1R8j34j01J45m4
$$ 52 39 -59 22 13 116 126 62 -64 -85 154 -196 88 -39 -28 -106 -119 252 -35 -103 -32 66 -68 -169 -24 -68
6641f8p1K00L3j56M5l2N7l5o0r8K56j0J02k3n4j87L44j65p5j36q7L56k09N2k2
$$ -68 -139 61 94 -62 -17 -49 8 -27 -87 -185 71 61 163 140 86 -101 243 78 3 -133 -220 136 -73 -21 -43
6666d3l8K91j52j56J10j0J00K18l52J70K25l21j12J49l37L86n8l72K18l0K16j2
$$ -43 -81 210 58 -98 12 2 102 320 -32 138 363 42 -70 79 -258 128 70 -302 -84 -114 102 90
6688I0J6j95j69L61k5k15J52J69j90O7n1K20k98M08k86r3P9RJ38K10m48l2K83
$$ 90 106 -89 -258 103 78 -137 15 184 -6 61 10 230 -68 340 54 -39 40 49 187 397 -51 -83 200
6711B00j76J53j54N1L03m47J1Q7N3M2j82K20j42K23j62r2R6j28n0J3J26k30J99
$$ 200 24 177 23 74 377 -70 -59 28 81 123 -59 161 19 242 80 -12 84 -44 -94 -81 45 -185 14
6734A4K8J87k57J30j34k16K15J27k78r2K87R7l06K89j86K64k27O8j09J04j34Q9
$$ 14 42 229 -28 102 -32 -248 -33 94 -184 -276 11 108 -198 91 -95 169 -58 10 -99 5 -129 -40
6756d0N4j48J69J10o2l42J73P0M6m38M55j39K43j77j65K27o8J85k77j18K16Q3
$$ -40 14 -134 35 145 83 -259 -86 -16 30 -408 47 -92 151 -26 -191 36 -32 153 -124 -242 -26 57
6778E7n1J21k05J01J20K5j96J3PJ56j8Q4k62J15KJ18j68M4j70L60k09L7j21P6
$$ 57 6 127 -78 23 143 168 -28 -15 -8 148 130 214 -48 67 69 187 19 63 -107 253 44 81 -40 36
6802C6j2n8j06j16L61j11K02L9m47K59L1K0n6m8O3j53L15n90R0K85J51q0k17L14
$$ 36 24 -34 -140 -256 105 -6 196 235 -212 47 78 98 42 -6 57 -96 219 -371 -281 4 155 75 -142 172
6826A72q5O6j03j16r1K4K00J35ol67J46k8P5P8l07K17pj7o3J36J01r8j25J17J09
$$ 172 87 153 50 -66 -157 -133 67 202 196 -171 -25 -53 22 100 -207 10 3 -14 -77 59 160 62 -63 54 163
6851A63r8j07q0n0K43p2p9O2J18l60L36M8j67j13J82J86j56K4J60j51j64J03R1
$$ 163 65 -42 -122 -172 71 -1 -80 -18 100 -260 76 124 -43 -156 26 212 56 80 240 89 -75 28 119
6874A19M1M7j38k36R0K63j71O1J87j69r8k36L14k67J63K08q4l66N06j78j92R2
$$ 119 160 207 69 -167 -77 186 15 76 263 94 -4 -240 74 -193 -30 178 94 -272 234 56 -136 -44
6896d4n7L9l0n4P3jr7q0L00P9L6k42rJ41o5O5J22m22J50J37k12J5J97R2k72PJ84
$$ -44 -101 -62 -92 -146 -73 -74 -171 -251 49 128 164 -78 -87 54 -11 54 176 -246 -96 41 -171 -156 41 133 -139 -132 52
6923E2o3l2O3J3m5p5J86P0k83K0K3K70l13k17J48J92J21j60J41j82J4k0J76k73
$$ 52 -11 -43 20 33 -12 -87 99 169 -114 -94 -71 199 -114 -331 -183 9 130 -30 111 -71 -57 -77 99 -174
6947a74K81ll9j74K5K49j66q3R2K94l72J14j83J42k01M19j70q9m2l8J81k87L52
$$ -174 107 104 65 -109 -84 165 -1 -84 8 302 -70 44 -139 3 -198 221 51 -38 -80 -118 63 -224 128
6970A28l77M4L53k28J9O7J49J05k05l24M10j53K36j31k41j57O77k31l14J2L6K42
$$ 128 -249 -205 148 -80 -61 6 155 260 55 -269 141 -12 224 93 -148 -305 372 141 -173 -161 -125 117
6992A17o8M3k37J41L4j40q0Q5M61k71Jj98L0k6K58k45j59L12M9j56P8j48J72j10
$$ 117 49 92 -145 -4 30 -110 -190 -105 356 85 86 -112 -82 -108 150 -95 -254 58 107 -49 29 -119 53 -57
7016e7O4kj10j39K71R2j01j56p0J14J64lo3K2J71l90K27r7J92l7K0j14J2j18L69
$$ -57 7 5 -105 -244 27 119 18 -138 -208 -94 70 67 4 26 197 -193 34 -63 129 92 112 -2 10 -108 261
7041B61n19J99J55J14j77R2j11n4k0J23q8J69N2j85L1j63J23m1J34mq3j65K02
$$ 261 -258 -59 96 210 33 125 14 -40 -60 63 -25 144 196 11 42 -121 2 -39 95 91 8 -157 45
7064D5j48J36r3J28j68Kl1J26nK7J69r4Mo0j85L54k91R4J3p1L19m41J31K7Q4j87
$$ 45 -103 33 -60 68 -100 -98 -129 -3 -8 19 188 94 98 38 -147 207 -84 10 23 -48 271 -170 -39 -12 72 -115
7090a15J10k93M26N6k00J40r3o8O3j09k8q7M66l06R1j72J89k71K69j16R8p8J11
$$ -115 -5 -298 128 184 -16 124 31 -37 26 -83 -111 -198 268 -38 53 -119 70 -201 68 -48 50 -28 83
7113H3j09J3M8K13j10j02j00J92%J61m25K07P6j00P4k74M1L71k58Kj76J99k38
$$ 83 -26 -13 35 248 138 36 -64 128 128 289 -136 71 147 47 121 -153 -112 259 1 3 -173 26 -212
7136b12J42J25j11K00n1K4l51K22q4K59l47L64k57QJ30Q9k21M5P2k25K16p5L27
$$ -212 -70 55 -56 144 93 117 -234 -12 -96 163 -184 180 -77 -69 61 150 -71 -26 46 -179 37 -38 289
7159B89k86k72K83K9p6k04K64J11j27m8J0R4k7Q6q6J48j67q6M7L0j18J45J24O6
$$ 289 3 -269 14 43 -33 -237 27 138 11 -37 -27 67 40 126 40 188 21 -65 -18 12 -106 39 163 229
7183B29l89R9K90O4k48K1j46J63O6o5k22L8P8N4lp7OP1J09o0q0J12k20LK21k12
$$ 229 -160 -61 229 293 45 66 -80 83 149 84 -138 -100 -22 32 29 -48 -42 29 138 78 -2 110 -110 -107 114 -98
7209i8K16p5k04J09J9R2j50pK79pj77k2K34k59k38L22j12P7k33N42k09p4J80m20
$$ -98 118 43 -161 -52 -33 59 -91 -98 181 174 -3 -25 209 -50 -288 34 -78 -1 -234 308 99 25 205 -215
7233b15K25j50K93k3J0j33j83L18k47p6J09J93k93L30k28o0K29J1n8j81J96k80
$$ -215 10 -140 153 130 140 7 -176 142 -105 -181 -72 121 -172 158 -70 -130 99 110 52 -129 67 -213
7255b13K73l09K58J33j93r4K69J1k86P7J62j16P0k6R8j5R2N9j87o2J4j9J21Mj94
$$ -213 60 -249 9 142 -51 -145 124 135 -151 -74 88 -28 42 16 114 99 191 250 63 1 15 -4 117 121 -73
7280g3J89q5n4J15k32K13qj96K59o5p8q6J67m3k04L22j25M8k13J66M0n6J25n6
$$ -73 116 31 -23 92 -140 73 65 -131 128 63 -15 -101 66 23 -181 141 16 64 -149 17 57 1 126 70
7304G0m5o8J74j28r4K36n4j07j3J15j79J72r7K4q7K39j88J90m73K10J43m6j6J99
$$ 70 25 -43 131 3 -91 145 91 -16 -29 86 -93 79 -18 6 -81 158 -30 160 -313 -103 40 -6 -22 177
7328A77j45L53k59j83r5Q3J18l4o1M8P3r1J97l52J91o2N6j65QK84j90J73k13K82
$$ 177 32 385 126 -57 -152 -69 49 15 -46 2 75 -16 181 -171 20 -42 14 -151 -143 141 -49 124 -89 193
7352A93l13L00j85j28J53j17J05k59K73PJ89j18QJ93k91j27P7P4J09k00K4j02
$$ 193 -120 180 -5 -133 20 -97 8 -251 22 29 218 100 108 301 10 -117 -40 34 143 -57 -33 -135
7374a35K62m47L20n3L01j83k43J72j32K68j66J59j79J55k13K00l1j21J29j02J38
$$ -135 127 -320 0 -53 248 65 -178 -6 -138 130 -36 123 -56 99 -114 86 55 -66 63 -39 99
7395I9k22K73j08j6ML2k2k3o3J44m2o7J84k98J82Q4p2Q1j73k10K77l27K67R3o7
$$ 99 -123 150 42 26 30 62 40 17 -46 98 56 -11 173 -125 57 141 69 150 -23 -233 44 -283 -16 77 10
7420A0j4M0n4k33K42r4k6J77o3Q8k63J68p6R5K6J16m9o8O8q9m2o8J7J05J09j27
$$ 10 -4 36 -18 -251 -9 -103 -129 48 -15 73 -190 -22 -98 -3 23 139 90 22 90 1 -41 -109 -92 13 122 -5
7446eJ65j9N0j93j12l57M88L3p5N9mo8J3J15j46M8R3j75J03q8J40r7k71K97J63
$$ -5 160 141 191 -2 -114 -471 17 50 -25 34 30 -38 -25 90 -56 -8 85 -90 13 -75 65 -32 -303 -6 157
7471A57q0P3p1L1j32J44m1p1l5J0K8j58J75o8m5J62j59K83j40j14J61j42l1K3
$$ 157 77 150 79 110 -22 122 81 10 -25 -15 13 -145 30 -38 -83 79 -80 203 63 -51 110 -32 -63 -40
7495d0P7J45J42k18L4j10l5j95O0K00j17K51m15K99p5P5q0o9M45l41q7J52j91
$$ -40 37 182 324 106 140 30 -5 -200 -140 60 -57 194 -221 78 3 78 -2 -71 374 33 -54 98 -93
7518i3Q2N6J72q7l15J26J15j93J24J59j50Q2k43J44p9K7K22j5n5m5j65J35J45
$$ -93 -11 45 217 130 -185 -59 56 -137 -13 146 -4 78 -165 -21 -100 -73 149 134 79 34 -131 4 149
7541A49j34k9q4rj35L73JK4k70L45j05l15L03M6l39K57l30L64p3j50L98j20l2
$$ 149 15 -14 -98 -107 -242 131 132 156 -114 231 126 -189 114 160 -179 78 -252 112 39 -111 287 167 135
7564A35k72p5J53O1m4L4M1Q2P4k5K9j24K64l26l4n2%J31J21n8j50MJ29r4J70j74
$$ 135 -137 -212 -59 2 -42 -8 33 115 189 164 193 69 333 7 -27 -79 -79 52 173 115 -35 -31 98 4 174 0
7590@O1O4k77K61m5J1j3jk3OL8o7r1l3J72j36l0J38Jj14Jl45L87j08M9J79n8k1
$$ 0 61 125 -152 109 64 75 62 61 38 44 82 15 -76 -109 63 -73 -103 35 36 -78 -77 -422 -35 -143 -94 85 27 6
7618FK35m56K39M5m5J03k26J69j03m3m3K9K63j04j62L03j02j05Pj79M7J50p0k31
$$ 6 241 -215 24 69 24 127 -99 70 -33 -76 -119 -90 173 69 -93 210 108 3 10 -169 -122 28 -42 -273
7642b73J53K53k31R3k06L72k69QL4J48j58L5j03Q8L7J84l73K49p1j78K10PM4K0
$$ -273 -120 133 -98 -5 -211 161 -108 -100 -66 82 -76 -41 -144 -56 -19 165 -208 41 -30 -208 2 9 53 73
7666G3M1r0m2J0P0J33m8k2k13k03K39p9J99J04j40m7J84K8k95l5L63l31J8J90
$$ 73 114 24 -18 -8 62 195 147 125 -88 -291 -52 -131 68 172 32 -15 169 197 -98 -133 230 -101 -83 107
7690A07m1j9j8j73K73r5P0P6k54j9K73o1K6j93K04k63J8O6j23L76k56J30P1k50
$$ 107 66 47 29 -144 129 34 104 180 -74 -93 180 119 145 -48 156 -107 -89 -23 -146 230 -26 104 175 -75
7714g5M4K0k22P1K75k36O7Q7j93K24K5n3k50K43J89k74j07J05Q0nrk48M89j05
$$ -75 -31 -11 -233 -162 113 -123 -56 31 -162 62 87 34 -216 27 216 -58 -165 -60 20 15 6 -242 247 142
7738A42j75j06j84K28mK47N2l53J99L8l03L61j86l4K14j80K6J31k17q1J10O7j2
$$ 142 -33 -139 -323 -95 -99 148 200 -153 46 84 -219 142 -44 -78 136 -44 -18 113 -104 -185 -75 -8 -20
7761b0J04NMk08N0j69J73M9J25K4Op6l7k26J78J7O5k30J80q5j89J62J86j65j16
$$ -20 84 89 93 -115 -65 -234 -61 -12 113 137 143 67 30 -196 -18 -1 64 -166 14 -71 -260 -98 88 -77 -193
7786a93K09j23L50l64qK62k65K44K7j12R5o3j89R1Q2P2J9j45rK04j4l64o5M21
$$ -193 16 -107 243 -121 -129 133 -132 112 139 27 122 59 -130 -39 43 115 134 -11 -20 184 170 -194 -259 162
7810A62J4j6p5j12k79M49q6k07K38l09K2K03J40l56M24J28j41l05L33m7k04R4
$$ 162 176 160 85 -27 -306 143 57 -150 88 -221 -199 4 144 -212 212 340 199 -106 227 180 -24 70
7832G0k18Q5J01J20j96K6R6j01l6j82j89L96m1Q0q0Q2J73j96qq9j75M17j8l54
$$ 70 -148 -63 38 158 -38 -12 84 -17 -53 -235 -424 -28 -69 11 -69 13 186 -10 -18 -107 -282 135 117 -237
7856b37J24J77K6Ll8Q2k5j59J05J01j65J04p5j8j32OR7K20q2j00QO4j02j06J60
$$ -237 -113 64 90 93 55 137 112 -47 58 159 -6 98 23 5 -127 -121 -24 196 114 14 22 86 -16 -122 38
7881C8j92o8M42l45J02r0K93j82k85K56M4j24J09k1J01j52K2N2L4J9J90pk10j3
$$ 38 -154 -222 220 -125 -23 -113 180 -2 -287 -31 13 -111 -2 -23 78 -74 -52 0 34 53 243 236 26 13
7905A3R4r4O8r3j71J87O6K36k53j47p0L12o3Ok92L10Q1j53J58j68o0j16K83k88
$$ 13 107 13 81 -12 -183 4 70 306 53 -94 -164 148 85 91 -201 109 190 37 195 27 -33 -149 134 -154
7929a54J0L45j05r1K26m51K54r2k8K6K3m5J48j6j34j2N8K12o1k20J38n0M5K2j22
$$ -154 -144 201 96 5 231 -220 34 -58 -86 -60 -37 -82 66 50 -84 -96 -38 174 113 -107 31 -19 26 48 -74
7954g4J88K6l96N61l21r8K10q4l7N3j27N4L6l1K2o5K24k30Q1r1K87r7j24k7r7
$$ -74 114 140 -256 305 -16 -114 96 12 -25 28 -99 -45 -9 -40 -18 -83 141 -89 -8 -99 188 91 -33 -60 -157
7979a57L86l15J04j31M0K22N2m44K33J71l76K62j19J12m5R2L2k32j0M69k91q9
$$ -157 229 -86 18 -113 -73 149 201 -243 -10 161 -215 47 -72 40 -5 87 119 -113 -123 346 55 -34
8001c4J04j14k9K90k80Q2m8J24j12K03k41J38j1j9M8q2L5k6J08j40j2L7P9m3p1
$$ -34 70 -44 -73 217 -63 19 -29 95 -17 186 -55 83 72 53 101 19 54 28 136 -4 -16 21 100 57 -14
8026a4o6Q0K30l17L1L5j61M02k0k80K37m2Q1k30k75M89n6j05k31J55p2J58j02
$$ -14 -80 0 230 -87 -56 -21 -182 220 200 -80 157 115 196 -34 -309 180 124 19 -212 -57 -129 29 -73
8049g3K23j85k2O8J93j26lq6k1M3k8O8J65k21k40k9J53J02o4J18N5rLk80J83k42
$$ -73 150 -35 -57 11 204 78 75 -11 -32 11 -17 51 216 -5 -245 -274 -121 -19 -83 35 90 81 84 -196 -13 -255
8075b55L18J27n7k02J11J48k36Jj27K40nk9N7l02J76k5l6J47p8P1n4K18k65nK64
$$ -255 63 190 133 -69 42 190 -46 -45 -172 68 63 34 91 -211 -35 -60 -96 51 -27 44 -10 208 -57 -62 202
8100B02k46K0p4J25P1j20M8L4n3P7n5Ln4m7J79M2r7l01K94k10K24K38l96J81j12
$$ 202 -44 -24 -98 27 98 -22 26 60 7 84 29 32 -22 -69 110 152 55 -246 48 -162 62 300 -96 85 -27
8125b7KK9j60K94j28j65k5J64K9N7n3q2nJ45J11j35j56J28J33N5k06M9o8N6q2
$$ -27 -25 4 -156 138 10 -155 -180 -16 13 70 17 -65 -70 75 186 51 -105 23 156 211 5 54 -14 42 -40
8150d0L25k61r3M31l58m1k0K15j84L1K4l4K79l30J91q8k42L38QJ41n42J46Lj6
$$ -40 285 24 -69 362 4 -37 -57 158 -26 5 29 -5 274 -56 135 47 -195 143 151 292 -250 -104 -101 -117
8174a17l5J8J65O6q7R4P6o3j02q0P5Q2l55K95J27j72j06
$$ -117 -152 -134 31 97 10 104 180 117 15 -65 10 92 -263 32 159 -13 -119
8191a19
$$ Imaginary data points
##PAGE= N=2
##DATA TABLE= (X++(I..I)), XYDATA
0@%%%%%%%%qJ6j6J6k4L2m0M8n6P2q8J05j29J60j92K24k62L04l54M14m76N44o24
$$ 0 0 0 0 0 0 0 0 0 -8 8 -8 8 -16 16 -24 24 -32 40 -48 57 -72 88 -104 120 -142 162 -192 222 -254 290 -334
31c34P13q09R16j036J169j313J471j645J836k046K274k524K797l093L418l774
$$ -334 379 -430 486 -550 619 -694 777 -868 968 -1078 1196 -1328 1469 -1624 1794 -1980
47a980M162m588N055n568O133o759P456q236R112j0107J1246j2561J4108j5955
$$ -1980 2182 -2406 2649 -2919 3214 -3545 3911 -4325 4787 -5320 5926 -6635 7473 -8482
61h482J8202k1012K4644k9534L6517m7376O6738j11779M13785K76382n12452p50
$$ -8482 9720 -11292 13352 -16182 20335 -27041 39697 -72082 341703 618085 105633 104883
73A04883J21402K96390j57056m12148l9177L13974J25232j78929l37244O0499
$$ 104883 226285 522675 365619 -46529 -85706 228268 353500 174571 -162673 -102174
83a02174L09633J00145k51661k49108J30862K91394j0582k51318j83445J51024
$$ -102174 207459 307604 55943 -193165 -62303 229091 218509 -32809 -216254 -65230
93f5230K54399n2650k96378o1654J90057J81977m7780k46464k4789K74334J32011
$$ -65230 189169 136519 -159859 -221513 -31456 150521 102741 -143723 -168512 105822 237833
104B37833r9416j48155k196K47708J21751j60323j32035L6031J89648O1132j65590
$$ 237833 138417 -9738 -11934 235774 357525 197202 65167 101198 290846 351978 186388
115A86388j32116M3892J69744L8234j81895r5439P8826J30150N4621j70500j10271
$$ 186388 54272 98164 267908 306142 124247 28808 107634 237784 292405 121905 11634
126A1634J28360J15156k342j41116j24707J05417J43813p0178j67777q0597Q8245
$$ 11634 139994 255150 252808 111692 -13015 92402 236215 166037 -1740 -82337 5908
137E908J37529o8381j93425m7655J46668J25261q3948j75804n772J78681J20279
$$ 5908 143437 75056 -118369 -166024 -19356 105905 21957 -153847 -159619 19062 139341
148A39341j14329j92093N2614J94213N8284j38799j90209P2466K31618k865j95157
$$ 139341 25012 -167081 -114467 79746 138030 -769 -190978 -118512 113106 110241 -84916
159h4916j13888J03320K23806j4570k33227n4590J78354J80964o2881k16184k1633
$$ -84916 -198804 -95484 128322 113752 -119475 -174065 4289 185253 122372 -93812 -115445
170a15445K12331J37751j34557k06828L1623K12033O3953j65759j82310P2237
$$ -115445 96886 234637 100080 -106748 -75125 136908 200861 35102 -147208 -74971
180g4971K24299P13j98255j04186J13780J89975j7839k20114n2393J72832J23233
$$ -74971 149328 150041 -48214 -152400 -38620 151355 133516 -86598 -138991 33841 157074
191A57074o6287j92500k7364J84281Q4560j29513j56334K2560J64479M8534j44803
$$ 157074 90787 -101713 -129077 55204 139764 10251 -146083 -123523 40956 89490 -55313
202e5313j16050O3180J61046J0028j45572n8075Q4075J29072m234j42466l7437
$$ -55313 -171363 -108183 52863 62891 -82681 -140756 -56681 72391 68157 -74309 -111746
213a11746J13277P6863l3837j06035m0191J11916O3692o6233q0004q134Q3638
$$ -111746 1531 78394 44557 -61478 -101669 10247 73939 7706 -72298 -80432 3206
224C206N9956n7787p7720J7797P5642M4161n1679o6475J4503O7947M2105o3028
$$ 3206 63162 5375 -72345 -54548 21094 65255 13576 -52899 -38396 29551 71656 8628
236H628o8991K2443O0132K9204n1760q3544K7010Q8180N465n2417o6535K4919
$$ 8628 -60363 -37920 22212 51416 -344 -83888 -56878 31302 36767 -15650 -82185 -57266
248e7266J06554Q812q4061m8112M9639R3419N328j03269m4470P6921Q7978k5720
$$ -57266 49288 58100 -25961 -74073 -24434 68985 74313 -28956 -73426 3495 91473 65753
260F5753j13018k0970R1635P7062n0433j16748M696J19048M6999p9321r1474K0351
$$ 65753 -47265 -68235 23400 100462 50029 -66719 -62023 57025 104024 24703 -66771 -46420
272d6420J31182K5046j17662o4891N8529J06429q47j26341n3599R9449Q4332m4894
$$ -46420 84762 109808 -7854 -72745 -14216 92213 91366 -34975 -88574 10875 95207 50313
284E0313j14787k1468J13171O2631p3133j04148K1379J17995K8919r2203p1721
$$ 50313 -64474 -85942 27229 89860 16727 -87421 -66042 51953 80872 -11331 -83052
295h3052M8241J07575N136j11182l4483P6503P2166j7039r8509j7344R4585M7524
$$ -83052 -34811 72764 77900 -33282 -67765 8738 80904 63865 -34644 -51988 42597 90121
307I0121n3036o5873N704Q2274L0854o7659m5109L1387O5596L727o0756k5350
$$ 90121 37085 -28788 -23084 59190 90044 22385 -22724 8663 74259 77986 17230 -8120
319h120L8961M6227j2253n4994r620M3871J5498j7877l7277q957M0919L702k9444
$$ -8120 30841 77068 64815 9821 201 44072 59570 41693 4416 -4541 36378 40080 10636
332A0636j3629k13J6812J0136k5149q879J1797N46P940o926p732K744R32O520
$$ 10636 -2993 -3206 13606 23742 -1407 -10286 1511 2057 9997 3071 -4661 -1917 -985 5535
346E535K257q436p181R68J2251J1033k0634r703J1707J3423J4009k4880j6682
$$ 5535 7792 -644 -7825 -6857 5394 16427 -4207 -13910 -2203 11220 25229 349 -16333
359a6333K8414K1678o393j9799j5611K9211L0612k7868k7752L58K9460J8167l4721
$$ -16333 12081 33759 27366 7567 -8044 21167 51779 23911 -3841 -3483 25977 44144 9423
372I423l3115J5184L5741M31m0417k4328L3560K9748j2736l8920j3192M8149K0527
$$ 9423 -23692 -8508 27233 27664 -12753 -37081 -3521 26227 13491 -25429 -38621 9528 30055
385C0055l3183l0320P371M0039J3710m6240k5337L4505K7224m777l9978j1581
$$ 30055 -3128 -33448 -26077 13962 27672 -18568 -43905 -9400 17824 13047 -26931 -38512
397c8512M4688K3303k5224l0426J2887M0661J1182l6347j6770K6185L3172q466
$$ -38512 6176 29479 4255 -26171 -13284 27377 38559 2212 -14558 11627 44799 36333
409C6333m2856J422L3521J4277k3441l4982J2007M1358n318l8882r354K1460L3292
$$ 36333 -6523 -5101 28420 42697 19256 -15726 -3719 37639 32321 -6561 -15915 5545 38837
422C8837j6556m4654R056L6563J1702l0493l2234J9765M1327r429m0629j5589
$$ 38837 22281 -22373 -13317 23246 34948 4455 -27779 -8014 33313 23884 -16745 -32334
434c2334L3700L3847k9662l6864M527M0237K1316m0336l1498K9264L9459k914
$$ -32334 1366 35213 5551 -31313 -26786 13451 34767 -5569 -37067 -7803 31656 28742
446B8742l6904k2750M2221L6081k6284l5698q00M1737K3639l4806l5463K1238
$$ 28742 -8162 -30912 11309 47390 21106 -14592 -15392 26345 49984 15178 -20285 953
458I53M0010M731l7427k3530L3719L3286r509l6611q763L8850K2931k3538k8105
$$ 953 40963 45694 8267 -15263 18456 51742 42233 5622 -3141 35709 58640 35102 6997
471F997M402L1861J6406l4357k0267J7815J9796M392k8423j6799K1234J4600j0412
$$ 6997 11399 43260 59666 25309 5042 22857 42653 47045 18622 1823 23057 37657 27245
484B7245j7424j0057J4166J0639j4077j0576n613Q023N439q444n338n173R90P300
$$ 27245 9821 -236 13930 24569 10492 -84 -5697 2326 7765 -679 -6017 -11190 -10200 -2900
498b900k70p140l322n667J2066J1213j2235r251N79J7202J5938j3344k0221J3545
$$ -2900 -3170 -10310 -13632 -19299 -7233 3980 -8255 -17506 -16927 275 16213 2869 -17352 -3807
512c807K7388J0353j8436k2944K3661L6099Q50l2172j7740L3966L6441j5884m2741
$$ -3807 23581 33934 15498 -7446 16215 52314 53164 20992 3252 37218 73659 57775 15034
525A5034p166M0310L3493l6389m8317J0789M6014K0187m9598m6697K9020N2384
$$ 15034 7868 48178 81671 45282 -3035 7754 53768 73955 24357 -22340 6680 59064
537E9064l614n6280l4816M0508N3205k6334o2927j5711N3842L9851m2753o0860
$$ 59064 55450 -830 -35646 4862 58067 31733 -31194 -46905 6937 46788 4035 -56825
549e6825O918O3568K3190n3024n0575L3097O4047M355n6689l5413N1706N8367
$$ -56825 -49907 13661 36851 -16173 -66748 -33651 30396 34751 -21938 -57351 -5645 52722
561E2722j8073n8853j3147N5319M6026l5454n9494J0561N4197K7194m4776m9372
$$ 52722 34649 -24204 -37351 17968 63994 28540 -30954 -20393 33804 60998 16222 -33150
573c3150K5354N3670P559m7720l2754L2734M7749r989m5144j9529L3536L7278
$$ -33150 -7796 45874 53433 5713 -27041 5693 53442 43453 -1691 -21220 12316 49594
585D9594k3547m0120p994K9923K5720k4331l6610L439K8950J3774j6333k9711
$$ 49594 26047 -14073 -22067 7856 33576 9245 -27365 -23926 5024 18798 2465 -27246
597b7246P818K8353R002j3614k2148M837K4917R633j6418j9635L27K3414J0570
$$ -27246 -19428 8925 17927 4313 -17835 -12998 11919 21552 5134 -14501 -14174 9240 19810
610A9810j9198j9790j617K6836J4186k2360k3126M892L0205J6016k6179l0743
$$ 19810 612 -19178 -20795 6041 20227 -2133 -25259 -20367 9838 25854 -325 -31068
622c1068J5921L3548R526l3783l3495K3383L9848k944m4153k5318L1824M3879
$$ -31068 -15147 18401 27927 -5856 -39351 -15968 23880 20936 -23217 -48535 -16711 27168
634B7168j5151n0392j1659M4226M1851k8543n1292M493N4383K9897m1697n0183
$$ 27168 12017 -38375 -50034 -5808 36043 7500 -43792 -39299 15084 44981 3284 -46899
646d6899K1021N9567R304n1041m2979L5785O0599j0748n8649k4216M9045N2551
$$ -46899 -25878 33689 42993 -8048 -51027 -15242 45357 34609 -24040 -48256 789 53340
658E3340k5101o2192j881N8452L6634l9092n7927J6283N9492J7576n1183m6617
$$ 53340 28239 -33953 -35834 22618 59252 20160 -37767 -21484 38008 55584 4401 -42216
670d2216L0142N5522l056n5298k7911L7562M9244j8757n2973q206M2363L5682
$$ -42216 -12074 43448 40392 -14906 -42817 -5255 43989 25232 -27741 -35947 6416 42098
682D2098k7513m6177N107M4759J7061l2080l5852J2485M0938L421l2486k4530
$$ 42098 14585 -31592 -26485 18274 35335 3255 -32597 -20112 20826 24247 -8239 -32769
694c2769J8759L3235l580k9443j3068K1108K5250m776k6760l448J8296J7794l605
$$ -32769 -14010 19225 15645 -13798 -26866 -5758 19492 14716 -12044 -15492 2804 20598 16993
707A6993k3427k625J6242J3097l755j7687o530J5356J3769l808j4529r838J5649
$$ 16993 -6434 -9059 7183 20280 16525 -1162 -7692 7664 21433 17625 3096 -6742 8907
720H907J6909m028j7759j0569J6989J9235o273k4204q148J8916K1979j2224l0807
$$ 8907 25816 21788 4029 -6540 10449 29684 23411 -793 -8941 9975 31954 19730 -11077
733a1077j944K4494K0584j9399l3618N126L3829J2920k7278l0519J2220M1103
$$ -11077 -13021 11473 32057 12658 -20960 -15834 17995 30915 3637 -26882 -14662 26441
745B6441J538l6002k3815K3626L9827r117m1809j3470L5280L3015j9297m4063
$$ 26441 27979 -8023 -31838 -8212 31615 22498 -19311 -32781 2499 35514 16217 -27846
757b7846J465M2819K1168k8757l9816J4513M4882P483l7843k8207K3983M0992
$$ -27846 -26381 16438 37606 8849 -30967 -16454 28428 35911 -1932 -30139 -6156 34836
769C4836m921m3408j2592L1496L1841j5857m0518O2L6256J9663k5374l1792R271
$$ 34836 29915 -13493 -26085 5411 37252 21395 -19123 -19061 17195 36858 11484 -20308 -11037
782a1037L5647N810l0484k1025J5174L0830o563k9221r667J9946K1066j1270k4844
$$ -11037 24610 30420 -64 -21089 -5915 24915 18352 -10869 -20536 -590 20476 9206 -15638
795a5638N20K2403Q718j2392j7542O193J8311K89j2127r474O890J0460k789j0035
$$ -15638 -15118 7285 16003 3611 -13931 -7738 10573 10862 -1265 -10739 -3849 6611 3822 -6213
809f213j821M572M072j412n013K776P19M90J526P13P03l308k729N320M257o865
$$ -6213 -8034 -3462 610 -802 -5815 -3039 -2320 -1830 -304 409 1112 -2196 -4925 395 4652 -2213
825b213p436j791Q539M440j3165r353M710J2828J225j5610q639J3925J4871n466
$$ -2213 -9649 -11440 -2901 1539 -11626 -20979 -16269 -3441 -2216 -17826 -26465 -12540 2331 -3135
839c135j7196m770K1138J1585j2992j8190J927K3116O580k0497j6126J2411K1835
$$ -3135 -20331 -25101 -3963 7622 -5370 -23560 -21633 1483 8063 -12434 -28560 -16149 5686
852E686J537k3443r427K2218J8473n985k2371j213K4470J3495j6212j9307N253
$$ 5686 7223 -16220 -25647 -3429 15044 9059 -13312 -14525 9945 23440 7228 -12079 -6826
865f826K0778N485k3238j3954J0456J6429k762k2248o438J5122J2253r017j5476
$$ -6826 13952 19437 -3801 -17755 -7299 9130 6368 -15880 -22318 -7196 5057 -3960 -19436
878a9436n15J7464N668j3328p981L551J3115j087j3183l410P745N316m663p222
$$ -19436 -19951 -2487 3181 -10147 -18128 -14577 -1462 -2549 -15732 -19142 -11397 -6081 -10744 -17966
892a7966J830J0291r06k653J163O567O608m041M42P340O694k341n434J786J0920
$$ -17966 -16136 -5845 -6751 -9404 -8241 -1674 4934 893 1335 8675 15369 13028 7594 9380 20300
907B0300J420j2133m446O396J1441n213j6210o90J5314Q693j2089j5075M956K2161
$$ 20300 21720 9587 5141 11537 22978 17765 1555 865 16179 24872 12783 -2292 2664 24825
921B4825J646j9851j2640J1859K1626p516k6256q051K0077J6103j5174k7815J983
$$ 24825 26471 6620 -6020 5839 27465 19949 -6307 -14358 5719 21822 6648 -21167 -19184
934a9184K7959R555k0116k3222J3962L1415K054k5962j4555K1762K7930p147l1443
$$ -19184 8775 18330 -1786 -25008 -11046 20369 22423 -3539 -18094 3668 31598 24451 -6992
947f992m627K5498K0166j6105l0022M120K8054J2416k1941k2549J1456K9434L541
$$ -6992 -11619 13879 34045 17940 -12082 -7962 20092 32508 10567 -11982 -526 28908 32449
960C2449k3783j4327J6082K5933n454k4365p994J7524J7610j0991k3309k779J8453
$$ 32449 8666 -5661 10421 36354 30900 6535 -1459 16065 33675 22684 -625 -3404 15049
973A5049R777j1510j9255J851J8439N793j0436j3784M706J5027M228j0657j0322
$$ 15049 24826 13316 -5939 -4088 14351 20144 9708 -4076 630 15657 19885 9228 -1094
986a094K433J1533M452j1948q775k71J0325N952r951j1069Q60J2451P814p906
$$ -1094 1339 12872 17324 5376 -3399 -3670 6655 12607 2656 -8413 -7553 4898 12712 4806
1000D806j5029L513J6580Q512j0511j8319N798K0777O541j7782j9103R295K5963
$$ 4806 -10223 -6710 9870 18382 7871 -10448 -4650 16127 22668 4886 -14217 -4922 21041
1013B1041K183k5481j5422J5945K9382m596l0753j0034K5515K7740j3877l5101
$$ 21041 23224 -2257 -17679 -1734 27648 23052 -7701 -17735 7780 35520 21643 -13458
1025a3458k951L4553J9294k4200l5934N929L9767R332l3961l1701J8075M0112
$$ -13458 -16409 18144 37438 13238 -22696 -16767 23000 32332 -1629 -33330 -15255 24857
1037B4857o5m1274k2070K9911L6353j0371m4611j0326L7891K9390k1895m3311
$$ 24857 24792 -16482 -38552 -8641 27712 17341 -27270 -37596 295 29685 7790 -35521
1049c5521J496M2756J9568l2461l5439J2374M3814R330l9079k4949K2443M1120
$$ -35521 -34025 8731 28299 -4162 -39601 -27227 16587 25917 -13162 -38111 -15668 25452
1061B5452j949m0062j5968L1112L2754j2563l7915p884L5344K2463k0226l3978
$$ 25452 23503 -16559 -32527 -1415 31339 18776 -19139 -27023 8321 30784 10558 -23420
1073b3420O65L5649J3456k4266k8449Q491L1809Q121k7204k1999J3605K6849L322
$$ -23420 -22755 12894 26350 2084 -26365 -17874 13935 22056 -5148 -27147 -13542 13307 16629
1086A6629k7579j6899J5096K3925r48k5608j3928J6321K3099l830k2911j1902
$$ 16629 -10950 -27849 -12753 11172 10224 -15384 -29312 -12991 10108 6278 -16633 -28535
1098b8535J8251K2930n591k2601r835K0127K2161o897k5984o882K2531K2057j0498
$$ -28535 -10284 12646 7055 -15546 -25381 -5254 16907 10010 -15974 -22856 -325 21732 11234
1111A1234l0130k193K6992K0845j6353l1566K600L3384J7472k4632l0911R078
$$ 11234 -18896 -21089 5903 26748 10395 -21171 -18571 14813 32285 7653 -23258 -14180
1123a4180L8871R900l2815k8264J7686M0556N50l9804k3307K8659L8141q944m4684
$$ -14180 24691 34591 1776 -26488 -8802 31754 32304 -7500 -30807 -2148 35993 27049 -17635
1136a7635j3539L8822L2447j9322m5397k336M5564K4485l1430m2181J0486M7415
$$ -17635 -31174 7648 40095 20773 -24624 -26960 18604 43089 11659 -30522 -20036 27379
1148B7379J4477m2401l3826K2387M6212J997m8009k2963L3578M1632j1841m7571
$$ 27379 41856 -545 -34371 -11984 34228 36225 -11784 -34747 -1169 40463 28622 -18949
1160a8949j1680M2270L2601k4473m3674j65M6018K0548l3401l6796J1520M4074
$$ -18949 -30629 11641 44242 19769 -23905 -24070 21948 42496 9095 -27701 -16181 27893
1172B7893R535l7983k8914K2313L8104O32l8720j9693K8328L1948q079l6695j0935
$$ 27893 37428 -555 -29469 -7156 30948 31580 -7140 -26833 1495 33443 25364 -11331 -22266
1185b2266K9684K5677j4965l2978l783K8915K0238j9610k8275J850K7991J5130
$$ -22266 7418 33095 18130 -14848 -18631 10284 30522 10912 -17363 -15513 12478 27608
1197B7608k1063k4520N551K7481R506k0502k2704Q502K6748N755k1704k1448J1859
$$ 27608 6545 -17975 -12424 15057 24563 4061 -18643 -10141 16607 22362 658 -20790 -8931
1210h931K5807L778k4731j8461J4137K7271R62k8062j5469J7938K7892l828l1259
$$ -8931 16876 20654 -4077 -22538 -8401 18870 19832 -8230 -23699 -5761 22131 18303 -12956
1223a2956j1994K2917K7334j0271l3443q242K9912K3947j6994l4399j943L6575
$$ -12956 -24950 -2033 25301 15030 -18413 -26655 3257 27204 10210 -24189 -26132 10443
1235A0443J8739k4893l3531P669L9728J1961l3421k9859J8609L9079K733m0553
$$ 10443 29182 4289 -29242 -21573 18155 30116 -3305 -33164 -14555 24524 27257 -13296
1247a3296k2478K8461L6085q467m3567j1830L6656L0840k1029m1243m88M1818
$$ -13296 -35774 -7313 28772 20305 -23262 -35092 1564 32404 11375 -29868 -30356 11462
1259A1462K1982l1769l5545J0793M3019J0073l8015k8397K1984L9660j799l9403
$$ 11462 33444 1675 -33870 -23077 19942 30015 -8000 -36397 -14413 25247 23448 -15955
1271a5955j9339L1096L3303j1728l7737q489L5724K5164k0209l4281J917L4750
$$ -15955 -35294 -4198 29105 17377 -20360 -28849 6875 32039 11830 -22451 -20534 14216
1283A4216J6336k6358k8741J0738L1019P807k8820k1428J6569K7636m35k7532
$$ 14216 30552 4194 -24547 -13809 17210 25017 -3803 -25231 -8662 18974 18539 -8993
1295h993j3602J9210K3554o712k4483q492J9568J8649j0691k1807m435J9222J4372
$$ -8993 -22595 -3385 20169 13457 -11026 -19518 50 18699 8008 -13799 -18234 988 15360
1308A5360j1757k0424n64J9010J1078j0800j8503K816J8911R740j1381j7184L579
$$ 15360 3603 -16821 -17385 1625 12703 1903 -16600 -13784 5127 14867 3486 -13698 -10119
1321a0119J9738Q301j4206j6255M093K0352O502j7658j5867P327K2413L578k0009
$$ -10119 9619 17920 3714 -12541 -8448 11904 18406 748 -15119 -7792 14621 18199 -1810
1334a810j4846J3038K2963L33k3591j2063J9234K1608n697k7210p526K3685J8684
$$ -1810 -16656 -3618 19345 19678 -3913 -15976 3258 24866 19169 -8041 -15567 8118 26802
1347B6802j3891k7873n91K7365J4849k1129k4795Q050K9869Q838k6682j9878J6543
$$ 26802 12911 -14962 -15553 11812 26661 5532 -19263 -11213 18656 27494 812 -19066 -2523
1360b523K9546l47k9618j4336K3054K5639j0763l0459o734K7611J8610j8562k7350
$$ -2523 27023 26676 -2942 -17278 5776 31415 20652 -9807 -16541 11070 29680 11118 -16232
1373a6232K742K9613J0729k3243k2120J2750K7484K719k5786j5647J9017K2556
$$ -16232 -13490 16123 26852 3609 -18511 -5761 21723 24442 -1344 -16991 2026 24582
1385B4582o034k6286p562K1362J6514j2938k3147J056K1648J0736j6675j6880
$$ 24582 18548 -7738 -15300 6062 22576 9638 -13509 -12453 9195 19931 3256 -13624
1397a3624Q013K0322M753j7110j0404J1043J6871j446j5713o768J1527J2207o282
$$ -13624 -5611 14711 19464 2354 -8050 2993 19864 18418 2705 -4063 7464 19671 13389
1410A3389j3050l648J0897P521o683j0126l96R540N157n114q089J564P012L719
$$ 13389 339 -3309 7588 15109 8426 -1700 -2096 7444 12601 7487 -602 962 7974 11693
1424A1693m571p395Q40M854K563m472p110j147N148K929m072o730j367P516M394
$$ 11693 7122 -273 567 5421 7984 3512 -3598 -4745 403 3332 -740 -7470 -8837 -1321 3073
1439C073m348p186M40R963M806o617q511K999R791L643j0631q664N989J0394R9
$$ 3073 -1275 -8461 -8021 1942 6748 131 -8380 -5381 4410 8053 -2578 -11242 -5253 5141 5240
1454E240j2754o433R659J1317l857j2894k270J3451J0417q654j2542K397J4779
$$ 5240 -7514 -13947 -4288 7029 3172 -9722 -11992 1459 11876 3222 -9320 -6923 7856
1467G856N716j2846j1550O767J4505r16j5130q522J1619J2442o188j4980k267
$$ 7856 13572 726 -10824 -4057 10448 9532 -5598 -14120 -2501 9941 3753 -11227 -13494
1480a3494J5461Q771j0397j2644M129J6072L237j3934r732R585J2370k960j5343
$$ -13494 1967 10738 341 -12303 -8174 7898 11135 -2799 -12531 -2946 9424 6464 -8879
1493h879n373J2705Q690q252j4178J381J4055N304j1280r547P279J3411N85j2798
$$ -8879 -14252 -1547 7143 -1109 -15287 -13906 149 5453 -5827 -15374 -8095 5316 5901 -6897
1507f897m475J0692R885n199j1995o31J1523N331r993q956L839J1770J54j0771
$$ -6897 -11372 -680 9205 4006 -7989 -8620 2903 8234 -1759 -10715 -6876 4894 5048 -5723
1521e723m450Q173J0033l725r429k13J0318M889o592p506K332R438m32q246n231
$$ -5723 -10173 -2000 8033 4308 -5121 -5334 4984 9873 3281 -4225 -1893 7545 7113 -1133 -6364
1536f364M374O337l152p988j655O596L466l440n925K121O408J317l271l699L295
$$ -6364 -1990 4347 1195 -6793 -8448 -1852 1614 -1826 -7751 -5630 778 2095 -1176 -4875 -1580
1551a580M169l29l995j404K090K041j359l334M80P09J757l03r88L78P85J751J466
$$ -1580 2589 2260 -1735 -3139 -1049 992 -367 -3701 -3221 -2512 -755 -1058 -2046 -1668 -883 868 2334
1568B334O80j171M88J758K296q1m326o46K722K595l138n759m82N714K505n489
$$ 2334 3014 1843 2331 4089 6385 6304 1978 1332 4054 6649 3511 -2248 -2730 2984 5489 0
1584@n550K109R068J121p815m463O243R513k083j0522l140R790P209o027j2594
$$ 0 -5550 -3441 5627 6748 -1067 -5530 713 10226 8143 -2379 -5519 4271 11480 5453 -7141
1599g141O5J2549M640j0581j1057N440J4808J367j3821p254J1037J4531l077j6032
$$ -7141 -7076 5473 10113 -468 -11525 -6085 8723 10090 -3731 -10985 52 14583 11506 -4526
1613d526k827J4612J1481r770j6778K139J6660O454j5159j4089P214J8035O16
$$ -4526 -7353 7259 18740 8970 -7808 -5669 10991 17445 2286 -11803 -4589 13446 14062
1626A4062j7408q925J2603J7038m654j7875l811J6860J2323j0003j7115R80J7853
$$ 14062 -3346 -12271 332 17370 12716 -5159 -8970 7890 20213 10210 -6905 -5925 11928
1639A1928O244j4006j4813N766J7186J305j5605j0446J0676J4852k421j5712m646
$$ 11928 18172 4166 -10647 -4881 12305 13610 -1995 -12441 -1765 13087 10666 -5046 -9692
1652i692J3227J1557n620j4923o78J3068P349r008j2587J529J1855M025j0873
$$ -9692 3535 15092 9472 -5451 -6129 6939 14288 5280 -7307 -5778 6077 10102 -771
1665g71q900L163J1357J475r531o168M987J0039P14q666n271N697P820M27q463
$$ -771 -9671 -6508 4849 6324 -3207 -9375 -4388 5651 6365 -2301 -7572 -1875 5945 6372 -2091
1680b091n709N648O832j88q507m981N378Q078lq760m621O743J0377j054r988m285
$$ -2091 -7800 -2152 4680 4492 -4015 -8996 -3618 4460 4457 -4303 -8924 -2181 8196 7142 -2846 -7131
1696g131Q776J0885l969j2430l373J1481R424p080j4308j175J4499P375j0168
$$ -7131 1645 12530 8561 -3869 -7242 4239 13663 6583 -7725 -8900 5599 12974 2806
1709B806j5288L780J7282M527j4393j3376Q934J7795N22j9003r803J3330J6692
$$ 2806 -12482 -8702 8580 13107 -1286 -14662 -5728 12067 12589 -6414 -16217 -2887 13805
1722A3805n037k1129n167J7196J4648j1543k0510M67K1563J0062j5904j7400O918
$$ 13805 8768 -12361 -17528 -332 14316 2773 -17737 -17270 4293 14355 -1549 -18949 -12031
1735a2031K3275L778j8897j3686J2823K1467k114k1192q588J7856J6962q335k1021
$$ -12031 11244 15022 -3875 -17561 -4738 16729 14615 -6577 -15165 2691 19653 11318 -9703
1748i703k374K0227J2064j2767j8798M135K0103O823j5962j4642Q298J8255J542
$$ -9703 -12077 8150 20214 7447 -11351 -7216 12887 19710 3748 -10894 -2596 15659 17201
1761A7201j8023r872J1107J5148l250j7575n742J2569J1858o885j5107k168J3401
$$ 17201 -822 -10694 413 15561 12311 -5264 -11006 1563 13421 6536 -8571 -10739 2662
1774B662Q440q191j2327J62J2863O108q718j0142K195J1257M307q080q993L577
$$ 2662 11102 2911 -9416 -9254 3609 9717 999 -9143 -6948 4309 8616 536 -8457 -4880
1788d880J0110L861q396q142M180J0253L168q647p394M338J0978K270r642p982
$$ -4880 5230 9091 695 -7447 -3267 6986 10154 1507 -5887 -1549 9429 11699 2057 -5925
1802e925N657J2286L59j1305p748Q020J2507k058j3758n991J1175J1814m905j5559
$$ -5925 -268 12018 12377 1072 -6676 1344 13851 11793 -1965 -7956 3219 15033 10128 -5431
1816e431l207J3557J0673q502j6640N62J6381Q141j3252j4914M362J8504M376
$$ -5431 -8638 4919 15592 7090 -9550 -8988 7393 15534 2282 -12632 -8270 10234 14610
1829A4610j6864j2162R585J8610q37j8905q739J4450J6435o278j9624l990J8243
$$ 14610 -2254 -14416 -4831 13779 12942 -5963 -14702 -252 16183 9905 -9719 -13709 4534
1842D534J2561j1504j8185J627K0699P199j4988j5282P937J9002K517j7807j0601
$$ 4534 17095 5591 -12594 -10967 9732 16931 1943 -13339 -5402 13600 16117 -1690 -12291
1855a2291J2397J6309l331j8584n697J4553J2578p873j7186n60J5221Q580j1131
$$ -12291 106 16415 13084 -5500 -11197 3356 15934 8061 -9125 -9685 5536 14116 2985
1868B985j3676L558J4783M708j2590r680N584J3023O36j2120p400P449J0019k172
$$ 2985 -10691 -7133 7650 12358 -232 -9912 -4328 8695 9331 -2789 -10189 -2740 7279 5107
1882E107j0342n116Q124P329k997r159k381P744O013k923p418j135O539N500l219
$$ 5107 -5235 -10351 -2227 5102 2105 -7054 -9435 -1691 4322 1399 -6019 -7154 -615 4885 1666
1897A666p071n69N285N246l884o761j680N843M970l577p477j475P828N018l608
$$ 1666 -5405 -5974 -689 4557 673 -6088 -7768 -1925 3045 -532 -8009 -9484 -1656 3362 -246
1912b46q968K40R041N006o012r224J809R890L428r064r083L776J0762J578j1936
$$ -246 -9214 -8974 67 5073 -939 -10163 -8354 1536 4964 -4100 -13183 -9407 1355 2933 -9003
1927i003p356P227J1679j149j2719m711J0925J0686n026j2753j486J3542P342
$$ -9003 -16359 -9132 2547 1398 -11321 -16032 -5107 5579 553 -12200 -13686 -144 7198
1940G198q830j2350K046J3940L730j1687j0583O446J3376J68j3097o644J0761
$$ 7198 -1632 -13982 -11936 2004 5734 -5953 -16536 -10090 3286 3454 -9643 -16287 -5526
1953e526J1461l219j2825k407J2233Q457p042j1493J046J1518M985j0225r128
$$ -5526 5935 2716 -10109 -12516 -283 8174 1132 -10361 -9315 2203 7188 -3037 -12165
1966a2165M027J0573J584j0456n550O543R047j393q546k330P768O598l588o836
$$ -12165 -8138 2435 4019 -6437 -11987 -5444 3603 2210 -6336 -8666 -898 5700 2112 -4724
1980d724k63O704L074m493n399J052M655Q07m131l337J904L061Q86k761j443J880
$$ -4724 -4987 1717 4791 298 -5101 -4049 606 1413 -2718 -6055 -4151 -1090 -204 -2965 -4408 -2528
1996b528K029J121j129n96M0J252O38k57j585j947J207J527M02l281k099K281
$$ -2528 -499 622 -507 -1103 -1063 189 827 570 -1015 -2962 -1755 -228 174 -3107 -5206 -2925
2012b925L590J11l791j346M305N314j659m888l21N678M758m419n907O57P199K069
$$ -2925 665 776 -3015 -4361 -56 5258 3599 -1289 -1610 4068 8826 4407 -1500 -843 6356 8425
2028H425o273o029K978P802j7p371m427O152P179j810p801j837P843N737m852
$$ 8425 2152 -3877 -899 6903 6886 -485 -4912 1240 8419 6609 -1192 -3029 4814 10551 5699
2043E699q207P15P519K505o827p490L357O742J36p798m293M989O699j678p156
$$ 5699 -2508 -1793 5726 8231 1404 -6086 -2729 4013 4149 -3649 -7942 -2953 3746 2068 -5088
2058e088j004N901N535l755n522J120N319K687m688m062J577M804j79m278j882
$$ -5088 -6092 -191 5344 1589 -3933 -2813 2506 5193 505 -3557 -1980 2824 2645 -1633 -3515
2073c515K227L861j219k350k91K848J972o29q01P84J726l2m43j38K89p76j097
$$ -3515 -1288 2573 1354 -996 -1287 1561 3533 2904 2103 2887 4613 4581 4138 4000 4289 3513 2416
2090B416J037L31r23k598K00K294J217k924k483K015L760Q74m909j826L505M403
$$ 2416 3453 3784 2861 263 463 2757 3974 1050 -1433 582 4342 5216 307 -1519 1986 6389
2106F389j892o351j449N363L712n116o668L09P457K207p289n897L742Q718j37
$$ 6389 4497 -1854 -3303 2060 5772 656 -6012 -5703 1754 3961 -3328 -9225 -5483 3235 3098
2121C098q333l910P100P779k938r211j653Q692N710o254r159J240R724L390q526
$$ 3098 -5235 -9145 -2045 5734 2796 -6415 -8068 624 6334 80 -9079 -7839 1885 5275 -3251
2136c251p365M608R849N22r295m436P286Q694j858r377j914Q437O186m976q540
$$ -3251 -10616 -6008 3841 4363 -4932 -9368 -2082 6612 4754 -4623 -6537 1900 8086 3110 -5430
2151e430M59Q298L616o913o525K087P957J240o754m609L636O684k93o094l208
$$ -5430 -4971 3327 6943 30 -6495 -4408 3549 4789 -1965 -6574 -2938 3746 3453 -2641 -5849
2166e849M443N314j604n511k296L840L497j739n218j461L240K776j373m008j105
$$ -5849 -1406 3908 2304 -3207 -5503 -1663 1834 95 -5123 -6584 -3344 -568 -1941 -5949 -7054
2181g054K748L612p66l689j475K837M516r54m271k149L795M559q09o158k084N643
$$ -7054 -4306 -694 -1460 -5149 -6624 -3787 729 -225 -4496 -6645 -2850 1709 900 -5258 -7342 -1699
2197a699M628j701p429p11O979N926m662p350Q19R036M825p471p133K974J0083
$$ -1699 2929 1228 -6201 -6912 67 5993 1331 -6019 -5200 3836 8661 1190 -5943 -2969 7114
2212G114K374r935o931N917J0770j232j1266n087R091R761m615j2076j858J1669
$$ 7114 9488 -447 -7378 -1461 9309 8077 -3189 -8276 815 10576 5961 -6115 -7973 3696
2226C696P391p732j1845J960J2602M227j0733j0115N733J2147R69j2769p204Q946
$$ 3696 11087 3355 -8490 -6530 6072 10299 -434 -10549 -4816 7331 8300 -4469 -11673 -2727
2240b727J1180k569j3052l921J1000R766o274j2101Q6J1691O980q797j0000K861
$$ -2727 8453 5884 -7168 -11089 -89 9677 3403 -8698 -8612 3079 10059 1262 -8738 -5877
2254e877J2130K859r523q349O134J0637j0j0064n644P768Q584k117r713k560P698
$$ -5877 6253 9112 -411 -8760 -2626 8011 8001 -2063 -7707 61 8645 6528 -3185 -5745 1953
2269A953P016l943q866p73P468M735m918p436K95O851L724m961o617R80O468K937
$$ 1953 8969 5026 -3840 -4613 2855 7590 2672 -4764 -4469 2382 6106 1145 -5472 -4492 1976 4913
2285D913m912n910R64O784K505n329n859J694P302J871n584o066K860P675J851
$$ 4913 1 -5909 -4945 1839 4344 -985 -6844 -5150 2152 4023 -1561 -7627 -4767 2908 4759
2300D759p347n264M300Q145J052q620m802N848Q907j185j0153l530Q137Q301m187
$$ 4759 -2588 -7852 -3552 4593 5645 -2975 -7777 -1929 6978 5793 -4360 -7890 247 8548 4361
2315D361j0259j973J0536O978p126j0517R33J1980M927r528j0052M559J2335J404
$$ 4361 -5898 -7871 2665 9643 2517 -8000 -7067 4913 9840 312 -9740 -5181 7154 8558
2329H558j1621q557P975J1748j760j3348n109J0788J0394n683j3507q49J2415
$$ 8558 -3063 -11620 -3645 8103 6343 -7005 -12114 -1326 9068 3385 -10122 -10971 1444
2342A444Q075r005j2112K959J3290M445j1643r349N954J3148pj2429o515Q552
$$ 1444 9519 514 -11598 -8639 4651 9096 -2547 -11896 -5942 7206 7199 -5230 -11745 -3193
2356c193J1448l466j1663l191J0452Q789o152j0365M0J0485N524p404r317K556
$$ -3193 8255 4789 -6874 -10065 387 9176 3024 -7341 -7301 3184 8708 1304 -8013 -5457
2370e457J0214K680q484p545M902Q316Q78q643n001N536P286j125p697k809N262
$$ -5457 4757 7437 -1047 -8592 -3690 4626 5504 -3139 -8140 -2604 4682 3557 -4140 -6949 -1687
2385a687O831k570o699j582N239N103k744o700j373N454M333l046n863j024N735
$$ -1687 5144 2574 -4125 -5707 -468 4635 1891 -4809 -6182 -728 3605 559 -5304 -6328 -593
2400e93L837k864o030P3O392L867l779o200P20O614L715n559o070J261P691K409
$$ -593 3244 380 -5650 -5577 815 4682 903 -5297 -4577 2037 5752 193 -5877 -4616 3075 5484
2416E484o877o030L018Q779R36p854n111N478Q965j030q927l911P847P883l498
$$ 5484 -1393 -7423 -4405 4374 5310 -2544 -7655 -2177 6788 5758 -3169 -7080 767 8650 5152
2431E152r906j689R819O108o184j0289J741J0376L937q855q569M930J0693J017
$$ 5152 -4754 -6443 3376 9484 3300 -6989 -5248 5128 9065 210 -8359 -3429 7264 8281
2445H281j0033n808P064R810k121j1092k882Q835P577n480j0133n26R798M982
$$ 8281 -1752 -7560 -496 9314 7193 -3899 -6781 2054 9631 4151 -5982 -6508 3290 8272
2459H272p751q567K821J0144J731q526o165N707Q808p46q916l747P267O807l317
$$ 8272 521 -8046 -5225 4919 6650 -1876 -8041 -2334 6474 5728 -3188 -6935 332 7139 3822
2474C822q148q77P288M447m645p028J249O730L159n431n039L104N684J342n272
$$ 3822 -4326 -5203 2085 6532 1887 -5141 -3892 2838 5997 566 -4473 -1369 4315 5657 385
2489C85k891L278M552l29m800j824K808L728j526m276j194K798K522j089l693
$$ 385 -2506 772 5324 4995 195 -1629 1179 4907 3381 -895 -2089 709 3231 2142 -1551
2504a551q88K363K023o38l104r73K436J895n72l364r42K086K547j099l638r76
$$ -1551 -2439 -76 1947 1309 -1795 -2768 -332 1563 991 -2373 -3315 -1229 1318 219 -3419 -4395
2520d395K625K882j823l792o52L937L108k558m280O33N206K163l679m260K238
$$ -4395 -1770 1112 -711 -4503 -5155 -1218 1890 -668 -4948 -4315 891 3054 -625 -4885 -2647
2535b647N400O16m859l444L861N159j009o308j649M896M643k897o157M43N813
$$ -2647 2753 3369 -1490 -4934 -1073 4086 3077 -3231 -4880 16 4659 1762 -4395 -3952 1861
2550A861L398m892m957K019O251J269o207l977L785O095j496o379k291N694M517
$$ 1861 5259 367 -4590 -2571 3680 4949 -1258 -5235 -1450 4645 3149 -3230 -5521 173 4690
2565D690l798n790k0O560K454n023m703K350O251k08n400l040M330M761j943n580
$$ 4690 892 -4898 -4918 1642 4096 -927 -5630 -3280 2971 2763 -2637 -5677 -1347 3414 1471 -4109
2581d109q49M984L024l224m898J339M841J292m230l304K910M394l56m720r99L394
$$ -4109 -4958 26 3050 -174 -5072 -3733 1108 2400 -1830 -5134 -2224 2170 1814 -2906 -3905 -511
2597e11L172j842l767M71L351K016l376k211J249L256L35l518r08J721K713j363
$$ -511 2661 819 -2948 -2477 874 2890 -486 -2697 -1448 1808 2143 -1375 -2283 -562 2151 788
2613G88k036m47K589O32j510j386O26K124l54j450p24R14J272q33r41k00J096
$$ 788 -1248 -1695 894 1526 16 -1370 -744 1380 1026 -424 -1148 -234 1038 205 -736 -936 160
2630A60J82m83n28L13M51j84N4j26L70n78M91J03K12j51p87P85L93j6j075n06
$$ 160 342 -141 -669 -356 95 -89 -35 -161 209 -369 122 225 437 286 -501 284 677 661 -414 -920
2650i20R54R31q74j722J75J890P99j930j993J722K154J84l025r48K547K184j541
$$ -920 34 965 91 -1631 -1456 434 1233 -697 -2690 -968 1186 1370 -1655 -2603 -56 2128 587
2667E87k966k68L190K053l030k768J171M194M03l587k309K887M744j446m162j130
$$ 587 -2379 -2647 543 2596 -434 -3202 -2031 2163 2566 -1021 -3330 -443 4301 2855 -1307 -2437
2683b437M587L717l059m504O01N305J876m082m613K686N623p5n701l206M537M942
$$ -2437 2150 5867 2808 -1696 -1095 4210 6086 2004 -2609 77 5700 5625 -76 -3282 1255 6197
2699F197j885o255j271N944L689l980o069P60O614J845o042m416K802N957l4o671
$$ 6197 4312 -1943 -3214 2730 6419 2439 -3630 -2870 3744 5589 -453 -4869 -2067 3890 3856 -2815
2715b815k807M264N472k208o131j620O264L429l567n080L42O447K110m789m361
$$ -2815 -5622 -1358 4114 1906 -4225 -5845 419 3848 281 -4799 -4457 1990 4100 -689 -5050
2730e050K704N637J56n090l176L535M607o61n001j777M180L395j597m340m13M057
$$ -5050 -2346 3291 3447 -1643 -4819 -1284 3323 2662 -2339 -4116 64 3459 1862 -2478 -2891 1166
2746A166K193k288l681L07L513J855k748k878K54L116J493k562k730J95L320J242
$$ 1166 3359 1071 -2610 -2303 1210 3065 317 -2561 -2307 809 2302 -260 -2990 -2795 525 1767
2762A767k318k716Q35K959J622k674l452J330L855R22l234l154J444M296R63m710
$$ 1767 -551 -3267 -2432 527 2149 -525 -3977 -2647 1208 2130 -1104 -4258 -2814 1482 2445 -2265
2778b265k912K394M830K8n344k448L735N141j473o001j961N865M427l104o816
$$ -2265 -5177 -2783 2047 2075 -3269 -5717 -1982 3159 1686 -4315 -6276 -411 4016 912 -5904
2793e904J55O955L158n166o530K276P530K106p218n261M531P693m16p990l680
$$ -5904 -5749 1206 4364 -802 -7332 -5056 2474 4580 -2638 -7899 -3368 4325 3909 -4081 -7761
2808g761O688O814k753q484j125P662N735n287p970J059Q534L642o999o733L418
$$ -7761 -1073 5741 2988 -5496 -6621 1041 6776 1489 -6481 -5422 3112 6754 -245 -6978 -3560
2823c560Q730Q38p966n197N661Q008j735q437l337P373O251l461q486n63P623
$$ -3560 5170 6008 -1958 -7155 -1494 6514 4779 -3658 -6995 378 6629 3168 -5318 -5881 1742
2838A742M639n173p286J548P541K295n854o094L299O614J022o633m217M157N940
$$ 1742 6381 1208 -6078 -4530 3011 5306 -548 -6642 -3343 3271 4293 -2340 -6557 -2400 3540
2853C540n54o386k348M183N067j941n397j571M814M100k428n108o05M861L154
$$ 3540 2986 -3400 -5748 -1565 3502 1561 -3836 -5407 -593 3507 1079 -4029 -4634 227 3381
2868C381k535m812J37M802K416k602m796Q05M630K631l266m747J069N380K567
$$ 3381 846 -3966 -3829 973 3389 787 -4009 -3204 1426 4057 791 -3956 -2887 2493 5060
2883E060m758m567J749O178J120n201m286K861O664Q6o285m088M846O124j387
$$ 5060 302 -4265 -2516 3662 4782 -419 -4705 -1844 4820 4906 -1379 -5467 -621 5503 4116
2898D116o971k811O399N404k618q213p60P359M931n222p574J519P915L296p402
$$ 4116 -2855 -5666 733 6137 3519 -4694 -5454 1905 6836 1614 -5960 -4441 3474 6770 -632
2913f32o421L855Q463Q71q489n077N956Q327j861q777l011P561O885l929q944
$$ -632 -7053 -3198 5265 6136 -2353 -7430 -1474 6853 4992 -3785 -6796 765 7650 3721 -5223
2928e223n51Q562M991n786p981J638R165K681p603o548M488Q360M85q138m417
$$ -5223 -5774 2788 7779 1993 -5988 -4350 4815 7496 -107 -6655 -2167 6193 6678 -1460 -5877
2943e877N644O807j471p978k259O349N401l471p314n14O907L977n079n889J272
$$ -5877 -233 6574 5103 -2875 -5134 1215 6616 3145 -4169 -4683 2224 6201 1122 -4767 -3495
2958c495O254K359n489m474K049N850P61n506l542L085N159m55m967k425L128
$$ -3495 2759 5118 -371 -4845 -2796 3054 3815 -1691 -5233 -2148 3011 2556 -2411 -4836 -1708
2973a708M260o34m694j847L815L303o73m709j093L564L634j450m361j193L949
$$ -1708 2552 1918 -2776 -4623 -808 2495 1822 -2887 -3980 -416 3218 1768 -2593 -3786 163
2988A63L798k625m807m32M554L311l235m778j33N594K525l869n253J607N630J606
$$ 163 3961 1336 -3471 -3903 651 3962 727 -4051 -4184 1410 3935 66 -5187 -3580 2050 3656
3004C656m838m796K669N840P22o293l968M155N911j053o628k776N604N782k649
$$ 3656 -1182 -5978 -3309 2531 3253 -3040 -7008 -2853 3058 2005 -4623 -7399 -1795 3987 1338
3019A338o826j156O784M676m762o623J343P253K854n723n900K956P601O97o784
$$ 1338 -5488 -6644 140 4816 54 -6569 -5226 2027 4881 -842 -6742 -3786 3815 4512 -2272
3034b272m228M923O708j203p002k644N972N650l126p095k33O551L320m541n784
$$ -2272 -6500 -1577 5131 3928 -3074 -5718 254 5904 2778 -4317 -4550 2001 5321 780 -5004
3049e004J622O326J750n349m511K900N765K14n732k421L665M808j413n127j231
$$ -5004 -3382 2944 4694 -655 -5166 -2266 3499 3713 -2019 -4440 -775 4033 2620 -2507 -3738
3064c738L872L987k501m186p27M424K321k734l585O86L836J181k398k694J146
$$ -3738 134 4121 1620 -2566 -3293 1131 3452 718 -2867 -2181 1655 2836 438 -2256 -1110
3079a110K859R07j982k493J003K749R35k483k018J151K473O28k451j781R33K663
$$ -1110 1749 2656 674 -1819 -816 1933 2868 385 -1633 -482 1991 2619 168 -1613 -680 1983
3095A983O68k264j830J311K966J34k401k130J792L168j64l366j863K769K660o68
$$ 1983 2651 387 -1443 -132 2834 2968 567 -1563 229 3397 3233 -133 -1996 773 3433 2765
3111B765l692j157L124K847j743m131r5L935K574l103l839N98M745J188m105l371
$$ 2765 -927 -2084 1040 3887 2144 -1987 -2082 1853 4427 1324 -2515 -1917 2828 4016 -89 -3460
3127c460K237M573j38m661k348L431L785j318m495r32M103L247k213m498Q25M709
$$ -3460 -1223 3350 3212 -1449 -3797 -366 3419 2101 -2394 -3326 777 4024 1811 -2687 -1862 2847
3143B847J601l332l716J939M325N58m095k328K673L391n17l960o01K867K654j767
$$ 2847 4448 1116 -2600 -661 3664 4222 127 -2201 472 3863 3346 -614 -1215 1652 4306 2539
3159B539l585L50L148J485k357k529Q90K741J89k317j709J602J551m37j751j018
$$ 2539 -1046 -696 2452 3937 1580 -949 -59 2682 2871 554 -1155 447 1998 1561 -190 -1208
3175a208J514J080o72j289j30J354M19m87q15L03N54J16k57m17K91j67J81K51
$$ -1208 306 1386 714 -575 -705 649 1068 581 -234 69 623 739 482 65 356 189 370 621
3193F21l16m63r6M47L68n2j052J0R41N66j1j421j01J085R71j125j664M05J877
$$ 621 305 -158 -254 193 561 509 -543 -533 408 974 963 -458 -559 526 1497 372 -1292 -887 990
3212I90M58k141j037R03K028l81k220p60K238J663j086k042n64K618J095j418
$$ 990 1448 -693 -1730 -827 1201 820 -1400 -2160 78 1741 655 -1387 -1951 667 1762 344
3228C44k158P65K228N18k030j898J674K360m87k768o25K035J580j093k497M46
$$ 344 -1814 -1049 1179 1697 -333 -2231 -557 1803 1316 -1452 -2077 -42 1538 445 -2052 -1606
3244a606K042P83j899j308O66J697n3j829n67Q67J728r83j555J74R19Q43r89r76
$$ -1606 436 1219 -680 -1988 -1322 375 322 -1507 -2074 -1207 521 -462 -2017 -1843 -924 -81 -1070 -2046
3262b046M15J163R7j060L37J34P11l70j28J92P03l85n48M46P61L86j029l31Q56
$$ -2046 -1631 -468 -371 -1431 -1094 -960 -249 -619 -747 -555 148 -237 -785 -339 422 808 -221 -552 304
3281C04Q25o78j057N12J158P40j707n85J092J799o79k162j78K031J465j887j685
$$ 304 1129 451 -606 -94 1064 1804 97 -488 604 2403 1724 -438 -616 1415 2880 993 -692
3298f92K24K354P40k452j957J133L039o27k634j482K589K102j408k885j77K845
$$ -692 -468 1886 2626 174 -1783 -650 2389 1762 -872 -2354 235 2337 929 -1956 -2133 712
3314G12J533j805l049R98L184N62k545k390J761L070k83l119j211K512K489j375
$$ 712 2245 440 -2609 -1611 1573 2135 -410 -2800 -1039 2031 1748 -1371 -2582 -70 2419 1044
3330A044l197L16K590K139j912k370K68L176Q24k358j477P39K402J2k374j246
$$ 1044 -2153 -1837 753 2892 980 -1390 -1122 2054 2878 520 -957 -218 2184 2196 -178 -1424
3346a424J429K198o58k047q05J646J330m90j471o91J737P99o36j216j65O56J085
$$ -1424 5 2203 1545 -502 -1307 339 1669 1179 -292 -983 754 1553 917 -299 -464 192 1277
3363A277r38q65k48R03N72m64r94o44R45J087l30q39o23J280J348k14j843m89
$$ 1277 339 -526 -774 129 701 237 -757 -1401 -456 631 301 -538 -1161 119 1467 1253 -590 -1079
3381a079J640J259o71k516n7K068J323j220k969N70K498J348k623j831J004L206
$$ -1079 561 1820 1149 -1367 -1424 644 1967 747 -2222 -1652 846 2194 -429 -2260 -1256 1950
3397A950P06l298j848J957L641q80l472j517L295K879j997l997LL480J788k378
$$ 1950 2656 -642 -2490 -533 3108 2228 -1244 -2761 534 3413 1416 -2581 -2578 902 2690 312
3413C12l896J366M150P61l247k789K601L790P4m322j683L044L494j574m263p25
$$ 312 -3584 -2218 1932 2693 -554 -3343 -742 3048 3122 -1200 -2883 161 3655 2081 -2182 -2907
3429b907L607K662k609l775P18L752J842l340k581J787L814K99l340k000K226
$$ -2907 700 3362 753 -3022 -2304 1448 3290 -50 -2631 -844 2970 3269 -71 -2071 155
3444A55L222p42l350j196K037K173j113l104o49K806J286j502k333L89K398Q76
$$ 155 3377 2635 -715 -1911 126 2299 1186 -1918 -2567 239 1525 23 -2310 -1921 477 1353
3460A353j505k076O74K311N29j946j661O80J522M83j859j082M74J767N26j272
$$ 1353 -152 -2228 -1554 757 1286 -660 -2321 -1641 -119 364 -1495 -2577 -2103 -336 190 -1082
3476a082j139O66K298M96j367r57J138J991K60j407j516Q75K191q8k426j380J756
$$ -1082 -2221 -1555 743 1239 -128 -1085 53 2044 2304 897 -619 256 2447 2359 -67 -1447 309
3493C09K071m02k735q06K578K220j356k766k68K946J856k331k710N9L222Q31k860
$$ 309 2380 1978 -757 -1563 1015 3235 1879 -887 -1155 1791 3647 1316 -1394 -1335 1887 2718 -142
3510a42l042J301L569Jl601k227K751L411q52l802p74L586L074j807l816M02M034
$$ -142 -3184 -1883 1686 1687 -1914 -4141 -1390 2021 1169 -2633 -3407 179 3253 1446 -2370 -1968 2066
3527B066J824k811l510J351M026P32l534k372K143L599k52l654r34K890L066j544
$$ 2066 3890 1079 -2431 -1080 2946 3678 144 -2228 -85 3514 3262 -392 -1326 1564 4630 3086
3543C086l305j01L300J917k675k842M51K988M86k468k398R28K897r4k638j409
$$ 3086 -219 -320 2980 4897 2222 -620 -169 2819 3305 837 -1561 -633 2264 2170 -468 -1877
3559a877J712K053l44k270q15J975J534q69j895q0J316J092r77j807K67J111R61
$$ -1877 -165 1888 1544 -726 -1541 434 1968 1099 -796 -876 440 1532 555 -1252 -985 126 1087
3576A087j271q25J75J421Q70j027r26K60J098R17l88j405R5J091R32q54j637J96
$$ 1087 -184 -1009 -834 587 1457 430 -496 -236 862 1779 1391 -14 81 1172 2104 1250 -387 -191
3594a91J285P48j476j272J47J803P40j749j076N09K235J97j830j436J242K079
$$ -191 1094 1842 366 -906 -759 1044 1784 35 -1041 -532 1703 1900 70 -1366 -124 1955
3610A955m56k326q57J454J852j062k388n83K278J424j391k545O75K612Q41k023
$$ 1955 1499 -827 -1684 -230 1622 560 -1828 -2411 -133 1291 -100 -2645 -1970 642 1483 -540
3626e40j779J114K764J45k837j461K273K081r49k655l90K531J522j635k010L48
$$ -540 -2319 -1205 1559 1704 -1133 -2594 -321 1760 811 -1844 -2234 297 1819 184 -1826 -1478
3642a478K480J024k185j430R97K434n5k456q48J639J891j006k107P8J690Q42j252
$$ -1478 1002 2026 -159 -1589 -592 1842 1787 -669 -1517 122 2013 1007 -1100 -1022 668 1510 258
3659B58j778M59K047j08j381j429J524J113k9j778l55J293P75m58j549K08J007
$$ 258 -1520 -1061 986 878 -503 -1932 -408 705 676 -1102 -1457 -164 611 153 -1396 -1188 -181
3676a81M69q63p32K34J075j69p10k94P88N54k19m97L21K20L71p30J85J71P9N6
$$ -181 288 -575 -1307 -1073 2 -167 -877 -1171 -383 171 -48 -545 -224 -4 367 -363 -178 -7 72 128
3696A28m75M40j27K59o06K13R9j52j48l50N00K12m65l82J75L09K94m28p32P03
$$ 128 -347 93 -34 225 -381 -168 -69 -221 -369 -719 -219 -7 -472 -854 -679 -370 -76 -504 -1236 -533
3716e33L73l05o80q2O51M36p46m60M22R58J52p64n42P86O17k14q11J49Q86O18
$$ -533 -160 -465 -1145 -1227 -576 -140 -886 -1346 -924 34 186 -578 -1120 -334 283 69 -742 -593 293 911
3736I11q86n23M26J060O4r37l73P32J103j011j035N72J177M1j087n20O76J125
$$ 911 25 -498 -72 988 1052 115 -258 474 1577 566 -469 103 1280 1321 234 -286 390 1515
3754A515k90j590r8R54R74j170q57K27J323K45j383q51P73J348m65j385o20J792
$$ 1515 1225 -365 -463 491 1465 295 -562 -335 988 1233 -150 -1001 -228 1120 655 -730 -1350 442
3772D42O17r20j435N81J595M35j296j225J146J571j99j826m54J955J082p11j799
$$ 442 1059 139 -1296 -715 880 1315 19 -1206 -60 1511 1312 -514 -968 987 2069 1358 -441
3789d41J7J947P75j291j786J111J547N31j880j054J230J831q66j838j29J290J372
$$ -441 -424 1523 2298 1007 -779 332 1879 2410 530 -524 706 2537 1671 -167 -296 994 2366
3806B366j321j727K20J811N65j800j107N66J644k3j635q10J056J480p82j433l46
$$ 2366 1045 -682 -462 1349 1914 114 -993 -427 1217 1194 -441 -1251 -195 1285 503 -930 -1276
3823a276J259Q98n78j101PQ10N09l73j124J83R99L52m36r52L93N75R21q81n80
$$ -1276 -17 881 303 -798 -791 19 528 155 -969 -786 213 565 129 -823 -430 145 1066 185 -395
3842c95j69J205J73n39q39J18J018M35n86q07k37J243O72j031j036l0J405M56
$$ -395 -564 641 814 275 -564 -446 572 1007 421 -386 -623 620 1292 261 -775 -805 600 1056
3860A056j287j353O81J778K89j907r41P56K113l90k013q52J550J901q76k192m56
$$ 1056 -231 -1584 -903 875 1164 -743 -1684 -928 1185 795 -1218 -2070 -520 1381 505 -1687 -2143
3877b143K545J104j427k177L88K685Q18k164k138J361K779J86k523j708K001K729
$$ -2143 402 1506 79 -2098 -1710 975 1793 -371 -2509 -1148 1631 1817 -706 -2414 -413 2316
3893B316o81l156n73K715K166j784k948M06K670J487k259k638Q68L207L88k840
$$ 2316 1635 -1521 -2094 621 2787 1003 -1945 -1539 1131 2618 359 -2279 -1411 1796 2184 -656
3909f56j734J821K765k67l133j289K491K151r66l331l42K804J506j760k610j67
$$ -656 -2390 -569 2196 1929 -1204 -2493 -2 2149 1183 -2148 -2490 314 1820 60 -2550 -2717
3925b717K729J384k145j968P27K640K32j876j450J461K143J74k166j172J444K164
$$ -2717 12 1396 -749 -2717 -1990 650 882 -994 -2444 -983 1160 1334 -832 -2004 -560 1604
3941A604l61k204p89J573J623l75j798n92J543J759p91j701l68J860J195o79k390
$$ 1604 1243 -961 -1750 -177 1446 1071 -727 -1319 224 1983 1192 -509 -877 983 2178 1499 -891
3958h91K58J763J065j565j731k68K057R83j631k241L89K273J013k319j779R79
$$ -891 -633 1130 2195 630 -1101 -1369 688 1671 40 -2201 -1812 461 1474 -845 -2624 -1645
3974a645K547M48k278j749J628K786m15k752j437K316K628j087k982p18L032K386
$$ -1645 902 1350 -928 -2677 -1049 1737 1322 -1430 -2867 -551 2077 990 -1992 -2710 322 2708
3990B708k005k789K84L779J402k274l156J506L729P69l426k261J921L368j29m123
$$ 2708 703 -2086 -1802 1977 3379 1105 -2051 -545 3184 3953 527 -1734 187 3555 3426 -697
4006f97j331K367K803j054l751m52L154K177j874l411K25L406J328k513l101J228
$$ -697 -2028 339 3142 2088 -1663 -2115 1039 3216 1342 -2069 -1844 1562 2890 377 -2724 -1496
4022a496L624j8k916k262K028L212o14l096j665K464K910r73l024l91K968J976
$$ -1496 2128 2110 -806 -3068 -1040 2172 1558 -1538 -3203 -739 2171 1198 -1826 -2217 751 2727
4038B727j478k532p6K823J185j749k210M02K526Q81k286j943Q85K675M6j950j343
$$ 2727 1249 -1283 -1359 1464 2649 900 -1310 -908 1618 2499 213 -1730 -845 1830 1876 -74 -1417
4055a417R91K229Q7k143j144J681J680l32k372q06J262J965n20k688n21J623J779
$$ -1417 -426 1803 1890 -253 -1397 284 1964 1632 -740 -1546 -284 1681 1161 -1527 -2048 -425 1354
4072A354r49k288l46K131J508j173j993j91K434J332j820k149J92K880N23k124
$$ 1354 405 -1883 -2229 -98 1410 237 -1756 -1947 487 1819 -1 -2150 -1958 922 1445 -679
4088f79k137J284K873L1k414j999J910K706j88k885j201K580K692j053l408n75
$$ -679 -2816 -1532 1341 1372 -1042 -3041 -1131 1575 1387 -1498 -2699 -119 2573 1520 -1888 -2463
4104b463L205K084j790l178K50L278J345k549k904J438L359N36l255j876J876
$$ -2463 742 2826 1036 -2142 -1892 1386 2731 182 -2722 -1284 2075 2611 -644 -2520 -644
4119f44L083m89l298q05K073L026j508l345L4K801J469j645k855O6L226R81k440
$$ -644 2439 1950 -1348 -2153 -80 2946 1438 -1907 -1873 928 2397 752 -2103 -2037 1189 2170 -270
4136b70k215J159K662O07k458j445J158K485k07k543r19J973J906q22k095n35
$$ -270 -2485 -1326 1336 1943 -515 -1960 -802 1683 1476 -1067 -1986 -13 1893 1071 -1024 -1559
4152a559J854J377j157j863J98J820Q91j042j643K41J968O62j346j465M71J638
$$ -1559 295 1672 515 -1348 -1150 670 1561 519 -1124 -883 1085 1747 401 -1064 -593 1045
4168A045M60j360j564Q07J507M15j516r47P99J333N62j923p75R38J763l07j384
$$ 1045 1505 145 -1419 -612 895 1310 -206 -1153 -354 979 1541 -382 -1157 -219 1544 1237 -147
4185a47j044J148J674k96j824j019J963J421r30j770k21J864J200j272k003L28
$$ -147 -1191 -43 1631 1335 -489 -1508 455 1876 946 -824 -1045 819 2019 747 -1256 -928
4201i28J861J045j807j774P26K158N93k125j717J289K545k66k223j305J636K425
$$ -928 933 1978 171 -1603 -877 1281 1874 -251 -1968 -679 1866 1600 -623 -1928 -292 2133
4217B133r74k570m79K495J494j571k320L68K426P96j785j862J209K095L49k147
$$ 2133 1159 -1411 -1890 605 2099 528 -1792 -1424 1002 1798 13 -1849 -640 1455 1804 -343
4233c43j520J751J944m7k397o20J904R77o55k013K28J728Q85j099j721N05J515
$$ -343 -1863 -112 1832 1785 -612 -1232 672 1649 994 -1019 -791 937 1822 723 -998 -493 1022
4250A022P91j610q58M22J561J22j477q46J235Q60k50j154o51R89P39n60p51k46
$$ 1022 1813 203 -655 -233 1328 1450 -27 -873 362 1222 972 -182 -833 156 895 335 -416 -662
4268f62R28K94l57o99j83Q58L03j99o84N2O04J40o24j50j09M87M79o95k32m32
$$ -662 266 560 203 -496 -679 179 482 283 -401 -349 255 395 -229 -379 -488 -1 478 -217 -449 -881
4288h81P83M91m37o18J32Q22L84p13o46L47R99L0p10j015M73P36K74q88o01O51
$$ -881 -98 393 -44 -662 -530 292 676 -37 -683 -336 663 693 -17 -1032 -559 177 451 -437 -1038 -387
4308c87R42k10j129l91R59R69n18j174N7J234P36r65j252N39J197J93j093r19
$$ -387 555 345 -784 -1175 -216 753 235 -939 -882 352 1088 123 -1129 -590 607 800 -293 -1212
$$ [...]
8191C47
##END NTUPLES=NMR FID
##END=
